##TITLE=1H_CG-1150-D4
 CDCl3,8 sc, 
 2.9.2021
##JCAMPDX= 6.0         $$ Bruker NMR JCAMP-DX V2.0
##DATA TYPE= NMR SPECTRUM
##DATA CLASS= NTUPLES
##ORIGIN= UXNMR, Bruker Analytische Messtechnik GmbH
##OWNER= root
$$ XWIN-NMR		Version 3.5
$$ Thu Sep  2 13:46:14 2021 Russian Standard Time (UT+4h)  she@DPX200
##.OBSERVE FREQUENCY= 200.1313
##.OBSERVE NUCLEUS= ^1H
##.ACQUISITION MODE= SIMULTANEOUS
##.ACQUISITION SCHEME= undefined
##.AVERAGES= 8
##.DIGITISER RES= 18
##SPECTROMETER/DATA SYSTEM= spect
##.PULSE SEQUENCE= zg30
##.SOLVENT NAME= CDCl3
##.SHIFT REFERENCE= (INTERNAL, CDCl3, 0, 16.4695)
##AUDIT TRAIL= $$ (NUMBER, WHEN, WHO, WHERE, WHAT)
$$ ##TITLE= Audit trail, XWIN-NMR		Version 3.5
$$ ##JCAMPDX= 5.01
$$ ##ORIGIN= Bruker BioSpin GmbH
$$ ##OWNER= she
$$ F:/spectra/data/she/nmr/H-F/1/pdata/1/auditp.txt
$$ ##AUDIT TRAIL=  $$ (NUMBER, WHEN, WHO, WHERE, WHAT)
(   1,<2021-09-02 13:44:46.73 +0400>,<she>,<DPX200>,
      <created by zg, POWCHK disabled, PULCHK disabled
       configuration hash MD5:
       00 E9 B6 7A A2 85 ED C7 34 08 36 98 17 FE 4E 26
       data hash MD5: 16K
       A2 E4 A0 1D 45 C6 C6 AB C5 C4 5A CC 16 59 99 EA>)
(   2,<2021-09-02 13:45:04.48 +0400>,<she>,<DPX200>,
      <Start of raw data processing
       efp BC_mod = 2 LB = 0.24 FT_mod = 6 PKNL = 1 PHC0 = -13355.89 PHC1 = 11.40097 SI = 16K 
       data hash MD5: 16K
       1F BF 7F 85 81 9F 34 4C E0 C1 3A 8F 15 87 07 21>)
(   3,<2021-09-02 13:45:23.50 +0400>,<she>,<DPX200>,
      <pk PHC0 = -7.97532 PHC1 = 13 
       data hash MD5: 16K
       73 7D 3C 96 68 E1 0E A3 70 5C 73 B8 B3 34 94 33>)
(   4,<2021-09-02 13:45:26.68 +0400>,<she>,<DPX200>,
      <abs ABSG = 5 
       data hash MD5: 16K
       50 66 79 89 2E 77 AD 2D 47 30 77 50 EB DE 8A 8C>)
$$ ##END=
$$ 
$$ hash MD5
$$ FD 5B 37 D9 DE F6 08 93 1C FA 01 E4 BE 36 A5 A3
##$RELAX= 
##$RELAX= 
##$RELAX= 
##$RELAX= 
##$RELAX= 
##$RELAX= 
$$ Bruker specific parameters
$$ --------------------------
##$DU= <F:/spectra>
##$EXPNO= 1
##$NAME= <H-F>
##$PROCNO= 1
##$TYPE= <nmr>
##$USER= <she>
##$AMP= (0..31)
100 100 100 100 100 100 100 100 100 100 100 100 100 100 100 100 100 100 
100 100 100 100 100 100 100 100 100 100 100 100 100 100 
##$AQSEQ= 0
##$AQ_mod= 1
##$AUNM= <au_zg>
##$AUTOPOS= <>
##$BF1= 200.13
##$BF2= 200.13
##$BF3= 200.13
##$BF4= 200.13
##$BF5= 200.13
##$BF6= 200.13
##$BF7= 200.13
##$BF8= 200.13
##$BYTORDA= 1
##$CFDGTYP= 0
##$CFRGTYP= 5
##$CHEMSTR= <none>
##$CNST= (0..31)
1 1 145 1 1 1 1 1 1 1 1 1 1 1 1 1 1 1 1 1 1 1 1 1 1 1 1 1 1 1 1 1 
##$CPDPRG= <>
##$CPDPRG1= <>
##$CPDPRG2= <>
##$CPDPRG3= <>
##$CPDPRG4= <mlev>
##$CPDPRG5= <mlev>
##$CPDPRG6= <mlev>
##$CPDPRG7= <mlev>
##$CPDPRG8= <mlev>
##$CPDPRGB= <>
##$CPDPRGT= <>
##$D= (0..31)
0 1.2 0 0 0 0 0 0 0 0.06 0 0.03 0 0 0 0 0.0002 0 0 0 0 0 0 0 0 0 0 0 0 
0 0 0 
##$DATE= 1630575886
##$DBL= (0..7)
120 120 120 120 120 120 120 120 
##$DBP= (0..7)
150 150 150 150 150 150 150 150 
##$DBP07= 0
##$DBPNAM0= <>
##$DBPNAM1= <>
##$DBPNAM2= <>
##$DBPNAM3= <>
##$DBPNAM4= <>
##$DBPNAM5= <>
$$ [...]
##$SUBNAM3= <"">
##$SUBNAM4= <"">
##$SUBNAM5= <"">
##$SUBNAM6= <"">
##$SUBNAM7= <"">
##$SUBNAM8= <"">
##$SUBNAM9= <"">
##$SW= 20.0189088683792
##$SWIBOX= (0..15)
0 0 2 0 0 0 0 0 0 0 0 0 0 0 0 0 
##$SW_h= 4006.41025641026
##$TD= 16384
##$TD0= 1
##$TE= 0
##$TE2= 300
##$TE3= 300
##$TEG= 300
##$TL= (0..7)
0 120 120 120 120 120 120 120 
##$TP= (0..7)
150 150 150 150 150 150 150 150 
##$TP07= 0
##$TPNAME0= <>
##$TPNAME1= <>
##$TPNAME2= <>
##$TPNAME3= <>
##$TPNAME4= <>
##$TPNAME5= <>
##$TPNAME6= <>
##$TPNAME7= <>
##$TPOAL= (0..7)
0.5 0.5 0.5 0.5 0.5 0.5 0.5 0.5 
##$TPOFFS= (0..7)
0 0 0 0 0 0 0 0 
##$TUNHIN= 0
##$TUNHOUT= 0
##$TUNXOUT= 0
##$USERA1= <user>
##$USERA2= <user>
##$USERA3= <user>
##$USERA4= <user>
##$USERA5= <user>
##$V9= 5
##$VALIST= <valist>
##$VCLIST= <CCCCCCCCCCCCCCC>
##$VD= 0
##$VDLIST= <DDDDDDDDDDDDDDD>
##$VPLIST= <PPPPPPPPPPPPPPP>
##$VTLIST= <TTTTTTTTTTTTTTT>
##$WBST= 1024
##$WBSW= 4
##$XGAIN= (0..3)
0 0 0 0 
##$XL= 0
##$YL= 0
##$YMAX_a= 145975
##$YMIN_a= -198892
##$ZGOPTNS= <>
##$ZL1= 120
##$ZL2= 120
##$ZL3= 120
##$ZL4= 120
##$ABSF1= 16.47441
##$ABSF2= -3.54463
##$ABSG= 5
##$ABSL= 3
##$ALPHA= 0
##$AQORDER= 0
##$ASSFAC= 0
##$ASSFACI= 0
##$ASSFACX= 0
##$ASSWID= 0
##$AUNMP= <proc_1d>
##$AZFE= 0.1
##$AZFW= 0.1
##$BCFW= 0
##$BC_mod= 2
##$BYTORDP= 0
##$COROFFS= 0
##$CY= -3
##$DATMOD= 1
##$DC= 0
##$DFILT= <>
##$DTYPP= 0
##$F1P= 0
##$F2P= 0
##$FCOR= 1
##$FTSIZE= 16384
##$FT_mod= 6
##$GAMMA= 0
##$GB= 0
##$INTBC= 1
##$INTSCL= 1.334414e-10
##$ISEN= 128
##$LB= 0.24
##$LEV0= 0
##$LPBIN= 0
##$MAXI= 10000
##$MC2= 0
##$MEAN= 0
##$ME_mod= 0
##$MI= 1.114404
##$NCOEF= 0
##$NC_proc= -8
##$NLEV= 6
##$NOISF1= 3.799351
##$NOISF2= 2.8
##$NSP= 0
##$NTH_PI= 0
##$NZP= 0
##$OFFSET= 16.46952
##$PC= 1
##$PHC0= -13363.87
##$PHC1= 24.40097
##$PH_mod= 1
##$PKNL= yes
##$PPARMOD= 0
##$PSCAL= 0
##$PSIGN= 0
##$REVERSE= no
##$SF= 200.130007159962
##$SI= 16384
##$SIGF1= 3
##$SIGF2= 2
##$SINO= 5.538805
##$SIOLD= 16384
##$SREGLST= <1H.CDCl3>
##$SSB= 0
##$STSI= 16384
##$STSR= 0
##$SW_p= 4006.41025641026
##$SYMM= 0
##$S_DEV= 0
##$TDeff= 16384
##$TDoff= 0
##$TI= <>
##$TILT= no
##$TM1= 0
##$TM2= 0
##$TOPLEV= 0
##$USERP1= <user>
##$USERP2= <user>
##$USERP3= <user>
##$USERP4= <user>
##$USERP5= <user>
##$WDW= 1
##$XDIM= 16384
##$YMAX_p= 288035301
##$YMIN_p= -2048232
$$ End of Bruker specific parameters
$$ ---------------------------------
##NTUPLES= NMR SPECTRUM
##VAR_NAME=  FREQUENCY,     SPECTRUM/REAL,   SPECTRUM/IMAG
##SYMBOL=    X,             R,               I
##VAR_TYPE=  INDEPENDENT,   DEPENDENT,       DEPENDENT
##VAR_FORM=  AFFN,          ASDF,            ASDF
##VAR_DIM=   16384,         16384,           16384
##UNITS=     HZ,            ARBITRARY UNITS, ARBITRARY UNITS
##FACTOR=    0.24454680195387, 1,            1
##FIRST=     3296.04526936462, 0,            0
##LAST=      -710.364987045637, 0,           0
##MIN=       -710.364987045637, -2048232,    0
##MAX=       3296.04526936462, 288035301,    0
$$ Real data points
##PAGE= N=1
##DATA TABLE= (X++(R..R)), XYDATA
$$ [...]
6325A458331k24878L52239o4826j83972o9909k51172M51861P655k06398L32836
$$ 1458331 1233453 1585692 1520866 1336894 1266985 1015813 1467674 1475329 1268931 1601767
6315A601767n8282n8220K15588k67050K50752L39339l22272L45535J10079k13406
$$ 1601767 1543485 1485265 1700853 1433803 1684555 2023894 1701622 2047157 2157236 1943830
6305A943830J97626L18627l81544n1791M18807n47341J98742L60775m24105k5837
$$ 1943830 2141456 2460083 2078539 2026748 2445555 1898214 2096956 2457731 2033626 2007789
6295B007789J09842L23891m11229J298O5742J81781K79746M90601K5536j96022
$$ 2007789 2117631 2441522 2030293 2031591 2097333 2279114 2558860 3049461 3074997 2878975
6285B878975j21265M1967J19150k06692K5966k1340J01224N99262K02790j90035
$$ 2878975 2757710 2799677 2918827 2712135 2738101 2716761 2817985 3417247 3620037 3430002
6275C430002k10205P6989K88432j04024K74890n4937L71773o5473M51622L87774
$$ 3430002 3219797 3296786 3585218 3481194 3756084 3701147 4072920 4007447 4459069 4846843
6265D846843j96540Q175M5030K74051o0032O59426P74881Q0225M50697O26071
$$ 4846843 4650303 4658478 4703508 4977559 4917527 5576953 6351834 6432059 6882756 7508827
6255G508827P94856J182563R64074J141370J487639J718201J891658K223507L229669
$$ 7508827 8303683 9486246 10450320 11591690 13079329 14797530 16689188 18912695 22142364
6246B2142364L961224M175759M098676L156076J623686l094696o262873o658846
$$ 22142364 26103588 30279347 34378023 37534099 39157785 36063089 29800216 23141370
6238B3141370n063168k915062j609514j495436j470450m86128k71649n72594m82281
$$ 23141370 18078202 15163140 13553626 12058190 10587740 10101612 9829963 9257369 8775088
6229H775088L49954K68741j50047r4456n89766j77137j17571K67791N24443J80911
$$ 8775088 9125042 9393783 9243736 9149280 8559514 8382377 8264806 8532597 9057040 9237951
6219I237951K07871L31782n15305m42473j005141j335705o45092p67270l51401
$$ 9237951 9445822 9777604 9262299 8819826 7814685 6478980 5833888 5066618 4715217
6210D715217j24529o0715j1617l23253p29000p3733J21285J89012M11190m93744
$$ 4715217 4590688 4529973 4518356 4195103 3466103 3392370 3513655 3702667 4113857 3620113
6200C620113j66967J35891k24824j85078R9516O5820l47164P858K18265k31986
$$ 3620113 3453146 3589037 3364213 3179135 3278651 3344471 2997307 3005165 3223430 2991444
6190B991444j48402j23659k37871K99532M1852j35830N551M12549n81247K17566
$$ 2991444 2843042 2719383 2481512 2781044 2822896 2687066 2692617 3105166 2523919 2741485
6180B741485J93921Q5279k62693j48122K56587l95695O6510j9413O93423K78303
$$ 2741485 2935406 3020685 2757992 2609870 2866457 2470762 2537272 2517859 3211282 3489585
6170C489585q15963N68555k63432J70083L11857p9439M5862l33459M39738N37299
$$ 3489585 2673622 3242177 2978745 3148828 3460685 3381246 3427108 3093649 3533387 4070686
6160D070686p775J00504m06111L89619J10186k7737J56857N21639M84020M1060
$$ 4070686 4062911 4163415 3757304 4146923 4257109 4229372 4386229 4907868 5391888 5432948
6150E432948M13496R9659L36411J15863o6123l6443l81734l7131J76836l58693
$$ 5432948 5846444 5946103 6282514 6398377 6332254 6295811 5914077 5876946 6053782 5695089
6140E695089k60543N176n6951m03044P00785j05186k09228P40622r1374K40006
$$ 5695089 5434546 5439722 5382771 4979727 5680512 5575326 5366098 6106720 6015346 6255352
6130F255352M3887k71658J99053K83113L66414R9699L92029M96327L47815M93677
$$ 6255352 6299239 6027581 6226634 6509747 6876161 6975860 7367889 7864216 8212031 8705708
6120H705708Q5589p5402J65232Q52676M28077L89323P72453J27293j91396r4397
$$ 8705708 8791297 8715895 8881127 9733803 10161880 10551203 11323656 11450949 11259553 11165156
6110A1165156l01808o29075l83219o30207j56147n4061o84115k31506O1460k67189
$$ 11165156 10863348 10234273 9851054 9220847 9064700 9010639 8326524 8095018 8156478 7889289
6100G889289n86487J38239K26423l60691L23028K4141K67713j06997j27376o50747
$$ 7889289 7302802 7441041 7667464 7306773 7629801 7653942 7921655 7814658 7687282 7036535
6090G036535m64668O01805j21623J88706J00584N0426J81275K10107K36281j39177
$$ 7036535 6571867 7173672 7052049 7240755 7341339 7391765 7573040 7783147 8019428 7880251
6080G880251K96886M87354o13401k85925N76351m70175n41974m61563K19084o08198
$$ 7880251 8177137 8664491 8051090 7765165 8341516 7871341 7329367 6867804 7086888 6478690
6070F478690j57447L31854M74736n61469k56601j67751o7810O05952r5973k14724
$$ 6478690 6321243 6653097 7127833 6566364 6309763 6142012 6074202 6680154 6584181 6369457
6060F369457l5313J66485K41112L77525K44235k41521P4108m482M62363j64381
$$ 6369457 6334144 6500629 6741741 7119266 7363501 7121980 7196088 7191606 7653969 7489588
6050G489588J47725K41619M47697k46000L33387L70149l75537R83018L08021M49138
$$ 7489588 7637313 7878932 8326629 8080629 8414016 8784165 8408628 9391646 9699667 10148805
6040A0148805N04729M54754K40685N85398O87202O80631J020587J121126P75102
$$ 10148805 10653534 11108288 11348973 11934371 12621573 13302204 14322791 15443917 16219019
6031A6219019J421095J685198K155114K202551K543912K860822L084446M411144
$$ 16219019 17640114 19325312 21480426 23682977 26226889 29087711 32172157 36583301
6023C6583301M904551N623557O254424O190431O314355L787580l507825r793642
$$ 36583301 41487852 47111409 53365833 59556264 65870619 69658199 66150374 56356732
6015E6356732j0376141q607965m801671k934983k385605k074588q51008n10454
$$ 56356732 45980591 37372626 32570955 29635972 27250367 25175779 24324771 23814317
6007B3814317k26257r9934K48683k16770m75018J94206M23008L76311r3896n83753
$$ 23814317 23588060 23488126 23736809 23520039 23045021 23239227 23662235 24038546 23944650 23360897
5997B3360897m3016o18217m24182K68030L97045L22790J95006q462J52835j391485
$$ 23360897 23317881 22699664 22275482 22543512 22940557 23263347 23458353 23449891 23602726 22211241
5987B2211241k442410j271594j222840q63848l28308n67661j62909k97146J1253
$$ 22211241 19768831 18497237 17274397 16410549 16082241 15514580 15351671 15054525 15065778
5978A5065778N93o89750J0042n02084p89540r18466k96579l76943p62213n26181
$$ 15065778 15066371 14376621 14386663 13884579 13095039 12176573 11879994 11503051 10740838 10214657
5968A0214657l38844j088710j82633j28011p22752j57767l94864L72798k86445
$$ 10214657 9875813 8787103 8604470 8476459 7753707 7595940 7201076 7573874 7287429
5959G287429l32731Q8685j38753m89998n27564R1409n17846O4340R37425j27301
$$ 7287429 6954698 7043383 6904630 6414632 5887068 5978477 5460631 5524971 6462396 6335095
5949F335095l84448k810m10989j45243M1119j06358m94947j38973M8300n8434
$$ 6335095 5950647 5947837 5536848 5391605 5432724 5326366 4831419 4692446 4740746 4682312
5939D682312m09436L24746M3662o48437N1660J51922l59969N8574L19360l06464
$$ 4682312 4272876 4597622 4641284 3992847 4044507 4196429 3836460 3895034 4214394 3907930
5929C907930k29346k3215l15246K25665m7591J78116J68591l29411J77190J93525
$$ 3907930 3678584 3655369 3340123 3565788 3518197 3696313 3864904 3535493 3712683 3906208
5919C906208k2851k4819l28098o63997J85145M11947m10811r1744k00315j767
$$ 3906208 3883357 3858538 3530440 2866443 3051588 3463535 3052724 2960980 2760665 2758898
5909B758898Q70651R7624j57817J87183k73833j15659J05915l0498K00515p40442
$$ 2758898 3629549 3727173 3569356 3756539 3482706 3367047 3472962 3442464 3642979 2902537
5899B902537k3612M4320N9796N1221j13061j52874N5472k27278K24701Q4214k85091
$$ 2902537 2878925 2923245 2983041 3034262 2921201 2768327 2823799 2596521 2821222 2905436 2620345
5888B620345j14411j30521L10287k11085r952j829l78j25639J28391l12926N9316
$$ 2620345 2505934 2375413 2685700 2474615 2464663 2462834 2462456 2336817 2465208 2152282 2211598
5877B211598K5437J98915l08655k50280N33844L74873l59846J82995K5074m12655
$$ 2211598 2237035 2435950 2127295 1877015 2410859 2785732 2425886 2608881 2633955 2221300
5867B221300k54844j78312N2050J95649M90788Q0185j45023j54251k24795m038
$$ 2221300 1966456 1788144 1840194 2035843 2526631 2606816 2461793 2307542 2082747 2078709
5857B078709k58091N55314J8035O9069p2513j76778O34413J90418n04931l59169
$$ 2078709 1820618 2375932 2393967 2463036 2390523 2213745 2848158 3038576 2533645 2174476
5847B174476K37454k69238k49531p8559M30048K07576k48221J4215K28093j75407
$$ 2174476 2411930 2142692 1893161 1814602 2244650 2452226 2204005 2218220 2446313 2270906
5837B270906r8533m898L24694p1853Q2647J45210j02160l78513L35722m0467j42771
$$ 2270906 2172373 2167475 2492169 2420316 2502963 2648173 2546013 2167500 2503222 2462755 2319984
5826B319984J4794L4081k49923j58941J27631L01480K52923l92625L2810K0502
$$ 2319984 2334778 2368859 2118936 1959995 2087626 2389106 2642029 2249404 2282214 2302716
5816B302716j54335J83455J98141J6643J92315J69165M11983o30805m41385K64535
$$ 2302716 2148381 2331836 2529977 2546620 2738935 2908100 3320083 2689278 2247893 2512428
5806B512428M5171k06494j71368J15184J49103k45607k4460K91336N4279p6185
$$ 2512428 2557599 2351105 2179737 2294921 2444024 2198417 2173957 2465293 2519572 2443387
5796B443387j75542M9890J63544l51927K13264J11925J18830K73604q0809n2603
$$ 2443387 2267845 2317735 2481279 2129352 2342616 2454541 2573371 2846975 2766166 2713563
5786B713563K84186J44783j13072O6167k08731j1214L46332r2246m82749k41925
$$ 2713563 2997749 3142532 3029460 3095627 2886896 2875682 3222014 3129768 2647019 2405094
5776B405094J79465J49848l33350O60209m21652j28828l21449J45557K31638m11846
$$ 2405094 2584559 2734407 2401057 3061266 2639614 2510786 2189337 2334894 2566532 2154686
5766B154686k15623L40448N88822N30903j09432m90048k74051j5688M37752R1255
$$ 2154686 1939063 2279511 2868333 3399236 3289804 2799756 2525705 2510017 2947769 3039024
5756C039024q1378l79749j35509r5863R6779J04133n2417J17064L82217l19861
$$ 3039024 2957646 2577897 2442388 2346525 2443304 2547437 2495020 2612084 2994301 2674440
5746B674440L61545M36573k47104K84763O9794N59241J47957j23258q497Q3761
$$ 2674440 3035985 3472558 3225454 3510217 3580011 4139252 4287209 4163951 4155454 4239215
5736D239215K60400K16724P39103N30761N98320J197755J000455N38584P36047
$$ 4239215 4499615 4716339 5455442 5986203 6584523 7782278 8782733 9321317 10057364
5727A0057364J004759Q66560p68950j623468j565971j175539j086724p25966n94070
$$ 10057364 11062123 11928683 11159733 9536265 7970294 6794755 5708031 4982065 4387995
5718D387995m9624l71946k2261m38037o17035P93192j50207J54729j83338k91960
$$ 4387995 4338371 3966425 3944164 3506127 2889092 3682284 3532077 3686806 3503468 3211508
5708C211508k55861r6099K18199n67104L23156m47995L13966L463l84422K45961
$$ 3211508 2955647 2859548 3077747 2510643 2833799 2385804 2699770 2703233 2318811 2564772
5698B564772O6749l27918O16598l2726l27600R9446k73002l12493k3634j27053
$$ 2564772 2631521 2303603 2920201 2887475 2559875 2659321 2386319 2073826 2050192 1923139
5688A923139K80361J02035n20777q9765m28694J88524K82211L07405K6512j03586
$$ 1923139 2203500 2305535 1784758 1694993 1266299 1454823 1737034 2044439 2070951 1967365
5678A967365N3126L48314o65953N34803j74102l84830K4313K66744j30408j12448
$$ 1967365 2020491 2368805 1702852 2237655 2063553 1678723 1703036 1969780 1839372 1726924
5668A726924j64195M84901k1591p55454J93267K45311j00762k1677K51806L3122
$$ 1726924 1562729 2047630 2026039 1270585 1463852 1709163 1608401 1586724 1838530 1871652
5658A871652k34680K95050J57256l707n2169J88519o5141q5365k08268j5411k27031
$$ 1871652 1636972 1932022 2089278 2085571 2033402 2221921 2156780 2071415 1863147 1847736 1620705
5647A620705l40195Q28358k74451K39403K83569j975m24121J6226J84215j49169
$$ 1620705 1280510 2108868 1834417 2073820 2357389 2355414 1931293 1947519 2131734 1982565
5637A982565q2851K33647j3884o33334K40882O65050j48449J04470j76032M7859
$$ 1982565 1899714 2133361 2119477 1486143 1727025 2392075 2243626 2348096 2172064 2219923
5627B219923L25236K68069k87533M58037R1672N8340L01968j92818J93521K30209
$$ 2219923 2545159 2813228 2525695 2983732 3075404 3133744 3435712 3242894 3436415 3666624
5617C666624k49222O52541J77538j75316j63446l90869J73704m74407k35693M71210
$$ 3666624 3417402 4069943 4247481 4072165 3908719 3517850 3691554 3217147 2981454 3452664
5607C452664j51282o21253M95602M10502q8021K35968L3080R1657N1900j65068
$$ 3452664 3301382 2680129 3175731 3586233 3498212 3734180 3767260 3858917 3910817 3745749
5597C745749L55083K65909l48629l08997J60067l59194K10917N95592l97983k66645
$$ 3745749 4100832 4366741 4018112 3709115 3869182 3509988 3720905 4316497 3918514 3651869
5587C651869L0554K33174K03217K62418k65895k09491K17975L27373n29775j103
$$ 3651869 3682423 3915597 4118814 4381232 4115337 3905846 4123821 4451194 3921419 3920316
5577C920316K19775m38775M1188j75061l72842l53523J75N2872L30923K126R595
$$ 3920316 4140091 3701316 3742504 3567443 3194601 2841078 2841253 2894125 3225048 3227174 3236769
5566C236769j14217k82147j66506J52767l9775l1518L92995L7317m51190j07809
$$ 3236769 3122552 2840405 2673899 2826666 2786891 2755373 3148368 3185685 2734495 2626686
5556B626686k83569r6044j49001K16631q0566l62096j71463j06165Q2475J5330
$$ 2626686 2343117 2247073 2098072 2314703 2234137 1872041 1700578 1594413 1676888 1692218
5546A692218K07609L8468L060p932l42274j63443l3824J41141n9425K17722K4026
$$ 1692218 1899827 1938295 1941355 1933423 1591149 1427706 1393882 1535023 1475598 1693320 1717346
5535A717346k24168n77307N6702L10360L6148p074K1228P0264J47632p7333k55800
$$ 1717346 1493178 915871 972573 1282933 1319081 1312007 1333235 1403499 1551131 1473798 1217998
5524A217998n56575R6134P74408p8156m553K17429k24369j90831k07585L03695
$$ 1217998 661423 757557 1531965 1453809 1449256 1666685 1442316 1251485 1043900 1347595
5514A347595n8550m5640l5523o13815O2696N0508L13108K11523K52296l62241
$$ 1347595 1289045 1243405 1207882 594067 656763 707271 1020379 1231902 1484198 1121957
5504A121957k14157R2323j81634o6578K20729M41683L38457m9323n29540m89567
$$ 1121957 907800 1000123 818489 751911 972640 1414323 1752780 1703457 1173917 684350
5494F84350N88190j48971m94918k55096K24344J54367L49410K8130k671J79938
$$ 684350 1272540 1123569 628651 373555 597899 752266 1101676 1129806 1127135 1307073
5484A307073l7750N099r6857j05209K66873M41118r87204N7579l9790L68180R666
$$ 1307073 1269323 1274422 1177565 1072356 1339229 1780347 793143 850722 810932 1179112 1188778
5473A188778j44441J76451j8508q0915k09671j60918O43635M29560o66742J12260
$$ 1188778 1044337 1220788 1202280 1121365 911694 750776 1394411 1823971 1157229 1269489
5463A269489J58827l65620R4662K04730k88618l242L88907J75172n67930p9029
$$ 1269489 1428316 1062696 1157358 1362088 1073470 1070228 1459135 1634307 1066377 987348
5453I87348K85147k83124J70685M56868l43311L19190l78137j58576j42650J10445
$$ 987348 1272495 989371 1160056 1616924 1273613 1592803 1214666 1056090 913440 1023885
5443A023885N152J73575l12893L17204K24105K10607M35149Q1268m13371k94871
$$ 1023885 1029037 1202612 889719 1206923 1431028 1641635 2076784 2158052 1744681 1449810
5433A449810M59074m55109j03158L30689N901n20931J45816l4330J3739k84495
$$ 1449810 1908884 1453775 1350617 1681306 1687207 1166276 1312092 1277762 1291501 1007006
5423A007006K0153M07622j81546R9736K31128l85696J96796n113n90530O51820
$$ 1007006 1027159 1434781 1253235 1352971 1584099 1198403 1395199 1390086 799556 1451376
5413A451376O31706j27876m40798K5768K17361R1402J07717n6299j67671k00649
$$ 1451376 2083082 1955206 1514408 1540176 1757537 1848939 1956656 1900357 1732686 1532037
5403A532037m89776L03723O49231k89113L5226O365P572J26024j15211M05584
$$ 1532037 1042261 1345984 1995215 1706102 1741328 1747693 1755265 1881289 1766078 2171662
5393B171662M42166n15156k56683K43593k11418l9436j4551J52190p1139r3959
$$ 2171662 2613828 2098672 1841989 2085582 1874164 1834728 1820177 1972367 1901228 1807269
5383A807269M29362J43039m21356K14085k42616j19615L8010l69154n1917j70553
$$ 1807269 2236631 2379670 1958314 2172399 1929783 1810168 1848178 1479024 1427107 1256554
5373A256554L11984J29692K54151M25358k70648p3808K91643m25185J69614k42237
$$ 1256554 1568538 1698230 1952381 2377739 2107091 2033283 2324926 1899741 2069355 1827118
5363A827118J49300K67149J61005K07656k784j73462j85638J53788N59296J37725
$$ 1827118 1976418 2243567 2404572 2612228 2609444 2435982 2250344 2404132 2963428 3101153
5353C101153k3612K6517J69245L26372j16655J32485Q20403J02279R0432K7538
$$ 3101153 3077541 3104058 3273303 3599675 3483020 3615505 4435908 4538187 4628619 4656157
5343D656157o9831J87242O82669J90762k86333j45592o34823o52499l87233K1643
$$ 4656157 4586326 4773568 5456237 5646999 5360666 5215074 4580251 3927752 3540519 3562162
5333C562162K95520l47039n25614K80963O4853m76881k35662L79332l45227K32870
$$ 3562162 3857682 3510643 2985029 3265992 3330845 2853964 2618302 2997634 2652407 2885277
5323B885277L58171m14387O40245K79854K47844k12536J33703N32267j40880K79095
$$ 2885277 3243448 2829061 3469306 3749160 3997004 3784468 3918171 4450438 4309558 4588653
5313D588653K81637M31311k82619K82393k22342l88777l65201l6242m86715j78411
$$ 4588653 4870290 5301601 5018982 5301375 5079033 4690256 4325055 4288813 3802098 3623687
5303C623687k87993J16960J30206j60217k06096K0103k41315j56307K75407l53963
$$ 3623687 3335694 3452654 3582860 3422643 3216547 3236650 2995335 2839028 3114435 2760472
5293B760472J05652O5001l26807L45031J71513o32607k17783K58813K92111L85717
$$ 2760472 2866124 2931125 2604318 2949349 3120862 2488255 2270472 2529285 2821396 3207113
5283C207113n1028k25117L48732j99295R903m29512J14287j1868l5624k48116
$$ 3207113 3156085 2930968 3279700 3080405 3090308 2660796 2775083 2763215 2727591 2479475
5273B479475J25919J78895j64080m29730R8457J08744M84110R0633l4378L51164
$$ 2479475 2605394 2784289 2620209 2190479 2288936 2397680 2881790 2972423 2938045 3289209
5263C289209p8212l77417K65268J22131l98126l21908J14473M48329o4045k81064
$$ 3289209 3210997 2833580 3098848 3220979 2822853 2500945 2615418 3063747 2999702 2718638
5253B718638k64998K30676K32124L29299n96511M86126K16865M33105J79637J42586
$$ 2718638 2453640 2684316 2916440 3245739 2649228 3135354 3352219 3785324 3964961 4107547
5243D107547k56062P4813L56733l4564L42577l39803j43536k28577M93379J90614
$$ 4107547 3851485 3926298 4283031 4248467 4591044 4251241 4107705 3879128 4372507 4563121
5233D563121j15151Q9460L05409l00304J32940k52461l31231K12511l12061J017950
$$ 4563121 4447970 4537430 4842839 4542535 4675475 4423014 4091783 4304294 3992233 5010183
5223E010183j48328m83861N3986J22821Q4418j09601M7032n9546K45134M72040
$$ 5010183 4861855 4377994 4431980 4554801 4639219 4529618 4576650 4517104 4762238 5234278
5213E234278K79446l42399K513l91981M1275N55074p50060m32967P6496o2829
$$ 5234278 5513724 5171325 5173838 4781857 4823132 5378206 4628146 4195179 4271675 4208846
5203D208846K25576J22406n6600L41407J2122N5921J35681J41924l81729o2252
$$ 4208846 4434422 4556828 4500228 4841635 4853757 4909678 5045359 5187283 4805554 4743302
5193D743302L17730J36981J21436J84513q7455Q25790J57985L61506K16701j29905
$$ 4743302 5061032 5198013 5319449 5503962 5416507 6242297 6400282 6761788 6978489 6848584
5183F848584O4292J12791N97357J16260k7199K41583M67854R24645Q53922j56654
$$ 6848584 6912876 7025667 7623024 7739284 7712085 7953668 8421522 9346167 10200089 10043435
5173A0043435N48421O39904N28601P71086Q30610N83899O50253N65457N34576
$$ 10043435 10591856 11231760 11760361 12531447 13362057 13945956 14596209 15161666 15696242
5164A5696242O52114O94113J58691Q78664J91439J57004m08615m91061m18381
$$ 15696242 16348356 17042469 17201160 18079824 18271263 18428267 18019652 17528591 17110210
5155A7110210P541l54031o89289o17084m05610m76796m55536K33302j83032l92065
$$ 17110210 17117751 16763720 16074431 15457347 15051737 14574941 14119405 14352707 14169675 13777610
5145A3777610k21976k42887j35176m43662M80968P74196k66630N23923L06795
$$ 13777610 13555634 13312747 13177571 12733909 13214877 13989073 13722443 14246366 14553161
5136A4553161K80859N81432J04869J39071M11918K64926O75343J6641O3744K10861
$$ 14553161 14834020 15415452 15520321 15659392 16071310 16336236 17011579 17028220 17091964 17302825
5126A7302825k10402J56644k40814l55253p10858m26738n91138q30008p07372
$$ 17302825 17092423 17249067 17008253 16653000 15942142 15515404 14924266 14094258 13386886
5117A3386886n14003m72673p98983n93214n70004n96707k36255o71080m13409
$$ 13386886 12872883 12400210 11601227 11008013 10438009 9841302 9605047 8933967 8520558
5108H520558k1720l74277k87951m11164m01534k97294K25778j62456m16185k92525
$$ 8520558 8498838 8124561 7836610 7425446 7023912 6726618 6952396 6789940 6373755 6081230
5098F081230N84875m16681k74837n3537L53085j77520n70131l05937j12650K33574
$$ 6081230 6666105 6249424 5974587 5921050 6274135 6096615 5526484 5220547 5107897 5341471
5088E341471L321k54166L69559Q0176n15430l69617j73788L11018P8840L26012
$$ 5341471 5344792 5090626 5460185 5540361 5024931 4655314 4481526 4792544 4871384 5197396
5078E197396K91188K5445j27031q0688l69247J94559k85409k47786L88554J80845
$$ 5197396 5488584 5514029 5386998 5306310 4937063 5131622 4846213 4598427 4986981 5167826
5068E167826o552N7446J83521p27343J43067L92507M30776m35981o58009M10253
$$ 5167826 5161274 5218720 5402241 4674898 4817965 5210472 5641248 5205267 4547258 4957511
5058D957511L74243J03239K1641P488k22863J93099j67363K09415M80257m12431
$$ 4957511 5331754 5434993 5456634 5464122 5241259 5434358 5266995 5476410 5956667 5544236
5048E544236j6702P41213p4198k09161j9972L85914l7191J29375N32310L47798
$$ 5544236 5527534 6268747 6194549 5985388 5965416 6351330 6314139 6443514 6975824 7323622
5038G323622m47604j20313P7658k9858O47103K78276K23194j51141l42980N39557
$$ 7323622 6876018 6755705 6833363 6803505 7450608 7728884 7952078 7800937 7457957 7997514
5028G997514K06423l4020K42556M49548M64201M9299N11434P48874N12373K86047
$$ 7997514 8203937 8169917 8412473 8862021 9326222 9375521 9886955 10635829 11148202 11434249
5018A1434249L54740Q80931N68549Q18133O81710J123046J701131J669380J480739
$$ 11434249 11788989 12669920 13238469 14056602 14738312 15861358 17562489 19231869 20712608
5009B0712608J502473J908598J901501J109002J106167N86286j360354j963048
$$ 20712608 22215081 24123679 26025180 27134182 28240349 28826635 27466281 25503233
5001B5503233j156881m93279n13465m68552l84384o60756k67012R76742O85617
$$ 25503233 24346352 23853073 23339608 22871056 22486672 21825916 21558904 22535646 23221263
4992B3221263L21013K5822N54143q6354N02892O6378K6279l30830J66349L70863
$$ 23221263 23542276 23568098 24122241 24035887 24538779 24605157 24631436 24300606 24466955 24837818
4982B4837818n36273k52755m23703k41194K23425M92318r3093l202M3666q7546
$$ 24837818 24301545 24048790 23625087 23383893 23607318 24099636 24006543 24003341 24047007 23959461
4972B3959461k24300R34806P15577J63823L60597L55795N30967O44895L69134
$$ 23959461 23735161 24669967 25385544 25549367 25909964 26265759 26796726 27441621 27810755
4963B7810755J82132J11094J21646l7676M2758J65002j22487k51432j42347j193203
$$ 27810755 27992887 28103981 28225627 28187951 28230709 28395711 28273224 28021792 27879445 26686242
4953B6686242p00958j448800j078371l56774j180282j416312j085840r60233o43976
$$ 26686242 25985284 24536484 23458113 23101339 21921057 20504745 19418905 18458672 17814696
4944A7814696r09255n83587n722l93879q94897o04381K85506m47652k65597m8449
$$ 17814696 16905441 16321854 16316132 15922253 15027356 14422975 14708481 14260829 13995232 13946783
4934A3946783n08621o0443k80467m11687L53526m14474k93368P8585L0064j08869
$$ 13946783 13438162 13377719 13097252 12685565 13039091 12624617 12331249 12409834 12439898 12331029
4924A2331029o42138n7785N36282j92635k54686K4437J08620N9353N90909l46858
$$ 12331029 11688891 11631106 12167388 11974753 11720067 11744504 11853124 11912477 12503386 12156528
4914A2156528O9858M7387N61520K09446k12418N9513O14401L15561M28010K04112
$$ 12156528 12226386 12273773 12835293 13044739 12832321 12891834 13506235 13821796 14249806 14453918
4904A4453918J52845K53698J52491L13240l74J434995M56898M42277N29518N99776
$$ 14453918 14606763 14860461 15012952 15326192 15325818 16760813 17217711 17659988 18189506 18789282
4894A8789282M88424L69965Q57681O86010J466303J380318J135039J341747J159442
$$ 18789282 19277706 19647671 20505352 21191362 22657665 24037983 25173022 26514769 27674211
4885B7674211Q10416J074791Q37328M31959O33511L63267P03285l6435o61278
$$ 27674211 28484627 29559418 30396746 30828705 31462216 31825483 32528768 32492333 31831055
4876C1831055m35317l31220n41525n03607j28956j19728n33265q880J75277n35520
$$ 31831055 31395738 31064518 30522993 30019386 29890430 29770702 29237437 29228557 29403834 28868314
4866B8868314l53514j20890m25210Q40J28607l75435r371K34387l64688M4799
$$ 28868314 28514800 28393910 27968700 27969540 28098147 27722712 27713341 27947728 27583040 27627839
4856B7627839M69629J92161k1817j66639L05886k72196j62600j73510m57143m18964
$$ 27627839 28097468 28289629 28267812 28101173 28407059 28134863 27972263 27798753 27341610 26922646
4846B6922646J48184J4657l70192o07225k03397m56617n4429l92458k56250k03625
$$ 26922646 27070830 27085487 26715295 26108070 25904673 25448056 25393627 25001169 24744919 24541294
4836B4541294l78338J17892q45431j18423m09315l88314m38439m02521m96763
$$ 24541294 24162956 24280848 23435417 23316994 22907679 22519365 22080926 21678405 21181642
4827B1181642n15594m55390j51938o59639j71203l11210N6905j36028J50683J53983
$$ 21181642 20666048 20210658 20058720 19399081 19227878 18916668 18973573 18837545 18988228 19142211
4817A9142211j6631N89655L36245O48828Q1193O70766Q41799k06141J60181J186397
$$ 19142211 19125580 19715235 20051480 20700308 20781501 21452267 22294066 22087925 22248106 23434503
4807B3434503J69354L00983M11181L22963L95519M09152L63185k17383J30774
$$ 23434503 23603857 23904840 24316021 24638984 25034503 25443655 25806840 25589457 25720231
4798B5720231j81152m70594K03477M34629m47458J03056O81969O87367M26997
$$ 25720231 25539079 25068485 25271962 25706591 25259133 25362189 26044158 26731525 27158522
4789B7158522K93309J56558P56918Q74579K21715N54785P08684K79372M08366
$$ 27158522 27451831 27608389 28365307 29239886 29461601 30016386 30725070 31004442 31412808
4780C1412808N47050p8837l66888k27357m76870p97638l44129n04087l27166n33199
$$ 31412808 31959858 31881021 31514133 31286776 30809906 30012268 29668139 29164052 28836886 28303687
4770B8303687n61188K98683N8250R6960K13520Q36673O01372R57007L26595J73847
$$ 28303687 27742499 28041182 28099432 28196392 28409912 29246585 29847957 30804964 31131559 31305406
4760C1305406O08709M27403N26922j54477l14202k91396k46882l89251j072368
$$ 31305406 31914115 32341518 32868440 32713963 32399761 32108365 31861483 31472232 30399864
4751C0399864m55415K39299q1782q43581q4468J33433J7315J36811r7503P03710
$$ 30399864 29944449 30183748 30101966 29258385 29173917 29307350 29324665 29461476 29363973 30067683
4741C0067683J05547O66939N34296J8594K58348M44943Q16544L91990L96035J44081
$$ 30067683 30173230 30840169 31374465 31393059 31651407 32096350 32912894 33304884 33700919 33845000
4731C3845000q4634L66177j26283K16182K19528l92184m62468M56182j20369k40107
$$ 33845000 33760366 34126543 34000260 34216442 34435970 34043786 33581318 34037500 33917131 33677024
4721C3677024j54716m44593m59335k54354J03919K82214Q7763J8683j35159O81222
$$ 33677024 33522308 33077715 32618380 32364026 32467945 32750159 32837922 32856605 32721446 33402668
4711C3402668N03491K86834L00210L27649N68936N58059L61787N4335J52928j7968
$$ 33402668 33906159 34192993 34493203 34820852 35389788 35947847 36309634 36363969 36516897 36498929
4701C6498929R4030K51902o51257l9615j62594K58202M54002L13080K91661M91396
$$ 36498929 36592959 36844861 36193604 36153989 35991395 36249597 36703599 37016679 37308340 37799736
4691C7799736K73299K93594O81649N73295P49747P45376Q37137M78641R67741
$$ 37799736 38073035 38366629 39048278 39621573 40371320 41116696 41953833 42432474 43400215
4682D3400215J210848R96550J367582J293144K069273J591725J760243J993822
$$ 43400215 44611063 45607613 46975195 48268339 50337612 51929337 53689580 55683402
4674E5683402K257473K884276L157928K860980K312025K119107J201454L94812
$$ 55683402 57940875 60825151 63983079 66844059 69156084 71275191 72476645 72871457
4666G2871457o61176j105056j652504j263147m80636M11442J21815J1344R25800
$$ 72871457 72210281 71105225 69452721 68189574 67708938 68120380 68242195 68253539 69179339
4657F9179339J323904J093982J146152J381435J664188J615566K794109K239584
$$ 69179339 70503243 71597225 72743377 74124812 75789000 77404566 80198675 82438259
4649H2438259K465417L018454L515276L531608L784805M373471N642889N369498
$$ 82438259 84903676 87922130 91437406 94969014 98753819 103127290 108770179 114139677
4641A14139677O225943O333567O240119O292657O100431N610789N098827K298036
$$ 114139677 120365620 126699187 132939306 139231963 145332394 150943183 156042010 158340046
4633A58340046j455715n466279p758530p345061o630735n066686l475394k146104
$$ 158340046 156884331 151418052 143659522 136314461 129683726 124617040 121141646 118995542
4625A18995542k582523r73811K93189R86168J511203J297557J612083J878220
$$ 118995542 116413019 115439208 115732397 116718565 118229768 119527325 121139408 123017628
4617A23017628K000829K682460J595941K297160J343164O98892m36818j411510
$$ 123017628 125018457 127700917 129296858 131594018 132937182 133636074 133199256 131787746
4609A31787746k181536m189572m174163n451325n643012n094038n370139n209045
$$ 131787746 129606210 125416638 121242475 115791150 110148138 105054100 99683961 94474916
4601I4474916m809715m435205l694436l213890k997794k507723l009215l018860
$$ 94474916 89665201 85229996 81535560 78321670 75323876 72816153 69806938 66788078
4593F6788078j871955j818728j461873k107032j687160j763722j343881j350947
$$ 66788078 64916123 63097395 61635522 59528490 57841330 56077608 54733727 53382780
4585E3382780j637634j000010j247154r92856j370170j192487o41985j267107
$$ 53382780 51745146 50745136 49497982 48505126 47134956 45942469 45300484 44033377
4577D4033377j129870q44840o58154q26680q15057q53088l73922p11665n96194
$$ 44033377 42903507 42058667 41400513 40573833 39758776 38905688 38531766 37820101 37223907
4568C7223907n17992n40969K54595k06365l52626o70590l86136k30678o10786
$$ 37223907 36705915 36164946 36419541 36213176 35860550 35189960 34803824 34573146 33962360
4559C3962360m56195n7381q39328J14363J55369o66567R7558k28358l6891L42487
$$ 33962360 33506165 33448784 32609456 32723819 32879188 32212621 32310179 32081821 32044930 32387417
4549C2387417L61034j8273m86620K93660m6000j91422j58629l39318O32547J00798
$$ 32387417 32748451 32730178 32243558 32537218 32491218 32299796 32141167 31801849 32434396 32535194
4539C2535194l18835k88279l15170m05412J08267k28505m34759j99243l76921
$$ 32535194 32216359 31928080 31612910 31207498 31315765 31087260 30652501 30453258 30076337
4530C0076337p8046o12371K2372L78001k47042m97759r8482J55223l95832q81808
$$ 30076337 29998291 29385920 29408292 29786293 29539251 29041492 28943010 29098233 28702401 27820593
4520B7820593k06697k17373j72622p30398m13439n97502k95279o92015l17992
$$ 27820593 27613896 27396523 27223901 26493503 26080064 25482562 25187283 24495268 24177276
4511B4177276l51265N3966n35999n81963N6222l41506l94856o65587o92949l69254
$$ 24177276 23826011 23879977 23343978 22762015 22818237 22476731 22081875 21416288 20723339 20354085
4501B0354085l8039n24257J64857k15194m63566l40749K44547j61156q87555j78691
$$ 20354085 20316046 19791789 19956646 19741452 19277886 18937137 19181684 19020528 18132973 17954282
4491A7954282k2936k58064l5772J45243j49799m04479J70189J99677l65697l53069
$$ 17954282 17931346 17673282 17637510 17782753 17632954 17228475 17398664 17598341 17232644 16879575
4481A6879575P9526q5778j14339j16680N5127j85558j21524J07982o63583M19809
$$ 16879575 16959101 16873323 16758984 16642304 16697431 16511873 16390349 16498331 15834748 16254557
4471A6254557o81035J11353m5512J9340J48390O2405J15803K75815J06940J14493
$$ 16254557 15573522 15684875 15639363 15658703 15807093 15869498 15985301 16261116 16368056 16482549
4461A6482549j9482J74762K87862p38349l51929j5987p1181o67808N00392M15891
$$ 16482549 16463067 16637829 16925691 16187342 15835413 15819426 15748245 15080437 15580829 15996720
4451A5996720j36812j15994L97289K87856j62888m94731j23409J02607R50103
$$ 15996720 15859908 15743914 16141203 16429059 16266171 15771440 15648031 15750638 16700741
4442A6700741P2491l842k30532M49327l07747J52575M99641m48836N43538j97689
$$ 16700741 16773232 16769390 16538858 16988185 16680438 16833013 17332654 16883818 17427356 17229667
4432A7229667j43510J38007L95281L30713J96683j11729J39992M10725K19708
$$ 17229667 17086157 17224164 17619445 17950158 18146841 18035112 18175104 18585829 18805537
4423A8805537k42668M55292R03629J06220J98416J94020M170J64459M62599o6334
$$ 18805537 18562869 19018161 19921790 20028010 20226426 20420446 20424616 20589075 21051674 20985340
4413B0985340M04722M47155J135190Q7983P3449J89829L32224O50303M11539N27905
$$ 20985340 21390062 21837217 22972407 23060390 23133839 23323668 23655892 24306195 24717734 25245639
4403B5245639L39774Q21014Q14790Q04687O37309Q49125O17528M90863J619681
$$ 25245639 25585413 26406427 27221217 28025904 28663213 29512338 30129866 30620729 32240410
4394C2240410J471607J367509J399317J693203J761098K146760J713034J534026
$$ 32240410 33712017 35079526 36478843 38172046 39933144 42079904 43792938 45326964
4386D5326964J257519J318140J361581J615846J266564J77111R78525M58111P31935
$$ 45326964 46584483 47902623 49264204 50880050 52146614 52323725 53302250 53760361 54492296
4377E4492296J352344Q07055J68021N80306R45864J151580J123542O61944R88844
$$ 54492296 55844640 56651695 56819716 57400022 58345886 59497466 60621008 61282952 62271796
4368F2271796N95073M33146Q51990M64127M83886L17183N91267o16786n31382
$$ 62271796 62866869 63300015 64152005 64616132 65100018 65417201 66008468 65391682 64860300
4359F4860300k48437j038143l54920n03376q17249o72869r96855q85880n69240
$$ 64860300 64611863 63573720 63218800 62715424 61898175 61225306 60228451 59342571 58773331
4350E8773331m27008r57502r92872r22658j412308j511415j675443k190232k823746
$$ 58773331 58346323 57388821 56395949 55473291 54060983 52549568 50874125 48683893 45860147
4341D5860147k086518j389603j667955k191080j540374j008901j938935r12835
$$ 45860147 43773629 42384026 40716071 38524991 36984617 35975716 34036781 33123946
4333C3123946o61464q82114q45421r78676m87741o12408q45262n06224m50100
$$ 33123946 32462482 31580368 30734947 29756271 29268530 28656122 27810860 27304636 26854536
4324B6854536k57033j15118n49760l10067o64772k83540J64113K1690l8110r09013
$$ 26854536 26597503 26482385 25932625 25622558 24957786 24674246 24838359 24860049 24821939 23912926
4314B3912926n39926l64631m06842J19457M020L14361k63829k59235j86293j70545
$$ 23912926 23373000 23008369 22601527 22720984 22725004 23039365 22775536 22516301 22330008 22159463
4304B2159463J14246j37205j84329L03330K38151k36152M24375J90371o4093l54223
$$ 22159463 22273709 22136504 21952175 22255505 22493656 22257504 22681879 22872250 22808157 22453934
4294B2453934N59523L96184l41592p1560N59888N68131K41603N0571p7634k70780
$$ 22453934 23013457 23409641 23068049 22996489 23556377 24124508 24366111 24416682 24339048 24068268
4284B4068268L19102M68328O24648J05191Q2542k39122j5444K47195L71855m0417
$$ 24068268 24387370 24855698 25480346 25585537 25668079 25428957 25413513 25660708 26032563 25992146
4274B5992146O16978m7283L15518N05806M90338l52526j28935P9017m4660R20038
$$ 25992146 26609124 26561841 26877359 27383165 27873503 27520977 27392042 27471059 27426399 28346437
4264B8346437O17472M76946o8525K72089R00599Q07202N25894R05630P09030Q28448
$$ 28346437 28963909 29440855 29372330 29644419 30545018 31352220 31878114 32783744 33492774 34321222
4254C4321222J189667J127415Q39364J196422J600258J822609J398605J441630
$$ 34321222 35510889 36638304 37477668 38674090 40274348 42096957 43495562 44937192
4246D4937192J822254J373289P26083K098195J833765K038099K192065K336871
$$ 44937192 46759446 48132735 48858818 50957013 52790778 54828877 57020942 59357813
4238E9357813K304255K697259L239174K943383L644410L885076L428338L872812
$$ 59357813 61662068 64359327 67598501 70541884 74186294 78071370 81499708 85372520
4230H5372520L836747L474295K672242J666263J445824J011916l41953l88279
$$ 85372520 89209267 92683562 95355804 97022067 98467891 99479807 99137854 98749575
4222I8749575q01565j397518j692632j816194j921533j823707j846442j771066
$$ 98749575 97948010 96550492 94857860 93041666 91120133 89296426 87449984 85678918
4214H5678918j808711j001544o33468j076260j081740k97723k94567P67026J479715
$$ 85678918 83870207 82868663 82235195 81158935 80077195 79779472 79484905 80251931 81731646
4205H1731646J738058J781999K920550L270021K783968K671614K363738J987692
$$ 81731646 83469704 85251703 88172253 91442274 94226242 96897856 99261594 101249286
4197A01249286J823302J535363Q89219Q1449K8274k96553o86139p31843q64506
$$ 101249286 103072588 104607951 105497170 105578619 105606893 105310340 104624201 103892358 103027852
4188A03027852q40050j029203j380650j056135j707977j974862j613920k252020
$$ 103027852 102187802 101158599 99777949 98721814 97013837 95038975 93425055 91173035
4180I1173035k012590j451375k038740j900606j731054j589375j555008j574479
$$ 91173035 89160445 87709070 85670330 83769724 82038670 80449295 78894287 77319808
4172G7319808j262472j145166l46967j581925j010577j118182j510556j113717
$$ 77319808 76057336 74912170 74565203 72983278 71972701 70854519 69343963 68230246
4164F8230246r40511j084146j284312r87538o56058j492782p80880j392455j191924
$$ 68230246 67289735 66205589 64921277 63933739 63277681 61784899 61004019 59611564 58419640
4155E8419640j259343j002572j581952j426710j420979j660004r81616j664302
$$ 58419640 57160297 56157725 54575773 53149063 51728084 50068080 49086464 47422162
4147D7422162j469110j316692r68335q25912p82290m89698p99474q72423j84888
$$ 47422162 45953052 44636360 43668025 42842113 42059823 41570125 40770651 39898228 39713340
4138C9713340r99470j99813m22245p79419p60544p42664j80803r05472q55779
$$ 39713340 38713870 38514057 38091812 37312393 36551849 35809185 35628382 34722910 33867131
4129C3867131p11219p00751l88602q12649p69181k69934n12410m38162n73252
$$ 33867131 33155912 32455161 32066559 31253910 30484729 30214795 29702385 29264223 28690971
4120B8690971r20102m84540M07831q21237r32661n02969j33605l40423l85777
$$ 28690971 27770869 27286329 27694160 26872923 25940262 25437293 25303688 24963265 24577488
4111B4577488M02925m48861r3756o43510k94759P0359j65648K48123j65105q0166
$$ 24577488 24980413 24531552 24437796 23794286 23499527 23569886 23404238 23652361 23487256 23407090
4101B3407090l46830K05423j38821l81110n1477N23920L51903L0263L7051j11091
$$ 23407090 23060260 23265683 23126862 22745752 22694275 23218195 23570098 23600361 23637412 23526321
4091B3526321L4585j20617N57407J81743l9671M76905j4767o8969L33020M92413
$$ 23526321 23560906 23440289 23997696 24179439 24139768 24616673 24601906 24532937 24865957 25358370
4081B5358370J51164O83282Q5874m4679J095562Q79078J53421M39541K30351J019803
$$ 25358370 25509534 26192816 26278690 26234011 27329573 28208651 28362072 28801613 29031964 30051767
4071C0051767O71862J03662J037640P70917O85145J104963O16227J86947R18391
$$ 30051767 30723629 30827291 31864931 32635848 33320993 34425956 35042183 35229130 36147521
4062C6147521M34767m6213Q86924K75145k10325L96694M78190m07379l00126J89588
$$ 36147521 36582288 36536075 37422999 37698144 37487819 37884513 38362703 37955324 37655198 37844786
4052C7844786K13392N01120j71733P82880L43382M33885K35121O23732N13046
$$ 37844786 38058178 38559298 38387565 39170445 39513827 39947712 40182833 40806565 41319611
4043D1319611J016586M78056L13326P74165P73601J092282R97648M42040L87536
$$ 41319611 42336197 42814253 43127579 43901744 44675345 45767627 46765275 47207315 47594851
4034D7594851M98551Q48136P86418R05010J023932Q88311J405497R48255J266213
$$ 47594851 48093402 48941538 49727956 50632966 51656898 52545209 53950706 54898961 56165174
4025E6165174J034278K008011J402829J389457J717782J946394J744689J199132
$$ 56165174 57199452 59207463 60610292 61999749 63717531 65663925 67408614 68607746
4017F8607746J529971J101299Q77582R67013J083539L75258J039931J256812J097663
$$ 68607746 70137717 71239016 72116598 73083611 74167150 74542408 75582339 76839151 77936814
4008G7936814J094209O95296P74065J771509R99979R06108J168536J050632J568200
$$ 77936814 79031023 79726319 80500384 82271893 83271872 84177980 85346516 86397148 87965348
3999H7965348J444203J322806J658510J857041J814986K092663J997670K765332
$$ 87965348 89409551 90732357 92390867 94247908 96062894 98155557 100153227 102918559
3991A02918559K621281K448862K270714K530563K026142J633017K100541J836838
$$ 102918559 105539840 107988702 110259416 112789979 114816121 116449138 118549679 120386517
3983A20386517J394869J372872J139958J326949J705670J446162J589031J562843
$$ 120386517 121781386 123154258 124294216 125621165 127326835 128772997 130362028 131924871
3975A31924871J582822J245599R26810P33343R27732P09702N60040M60257k64271
$$ 131924871 133507693 134753292 135680102 136413445 137341177 138050879 138610919 139071176 138806905
3966A38806905j22894k69926k97151m34942m58373n29089p39138n08843n4496
$$ 138806905 138684011 138414085 138116934 137681992 137223619 136694530 135955392 135446549 135392053
3957A35392053m32350m90909L56882j0293l39082m37838k72569p35310j97984
$$ 135392053 134959703 134468794 134825676 134815383 134476301 134038463 133765894 133030584 132832600
3948A32832600l47797p41997l74451k94520j10164M17586K29364Q10799K340462
$$ 132832600 132484803 131742806 131368355 131073835 130963671 131381257 131610621 132421420 134761882
3939A34761882J977549K980282K811497K887211L581096L398528K691413K017721
$$ 134761882 136739431 139719713 142531210 145418421 148999517 152398045 155089458 157107179
3931A57107179J197730j08260j576965l281122m498254n969297o384205o892012
$$ 157107179 158304909 158196649 156619684 153338562 148840308 142871011 136486806 129594794
3923A29594794p134271o943931n623983n048269m835822l266225k724948k599444
$$ 129594794 122460523 115516592 109892609 104844340 100008518 96742293 94017345 91417901
3915I1417901k805290j862508j173052j302028j402290j128411p65903j215730
$$ 91417901 88612611 86750103 85577051 84275023 82872733 81744322 80978419 79762689
3907G9762689l40795k20729r51054o05750m06810o60744l37309j41797n20642
$$ 79762689 79421894 79201165 78250111 77644361 77237551 76576807 76239498 76097701 75577059
3898G5577059l29251j60044o31620n15603O3298k7083J44790k87483J88990Q21802
$$ 75577059 75247808 75087764 74456144 73940541 74003839 73976756 74121546 73834063 74023053 74844855
3888G4844855R50563J092840J409458J436022J553811J637458J465915J846721
$$ 74844855 75795418 76888258 78297716 79733738 81287549 82925007 84390922 86237643
3880H6237643J448734J317603J589573O09482K83172K73669R6314P6257K54842
$$ 86237643 87686377 89003980 90593553 91203035 91486207 91759876 91856190 91932447 92187289
3871I2187289q7612m31127n59507l44475l16542j024996q95344j590428j006052
$$ 92187289 92099677 91668550 91109043 90764568 90448026 89423030 88527686 86937258 85931206
3862H5931206j474508j253645j459946j140551j193195j775256j444549r01602
$$ 85931206 84456698 83203053 81743107 80602556 79409361 77634105 76189556 75287954
3854G5287954o60418k45746J84023J95342M31469O9733R60674J106563J028247
$$ 75287954 74627536 74381790 74565813 74761155 75192624 75262357 76223031 77329594 78357841
3845G8357841J681748K099464J922325J682639J921399J802521J922355K048684
$$ 78357841 80039589 82139053 84061378 85744017 87665416 89467937 91390292 93438976
3837I3438976J674940J395969O95274J319141J510385R80426J151008P68317O61384
$$ 93438976 95113916 96509885 97205159 98524300 100034685 101015111 102166119 102934436 103595820
3828A03595820J64735K62927L03835l06158j159808k250545k680517k517892k643797
$$ 103595820 103760555 104023482 104327317 104021159 102861351 100610806 97930289 95412397 92768600
3819I2768600l866343m460051l568221l787543m968703l443646l155023k965972
$$ 92768600 88902257 84442206 80873985 77086442 72117739 68674093 65519070 62553098
3811F2553098k999444k425771j908086j906344k065373j765982j634646j251727
$$ 62553098 59553654 57127883 55219797 53313453 51248080 49482098 47847452 46595725
3803D6595725j176723j036138j178515r47256m24387j052428j128738p85734l79701
$$ 46595725 45419002 44382864 43204349 42257093 41832706 40780278 39651540 38865806 38486105
3794C8486105m92202j108789q74375o09868j27632o30989k22639J97238j297680
$$ 38486105 37993903 36885114 36010739 35400871 35273239 34642250 34419611 34616849 33319169
3785C3319169j004274n77602n08166l74756n526k53868n62214o18275M86373n32520
$$ 33319169 32314895 31737293 31229127 30854371 30848845 30594977 30032763 29414488 29900861 29368341
3775B9368341l04183j90610n79158k32427k57550l23574Q0615n7611j69631j27243
$$ 29368341 29064158 28873548 28294390 28061963 27804413 27480839 27561454 27503843 27334212 27206969
3765B7206969l91840o40583m29620L23650J71487m9845l26504j52786M70019K86943
$$ 27206969 26815129 26174546 25744926 26068576 26240063 26190218 25863714 25710928 26180947 26467890
3755B6467890n29161L7716L55893l96381O9098M18573M92288N32255J44007j62952
$$ 26467890 25938729 25976445 26332338 25935957 26005055 26423628 26915916 27448171 27592178 27429226
3745B7429226j7138N20309O36576O86587K97913M39854Q19580O46994P96523J180759
$$ 27429226 27412088 27932397 28568973 29255560 29553473 29993327 30812907 31459901 32256424 33437183
3735C3437183P35822R95392J098938R12403P12785Q38295J076808J379793J043043
$$ 33437183 34173005 35168397 36267335 37179738 37892523 38730818 39807626 41187419 42230462
3726D2230462Q42954O22642K91083j55344L20293n8646m53667q94010o70626o89656
$$ 42230462 43073416 43696058 43987141 43831797 44152090 44093444 43639777 42745767 42075141 41385485
3716D1385485j062464j303494j653912j151627j541843j790081r94058q07927
$$ 41385485 40323021 39019527 37365615 36213988 34672145 32882064 31888006 31080079
3708C1080079j142546j108152j146471o13787q57925k87756n05941j139331n20385
$$ 31080079 29937533 28829381 27682910 27069123 26211198 25923442 25417501 24278170 23757785
3699B3757785L83186o41659l98863J40881k20631l98148J6289k43680J45017k06490
$$ 23757785 24140971 23499312 23100449 23241330 23020699 22622551 22638840 22395160 22540177 22333687
3689B2333687l76576R4089m69707M17321K03945r8843N2331l53897J2016j86425
$$ 22333687 21957111 22051200 21581493 21998814 22202759 22103916 22156247 21802350 21814366 21627941
3679B1627941M91944J54474L00606L0881P2902J42428l7324j59906L85462K89322
$$ 21627941 22119885 22274359 22574965 22605846 22678748 22821176 22783852 22623946 23009408 23298730
3669B3298730K51378J21590m923Q01390L88436K95901J15743j48257P97685p7628
$$ 23298730 23550108 23671698 23666775 24468165 24856601 25152502 25268245 25119988 25917673 25840045
3659B5840045L17719J091188L73382O63072M10180L61141P68657L79352L05703
$$ 25840045 26157764 27248952 27622334 28285406 28695586 29056727 29825384 30204736 30510439
3650C0510439J059429M31455O40717O00547k672L22916R39968M78611Q70936O21104
$$ 30510439 31569868 32001323 32642040 33242587 33239915 33562831 34502799 34981410 35852346 36473450
3640C6473450O84509J027660R16293Q12026Q86613Q91452J329610J037923R17779
$$ 36473450 37157959 38185619 39101912 39913938 40800551 41692003 43021613 44059536 44977315
3631D4977315J459236Q73382J134242J597386J626001J338016J276399J791731
$$ 44977315 46436551 47309933 48444175 50041561 51667562 53005578 54281977 56073708
3623E6073708M59262O71229J224274O42340J452054J395252J717224K046915J955192
$$ 56073708 56532970 57204199 58428473 59070813 60522867 61918119 63635343 65682258 67637450
3614F7637450K419308K486925K134768K210728L137685L217575L157189K367634
$$ 67637450 70056758 72543683 74678451 76889179 80026864 83244439 86401628 88769262
3606H8769262L796254M504306M477288N018895O652632O215312O311856P999934
$$ 88769262 92565516 97069822 101547110 106566005 113218637 119433949 125745805 133745739
3598A33745739Q750888R853785J1108634J2133683J3336182J3252181J3404301
$$ 133745739 142496627 152350412 163459046 175592729 188928911 202181092 215585393
3591B15585393J1599833R769065N979131K898072J646967J559716K461826L763423
$$ 215585393 227185226 236954291 242933422 245831494 247478461 249038177 251500003 255263426
3583B55263426M007568L969805N544114O275125O580974N162954J231335o252564
$$ 255263426 259270994 263240799 268784913 275060038 281641012 286803966 288035301 281782737
3575B81782737j4611611j9982473k1273700k0119756j7281045j5144739j2118550
$$ 281782737 267171126 247188653 225914953 205795197 188514152 173369413 161250863
3568A61250863j0413408q966984q274026p178258o035094n454688m635599m606891
$$ 161250863 150837455 141870471 133596445 126418187 120383093 114928405 110292806 105685915
3560A05685915m090172l645264l922992l153288k834829k440789k726166k382464
$$ 105685915 101595743 97950479 94027487 90874199 88039370 85598581 82872415 80489951
3552H0489951j643239k714364j884346j607497k067604j765502j925602j458303
$$ 80489951 78846712 76132348 74248002 72640505 70572901 68807399 66881797 65423494
3544F5423494j337449j317535k042089j255919q34437r02847q88105m21623l06803
$$ 65423494 64086045 62768510 60726421 59470502 58636065 57733218 56845113 56423490 56116687
3535E6116687o16406n86983n99610m50275j53046m83166l83843J71017j33371
$$ 56116687 55500281 54913298 54313688 53863413 53710367 53227201 52843358 53014375 52881004
3526E2881004l8131J80312L49609O79134K63405K08513K20167N00702M59544J102010
$$ 52881004 52842873 53023185 53372794 54051928 54315333 54523846 54744013 55244715 55704259 56806269
3516E6806269J453874J300710R50022J529531J198427J382982K721772K764470
$$ 56806269 58260143 59560853 60510875 62040406 63238833 64621815 67343587 70108057
3508G0108057K724410L980826L756827L843962M711703N125508N734370O708011
$$ 70108057 72832467 76813293 80570120 84414082 89125785 94251293 99985663 106693674
3500A06693674O730738P500698Q249481Q195572P610634O434421M598091J512600
$$ 106693674 113424412 120925110 129174591 137370163 144980797 151415218 156013309 157525909
3492A57525909k625888o569535q721494j0484273r761125r273855q080444p297492
$$ 157525909 154900021 148330486 139608992 129124719 119363594 110089739 102009295 94711803
3484I4711803o384858n625960n431795m423902l831702l317666l355916k703550
$$ 94711803 88326945 82700985 77269190 72845288 69013586 65695920 62340004 59636454
3476E9636454k749208k343544k462394k470796k203687k045779j015096j425373
$$ 59636454 56887246 54543702 52081308 49610512 47406825 45361046 44345950 42920577
3468D2920577j451221j454295j004271j496719j400470j517890q28895j221553
$$ 42920577 41469356 40015061 39010790 37514071 36113601 34595711 33766816 32545263
3460C2545263p31752o97012q97994q18701r34660r12373m60210o50987o46291
$$ 32545263 31813511 31116499 30218505 29399804 28465144 27552771 27092561 26441574 25795283
3451B5795283n64599o55458o57413o10286j85629n73962q01763n91966j51786
$$ 25795283 25230684 24575226 23917813 23307527 23121898 22547936 21746173 21154207 21002421
3442B1002421k95480m83592k11508j44847o23800l22431n88140n64514j31938
$$ 21002421 20706941 20223349 20011841 19866994 19243194 18920763 18332623 17768109 17636171
3433A7636171R3434o54741j3846J79726l61554m27217m66126j12734n18682m06800
$$ 17636171 17729605 17074864 17061018 17240744 16879190 16451973 15985847 15873113 15354431 14947631
3423A4947631J525m0723m38161k95191J61851j35656n24019q8495j64555r2875
$$ 14947631 14949156 14908433 14470272 14175081 14336932 14201276 13677257 13588762 13424207 13331332
3413A3331332J41756k57398k8268m74954k50649K54496j41902n78267k07933K10277
$$ 13331332 13473088 13215690 13187422 12712468 12461819 12716315 12574413 11996146 11788213 11998490
3403A1998490k95165P3322J09804J0492K44671j94758o81686j64901j97199n35499
$$ 11998490 11703325 11776647 11886451 11896943 12141614 11946856 11265170 11100269 10903070 10367571
3393A0367571L29725N8579m49196m14697K10295m02735K41980l30062n22402R4485
$$ 10367571 10697296 10755875 10306679 9891982 10102277 9699542 9941522 9611460 9089058 9183543
3383I183543L61999J23694n95496j68104k90900O180q0214M37297J00946M6799
$$ 9183543 9545542 9669236 9073740 8905636 8614736 8620916 8540702 8977999 9078945 9125744
3373I125744n30512j75282J75743J85221k21806L24061N43178j43867n43144O1993
$$ 9125744 8595232 8419950 8595693 8780914 8559108 8883169 9426347 9282480 8739336 8801329
3363H801329J5925p71M88390j68617j69558j26876j94912J10981r2947r5626P9347
$$ 8801329 8817254 8816483 9304873 9136256 8966698 8839822 8644910 8755891 8662944 8567318 8646665
3352H646665j94220j84572M68309N7837k54387K28028K8314m75648K5899n6213
$$ 8646665 8452445 8267873 8736182 8794019 8539632 8767660 8795974 8320326 8346225 8290012
3342H290012k24438J07260j7274L33805Q0813l18220k96790o29k87210l69208
$$ 8290012 8065574 8172834 8155560 8489365 8570178 8251958 7955168 7954539 7667329 7298121
3332G298121L2218q0019M06545l47306L74235l35097m63647L21k30197K51186
$$ 7298121 7330339 7250320 7656865 7309559 7683794 7348697 6885050 6885371 6655174 6906360
3322F906360k17749j26616O9286o88k64829P4388j71050q1101n60491l31585k7048
$$ 6906360 6688611 6561995 6631281 6630593 6365764 6440152 6269102 6188001 5627510 5295925 5268877
3311E268877L97122l01349n06815M6453K86779j39235j52300k79081l57806J77852
$$ 5268877 5665999 5364650 4857835 4904288 5191067 5051832 4899532 4620451 4262645 4440497
3301D440497O21885n340k6104p47190k91754N62865j45584k24911Q7820k34135
$$ 4440497 5062382 5057042 5030938 4283748 3991994 4554859 4409275 4184364 4272184 4038049
3291D038049j80912J85719k46114J32081K66126l22992m0369J48789J22284K37155
$$ 4038049 3857137 4042856 3796742 3928823 4194949 3871957 3831588 3980377 4102661 4339816
3281D339816l87003k45855j1395j13077j15788l67529K56020K2056j33656j58915
$$ 4339816 3952813 3706958 3695563 3582486 3466698 3099169 3355189 3377245 3243589 3084674
3271C084674O07602k97419k98826k10461L17653J07611k07972j29750P8598k5081
$$ 3084674 3692276 3394857 3096031 2885570 3203223 3310834 3102862 2973112 3051710 3026629
3261C026629k2039l62735M42434K17265L2328K90469m27593j14713m60207K80004
$$ 3026629 3004590 2641855 3084289 3301554 3333882 3624351 3196758 3082045 2621838 2901842
3251B901842J01311J32064N3413l81098L2691K96508o3061j23593L60446p5412
$$ 2901842 3003153 3135217 3188630 2807532 2840223 3136731 3073670 2950077 3310523 3235111
3241C235111J6116k47656j36393M88936R811m97071L23936K41019j010170L51924
$$ 3235111 3251227 3003571 2867178 3356114 3365925 2868854 3192790 3433809 2423639 2775563
3231B775563K53247K98817j92020p22987r2710K34933K49874M56651o99352J35622
$$ 2775563 3028810 3327627 3135607 2412620 2319910 2554843 2804717 3261368 2562016 2697638
3221B697638J75338j35244n33545l67460k1293j00160n1166K69892L23347P50
$$ 2697638 2872976 2737732 2204187 1836727 1815434 1715274 1664108 1934000 2257347 2258097
3211B258097l37329L50984j65918K7908R8475N03506N49952n63430n64519K19654
$$ 2258097 1920768 2271752 2105834 2133742 2232217 2735723 3285675 2722245 2157726 2377380
3201B377380K8861l83203j15928r2628j7124M23092j71947r0967R6623k82674
$$ 2377380 2406241 2023038 1907110 1814482 1797358 2220450 2048503 1957536 2054159 1771485
3191A771485r0834J67367J76997k68105J08880j50792l5428N60119j65974j02850
$$ 1771485 1680651 1848018 2025015 1756910 1865790 1714998 1679570 2239689 2073715 1970865
3181A970865J78391k40240j05373k23319N7229l92377m40383K16840O52221L13557
$$ 1970865 2149256 1909016 1803643 1580324 1637553 1245176 804793 1021633 1673854 1987411
3171A987411M53459m24267k82702k78370j74462J94327O13179j00351l42154L59806
$$ 1987411 2440870 2016603 1733901 1455531 1281069 1475396 2088575 1988224 1646070 2005876
3161B005876o65415J70421L33621N23587n37156L7002K74733l3891J19284n45873
$$ 2005876 1340461 1510882 1844503 2368090 1830934 1867936 2142669 2108778 2228062 1682189
3151A682189J05931j71348N83530M74497J72055K97411J26152n20113m82890J41329
$$ 1682189 1788120 1616772 2200302 2674799 2846854 3144265 3270417 2750304 2267414 2408743
3141B408743J7786j58682n01088l4536j15026K75397K9816K38509l02617L21751
$$ 2408743 2426529 2267847 1766759 1732223 1617197 1892594 1922410 2160919 1858302 2180053
3131B180053M2324o99453N7207n01804J7680J30141P876j83080L665j85269J57857
$$ 2180053 2222377 1522924 1580131 1078327 1096007 1226148 1234024 1050944 1054609 869340 1027197
3120A027197R905N99778l86320l06840J23845K34215M3331J66515j97617l56306
$$ 1027197 1037102 1636880 1250560 943720 1067565 1301780 1345111 1511626 1314009 957703
3110I57703J17303N29525j31215j77655P3773J25500K45829o60927K89074R1670
$$ 957703 1075006 1604531 1473316 1295661 1369434 1494934 1740763 1079836 1368910 1460580
3100A460580m80172L15701N08562k2044o07831l6288K85075Q9298q3694J4479
$$ 1460580 980408 1296109 1804671 1782627 1174796 1138508 1423583 1512881 1429187 1443666
3090A443666K2702m08636k5403Q1021n8117J98122L35362l22120J77869n4649
$$ 1443666 1466368 1057732 1032329 1113350 1055233 1253355 1588717 1266597 1444466 1389817
3080A389817j3601L5942m17303j27570K58101J07788L31022L87418n95845P7694
$$ 1389817 1376216 1412158 994855 867285 1125386 1233174 1564196 1951614 1355769 1433463
3070A433463M31288k03253m19585k71793J87412L60843P22j26997k25038k51008
$$ 1433463 1864751 1661498 1241913 970120 1157532 1518375 1519097 1392100 1167062 916054
3060I16054L1499J47103M5301k04030J18009k5121l45280N70027O6267k08708
$$ 916054 947553 1094656 1139957 935927 1053936 1028815 683535 1253562 1319829 1111121
3050A111121M01497k32020L5642k58453J76325k07845P9334R4846l46583o4219
$$ 1111121 1512618 1280598 1316240 1057787 1234112 1026267 1105601 1200447 853864 789645
3040G89645K8169J80704L57445k48074j10153K92791N794L7699p70680L51189
$$ 789645 817814 998518 1355963 1107889 997736 1290527 1296321 1334020 563340 914529
3030I14529J32678J99998R6089J82042j66797Q6974O85J06642k0827Q8034o5039
$$ 914529 1047207 1247205 1343294 1525336 1358539 1445513 1446198 1552840 1532013 1620047 1555008
3019A555008J25035K71009k0309k88452k78229M06918J7319k36103k36759M75224
$$ 1555008 1680043 1951052 1930743 1642291 1364062 1770980 1788299 1552196 1315437 1790661
3009A790661K8604j04088K43039L84511j15507k07415n09614j39226N04053J26153
$$ 1790661 1819265 1715177 1958216 2342727 2227220 2019805 1510191 1370965 1875018 2001171
2999B001171J97998l26214J39585j60789P0527M55055J171l69404J92277L60619
$$ 2001171 2199169 1872955 2012540 1851751 1922278 2377333 2378504 2009100 2201377 2561996
2989B561996J62543j06158N73752j75497m772J67727k08739L77794J79868L40272
$$ 2561996 2724539 2618381 3192133 3016636 3011864 3179591 2970852 3348646 3528514 3868786
2979C868786R9758J38566l54013N42442L16385p9162p7191K74014K65642L16339
$$ 3868786 3968544 4107110 3753097 4295539 4611924 4532762 4455571 4729585 4995227 5311566
2969E311566m13418P0783j67413L66523N84554L25449o5298J26861L97108J38969
$$ 5311566 4898148 4968931 4801518 5168041 5752595 6078044 6012746 6139607 6536715 6675684
2959F675684l88379j64356P8847Q58596N1098k08380P7253N13896L86556M80243
$$ 6675684 6287305 6122949 6201796 7060392 7111490 6903110 6980363 7494259 7880815 8361058
2949H361058J55327p1274N27776N86763N21871J25512N35228O09507N14692K90549
$$ 8361058 8516385 8445111 8972887 9559650 10081521 10207033 10742261 11351768 11866460 12157009
2939A2157009N58862N30360L30889N97358P57560Q57487O54080J339222P38122
$$ 12157009 12715871 13246231 13577120 14174478 14932038 15789525 16443605 17782827 18520949
2930A8520949J121916R76733J738781J352641J708580J168617J943979K424171
$$ 18520949 19642865 20619598 22358379 23711020 25419600 26588217 28532196 30956367
2922C0956367K897651K806966M003238M137896M231263M649727O201665O184762
$$ 30956367 33854018 36660984 40664222 44802118 49033381 53683108 59884773 66069535
2914F6069535Q776279J0310652J3547522J6473641K3044632K7961341L0466263
$$ 66069535 74845814 85156466 98703988 115177629 138222261 166183602 196649865
2907A96649865K7831935L3114542J7898224l8559449m8040532m3151464l0385178
$$ 196649865 224481800 257596342 275494566 236935117 188894585 145743121 115357943
2900A15357943j9231955j4387422j0379973p258772n465163m989027l966346k807953
$$ 115357943 96125988 81738566 71358593 64099821 58634658 53645631 49679285 46871332
2892D6871332k061168l012268m011016l648919k987721j966479j774330k557204
$$ 46871332 44810164 41797896 37786880 34137961 31150240 29183761 27409431 24852227
2884B4852227j374304j042474p39886j149242m97486o33717j020428n44713r70039
$$ 24852227 23477923 22435449 21695563 20546321 20048835 19415118 18394690 17849977 16879938
2875A6879938j197370l21209p96454p85744n61916m22350r12878n3004j124031
$$ 16879938 15682568 15361359 14564905 13779161 13217245 12794895 11882017 11829013 10704982
2866A0704982n81215n0401l16671J30931r4907m34546j50030L2638r9812k80600
$$ 10704982 10123767 10073366 9756695 9887626 9792719 9358173 9208143 9240781 9140969 8860369
2856H860369j50864l60846p31593n83849K98540l52955j45178N4217n5429M4324
$$ 8860369 8709505 8348659 7617066 7033217 7331757 6978802 6833624 6887841 6832412 6876736
2846F876736l04451n21857J93129l51927k06563N7856k81099l62506J17782k93855
$$ 6876736 6572285 6050428 6243557 5891630 5685067 5742923 5461824 5099318 5217100 4923245
2836D923245J25433l86765l64589m08973M48032j90463R1519M4113m41983J91946
$$ 4923245 5048678 4661913 4297324 3888351 4336383 4145920 4237439 4281552 3839569 4031515
2826D031515q7217l49471P2490j05159k77680K15322L34608k14384k19799J68736
$$ 4031515 3944298 3594827 3667317 3562158 3284478 3499800 3834408 3620024 3400225 3568961
2816C568961j49474l98841j95929k65731J76896L35077j66042M88555N7167n03914
$$ 3568961 3419487 3020646 2824717 2558986 2735882 3070959 2904917 3393472 3450639 2946725
2806B946725O3688l33960L6398q9170k08130n9744j42777k4339J27608M60468
$$ 2946725 3010413 2676453 2712851 2623681 2415551 2355807 2213030 2188691 2316299 2776767
2796B776767j54856m16297L7281j05531r1590L62568o29730k3906Q1922K89669
$$ 2776767 2621911 2205614 2242895 2137364 2045774 2408342 1778612 1754706 1836628 2126297
2786B126297l3649l12222m212J03709k59138L1621P7765M85001j25784k38865
$$ 2126297 2092648 1780426 1776214 1879923 1620785 1652406 1730171 2215172 2089388 1850523
2776A850523L43919l39490k04394J9676J02901k7216K47583p4325l07128L47768
$$ 1850523 2194442 1854952 1650558 1670234 1773135 1745919 1993502 1919177 1612049 1959817
2766A959817J4797k69647J90047j6295k71053l61102J76268n45487j25095J08471
$$ 1959817 1974614 1704967 1895014 1878719 1607666 1246564 1422832 877345 752250 860721
2756H60721L58521l53531j07947J9288N56385J12694n49443N3191L4453k25236
$$ 860721 1219242 865711 757764 777052 1333437 1446131 896688 949879 984332 759096
2746G59096m7813m3136J73944J92919n10537K19215m41979Q3418L87876M21938
$$ 759096 711283 668147 842091 1035010 524473 743688 301709 385127 773003 1194941
2736A194941m06870m9883L39454o1532l63464k34748q7841N707J20262K05193
$$ 1194941 788071 738188 1077642 1016110 652646 417898 330057 335764 456026 661219
2726F61219L03058k45690j63507J18168n3106J36153k56346m4123r0641L74184
$$ 661219 964277 718587 555080 673248 620142 756295 499949 455826 365185 739369
2716G39369K66474j48384r1261K15265j45022L15029J05261o83273N45454j12026
$$ 739369 1005843 857459 766198 981463 836441 1151470 1256731 573458 1118912 1006886
2706A006886K9827l5835j05860k193J94694l7745l38224O17502p07257R422j67392
$$ 1006886 1036713 1000878 895018 892825 1087519 1049774 711550 1329052 621795 631217 463825
2695D63825K21342O49886j3571l64199k63831J88438l51104l2819J40354L31280
$$ 463825 685167 1335053 1321482 957283 693452 881890 530786 497967 638321 969601
2685I69601o562M9294k95343J15723Q3363N9148k24606K32569o4487j87733L09913
$$ 969601 963039 1012333 716990 832713 916076 975224 750618 983187 918700 730967 1040880
2674A040880l49400N90804n3006m6135L12188k56019k20994O8846K49655J56313
$$ 1040880 691480 1282284 1229278 1183143 1495331 1239312 1018318 1087164 1336819 1493132
2664A493132O8072P45403k73030L07j12515o97708m86384L60675j69930k4150
$$ 1493132 1561204 2306607 2033577 2033884 1921369 1223661 737277 1097952 928022 903872
2654I03872K61459m24248K48056L19540K63714m38213l00669j4840j03800K13904
$$ 903872 1165331 741083 989139 1308679 1572393 1134180 833511 818671 714871 928775
2644I28775l69265J10509n3558l43567N87452J945q0591J30051n5206l29838j79878
$$ 928775 559510 670019 616461 272894 860346 862291 781700 911751 856545 526707 346829
2633C46829J9814M45108k08707k46906j69671K72625j17863N791O7196K08233
$$ 346829 366643 811751 603044 356138 186467 459092 341229 347020 414216 622449
2623F22449L53396J00342o95372M0442p7082M80929n23455L80777M79959o22528
$$ 622449 975845 1076187 380815 421257 344175 825104 301649 682426 1162385 539857
2613E39857o15698N04545P5976J84665K15916k96103r0804k130Q3467k84517M4265
$$ 539857 -75841 428704 504680 689345 905261 609158 518354 516224 599691 315174 359439
2602C59439K11240J18374Q3279l7937N0057J84028n62810P4549l01937j8713L57783
$$ 359439 570679 689053 772332 734395 784452 968480 405670 480219 178282 159569 517352
2591E17352M22077l37676j65063k54689L06375J3940L6556P8557l0494m88409
$$ 517352 939429 601753 436690 182001 488376 502316 538872 617429 586935 98526
2581I8526K07037l4778J53590m82556J4867R39787k14553k59650Q1289J36880
$$ 98526 305563 270785 424375 -58181 -43314 896473 681920 422270 503559 640439
2571F40439k08244j45255J35590o316K73124o7018J72075j14296o99144L94724
$$ 640439 432195 286940 422530 416214 689338 622320 794395 680099 -19045 375679
2561C75679l1098K65891k58993K6708j05946J69958J40694m28923k82645O8315
$$ 375679 344581 610472 351479 378187 272241 442199 582893 153970 -128675 -60360
2551f0360M99333R6815j7707m21892K94168j1267j85112N4841l8879j22449j47960
$$ -60360 438973 535788 518081 96189 390357 379090 193978 248819 209940 87491 -60469
2540f0469O9847L70030m14903M5781l0626L66383k25001R6839J85641K00871J97411
$$ -60469 9378 379408 -35495 10286 -20340 346043 121042 217881 403522 604393 801804
2529H01804J07636K36370q6113l13798n70987M13939p36769M03441N19796j48875
$$ 801804 909440 1145810 1059697 745899 174912 588851 -147918 255523 775319 626444
2519F26444m31334j01576J75894J25781O4114k98356J78829j27598J59538L29430
$$ 626444 195110 93534 269428 395209 459323 160967 339796 212198 371736 701166
2509G01166m19282j90605j94672k34628Q97324m17088m73003J58170j8414K18431
$$ 701166 281884 91279 -103393 -338021 559303 142215 -330788 -172618 -191032 27399
2499B7399K02782K14717k31623j9534l50176k8031K79061m6708K60434o1387p9944
$$ 27399 230181 444898 213275 193741 -156435 -184466 94595 47887 308321 246934 166990
2488A66990J27516k78237J56935j45809J25867K08072j9459j98750j33515m6848
$$ 166990 294506 16269 173204 27395 153262 361334 341875 143125 9610 -37238
2478c7238K27416j43456l43502N82601m59201k63892K52674n41472L92911M49540
$$ -37238 190178 46722 -296780 285821 -173380 -437272 -184598 -726070 -333159 116381
2468A16381O1144j81191k5430j43939R9005J52000m61583q0607K45306R3788L03681
$$ 116381 177525 -3666 -29096 -173035 -74030 77970 -383613 -464220 -218914 -125126 178555
2457A78555r6096L51348l24498j41884M7139J4634o0265J44903P374O12837m03132
$$ 178555 82459 433807 109309 -32575 14564 29198 -31067 113836 121210 734047 330915
2446C30915n18616O6505K94178J72209l4890k41813O6683J77856j59885p732L26703
$$ 330915 -187701 -121196 172982 345191 310301 68488 135171 313027 153142 145410 472113
2435D72113j4862M9298j08743m15597L32212j08226M72587l46886j61961L85991
$$ 472113 457251 506549 397806 -17791 314421 206195 678782 331896 169935 555926
2425E55926K62722o06819K80673N7192m80421m05041K76793J41583L23278k93503
$$ 555926 818648 211829 492502 549694 69273 -335768 -58975 82608 405886 112383
2415A12383O59383q8646o78760l92698j2367N27379L84753j32092K0103j29942
$$ 112383 771766 683120 4360 -388338 -400705 126674 511427 379335 399438 269496
2405B69496O9372j9576j25833j92588N0736K96516J68591l58213l77549k64875
$$ 269496 338868 319292 193459 871 51607 348123 516714 158501 -219048 -483923
2395d83923J59684L92737m62680K46799q8618L66182j04655q7193M61045J27860
$$ -483923 -324239 68498 -394182 -147383 -236001 130181 25526 -61667 399378 527238
2385E27238m5582j13984o2910o9371k03370j10924N76587l02649o61795L52280
$$ 527238 481656 367672 304762 235391 32021 -78903 497684 195035 -466760 -114480
2375a14480K40495j09986k31809M6380Q0079O8148K01635J55109k19433j59106
$$ -114480 126015 16029 -215780 -169400 -89321 -21173 180462 335571 116138 -42968
2365d2968j98523J55964K33576O9195K53009m42707k67790p488K04473k34524
$$ -42968 -241491 -85527 148049 217244 470253 27546 -240244 -247732 -43259 -277783
2355b77783K09342K49224n93726P147L74200L63908k6646K61450k47744N623k17180
$$ -277783 -68441 180783 -412943 -405796 -31596 332312 305666 567116 319372 324995 107815
2344A07815M3901j9477j6032J90288o9081k82191j71453p7425O70287K47916l72742
$$ 107815 151716 132239 116207 306495 237414 -44777 -216230 -293655 376632 624548 251806
2333B51806j56020K40548j96359k12101L98378p053J62619l42981o3934O2839
$$ 251806 95786 336334 139975 -72126 326252 319199 481818 138837 74903 137742
2323A37742J45496k66508J44510l61972J33450K5327n2794n0813M90492k005m07868
$$ 137742 283238 16730 161240 -200732 -67282 -41955 -94749 -145562 344930 342925 -64943
2312f4943J60765J02729Q4546K1629K85389o09030P2772K00235J98326n29882
$$ -64943 95822 198551 283097 304726 590115 -18915 53857 254092 452418 -77464
2302g7464j62595J73235P6519n33432j35875J28857J45039K39981N45247o37948
$$ -77464 -240059 -66824 9695 -523737 -659612 -530755 -385716 -145735 399512 -238436
2292b38436j05369J47424j09049J98691L17346k49335J19137K33035k87442M91660
$$ -238436 -343805 -196381 -305430 -106739 210607 -38728 80409 313444 26002 517662
2282E17662M179m13832k3125K35768l8020o9996k09181K47444q150j40673K29295
$$ 517662 521841 108009 84884 320652 282632 212636 3455 250899 242749 102076 331371
2271C31371n5763j76477J67536p7453j64388K9170J21797J54397l52652k0372
$$ 331371 275608 99131 266667 189214 24826 53996 175793 330190 -22462 -42834
2261d2834J70725l04437K6626J62922N2102L86341j73264J76701j52444n18550
$$ -42834 127891 -176546 -149920 13002 65104 451445 278181 454882 302438 -216112
2251b16112J54865K56761n3151n9605K44992k14372P8093j04467N2259j82454
$$ -216112 -61247 195514 142363 82758 327750 113378 191471 87004 139263 -43191
2241d3191J60243M99763L2400j26851J48918j66708j73074j73539P5223J79259
$$ -43191 117052 616815 649215 522364 671282 504574 331500 157961 233184 412443
2231D12443j08031k06202l28299Q3548O88867P9538m96946j86170M11887j27053
$$ 412443 304412 98210 -230089 -146541 542326 621864 124918 -61252 350635 223582
2221B23582m5043n2657K65253J14355q0413R1455l62416k28265K40407k29838
$$ 223582 178539 125882 391135 505490 425077 516532 154116 -74149 166258 -63580
2211f3580j25098k7914O4792l58429N76784j09262k2405j93226K25321O57235
$$ -63580 -188678 -216592 -151800 -510229 66555 -42707 -65112 -258338 -33017 624218
2201F24218l10237j03935j84401j15299L97975J46077j13020k18948K14019j09375
$$ 624218 313981 210046 25645 -89654 308321 454398 341378 122430 336449 227074
2191B27074m01990p7916J28879K36160l61037Q4392J09050R8545K12423O0116
$$ 227074 -174916 -252832 -123953 112207 -248830 -164438 -55388 43157 255580 315696
2181C15696k75306o616K49599J549j32612J20211k58588j7098L46238J18975p4112
$$ 315696 40390 33774 283373 284922 152310 272521 13933 -3165 343073 462048 387936
2170C87936j27258l47906L28032O547l03238k120r9742m38737K00158K83855K43417
$$ 387936 260678 -87228 240804 247351 -55887 -58007 -157749 -596486 -396328 -112473 130944
2159A30944l15873M45320j52030j82472M33355j63637k24779J72758n1218L2688
$$ 130944 -184929 260391 108361 -74111 359244 195607 -29172 143586 92368 125056
2149A25056j71699l00624k92333J16749L46682O82938l04216L48082k03799j81788
$$ 125056 -46643 -347267 -639600 -522851 -176169 506769 202553 550635 346836 165048
2139A65048j10022k13032n6871q8753L63040l10620O88567J8903j66591k16591
$$ 165048 55026 -158006 -214877 -303630 59410 -251210 437357 456260 289669 73078
2129G3078l2382L7546K8975j05229k7526o8531j66544J87223q853K65289J44150
$$ 73078 40696 78242 107217 1988 -25538 -94069 -260613 -73390 -82243 183046 327196
2118C27196m29758j04246J61231P1185J77458j63880O3520J26425M20778m21212
$$ 327196 -102562 -206808 -45577 25608 203066 39186 102706 229131 649909 228697
2108B28697k59772J32569l66480M00586K84257J06392n52091m8475m1972J73492
$$ 228697 -31075 101494 -264986 135600 419857 526249 -25842 -74317 -116289 57203
2098E7203J17213J2321n23827j43212L63296K91308r2986M03383k76227q9134
$$ 57203 174416 186737 -337090 -480302 -117006 174302 81316 484699 208472 119338
2088A19338l19503q6863L62904k00362l09249k85985M94398k711M42004n16470
$$ 119338 -200165 -287028 75876 -124486 -433735 -719720 -225322 -228033 213971 -302499
2078c02499j75950J66187k70925J6792K84158J9996M1489M94326n4716l86760
$$ -302499 -478449 -312262 -583187 -566395 -282237 -262241 -220752 273574 218858 -167902
2068a67902O3671K04278L57660m02308M5134N71197n83892k27009N07021K07984
$$ -167902 -104231 100047 457707 55399 100533 671730 87838 -139171 367850 575834
2058E75834r4792p53590O7659R9445K17331J0836k56098r1143K16200J13229K0587
$$ 575834 481042 -272548 -204889 -105444 111887 122723 -133375 -224518 -8318 104911 125498
2047A25498n8678j20795L55264N9607k77953k20507m69363n23072O18775L28865
$$ 125498 66820 -53975 301289 360896 82943 -137564 -606927 -1129999 -511224 -182359
2037a82359K57470k15972N83820m4482q6706q5904Q0520j48984r4500K00570Q2794
$$ -182359 75111 -140861 442959 398477 311771 225867 306387 157403 62903 263473 346267
2026C46267m16609L16521j59772L13200K28973l55637m57545n8929j09582J14507
$$ 346267 -70342 246179 86407 399607 628580 272943 -184602 -243531 -353113 -238606
2016b38606R1915k8291N51999n49898l7203K80437l46012K65293j95457J56439
$$ -238606 -146691 -174982 377017 -172881 -210084 70353 -275659 -10366 -205823 -49384
2006d9384K7736j99080K32079J27526r4037J52820L36442k50577j49045Q5271
$$ -49384 -21648 -220728 11351 138877 44840 197660 534102 283525 134480 219751
1996B19751L9218j89479J91976l01443K59369n661J95591l4335P6212k43761n52024
$$ 219751 258969 69490 261466 -39977 219392 213731 409322 374987 451199 207438 -344586
1985c44586k35486N92462j06442M7019K97957M17271m7464l88449j04636l10032
$$ -344586 -580072 12390 -94052 -47033 250924 668195 620731 232282 127646 -182386
1975a82386K73832p6738k68456J80194k97227P8199L76151K56190m53314j41547
$$ -182386 91446 14708 -253748 -73554 -370781 -292582 83569 339759 -113555 -255102
1965b55102m281j07172O9758J72031L19528j52230l74060O8107J00956n513j62751
$$ -255102 -259383 -366555 -296797 -124766 194762 42532 -331528 -263421 -162465 -167978 -330729
1954c30729R438M59498m51448p9480K28505l52697J34568o5120N64030j00921
$$ -330729 -321291 138207 -313241 -392721 -164216 -516913 -382345 -447465 116565 15644
1944A5644M20666k3547j27635m31487Q2245M54110k19726J11184m2567J24581
$$ 15644 436310 412763 285128 -146359 -64114 389996 170270 281454 238887 363468
1934C63468l23815k56162L08520L37631l23937j32748m1020K23225K88392n12630
$$ 363468 39653 -216509 92011 429642 105705 -27043 -68063 155162 443554 -69076
1924f9076P0025Q2403j21020j63353k40705J61408l5029O7445O82086j81749l87457
$$ -69076 949 83352 -37668 -201021 -441726 -280318 -315347 -247902 434184 252435 -135022
1913a35022L15902k48453L43038l64553k23552j18525O25300k89569l60989L10420
$$ -135022 180880 -67573 275465 -89088 -312640 -431165 194135 -95434 -456423 -146003
1903a46003l47651L94149K51578m6502k39786J4671K65115m18286J72788M69611
$$ -146003 -493654 -99505 152073 105571 -134215 -119544 145571 -272715 -99927 369684
1893C69684M94054o85364n5512l36277K84333R8963m24860O9068M51184k15508
$$ 369684 863738 178374 122862 -213415 70918 169881 -254979 -185911 265273 49765
1883D9765o5899J08668m17922l22989L27507l1302j64668J12052O9514L38295
$$ 49765 -16134 92534 -325388 -648377 -320870 -352172 -516840 -404788 -335274 3021
1873C021J01649L79190m90242j85929l198K81286k39469l67313M10038M447o3855
$$ 3021 104670 483860 -6382 -192311 -195509 85777 -153692 -521005 -110967 -106520 -170375
1862a70375k56111K42127L61204J7210L58470l77575j39581K20698j24369m31093
$$ -170375 -426486 -184359 176845 194055 552525 174950 35369 256067 131698 -299395
1852b99395L51489k265J33683K4800k48011M9168j08263j4576k71797L28065K2387
$$ -299395 52094 49829 183512 208312 -39699 9469 -98794 -113370 -385167 -57102 -34715
1841c4715J10750k34857K72157K37571k79459k57912j09255k09143j50303K37331
$$ -34715 76035 -158822 113335 350906 71447 -186465 -295720 -504863 -655166 -417835
1831d17835r4357L04915L04881P7998J13224J37494n56784r5872K42205j266k04267
$$ -417835 -512192 -207277 97604 175602 288826 426320 -130464 -226336 15869 14603 -189664
1820a89664m33578M66883K65683m7479j5572O9415k56956K29410j45463K09513
$$ -189664 -623242 -156359 109324 61845 46273 115688 -141268 88142 -57321 152192
1810A52192J77390n71109K63481m20778l4053L77191k05886j83983P2109M67643
$$ 152192 329582 -241527 21954 -398824 -432877 -55686 -261572 -445555 -373446 94197
1800I4197j57845n43155J023766o3271n24875k48798O13484j91538m06008o2701
$$ 94197 -63648 -606803 416963 353692 -171183 -419981 193503 1965 -404043 -466744
1790d66744K94550n2871Q4839k97501K82976L15868l48115K46957J11052j840
$$ -466744 -172194 -225065 -140226 -437727 -154751 161117 -186998 59959 171011 169171
1780A69171J07254n38809J63679K67352k42302J78760m61547K12092l1341J56368
$$ 169171 276425 -262384 -98705 168647 -73655 105105 -356442 -144350 -175691 -19323
1770a9323M7275k33409k11681M58838J77253p3056n12638j96773K60563K06658
$$ -19323 27952 -205457 -417138 41700 218953 145897 -366741 -563514 -302951 -96293
1760i6293K46644k13192o718o8944J17373N2297l6082m12506K44890K9848K22326
$$ -96293 150351 -62841 -69559 -138503 -21130 31167 -4915 -417421 -172531 -142683 79643
1749G9643L62575k19028p19457L0839K03763q8720L31151j53577p4105j4675R5079
$$ 79643 442218 223190 -496267 -465428 -261665 -350385 -19234 -172811 -246916 -261591 -166512
1738a66512j55408n1800k9677K93748m2948m69889N38336K7241j07309M09878
$$ -166512 -321920 -373720 -403397 -109649 -152597 -622486 -84150 -56909 -164218 245660
1728B45660k59862J10629k1633r6814j56375N90166n0246k51433j82043J46821
$$ 245660 -14202 96427 74794 -22020 -178395 411771 361525 110092 -71951 74870
1718G4870j74329L39951M62982p48602L30039M41461j68237l18146o5774k25707
$$ 74870 -99459 240492 703474 -45128 284911 726372 558135 239989 174215 -51492
1708e1492m80278j3393M15882M26440n64900N29449n1722l95420K05369n08216
$$ -51492 -531770 -545163 -129281 297159 -267741 261708 209986 -185434 19935 -488281
1698d88281M00635j19400q5643L21994L99304j48765K86659m06401m01022P2872
$$ -488281 -87646 -207046 -292689 29305 428609 279844 566503 160102 -240920 -168048
1688a68048k44739K20356k1653k62668j01673J41808J40808L32346J48864o7426
$$ -168048 -412787 -192431 -214084 -476752 -578425 -436617 -295809 36537 185401 117975
1678A17975j39654o23082K14167R52965o3217j95176K95523l62037p3756J99572
$$ 117975 -21679 -644761 -430594 522371 459154 263978 559501 197464 123708 323280
1668C23280m95496k48152m8265M96795J6422J61355m8550K60101j92310j72656
$$ 323280 -172216 -420368 -468633 28162 44584 205939 157389 417490 225180 52524
1658E2524n4409Q4824r9668r2615K4651M35603o3427j65092J27091k61668P0693
$$ 52524 -1885 82939 -16729 -109344 -84693 350910 287483 122391 249482 -12186 58507
1647E8507l86241K51894N3711j03915l6908k60804o1777K89316L58758J7615l80591
$$ 58507 -327734 -75840 -22129 -126044 -162952 -423756 -485533 -196217 162541 180156 -200435
1636b00435O9968O21983K84391j25294k48834l9473m26458k08626K16646L68981
$$ -200435 -130467 491516 775907 650613 401779 362306 -64152 -272778 -56132 312849
1626C12849N5675l93463K65242O235k83622j83858j39234K17250l703k30400M85066
$$ 312849 368524 -24939 240303 246538 -37084 -220942 -360176 -142926 -146629 -377029 108037
1615A08037m87130n3929O04733n71067P9335K23317M27202k76772n6739o3049
$$ 108037 -379093 -433022 171711 -399356 -320021 -96704 330498 53726 -3013 -66062
1605f6062O5200L16713L03663m49627m05817K39362m6198L94310k28684j82767
$$ -66062 -862 315851 619514 169887 -235930 3432 -42766 351544 122860 -59907
1595e9907j27774k60887j1613R50537k68021K20809l22536j49564j67492m13669
$$ -59907 -187681 -448568 -460181 490356 222335 443144 120608 -28956 -196448 -610117
1585f10117K13M49559M65669k01012p91347J71462j71329M23719J12648k21691
$$ -610117 -609904 -160345 305324 104312 -687035 -515573 -686902 -263183 -150535 -372226
1575c72226J11935K17386p5436l57216J61436Q4897M47858l26832R2104L68972
$$ -372226 -260291 -42905 -118341 -475557 -314121 -229224 218634 -108198 -16094 352878
1565C52878k17558p518L94636m78963o05992M0794J40129O72851R3463m96804
$$ 352878 135320 127802 522438 43475 -562517 -521723 -381594 291257 384720 -112084
1555a12084J19615j65298J61262l54053m3001L55016o6720L05001J65625j31168
$$ -112084 7531 -157767 3495 -350558 -393559 -38543 -105263 199738 365363 234195
1545B34195Q4919J7933m08860n66241L16379J46100k0976k20085k6998J36572
$$ 234195 319114 337047 -71813 -638054 -321675 -175575 -196551 -416636 -443634 -307062
1535c07062K11533r3813L33255q656j05918L86521L2060n57027K4469k56134K68213
$$ -307062 -95529 -189342 143913 135257 29339 415860 447920 -109107 -84638 -340772 -72559
1524g2559L94119k65143J07791O3060m16888P0613K87849m53180J70396j5356
$$ -72559 321560 56417 164208 227268 -189620 -119007 168842 -284338 -113942 -129298
1514a29298Q7497K92315m2165o00852K29209k08390K16321k47752L02775L29391
$$ -129298 -41801 250514 208349 -392503 -163294 -371684 -155363 -403115 -100340 229051
1504B29051l35791K49430L5992j43465j05992k50759n5181J22890K57053N78178
$$ 229051 -106740 142690 178682 35217 -70775 -321534 -376715 -253825 3228 581406
1494E81406k06888m14465j94903j00901M2845O7204J95555J83383j81482J51561
$$ 581406 374518 -39947 -234850 -335751 -292906 -225702 -30147 153236 -28246 123315
1484A23315O651k41696j72848L43406p8799N0791m16632m119M34555k02492n14007
$$ 123315 129966 -111730 -284578 58828 -19971 30820 -385812 -389931 44624 -157868 -671875
1473f71875J94334J46921K85499N4795K40407o5970n60787j15678l00789M04050
$$ -671875 -477541 -330620 -45121 9674 250081 184111 -376676 -492354 -793143 -389093
1463c89093M29040j10124o974L6768j22829J94819Q3904j44553m78235J86466
$$ -389093 39947 -70177 -77151 -40383 -163212 31607 115511 -29042 -507277 -320811
1453c20811K9724L07748K20493l82781K32291m34669J16668K83729j89205k76
$$ -320811 -291087 16661 237154 -145627 86664 -348005 -231337 52392 -136813 -137089
1443a37089j04365M03841K88762j41165k31392P3134p4220j41477o7380N8010
$$ -137089 -241454 162387 451149 309984 78592 151726 77506 -63971 -131351 -73341
1433g3341K82630K52793r0101q86403K63712j88967K11495l46892M08825N2643
$$ -73341 209289 462082 371981 -514422 -250710 -439677 -228182 -575074 -166249 -113606
1423a13606N6591l7552K94098n9729l79846M35082l7901j72729J33930l12530
$$ -113606 -57015 -94567 199531 139802 -240044 195038 157137 -15592 118338 -194192
1413a94192j55168j52368J12245O16078o60504j23835P680M92714k32083M83494
$$ -194192 -349360 -501728 -389483 226595 -433909 -557744 -550064 -57350 -289433 194061
1403A94061n05646K70163k55447L48753R683l16238m10759N57182l90938M3292
$$ 194061 -311585 -41422 -296869 51884 61567 -254671 -665430 -108248 -499186 -455894
1393d55894j22908K57888N44794L64833m54216l07634J15973j33484k0076P6622
$$ -455894 -578802 -320914 223880 588713 134497 -173137 -57164 -190648 -210724 -134102
1383a34102M30604l37738L16542m35192L04195R8426K27889m23054j4547K5862
$$ -134102 296502 -41236 275306 -159886 144309 242735 470624 47570 33023 58885
1373E8885l06186K32198r0179k44970P36555q1604P175n61243n4245J98757j74318
$$ 58885 -247301 -15103 -105282 -350252 386303 304699 311874 -249369 -303614 -104857 -279175
1362b79175R947K74625k09485j07669L1054j39090J56917k54258J41736J33304
$$ -279175 -269228 5397 -204088 -311757 -280703 -419793 -262876 -517134 -375398 -242094
1352b42094J72780N89390l27366n36044K73502p1253q6161M8506N4994L46426
$$ -242094 -69314 520076 192710 -343334 -69832 -141085 -227246 -178740 -123746 222680
1342B22680M03637n47049j78761j60423r9458J98299J67177j11140k01773J68348
$$ 222680 626317 79268 -99493 -259916 -359374 -161075 6102 -105038 -306811 -138463
1332a38463q365J27083p2831M5894j21820K97094O482j28808r4190P5185n9647
$$ -138463 -146828 -19745 -92576 -46682 -168502 128592 135074 6266 -87924 -12739 -72386
1321g2386j08704M31585R1373K81750O7553n77421j93875L13002m22527m31751
$$ -72386 -181090 250495 341868 623618 691171 113750 -80125 232877 -189650 -621401
1311f21401L11360k3081M09067n2864L17255j77001J25251L22986o79402J89355
$$ -621401 -310041 -333122 75945 23081 340336 163335 288586 611572 -67830 121525
1301A21525j25409L48106l57882p7345N43348j12403q6331K68660k06203j30768
$$ 121525 -3884 344222 -13660 -91005 452343 339940 253609 522269 316066 185298
1291A85298m92680q7687J29665N2086K73036n3552N6841l7298K33j09460k44054
$$ 185298 -307382 -395069 -265404 -213318 59718 6166 63007 25709 25942 -83518 -327572
1280c27572M16267o01239N39978L57954j42796j41203m8173j12478j37325M05216
$$ -327572 88695 -512544 27434 385388 242592 101389 53216 -59262 -196587 208629
1270B08629K36918k35467m8592k11732l78777J42513j64267r6742J25063L62661
$$ 208629 445547 210080 161488 -50244 -429021 -286508 -450775 -547517 -422454 -59793
1260e9793j6191J7343M4962J56677k8797l15695k97025O24714j98401J54492J7884
$$ -59793 -75984 -58641 -13679 142998 114201 -201494 -498519 126195 -72206 82286 100170
1249A00170J28431k38407n7592L54808L79335o18305j0026p106k64354m10563
$$ 100170 228601 -9806 -67398 287410 666745 48440 38414 31308 -233046 -643609
1239f43609J13840L26950j17721N4365Q56024k20205k71585j42205q6167J99986
$$ -643609 -529769 -202819 -320540 -266175 589849 369644 98059 -44146 -130313 69673
1229F9673n63M04241k40788O7410L3075Q932P3487J75463l47801k22093k36653
$$ 69673 69110 473351 232563 299973 333048 341980 415467 590930 243129 21036 -215617
1218b15617j7502L3626K63422J44708L86968l16377r8646l44798k28715J87735
$$ -215617 -233119 -199493 63929 208637 595605 279228 180582 -164216 -392931 -205196
1208b05196k27779J57329R4202l67820o2412L13369m6687N0729j7615P1058k05193
$$ -205196 -432975 -275646 -181444 -549264 -611676 -298307 -344994 -294265 -311880 -240822 -446015
1197d46015O9705o207O8619K16576p9484J58969K52540j86254J30653j18192j56162
$$ -446015 -376310 -382517 -313898 -97322 -176806 -17837 234703 48449 179102 60910 -95252
1186i5252N2069L15439k65399l62653K24253k05231K53443J58175K32225m17800
$$ -95252 -43183 272256 6857 -355796 -131543 -336774 -83331 74844 307069 -110731
1176a10731j17419L08767L38958l47269l67826K47376N61943o4715n20679k72897
$$ -110731 -228150 80617 419575 72306 -295520 -48144 513799 449084 -71595 -344492
1166c44492K30414j62521n661J24573j45986k90061O23564l2803j30207K2793
$$ -344492 -114078 -276599 -282260 -157687 -303673 -593734 29830 -2973 -133180 -110387
1156a10387K897J11852M32918N6020k60766J71176l12725j71559J56051M7353
$$ -110387 -107490 4362 437280 493300 232534 403710 90985 -80574 75477 122830
1146A22830l57131J09092L62693J05157k40720m5068M520P7272J11129j23202
$$ 122830 -234301 -125209 237484 342641 101921 56853 61373 138645 249774 126572
1136A26572J6179m3539k47873J12153j2500r4882K31410J94124K6757J2727K608
$$ 126572 142751 99212 -148661 -36508 -49008 -143890 87520 281644 308401 321128 323736
1125C23736j38531r5379K52456l50706n6754J12692m4805J99548K41160p2273
$$ 323736 185205 89826 342282 -8424 -65178 47514 2709 202257 443417 371144
1115C71144l27370j10904J81880Q6416n26684k27061J40034L88780K10607l63673
$$ 371144 43774 -67130 114750 201166 -325518 -552579 -412545 -23765 186842 -176831
1105a76831L37106o2004j68710j33097j54108K63829o6392j7649L21034l95196
$$ -176831 160275 98271 -70439 -203536 -357644 -93815 -160207 -177856 143178 -252018
1095b52018l21934m1043M34641J86035o6787J35682N81474m92463m35921K00187
$$ -252018 -573952 -614995 -180354 5681 -61106 74576 656050 163587 -272334 -72147
1085g2147j71976J55129K20118l0023J37641m01271L41653M3073J28715l6370
$$ -72147 -244123 -88994 131124 101101 238742 -162529 179124 222197 350912 314542
1075C14542l37470J66340K375m0433j5781J3471j21394P5250l36799K12163K49320
$$ 314542 -22928 143412 145787 105354 89573 103044 -18350 56900 -279899 -67736 181584
1064A81584K45007o06327Q234j70434J40844K11473l21517j21129L42405k3616
$$ 181584 426591 -179736 -171502 -341936 -201092 10381 -311136 -432265 -89860 -113476
1054a13476r0672K93263j95518o20527J30465K24561M19771k81698L97529L27812
$$ -113476 -204148 89115 -106403 -726930 -596465 -371904 47867 -233831 163698 491510
1044D91510p4396m48967k5212K32824j7236j26058R5684q4176l37850J59431j07289
$$ 491510 417114 -31853 -57065 175759 158523 32465 128149 43973 -293877 -134446 -241735
1033b41735K13684l66716L70708J34327K0318L9116j25637J78849N7109l20904
$$ -241735 -28051 -394767 -24059 110268 130586 169702 44065 222914 280023 -40881
1023d0881m9192k04371M37795j51141L46664j20346j75086j15353M54046m79764
$$ -40881 -90073 -294444 143351 -7790 338874 218528 43442 -71911 382135 -97629
1013i7629l52786J15707N2799K16409n8741Q6590J64026K82466M3104l04408N2999
$$ -97629 -450415 -334708 -281909 -65500 -124241 -37651 126375 408841 451945 147537 200536
1002B00536L01644p49070L67510P607j45415k09559n6312j32651K63599J55648
$$ 200536 502180 -246890 120620 128227 -17188 -226747 -283059 -415710 -152111 3537
992C537L7864n80234J99580P42422J23135k06592j95076k79276J46833M14908
$$ 3537 41401 -538833 -339253 403169 526304 319712 124636 -154640 -7807 407101
982D07101o38181L07716J32700m9251k16663k63014P1430j23285k33587N56943
$$ 407101 -231080 76636 209336 160085 -56578 -319592 -248162 -371447 -605034 -48091
972d8091J32820p77556L14570M29537j85570l23300K67243M91301j55952j96628
$$ -48091 84729 -692827 -378257 51280 -134290 -457590 -190347 300954 145002 -51626
962e1626J3409J520N89711J85777k68826K16268l55299K03568J28025n72444q3996
$$ -51626 -38217 -36697 553014 738791 469965 686233 330934 534502 662527 90083 6087
951F087r3654K19778l7444L86366J20180j30471k31076m21567L92434l20j80874
$$ 6087 -87567 132211 94767 481133 601313 470842 239766 -181801 210633 210313 29439
940B9439k32550J76034j68373N29825l49737Q9483J68561p29422k9124p5066N69434
$$ 29439 -203111 -27077 -195450 334375 -15362 74121 242682 -486740 -515864 -590930 -21496
929b1496r7378l81838O8718L96327J75413n3248k27157K85374J18448l95104q570
$$ -21496 -118874 -500712 -431994 -35667 139746 86498 -140659 144715 263163 -131941 -140511
918a40511K16748l35208L25363L41147j79016r5633J47025K0881N4449n30933
$$ -140511 76237 -258971 66392 407539 228523 132890 279915 300796 355245 -175688
908a75688r5808K79370k86579J48057m41029L65763L88854k27612p2270j60879
$$ -175688 -271496 7874 -278705 -130648 -571677 -205914 182940 -44672 -116942 -277821
898b77821l2459M43917N938r0243J72463J1538N42276j09143R7216p41663L932
$$ -277821 -310280 133637 139575 49332 221795 233333 775609 666466 763682 22019 25951
887B5951J27831l3938j14562N47919N14089l30902n51149r64992N87676N24314
$$ 25951 153782 119844 5282 553201 1067290 736388 185239 -779753 -192077 332237
877C32237l8497k79335M13769j33436l64270K28421L3264j167l03990k33260J05317
$$ 332237 293740 14405 428174 294738 -69532 158889 192153 190986 -113004 -346264 -240947
866b40947J58899K0008k08636l6387K02409L43116j95178Q6045l51770j21292
$$ -240947 -82048 -62040 -270676 -307063 -104654 238462 43284 129329 -222441 -343733
856c43733K41091l13367M60018M18302l38203m03008j24430L25858L07448n56338
$$ -343733 -102642 -416009 44009 462311 124108 -278900 -403330 -77472 229976 -326362
846c26362J96680Q2277j51982L63382j18135o20406J26620N01310K22161K21427
$$ -326362 -129682 -47405 -199387 163995 45860 -574546 -447926 53384 275545 496972
836D96972m87199j52949k7433O8491N71778o6132k24087j1369Q4997K0705j89063
$$ 496972 9773 -143176 -170609 -102118 469660 403528 179441 168072 253069 273774 84711
825H4711R903j88420R2639N6201j096M61715k70122k68750R0822l09642N4021
$$ 84711 94614 -93806 -1167 55034 53938 515653 245531 -23219 67603 -242039 -188018
814a88018J50185K37160K5665K02689l23031j50061K75860r1573j72558J02909
$$ -188018 -37833 199327 224992 427681 104650 -45411 230449 138876 -33682 69227
804F9227l85143j7857J60262L44938j70026Q3839l24255J3005J03275k99093P6295
$$ 69227 -315916 -333773 -173511 171427 1401 85240 -239015 -226010 -122735 -421828 -345533
793c45533O0303K43190k63729j41455O79K18927J93378k9975L41693j31358n08807
$$ -345533 -285230 -42040 -305769 -447224 -446545 -227618 -34240 -64215 277478 146120 -362687
782c62687O5301j21508k3151J77313L38110P1282K36605k37567q715j42093j08832
$$ -362687 -297386 -418894 -442045 -264732 73378 144660 381265 143698 134983 -7110 -115942
771a15942l39986K86895P7972M71177p7982l94933M50179m11494L4561M08924
$$ -115942 -455928 -169033 -91061 380116 302134 -92799 357380 -54114 -19553 389371
761C89371l56339K76002k45527K52826P9086l42212m2601J93462M10312p16848
$$ 389371 33032 309034 63507 316333 395419 53207 10606 204068 614380 -102468
751a02468L19356k77187k489k05459q1313J28393L58143L64313m182l04859J93559
$$ -102468 216888 -60299 -62788 -268247 -349560 -221167 136976 501289 497107 192248 385807
740C85807J21405n60644O5238j18985Q306J71191K53027J46736k91897m917J31835
$$ 385807 507212 -53432 11806 -107179 -98873 72318 325345 472081 180184 175267 307102
729C07102j34282n8716O5912j4754k97949K18472O5838j68857l92189M3192j32066
$$ 307102 172820 114104 180016 165262 -132687 85785 151623 -17234 -409423 -366231 -498297
718d98297K40033M6513r8200M12128l99028J1491L23290m55363q3768M96556l69444
$$ -498297 -258264 -211751 -309951 102177 -296851 -285360 37930 -417433 -501201 -4645 -374089
707c74089M06759P9173m95458R991L70410l54727M22987j18221K21538p897l71612
$$ -374089 32670 111843 -383615 -373624 -3214 -357941 65046 -53175 168363 160466 -211146
696b11146M06871K39050K36642m43065K75075k06900J65063n05541j79544R177
$$ -211146 195725 434775 671417 228352 503427 296527 461590 -43951 -223495 -214318
686b14318k4471k1639J90252r8096J48660j72272j37269o4493P4178M51201J8818
$$ -214318 -238789 -260428 -70176 -168272 -19612 -191884 -329153 -393646 -319468 131733 150551
675A50551n5126J82452l80723j09238j52143k31228R0230j08626J53000J07353
$$ 150551 95425 277877 -102846 -212084 -364227 -595455 -505225 -613851 -460851 -353498
665c53498k1543K98957M88844N3314m96533j39530M64120k03161l75080J60312
$$ -353498 -375041 -76084 412760 466074 -30459 -169989 294131 90970 -284110 -123798
655a23798N14799l90657K37490k72579m56669j01167N05550L50312j74109q3242
$$ -123798 391001 344 237834 -34745 -491414 -592581 -87031 263281 89172 5930
645E930R262O7804l9177k03180j64421l6961m51576J50746L86682K44164R8298
$$ 5930 15192 82996 43819 -159361 -323782 -360743 -812319 -661573 -274891 -30727 67571
634F7571n06251Q93711J41553p61949j4602K8502K59094P1578k7470l71038j69238
$$ 67571 -438680 455031 596584 -165365 -179967 -151465 107629 179207 151737 -219301 -388539
$$ [...]
##END NTUPLES=NMR SPECTRUM
##END=
