##TITLE=1H_CG-1150-D3
 CDCl3,8 sc, 
 2.9.2021
##JCAMPDX= 6.0         $$ Bruker NMR JCAMP-DX V2.0
##DATA TYPE= NMR SPECTRUM
##DATA CLASS= NTUPLES
##ORIGIN= UXNMR, Bruker Analytische Messtechnik GmbH
##OWNER= root
$$ XWIN-NMR		Version 3.5
$$ Thu Sep  2 13:37:52 2021 Russian Standard Time (UT+4h)  she@DPX200
##.OBSERVE FREQUENCY= 200.1313
##.OBSERVE NUCLEUS= ^1H
##.ACQUISITION MODE= SIMULTANEOUS
##.ACQUISITION SCHEME= undefined
##.AVERAGES= 8
##.DIGITISER RES= 18
##SPECTROMETER/DATA SYSTEM= spect
##.PULSE SEQUENCE= zg30
##.SOLVENT NAME= CDCl3
##.SHIFT REFERENCE= (INTERNAL, CDCl3, 0, 16.4744)
##AUDIT TRAIL= $$ (NUMBER, WHEN, WHO, WHERE, WHAT)
$$ ##TITLE= Audit trail, XWIN-NMR		Version 3.5
$$ ##JCAMPDX= 5.01
$$ ##ORIGIN= Bruker BioSpin GmbH
$$ ##OWNER= she
$$ F:/spectra/data/she/nmr/H-F/1/pdata/1/auditp.txt
$$ ##AUDIT TRAIL=  $$ (NUMBER, WHEN, WHO, WHERE, WHAT)
(   1,<2021-09-02 13:36:33.96 +0400>,<she>,<DPX200>,
      <created by zg, POWCHK disabled, PULCHK disabled
       configuration hash MD5:
       00 E9 B6 7A A2 85 ED C7 34 08 36 98 17 FE 4E 26
       data hash MD5: 16K
       AC 00 9A 38 DC 3F 52 D8 39 5E A0 0D 46 39 5E 22>)
(   2,<2021-09-02 13:36:38.59 +0400>,<she>,<DPX200>,
      <Start of raw data processing
       efp BC_mod = 2 LB = 0.24 FT_mod = 6 PKNL = 1 PHC0 = -13355.78 PHC1 = 11.60097 SI = 16K 
       data hash MD5: 16K
       B3 C2 43 7C 42 16 76 F7 30 9E 57 55 1E EB 69 5E>)
(   3,<2021-09-02 13:36:47.42 +0400>,<she>,<DPX200>,
      <abs ABSG = 5 
       data hash MD5: 16K
       3F 82 70 04 0B 68 15 B7 97 9F 33 79 EF 8E 19 E2>)
(   4,<2021-09-02 13:37:09.12 +0400>,<she>,<DPX200>,
      <pk PHC0 = -0.1096845 PHC1 = -0.2 
       data hash MD5: 16K
       04 EA 38 7E BD 4B 50 0A C2 C4 4F 6F 04 11 37 CC>)
(   5,<2021-09-02 13:37:12.57 +0400>,<she>,<DPX200>,
      <abs ABSG = 5 
       data hash MD5: 16K
       22 E9 31 6F 5B 03 5D A6 AF 28 46 79 FA 53 E6 D0>)
$$ ##END=
$$ 
$$ hash MD5
$$ 58 7A 56 88 89 F0 BC D3 C8 A4 70 A9 04 B8 14 6D
##$RELAX= 
##$RELAX= 
##$RELAX= 
##$RELAX= 
##$RELAX= 
##$RELAX= 
$$ Bruker specific parameters
$$ --------------------------
##$DU= <F:/spectra>
##$EXPNO= 1
##$NAME= <H-F>
##$PROCNO= 1
##$TYPE= <nmr>
##$USER= <she>
##$AMP= (0..31)
100 100 100 100 100 100 100 100 100 100 100 100 100 100 100 100 100 100 
100 100 100 100 100 100 100 100 100 100 100 100 100 100 
##$AQSEQ= 0
##$AQ_mod= 1
##$AUNM= <au_zg>
##$AUTOPOS= <>
##$BF1= 200.13
##$BF2= 200.13
##$BF3= 200.13
##$BF4= 200.13
##$BF5= 200.13
##$BF6= 200.13
##$BF7= 200.13
##$BF8= 200.13
##$BYTORDA= 1
##$CFDGTYP= 0
##$CFRGTYP= 5
##$CHEMSTR= <none>
##$CNST= (0..31)
1 1 145 1 1 1 1 1 1 1 1 1 1 1 1 1 1 1 1 1 1 1 1 1 1 1 1 1 1 1 1 1 
##$CPDPRG= <>
##$CPDPRG1= <>
##$CPDPRG2= <>
##$CPDPRG3= <>
##$CPDPRG4= <mlev>
##$CPDPRG5= <mlev>
##$CPDPRG6= <mlev>
##$CPDPRG7= <mlev>
##$CPDPRG8= <mlev>
##$CPDPRGB= <>
##$CPDPRGT= <>
##$D= (0..31)
0 1.2 0 0 0 0 0 0 0 0.06 0 0.03 0 0 0 0 0.0002 0 0 0 0 0 0 0 0 0 0 0 0 
0 0 0 
##$DATE= 1630575393
##$DBL= (0..7)
$$ [...]
##$SUBNAM3= <"">
##$SUBNAM4= <"">
##$SUBNAM5= <"">
##$SUBNAM6= <"">
##$SUBNAM7= <"">
##$SUBNAM8= <"">
##$SUBNAM9= <"">
##$SW= 20.0189088683792
##$SWIBOX= (0..15)
0 0 2 0 0 0 0 0 0 0 0 0 0 0 0 0 
##$SW_h= 4006.41025641026
##$TD= 16384
##$TD0= 1
##$TE= 0
##$TE2= 300
##$TE3= 300
##$TEG= 300
##$TL= (0..7)
0 120 120 120 120 120 120 120 
##$TP= (0..7)
150 150 150 150 150 150 150 150 
##$TP07= 0
##$TPNAME0= <>
##$TPNAME1= <>
##$TPNAME2= <>
##$TPNAME3= <>
##$TPNAME4= <>
##$TPNAME5= <>
##$TPNAME6= <>
##$TPNAME7= <>
##$TPOAL= (0..7)
0.5 0.5 0.5 0.5 0.5 0.5 0.5 0.5 
##$TPOFFS= (0..7)
0 0 0 0 0 0 0 0 
##$TUNHIN= 0
##$TUNHOUT= 0
##$TUNXOUT= 0
##$USERA1= <user>
##$USERA2= <user>
##$USERA3= <user>
##$USERA4= <user>
##$USERA5= <user>
##$V9= 5
##$VALIST= <valist>
##$VCLIST= <CCCCCCCCCCCCCCC>
##$VD= 0
##$VDLIST= <DDDDDDDDDDDDDDD>
##$VPLIST= <PPPPPPPPPPPPPPP>
##$VTLIST= <TTTTTTTTTTTTTTT>
##$WBST= 1024
##$WBSW= 4
##$XGAIN= (0..3)
0 0 0 0 
##$XL= 0
##$YL= 0
##$YMAX_a= 509288
##$YMIN_a= -631395
##$ZGOPTNS= <>
##$ZL1= 120
##$ZL2= 120
##$ZL3= 120
##$ZL4= 120
##$ABSF1= 16.48045
##$ABSF2= -3.538589
##$ABSG= 5
##$ABSL= 3
##$ALPHA= 0
##$AQORDER= 0
##$ASSFAC= 0
##$ASSFACI= 0
##$ASSFACX= 0
##$ASSWID= 0
##$AUNMP= <proc_1d>
##$AZFE= 0.1
##$AZFW= 0.1
##$BCFW= 0
##$BC_mod= 2
##$BYTORDP= 0
##$COROFFS= 0
##$CY= -3
##$DATMOD= 1
##$DC= 0
##$DFILT= <>
##$DTYPP= 0
##$F1P= 0
##$F2P= 0
##$FCOR= 1
##$FTSIZE= 16384
##$FT_mod= 6
##$GAMMA= 0
##$GB= 0
##$INTBC= 1
##$INTSCL= 1.334414e-10
##$ISEN= 128
##$LB= 0.24
##$LEV0= 0
##$LPBIN= 0
##$MAXI= 10000
##$MC2= 0
##$MEAN= 0
##$ME_mod= 0
##$MI= 1.114404
##$NCOEF= 0
##$NC_proc= -6
##$NLEV= 6
##$NOISF1= 3.799351
##$NOISF2= 2.8
##$NSP= 0
##$NTH_PI= 0
##$NZP= 0
##$OFFSET= 16.47441
##$PC= 1
##$PHC0= -13355.89
##$PHC1= 11.40097
##$PH_mod= 1
##$PKNL= yes
##$PPARMOD= 0
##$PSCAL= 0
##$PSIGN= 0
##$REVERSE= no
##$SF= 200.130006181523
##$SI= 16384
##$SIGF1= 3
##$SIGF2= 2
##$SINO= 5.538805
##$SIOLD= 16384
##$SREGLST= <1H.CDCl3>
##$SSB= 0
##$STSI= 16384
##$STSR= 0
##$SW_p= 4006.41025641026
##$SYMM= 0
##$S_DEV= 0
##$TDeff= 16384
##$TDoff= 0
##$TI= <>
##$TILT= no
##$TM1= 0
##$TM2= 0
##$TOPLEV= 0
##$USERP1= <user>
##$USERP2= <user>
##$USERP3= <user>
##$USERP4= <user>
##$USERP5= <user>
##$WDW= 1
##$XDIM= 16384
##$YMAX_p= 498355934
##$YMIN_p= -421872
$$ End of Bruker specific parameters
$$ ---------------------------------
##NTUPLES= NMR SPECTRUM
##VAR_NAME=  FREQUENCY,     SPECTRUM/REAL,   SPECTRUM/IMAG
##SYMBOL=    X,             R,               I
##VAR_TYPE=  INDEPENDENT,   DEPENDENT,       DEPENDENT
##VAR_FORM=  AFFN,          ASDF,            ASDF
##VAR_DIM=   16384,         16384,           16384
##UNITS=     HZ,            ARBITRARY UNITS, ARBITRARY UNITS
##FACTOR=    0.24454680195387, 1,            1
##FIRST=     3297.02359569909, 0,            0
##LAST=      -709.386660711169, 0,           0
##MIN=       -709.386660711169, -421872,     0
##MAX=       3297.02359569909, 498355934,    0
$$ Real data points
##PAGE= N=1
##DATA TABLE= (X++(R..R)), XYDATA
$$ [...]
6412B01870q1878k3316K0424o4121l0832P7699J11664J381p7433K8290N7298j08863
6400A12183N4238k1560N9172l6911k8234m393O549L7488J38256j05108O6105O7053
6388C44838M7626L0447q84m0124O3163p5457j61220N4634O9538N0307r0984j4507
6376B77377j9769J53007j86721L3008j6584Q742M3860m6729K1583o4382N2657
6365B56049n2266N4060j8118Q675J55372m5238k40O3135j27500M9216m7174R9602
6353C95573J5622j64314p611J07212r9121j04823O9483M9448P7853j9961k6650
6342B92711n9637O3941J3692r306o1424J03272N9051j14024O213P4972M2897o6714
6330C45644j33248M9829o4044l6029j0703J16804N9124p874j5196M1583j07541
$$ y = [201870, 119992, 96676, 117100, 52979, 22147, 99846, 211510, 212891, 135458, 163748, 221046, 112183, 166421, 144861, 204033, 167122, 138888, 134495, 141044, 178532, 316788, 211680, 277785, 344838, 392464, 422911, 422027, 381903, 445066, 369609, 208389, 263023, 332561, 382868, 291884, 277377, 257608, 410615, 223894, 256902, 240318, 249060, 292920, 246191, 267774, 203392, 256049, 203783, 257843, 239725, 248400, 403772, 358534, 358294, 421429, 293929, 343145, 295971, 395573, 411195, 246881, 239270, 346482, 247361, 142538, 212021, 261469, 339322, 319361, 292711, 233074, 297015, 310707, 301401, 239977, 343249, 402300, 288276, 294489, 369461, 412358, 345644, 212396, 262225, 198181, 162152, 151449, 268253, 327377, 319503, 304307, 345890, 238349]
6319B38349r219J05962L151q5503n4748O7592r6074J61641r712P9707j08894j8238
6307B74014J57433P6094R825m6949J0524R2452m1288p1510N585l3932k9228m4775
6295C58245J29414j4631p8801n318O6077L0810j977R5919k7550m7141p7401N2570
6283D80216J25124j2133j3357j28020R5981K6558K5216k4593M7300L330L2473
6272F58095Q8065l640j019j8937l3635p7612N0282O4455J01241K4238M7889o9205
6260H30217M4568O8057k4785Q3715J34367M6666N8418K1867l8524J45377K062
6249A372005J25184Q6416J14234J41975M3699J12713L59508L18065J55761K06184
6239C035744L53369L30114M01031N85797O78364Q32049J215788J480911J414676
$$ y = [238349, 229130, 335092, 338243, 252740, 197992, 265584, 169510, 331151, 321439, 401146, 292252, 274014, 431447, 507541, 517366, 470417, 480941, 573393, 532105, 460595, 466180, 432248, 403020, 358245, 487659, 473028, 394227, 388909, 454986, 485796, 483819, 579738, 552188, 505047, 427646, 480216, 605340, 593207, 579850, 451830, 547811, 574369, 599585, 574992, 622292, 625622, 658095, 746160, 742520, 741501, 722564, 688929, 611317, 661599, 726054, 827295, 851533, 899422, 830217, 874785, 942842, 918057, 1001772, 1136139, 1182805, 1241223, 1263090, 1224566, 1369943, 1372005, 1497189, 1583605, 1697839, 1839814, 1883513, 1996226, 2355734, 2673799, 2829560, 3035744, 3389113, 3719227, 4120258, 4706055, 5384419, 6216468, 7432256, 8913167, 10327843]
6230A0327843J117809K10874r99450j849642j820656j385390q51229o21129m75485
6221C653545l45670k01029j26098l0268p4035k5531j09287j30014k17093j38560
6211B255960O5151j769J67052K27516j0633l2251l0505k56116l39779j67222k95445
6200A581959j49568l7276j13636r3991j23734r461j2898J1247j5535j04585j06217
6189H26305Q6121p0641j01830J20077o7187J0462K7949n2291o6090Q2896L5528
6178H31299p8186l2630r7106Q9620k434p3508K613j1296j2150q783m7869k8866
6166E30704J69957j698j22625l7537j5321M6547O6051L579o003p2625q7961K2842
6154D95910O7988k2239J9448K2407j61682j10433K17783O553m1479q523R3610
$$ y = [10327843, 11445652, 11656526, 10657076, 8807434, 6986778, 5601388, 4750159, 4129030, 3653545, 3307875, 3106846, 2980748, 2950480, 2876445, 2850914, 2741627, 2611613, 2394520, 2255960, 2321111, 2319342, 2486394, 2713910, 2703277, 2671026, 2640521, 2384405, 2044626, 1877404, 1581959, 1432391, 1395115, 1281479, 1187488, 1063754, 1054293, 1041395, 1052642, 1037107, 932522, 826305, 912426, 841785, 739955, 860032, 792845, 803307, 831256, 778965, 712875, 795771, 831299, 753113, 720483, 623377, 712997, 710563, 637055, 639668, 628372, 616222, 607439, 559570, 530704, 700661, 698963, 576338, 538801, 523480, 570027, 636078, 639657, 633654, 561029, 473068, 495910, 563898, 541659, 561107, 583514, 421832, 311399, 529182, 535735, 494256, 485733, 579343]
6143E79343M0201j12337m5000J03861N804M930M3173l5615N2172j12025j0622
6132E13885m5243k8174N129n724o534N0238o7928K9479J29595J9221Q698j0308
6120E92334j2065P0515k515K6847p602m0793L95k9014R2257R8307l6256K7607
6108G80017p7597k4594Q6771R7847o7468k7598p1964L4878l2717K086M2204k023
6096G39842n116R6000n8608M4268j274r0582L3845J74458L6910r7404j6447k2724
6084H33168N8772P4567O6612O8905j4038r6928R4236L4981R8631p2632N1310M5402
6072A242986n2984k6254L1099L6908J48q861J14441K8990p9124l3868j74n0626
6060A202681M7365J63374L8012o576N0748p9005R3083L7903J5697N5804J0191
$$ y = [579343, 619544, 507207, 462207, 566068, 571872, 576802, 619975, 584360, 636532, 524507, 513885, 468642, 440468, 445597, 439873, 433339, 483577, 415649, 445128, 574723, 593944, 602642, 592334, 580269, 650784, 648269, 675116, 667514, 626721, 627116, 598102, 690359, 788666, 752410, 780017, 702420, 677826, 764597, 862444, 794976, 767378, 695414, 730292, 697575, 699661, 741865, 739842, 734726, 830726, 772118, 816386, 815112, 724530, 758375, 932833, 969743, 872339, 855892, 833168, 891940, 966507, 1033119, 1102024, 1087986, 991058, 1085294, 1120275, 1218906, 1146274, 1197584, 1242986, 1190002, 1163748, 1194847, 1231755, 1231903, 1223042, 1337483, 1366473, 1287349, 1253481, 1253307, 1202681, 1250046, 1413420, 1451432, 1444856, 1495604, 1416599, 1509682, 1547585, 1563282, 1619086, 1629277]
6049A629277R7989O7757K19j6337J20488P1951P0665m8122N3600O7088k6255J20841
6037B209161P8031N646o0095J06724P8316R9379N6714N6250K46733J15382J58413
6026C150654J32473K43508K26662K10426K55081K15243K96419M07718K98403L48664
6016E785251M18461O44208O19279N00637Q35958Q44502Q80306J019361J032821
6007A2580784J252602J239378J624763J885964J849585J498683M34761j501529
5999B0864991l017298k794151j943554j329536q62442m91970k25276r3233M945
5990A0112476J96633K00223K74127J54036L47227J13419k04148k58725j56387
5981A0778881m05187l46629l80185j67686j61295k30841m36976o71629n35815
$$ y = [1629277, 1727266, 1795023, 1795242, 1778905, 1899393, 1971344, 2042009, 1993887, 2047487, 2114575, 2088320, 2209161, 2287192, 2292838, 2232743, 2339467, 2417783, 2517162, 2573876, 2630126, 2876859, 2992241, 3150654, 3283127, 3526635, 3753297, 3963723, 4218804, 4434047, 4730466, 5138184, 5436587, 5785251, 6203712, 6847920, 7467199, 7967836, 8803794, 9648296, 10528602, 11547963, 12580784, 13833386, 15072764, 16697527, 18583491, 20433076, 21931759, 22366520, 20864991, 17847693, 15053542, 13109988, 11780452, 10918010, 10426040, 10200764, 10107531, 10112476, 10309109, 10509332, 10783459, 10937495, 11284722, 11398141, 11193993, 10935268, 10778881, 10373694, 10027065, 9646880, 9479194, 9317899, 9087058, 8650082, 7978453, 7442638]
5972G442638l33284k05056q6460j28107J5573J29332R6299Q9202o1126l8784k05837
5961F714390k45774m02026m14584m24550m49741k43667l66591l24526j70586j31198
5951C541147j97976j91730j86352j38227j58205j7639k23395j91762o1130j79119
5941A995612J29214j30474n153j53812K6664N2410N6147P421o704J91500j43157
5930B019668o0908J49684m3735K4038J00650J15447p7263J52100J31858l0826
5920B480713j56312j92674m7307k14241j20358m4547J5054j53222j01312q5155
5910A380639N60R8156r174m7189Q773O1050L7899r3223l8510L8869J38374J51880
5898A728104L0464L8754Q7523J49289J35471O2303m2499p1347k36501j27855j94709
$$ y = [7442638, 7109354, 6904298, 6817838, 6689731, 6705304, 6834636, 6930935, 7020137, 6959011, 6920227, 6714390, 6468616, 6066590, 5652006, 5227456, 4777715, 4534048, 4167457, 3842931, 3672345, 3541147, 3343171, 3151441, 2965089, 2826862, 2668657, 2651018, 2427623, 2235861, 2174731, 1995612, 2124826, 1994352, 1989199, 1835387, 1862051, 1914461, 1970608, 1978029, 1971325, 2162825, 2019668, 1958760, 2108444, 2064709, 2088747, 2189397, 2304844, 2227581, 2379681, 2511539, 2480713, 2324401, 2131727, 2084420, 1870179, 1749821, 1705274, 1720328, 1567106, 1465794, 1380639, 1381199, 1479355, 1470181, 1422992, 1431765, 1492815, 1530714, 1437491, 1398981, 1437850, 1576224, 1728104, 1758568, 1797322, 1884845, 2034134, 2169605, 2231908, 2189409, 2118062, 1881561, 1753706, 1558997]
5887A558997j07695J8394J0807j01277j52977J4506J12318j18051k9300r6607
5877A109115j09013O3494Q4336p8055J9584K4254M312o8560l8449J18637M0772
5866A170427O481J38944j7643j9095m0610o7252L3891P5163q9036j04261j2680
5855A074329n1002L8774j89289J6120L6104n8295P5623L4594k03582j4164J02179
5844H61391J5716L3300L823r7810Q287o1063l7427O9783o628m6062L4429l6325
5832G41414N7173k3523r534R3596l1603j5802M7015O2294J04549j46339j05281
5821G73959j9484k4339P1480Q7378o3904J8998M4887J24201j2665j25345m548
5810H70618n2125M4552N8776j14929J14436p6728l3098J9765N15R0269m4781l0761
$$ y = [1558997, 1451302, 1469696, 1480503, 1379226, 1226249, 1240755, 1353073, 1235022, 1205722, 1109115, 1000102, 1063596, 1147932, 1069877, 1089461, 1113715, 1118027, 1049467, 1011018, 1129655, 1170427, 1176908, 1315852, 1298209, 1279114, 1238504, 1171252, 1205143, 1280306, 1191270, 1087009, 1074329, 1023327, 1062101, 872812, 888932, 925036, 866741, 942364, 976958, 773376, 759212, 861391, 877107, 910407, 914230, 816420, 824707, 763644, 726217, 796000, 789372, 743310, 777739, 741414, 798587, 775064, 765530, 859126, 827523, 811721, 858736, 921030, 1025579, 879240, 773959, 754475, 730136, 801616, 888994, 825090, 844088, 888975, 1013176, 1000511, 875166, 870618, 818493, 863045, 921821, 806892, 921328, 844600, 811502, 831267, 831782, 922051, 877270, 846509]
5798H46509r7133P0978J705l0245k0008J37893P5130O3510q4177j09716L2954
5787H87400j11108P0682P0092m0375n389k0996l8232r0149J92071R063j13073
5776H09986k5542K26848J4841p1867k2676p9286N5827l7721Q0826j5649K4658
5765I60245K3976P3969n691o0413p1513K8257n2680J3266M0974K2553m1525j57100
5753G74318J08595k7377n9680N3998N2948M8174n1832q498q0114N4047r291j1526
5741H43762J16347Q6420p8327q1972l3236N7373J01238K2658M1090k3196O0162
5730A112319k5399P8581j324j9057J2908J21910N1558R6741J13606J49336M2430
5719A733609L47796K39575L41088M41181J59820K07557k02603m65610l44969m33886
$$ y = [846509, 749376, 820354, 822059, 791814, 771806, 909699, 984829, 1048339, 964162, 854446, 887400, 776292, 846974, 917066, 876691, 871302, 850306, 812074, 721925, 913996, 923059, 809986, 784444, 1011292, 1026133, 954266, 931590, 852304, 908131, 870410, 951236, 935587, 960245, 984221, 1058190, 1052499, 992086, 920573, 948830, 896150, 909416, 950390, 972943, 931418, 774318, 882913, 855536, 795856, 849854, 902802, 950976, 899144, 890646, 810532, 864579, 855288, 843762, 960109, 1046529, 968202, 886230, 852994, 910367, 1011605, 1034263, 1075353, 1052157, 1112319, 1086920, 1165501, 1164177, 1145120, 1158028, 1279938, 1331496, 1428237, 1541843, 1691179, 1733609, 2081405, 2320980, 2662068, 3103249, 3263069, 3470626, 3268023, 2802413, 2457444, 2023558]
5709B023558k58557j37433o9903k01037j32247n4205j08087l7549J9735l4358
5699A009917J5441J62954j4167m6778q9208K1691L4826m7191m3643K9478n9271
5688I74049K0476m0275K5844l1542L9513k6329m7727k2719j65982J1116P7847
5677H14271R1142P242p9120J20859r3484O0352l5136L7836L4431o4093J24568
5666A018868j07975j967k8600j742k4815l1782Q1539K0112j9347q9031O4881L3954
5654I14095J1254m694L0513m9742O3162R7929O3965P1780n2775j9260q6400m593
5642A035234O4288J9627J45075j2923n5471M7632J5105R2957m425J08800O3499
5631A519398k0909Q8919J64050O8732o4611J50894K22653R1606K59418K62404
$$ y = [2023558, 1765001, 1627568, 1557665, 1356628, 1224381, 1170176, 1062089, 1024540, 1044275, 1009917, 1025358, 1188312, 1174145, 1127367, 1038159, 1059850, 1094676, 1047485, 1003842, 1033320, 974049, 994525, 954250, 980094, 948552, 988065, 961736, 914009, 891290, 725308, 736424, 814271, 905413, 912655, 833535, 954394, 860910, 921262, 886126, 923962, 958393, 894300, 1018868, 910893, 908926, 880326, 878584, 853769, 821987, 903526, 923638, 904291, 815260, 880141, 914095, 925349, 920655, 951168, 901426, 964588, 1062517, 1126482, 1198262, 1145487, 1126227, 1039827, 1035234, 1099522, 1119149, 1264224, 1251301, 1195830, 1243462, 1258567, 1351524, 1347099, 1455899, 1519398, 1498489, 1587408, 1751458, 1820190, 1755579, 1906473, 2129126, 2220732, 2480150, 2742554]
5621B742554K20159K44356K44472J40098K97846K20263J17203R153N9765r6499
5611D199370j05664J4217J9115r7553j29276p6270j49944p330P6176k0989J30138
5600C851990K82750K51858J55516J99518J23450J18805l2578r4784l9750l86083
5590D430692k07338j24031k71031r4056P9878P9127M7261M6342K04689K12430
5580D403963J78192K39683R2365K0932r4199l2857j16157j94550p0036j77641
5570D249695n2475n0579j02681J22180n6901k7779L8332q4080J98833J02594Q027
5559D345166l2424j57487j96349j49935k17745j52195l33871l90885k00654k30196
5549B283425j90707j04701l0536q7057p8179j50606k18174J5967q3936j17245
$$ y = [2742554, 2962713, 3207069, 3451541, 3591639, 3889485, 4109748, 4226951, 4236104, 4295869, 4199370, 4093706, 4107923, 4127038, 4029485, 3900209, 3823939, 3673995, 3666665, 3742841, 3721852, 3851990, 4134740, 4386598, 4542114, 4741632, 4865082, 4983887, 4951309, 4856525, 4816775, 4430692, 4223354, 4099323, 3828292, 3734236, 3814114, 3893241, 3940502, 3986844, 4191533, 4403963, 4582155, 4821838, 4914203, 4935135, 4840936, 4808079, 4691922, 4497372, 4427336, 4249695, 4197220, 4146641, 4043960, 4166140, 4109239, 4081460, 4119792, 4035712, 4234545, 4337139, 4345166, 4312742, 4155255, 3958906, 3808971, 3591226, 3439031, 3105160, 2714275, 2513621, 2283425, 2092718, 1988017, 1957481, 1870424, 1792245, 1641639, 1423465, 1439432, 1355496, 1238251]
5539A238251k2398k932m2776p0575n0808M7257n0000J27163k3826m5464J8663
5528A122555K8001p9906q9190p0869j06286p2539m991L3451k2291m1748n5179
5517F41008L1884Q5161m2941L2099J7160k1272M3556J4877o4227q580L6671m6694
5505G18702m2620j27573P8504J12873n0177o2429N0251m2585m4545j9965L7912
5494F08348o7579M296K8052M0427q2554j7394J9476q6565M62J09422j748N7028
5482F11671r0116q3006J26580j27368P1142k9642M7078K2346j16110l644k6060
5471D02871J01189K1679l1049M226q6501N9850J1172Q973R4117k1318p3480N7250
5459E48979M3885r5855p416P0376N1885m3853j48197q3234K07515r1548L507Q528
$$ y = [1238251, 1215853, 1212921, 1170145, 1099570, 1048762, 1096019, 1046019, 1173182, 1149356, 1103892, 1122555, 1150556, 1070650, 981460, 910591, 804305, 731766, 726775, 760226, 737935, 696187, 641008, 672892, 758053, 715112, 747211, 764371, 743099, 786655, 801532, 737305, 728725, 765396, 718702, 676082, 548509, 627013, 739886, 689709, 627280, 677531, 634946, 590401, 570436, 608348, 540769, 545065, 573117, 613544, 530990, 513596, 533072, 446507, 446969, 556391, 554643, 611671, 521555, 438549, 565129, 437761, 508903, 479261, 526339, 548685, 432575, 428931, 402871, 504060, 525739, 494690, 498916, 412415, 472265, 483437, 492410, 586527, 565209, 491729, 548979, 592864, 497009, 489593, 559969, 611854, 568001, 419804, 336570, 544085, 452537, 456044, 464572]
5447D64572j5595O7077M4633m0041J07271j22189q0578J30059N2271l9435O181
5436E74226L0206l9973l2236J442j47062O1067O6936m8603l4392o3511P8369J39739
5424E86208k5096j25149N7182J7695k306K0027k3862k3392Q0910j0899j35763
5413D15555K9332M3156P2154P4717r3513r2313l7454J43120K7313Q2496l1515
5402F33048p2251l9853N8781m2943k6810J37041n6144q4921J4249J9233J10034
5391F49464j66326O7647l8703N4133J26500j7340M7536j35185p5719J25422N263
5380F42692N1823j15434j2522L2364J3849R338L4700O7021o0549l5804R7981J30653
5368H56112p8120j2267L4821l922R42Q0493n7166r5157p9359J68125m1481k0772
$$ y = [464572, 448977, 516054, 560687, 520646, 627917, 505728, 425150, 555209, 607480, 568045, 574226, 604432, 564459, 532223, 533665, 386603, 447670, 514606, 466003, 431611, 368100, 446469, 586208, 561112, 435963, 493145, 510840, 508534, 528561, 504699, 481307, 562217, 551318, 415555, 444887, 488043, 560197, 634914, 541401, 449088, 411634, 554754, 582067, 664563, 633048, 560797, 520944, 579725, 536782, 509972, 647013, 590869, 505948, 520197, 539430, 649464, 483138, 550785, 512082, 566215, 692715, 675375, 722911, 587726, 512007, 637429, 642692, 694515, 579081, 566559, 598923, 612772, 622110, 656810, 723831, 663282, 627478, 725459, 856112, 777992, 765725, 800546, 796624, 797566, 878059, 820893, 725736, 646377, 814502, 773021, 752249]
5356G52249K0925N7026k1898k8517l0075J53524K1078q4253J5504L3873J53674
5345A043110j08988M3761M4168Q050n315l1579L2613k1020Q5120K7290J9218P4940
5333A211368m1111J0772J08339K6926J09906O0056L893L3857m0726J15154P5480
5322A673914J05273m6237K5917j19750n7012l480j3605J24895R4249J31245P0225
5311A985634j0487N2231K80321J68057J29709J56690Q3901J79629K61068L97832
5301C684585M08178M25594K34056J39435o5865m62319l63711n49371n42682k86834
5291B621066l27696j79999m4722r4634j26848o1379p0353l0302J6867k30070m931
5280A466999J6927p5925J09067p4565j2271M333j05268M7572k9082K5924m9423
$$ y = [752249, 773174, 830200, 808302, 779785, 749710, 903234, 924312, 840059, 855563, 889436, 1043110, 934122, 977883, 1022051, 1030101, 1024786, 993207, 1025820, 1004800, 1089920, 1117210, 1136428, 1211368, 1170257, 1181029, 1289368, 1316294, 1426200, 1486256, 1490149, 1524006, 1483280, 1598434, 1673914, 1779187, 1732950, 1758867, 1639117, 1582105, 1578625, 1565020, 1689915, 1784164, 1915409, 1985634, 1975147, 2027378, 2307699, 2475756, 2605465, 2762155, 2846056, 3025685, 3286753, 3684585, 4092763, 4518357, 4752413, 4891848, 4825983, 4363664, 3999953, 3450582, 2907900, 2621066, 2293370, 2113371, 2068649, 1974015, 1847167, 1785788, 1715435, 1685133, 1702000, 1471930, 1466999, 1483926, 1408001, 1517068, 1442503, 1430232, 1434565, 1329297, 1376869, 1347787, 1373711, 1324288]
5269A324288n3377M1396J4248J1617P2709J2309Q6206k03912j9325M5741N8439
5258A390339P6608o019l0419N1736R1892r112N5259R7902R4860j4629J46427N8368
5246B003212R1818Q9623K12365J54418R1428K52705K14708L67400N59698M35628
5236D473003L32239L01734j2906l77829l97690n03259m93517k59648k37846k24913
5226B599368j07446j61089r049R231j15894p1735j45180k2734J9611j10357l8819
5215A845907m0877o0263R2984j87938K0066P6687J02844O433L9556J19873l0516
5204A984756k2041N0409J9150L4058j21265j60535L5142j4649M3404m0457p2333
5193A735639j62169j2770j59812J52361k5708m2147M9240M8820m3524M8245M5504
$$ y = [1324288, 1270911, 1312307, 1326555, 1338172, 1410881, 1423190, 1509396, 1305484, 1286159, 1331900, 1390339, 1466947, 1460928, 1430509, 1482245, 1574137, 1565025, 1620284, 1718186, 1813046, 1798417, 1944844, 2003212, 2095030, 2184653, 2397018, 2551436, 2642864, 2895569, 3110277, 3477677, 4037375, 4473003, 4805242, 5106976, 5094070, 4716241, 4318551, 3815292, 3321775, 3062127, 2824281, 2599368, 2491922, 2330833, 2321784, 2331015, 2215121, 2143386, 1998206, 1975472, 1995083, 1884726, 1845907, 1805030, 1744767, 1837751, 1649813, 1669879, 1746566, 1849410, 1855843, 1895399, 2015272, 1984756, 1962715, 2013124, 2032274, 2066332, 1945067, 1784532, 1819674, 1805025, 1848429, 1807972, 1735639, 1573470, 1560700, 1400888, 1553249, 1527541, 1485394, 1534634, 1583454, 1539930, 1588175, 1633679]
5182A633679p5276n8527n5487j5583R8041J1719l4795J7553L9053n241L731p811
5170A551056k4596L3557Q4686M0714M7467M9626q009j41694m3052N4398q9273
5159A554880K4875N5054J25661J5000P9594o1090l3566J2559K6871j00801o5291
5148A633746J83627J28515j72199j09776J86922J2370m8784J30711m4954R7131
5138A997309O770J8566O2449j642k7891J3571o4179J622N0616M315P3093N5237
5126B189836J9844j6309k6040O4449P7395K930j4761L798K7239N4117J817K537
5114B386852P2888p615n8634J65454N3329n390L1632q3549K1012P0953N4180o0630
5102B640482K9325P5724J15965j16854P1888R1737k584J11837K6207j48838j3356
$$ y = [1633679, 1558403, 1499876, 1444389, 1428806, 1526847, 1538566, 1503771, 1521324, 1560377, 1555136, 1558867, 1551056, 1526460, 1560017, 1644703, 1685417, 1732884, 1782510, 1774501, 1632807, 1589755, 1644153, 1554880, 1579755, 1634809, 1760470, 1775470, 1855064, 1793974, 1760408, 1772967, 1799838, 1699037, 1633746, 1817373, 1945888, 1773689, 1663913, 1850835, 1863205, 1814421, 1945132, 1900178, 1997309, 2004079, 2022645, 2085094, 2083452, 2055561, 2069132, 2004953, 2006575, 2057191, 2061506, 2134599, 2189836, 2209680, 2193371, 2167331, 2231780, 2309175, 2312105, 2297344, 2301142, 2328381, 2382498, 2384315, 2386852, 2459740, 2452125, 2393491, 2558945, 2612274, 2606884, 2638516, 2554967, 2575979, 2646932, 2701112, 2640482, 2669807, 2745531, 2861496, 2744642, 2816530, 2908267, 2905683, 3017520, 3043727, 2894889, 2881533]
5091B881533Q3100j0105L1410M6499J0649q637J11578R380L3493N7868J38044
5080C384812J99165r4487N9708l6732L443J08487O9146J7377P6359P8807N3448
5069C919533O1479Q2808J07837k7641J33358J3475J00847R3736l680M5730Q4374
5058D611856J30501L5406J18655J37196Q1142J56927N6216M6033M1227J19470
5048E534629Q0986J31646J18007J53654J91360Q4416J2902J81162J96301K11260
5038F896323O1892J58114J21167P6804J20089J67362L52710R4156J65558K43557
5028H457732J90490K78219L35549L25138K81289J62116L24390L04828L92978L49194
5018A1401923L28690L38192L92807M62807M71089M65656O10748N76327O24901
$$ y = [2881533, 2964633, 2954528, 2985938, 3032437, 3043086, 3034449, 3146027, 3155407, 3188900, 3246768, 3384812, 3583977, 3489490, 3549198, 3512466, 3515909, 3624396, 3693542, 3710919, 3787278, 3866085, 3919533, 3981012, 4063820, 4171657, 4144016, 4277374, 4290849, 4391696, 4485432, 4481752, 4527482, 4611856, 4742357, 4777763, 4896418, 5033614, 5114756, 5271683, 5327899, 5373932, 5415159, 5534629, 5615615, 5747261, 5865268, 6018922, 6210282, 6294698, 6307600, 6488762, 6685063, 6896323, 6958215, 7116329, 7237496, 7314300, 7434389, 7601751, 7954461, 8048617, 8214175, 8457732, 8648222, 8926441, 9261990, 9587128, 9868417, 10030533, 10354923, 10659751, 11052729, 11401923, 11730613, 12068805, 12461612, 12924419, 13395508, 13861164, 14471912, 15048239, 15673140]
5009A5673140P42588Q18097J044872R23274R97635J168496J278712J387232J612272
5000B5646318J509315J510397J563497J534034J305355J380384J371366J124055
4992C6944721J065029R22402Q55597O98370P16767P39073Q57458P23703J047627
4983D4570747J139348J241298J443006J574853J356455J317947R48250Q63012
4975E4454916O34235L72481K91563j9140l9118j48676j40822j32130j79334r8511
4965E4995464J12807P9318L64381N12485O48279R05765J132324J135347J048262
4956F0934432P90047N66269J87533j7611k17797l26600k59265k04066j08778j67206
4946F1176958m31006o74229j094667j473916j754204k021046k235061k326363
$$ y = [15673140, 16415728, 17233825, 18278697, 19201971, 20199606, 21368102, 22646814, 24034046, 25646318, 27155633, 28666030, 30229527, 31763561, 33068916, 34449300, 35820666, 36944721, 38009750, 38932152, 39787749, 40486119, 41202886, 41941959, 42799417, 43523120, 44570747, 45710095, 46951393, 48394399, 49969252, 51325707, 52643654, 53591904, 54454916, 55089151, 55461632, 55753195, 55734055, 55694937, 55546261, 55405439, 55273309, 55093975, 54995464, 55108271, 55187589, 55551970, 56064455, 56712734, 57618499, 58750823, 59886170, 60934432, 61724479, 62290748, 62478281, 62460670, 62242873, 61916273, 61657008, 61452942, 61344164, 61176958, 60745952, 60071723, 58977056, 57503140, 55748936, 53727890, 51492829, 49166466]
4938D9166466k560582k452838k373369k364744k150894j942617j713774j631359
4930C1976289j455296j224148j124024r53394p94022o86292n17833p46348n49686
4921B3925246m27885n40509m64162l31784l36604j04189j45478k20482j62538
4912B1191615k25541j96477j98643j50168j31977J6283m2015R1660J52577J24035
4902B0631349K73751K71592L35616L86468M26869N34030N06544O99947N66948
4893B4633114P42486P31376O21661N11403O83091P57264P68831Q55661R69347
4884C1274234R86239J161722J422062J523097J490150J695441K013044K053580
4876D3619569K113968K359558K364596K261697K300140J928987J786137J423565
$$ y = [49166466, 46605884, 44153046, 41779677, 39414933, 37264039, 35321422, 33607648, 31976289, 30520993, 29296845, 28172821, 27219427, 26425405, 25739113, 25221280, 24474932, 23925246, 23497361, 22956852, 22492690, 22160906, 21824302, 21720113, 21574635, 21354153, 21191615, 20966074, 20769597, 20570954, 20420786, 20288809, 20305092, 20263077, 20354737, 20507314, 20631349, 20905100, 21176692, 21512308, 21898776, 22325645, 22859675, 23366219, 24066166, 24633114, 25375600, 26106976, 26728637, 27240040, 27923131, 28680395, 29449226, 30304887, 31274234, 32260473, 33422195, 34844257, 36367354, 37857504, 39552945, 41565989, 43619569, 45733537, 48093095, 50457691, 52719388, 55019528, 56948515, 58734652, 60158217]
4868F0158217J178174P07840K95365N395k11362m00190l89721n64207m74897l98380
4858E9906234k34477l21968k93192m19191n42484n54626o35747o15489n84549
4849E5704511l09231k82407j7675K26318J53143K61820L39669J75310J37223M0525
4839E6429206J624j16366l77141n54337o03107q73092r08534j121105j426010
4830E0451138j435290j215754j156725j173985r99694r78885q01944p32922q28964
4821D1126975q46511q91833q72081r84739j177779j229790j143334j228367j326356
4812C1426185j160833j038223r95273j075282r21032o29708o67894p57412n51873
4803B3628655l43386k73247l21274l02670j82791n4482k52503k82408j92839j22723
$$ y = [60158217, 61336391, 62044231, 62339596, 62344991, 62133629, 61733439, 61343718, 60779511, 60304614, 59906234, 59671757, 59349789, 59056597, 58637406, 58094922, 57540296, 56904549, 56289060, 55704511, 55395280, 55112873, 55095198, 55321516, 55474659, 55736479, 56076148, 56251458, 56388681, 56429206, 56430830, 56314464, 55937323, 55382986, 54779879, 53906787, 52998253, 51877148, 50451138, 49015848, 47800094, 46643369, 45469384, 44469690, 43490805, 42688861, 41955939, 41126975, 40280464, 39388631, 38516550, 37531811, 36354032, 35124242, 33980908, 32752541, 31426185, 30265352, 29227129, 28231856, 27156574, 26235542, 25605834, 24937940, 24180528, 23628655, 23285269, 23012022, 22690748, 22388078, 22205287, 22150805, 21898302, 21615894, 21423055, 21300332]
4793B1300332j59591n1046M9247O1373r8267q1738k23693l85439k60340l41198
4783A9809640j59831k70157j60370l710j40784j21902J54377J61835Q8765J48936
4773A9506799K24771L89823L81780L24866J87865J34788J13062o8162l21562m56741
4763B0417289n70632m95456m75433m24064k89858j07461n2231M5273O9481K23401
4753A8340309K29234J22782J73458J07324K84986J2332O9919L8831k53621k75984
4743A8849570k32695n20576m13176l60223k81900q4396r0491m0042l5661P7607
4733A6868017J57202K01879K71438K89802K10591M14172L86194L92430L18457
4724A9510182K18730P7445j49869j01563j64531k14431k56890j99406j75697j74813
$$ y = [21300332, 21140741, 21089695, 21138942, 21200315, 21102048, 21020310, 20796617, 20411178, 20150838, 19809640, 19649809, 19379652, 19219282, 19215572, 19074788, 18952886, 19107263, 19269098, 19357863, 19506799, 19731570, 20121393, 20503173, 20828039, 21015904, 21150692, 21263754, 21195592, 20874030, 20417289, 19846657, 19351201, 18875768, 18451704, 18161846, 18054385, 18002154, 18047427, 18116908, 18340309, 18569543, 18692325, 18865783, 18973107, 19258093, 19270425, 19340344, 19379175, 19125554, 18849570, 18616875, 18096299, 17683123, 17322900, 17041000, 16956604, 16866113, 16826071, 16790410, 16868017, 17025219, 17227098, 17498536, 17788338, 17998929, 18413101, 18799295, 19191725, 19510182, 19728912, 19806357, 19656488, 19554925, 19390394, 19175963, 18919073, 18719667, 18543970, 18369157]
4714A8369157j56618k72704k9050J14368O3865J40690J44434K46557K93630K18275
4704A9132604L59942L60021K61950L05622K52287K99517M90194K54069K15901
4695B1932107M14693K31016K60138K74585L90159K93397L11256L84387N15578
4686B5007316N46904O27235P05417Q29793P06973Q83895R16402Q51743R90851
4677C2066529J047577J272990J342965J478567J574661J791662K002388K239649
4669D4816988K673651K967793L495078M170218M819339N646208N526719N233600
4661G9349594L925432J529131n06279k221683l357953l170475k084542j009539
4653G2453686K9828Q42623J272082J749382K423617K759077L492424M067751M520476
$$ y = [18369157, 18212539, 17939835, 17910785, 18025153, 18089018, 18229708, 18374142, 18620699, 18914329, 19132604, 19492546, 19852567, 20114517, 20420139, 20672426, 20971943, 21462137, 21716206, 21932107, 22346800, 22577816, 22837954, 23112539, 23502698, 23796095, 24107351, 24491738, 25007316, 25554220, 26181455, 26886872, 27716665, 28423638, 29307533, 30223935, 31075678, 32066529, 33114106, 34387096, 35730061, 37208628, 38783289, 40574951, 42577339, 44816988, 47490639, 50458432, 53953510, 58123728, 62943067, 68589275, 74115994, 79349594, 83275026, 84804157, 84297878, 82076195, 78718242, 75547767, 73463225, 72453686, 72483514, 73326137, 74598219, 76347601, 78771218, 81530295, 85022719, 89090470, 93610946]
4644I3610946N141440N651008O247540P177981Q016498Q824486R901584J0998695
4636A55570178J2149485J2997632J3789298J3996251J3211458J1280069Q027353
4629B41021724L402729k232484p977609j2206224j4679397j5303835j4584207
4622A77440697j3184508j1535245j0169199q815863p643076o724834n737681n205408
4614A08424883m559525m278955m146203l977321l660844l427501l138449k969670
4606G8266415k572696k266868k214094k032387j933701j890001k179331k059273
4598F1118064k372735k446367k442150k132368j870997k000776j782197j655004
4590D4415470j498254j539368j443175j380911j545126j583132j576163j286135
$$ y = [93610946, 98752386, 104403394, 110650934, 117828915, 125845413, 134669899, 144571483, 155570178, 167719663, 180717295, 194506593, 208502844, 221714302, 232994371, 241021724, 244424453, 242191969, 234214360, 222008136, 207328739, 192024904, 177440697, 164256189, 152720944, 142551745, 133735882, 126092806, 119367972, 113630291, 108424883, 103865358, 99586403, 95440200, 91462879, 87802035, 84374534, 81236085, 78266415, 75693719, 73426851, 71212757, 69180370, 67246669, 65356668, 63177337, 61118064, 58745329, 56298962, 53856812, 51724444, 49853447, 47852671, 46070474, 44415470, 42917216, 41377848, 39934673, 38553762, 37008636, 35425504, 33849341, 32563206]
4582C2563206j242812j265391j171701r61962j068491r72808q25816q40082p65738
4573B3448405p72648p00330p16197o62372n75452m80748n18645m64305m58965
4564A8098743m24587l99194m22762l44311m83307l46964k48709k49004l04107
4555A4875798m24593j85243k11607l51910l02882j51621k61778j23209j47022
4546A2715933k47151k02843j622j45805j17887j84918j71806n6822j16135p4344
4536A1396600j89298J6286N7753n9617j31317J0561K2473L5532J02759Q517j20659
4525A1149590O5034q6824N757P9204q1169K859j1896j52939j89288k41384j69405
4514A0369539j29743l7113q7192j36915j17622M2186P7440K7285R103j86719L3160
$$ y = [32563206, 31320394, 30055003, 28883302, 27921340, 26852849, 25880041, 25054225, 24214143, 23448405, 22675757, 21975427, 21259230, 20596858, 20021406, 19540658, 19022013, 18557708, 18098743, 17674156, 17274962, 16852200, 16507889, 16024582, 15677618, 15428909, 15179905, 14875798, 14451205, 14265962, 14054355, 13702445, 13399563, 13247942, 12986164, 12862955, 12715933, 12468782, 12265939, 12264317, 12118512, 12000625, 11815707, 11643901, 11587079, 11470944, 11396600, 11207302, 11223588, 11281341, 11221724, 11090407, 11100968, 11123441, 11158973, 11261732, 11270249, 11149590, 11214624, 11127800, 11133557, 11212761, 11131592, 11134451, 11122555, 10969616, 10780328, 10538944, 10369539, 10239796, 10202683, 10115491, 9978576, 9860954, 9903140, 9980580, 10007865, 10016968, 9830249, 9863409]
4503I863409q5552j07485J3880r0807K4892M0031M6811J23529O2885K2145R9325
4492A0013063q3345J07601J13442P5359M7084r3852k2944M8803j56622J16391
4482A0164980N1456k55859j55863k75290j66213k00397k1723k7164n749L6225
4472I144403j9197J7182J76025J14878K04165N7844J18706j8211j32756M1811
4462I704850j67164j97286j05567j68585j0931J2465j17401J10304R7060J8308
4452I176053J62204K00046j769K8976J26215K6673j9082J5086L2556P5527N5019
4441I877504L02585l3522o3241J96233L9411J78686J15875R569J47576J23021
4431A0893697L15372K21143J17654O3035J77805J36675M2371N3224J07791K15094
$$ y = [9863409, 9777857, 9670372, 9684252, 9593445, 9618337, 9658368, 9705179, 9828708, 9891593, 9913738, 10013063, 9929718, 10037319, 10150761, 10226120, 10273204, 10179352, 10156408, 10205211, 10048589, 10164980, 10216436, 9960577, 9804714, 9529424, 9363211, 9162814, 9141091, 9113927, 9108178, 9144403, 9125206, 9142388, 9318413, 9433291, 9637456, 9695300, 9814006, 9795795, 9663039, 9704850, 9537686, 9340400, 9234833, 9066248, 9055317, 9067782, 8950381, 9060685, 9157745, 9176053, 9338257, 9538303, 9536534, 9565510, 9691725, 9718398, 9699316, 9714402, 9746958, 9822485, 9877504, 10180089, 10146567, 10083326, 10279559, 10318970, 10497656, 10613531, 10623100, 10770676, 10893697, 11209069, 11430212, 11547866, 11610901, 11788706, 11925381, 11967752, 12020976, 12128767, 12343861]
4421A2343861m33K7327J61938M6621J7208J49389Q8789N5063J01923J40006J41773
4410A3273465L08671J82216J41229K82484K11015J71916L67513K92931J30299
4401A5361739K56589K33989M05979L70101K81999M39971L07622K96345N32793
4392A8487127M48495M77834O77819O45853Q66850R03459R60902J174592J255514
4383B5898445J262087J501116J554519J713589J727520K027880J911413J715078
4375C9311647J597842J391002J048725Q72570O41812N23383O19762M51222M37063
4366D6895028O28190O78092O34639P27315N62087O87208O37213O17685M19280
4357E2486737M99739M71792N62781R14525J135429J417874J961019K361430K720292
$$ y = [12343861, 12343428, 12370755, 12532693, 12579314, 12596522, 12745911, 12834700, 12889763, 12991686, 13131692, 13273465, 13582136, 13764352, 13905581, 14188065, 14399080, 14570996, 14938509, 15231440, 15361739, 15618328, 15852317, 16258296, 16628397, 16910396, 17350367, 17657989, 17954334, 18487127, 18935622, 19413456, 20091275, 20737128, 21603978, 22507437, 23468339, 24642931, 25898445, 27160532, 28661648, 30216167, 31929756, 33657276, 35685156, 37596569, 39311647, 40909489, 42300491, 43349216, 44221786, 44863598, 45386981, 46006743, 46457965, 46895028, 47523218, 48201310, 48835949, 49563264, 50125351, 50812559, 51449772, 52067457, 52486737, 52986476, 53458268, 54021049, 54935574, 56071003, 57488877, 59449896, 61811326, 64531618]
4348F4531618L262933L560569L846411M158416M119076L739163L429322L079530
4340I3727038K462728J763436J113295L71430j42381n85050n77241o39995p96454
4331I6696806p53697r32057j096762j378021j973116k456479l096872l575952
4323H1433850l847482m419710m574405m371883m395558m149801l708222l559760
4315D8407029l124270k772894k536611k156768j897818j767878j511824j415746
4307C1223220j328404j157021r59776r02964p87883o19745o98274m79588n10288
4298B3779277m99860m85644m55461k18652l14386l48367j95328k46482j68880
4289B0846217j61089j90968r6217k21166j41665N1599j32209m9931j2363j07713
$$ y = [64531618, 67794551, 71355120, 75201531, 79359947, 83479023, 87218186, 90647508, 93727038, 96189766, 97953202, 99066497, 99437927, 99295546, 98710496, 98133255, 97493260, 96696806, 95943109, 95011052, 93914290, 92536269, 90563153, 88106674, 85009802, 81433850, 77586368, 73166658, 68592253, 64220370, 59824812, 55675011, 51966789, 48407029, 45282759, 42509865, 39973254, 37816486, 35918668, 34150790, 32638966, 31223220, 29894816, 28737795, 27778019, 26875055, 26087172, 25467427, 24769153, 24289565, 23779277, 23279417, 22793773, 22338312, 22119660, 21805274, 21456907, 21261579, 21015097, 20846217, 20685128, 20494160, 20397943, 20176777, 20035112, 20086711, 19954502, 19904571, 19892208, 19784495]
4279A9784495k752R0902K1602M9133K15445K4094P0139J73194P4945K89303K10541
4268B1001041J13735K40591J71044J80075L59766J08425J1687R4988J2705K1887
4258B2315944Q9396J0060M2864K21603J34160K31134K09144L59730L27148L62725
4248B4303908K31485M89664N51729O03473O39482P68603R50552Q06606P90541
4239C0136043J060845J150428J226646J138694J496600J698052J677654J826577
4231D1411539K196880K418909K398085K710593L167933L235346L390689L545602
4223F4475576L795721M028119L869869L792390L803013L565056L277047K894490
4215I3501281K281125J494805O96775l20116j219845j792735k627071l096483
$$ y = [19784495, 19781743, 19872645, 19894247, 19943380, 20158825, 20182919, 20253058, 20426252, 20501197, 20790500, 21001041, 21114776, 21355367, 21526411, 21706486, 22066252, 22174677, 22186364, 22281352, 22294057, 22315944, 22405340, 22415400, 22458264, 22679867, 22814027, 23045161, 23254305, 23614035, 23941183, 24303908, 24535393, 25025057, 25576786, 26180259, 26819741, 27588344, 28538896, 29345502, 30136043, 31196888, 32347316, 33573962, 34712656, 36209256, 37907308, 39584962, 41411539, 43608419, 46027328, 48425413, 51136006, 54303939, 57539285, 60929974, 64475576, 68271297, 72299416, 76169285, 79961675, 83764688, 87329744, 90606791, 93501281, 95782406, 97277211, 97973986, 97653870, 96434025, 94641290, 92014219, 88917736]
4207H8917736l372967l402115l455751l228497k918900k494908k271214j724290
4199F6049094j280875r01429k81270q0729N09000P57945J085965J650546J949564
4190F9457811K315398K920686L579143L794618M376142M813243N505471O123361
4182A02885873O663212P060434P603636P692932P773691P387708O850206O140660
4174A60058352N106099L782538K736684J623961N21416m77245j045747j630036
4166A70676022k129466k623899k969762l268881l804203m158836m782446n121615
4158A41816914n584302o139815o571090o584883o682186o668820o546160o176983
4150I0862675n820480n563310n132176m625719m261251l753856l415824l142091
$$ y = [88917736, 85544769, 82142654, 78686903, 75458406, 72539506, 70044598, 67773384, 66049094, 64768219, 63866790, 63585520, 63504791, 64013791, 64771736, 65857701, 67508247, 69457811, 71773209, 74693895, 78273038, 82067656, 86443798, 91257041, 96762512, 102885873, 109549085, 116609519, 124213155, 131906087, 139679778, 147067486, 153917692, 160058352, 165164451, 168946989, 171683673, 173307634, 173829050, 173351805, 172306058, 170676022, 168546556, 165922657, 162952895, 159684014, 155879811, 151720975, 146938529, 141816914, 136232612, 130092797, 123521707, 116936824, 110254638, 103585818, 97039658, 90862675, 85042195, 79478885, 74346709, 69720990, 65459739, 61705883, 58290059, 55147968]
4142E5147968k798632k610560k250309j971861j788066j596740j496426j355628
4134C9279746j264943j059752r67935p21433p46031p27805n91531m84897k51975
4125C2463444k91341k15475j08838N7188p4343O4626J41722K2807M5070K54078
4115C2358938Q7026j18812r4618j93434m83673o02830m86263p96558r78745q99168
4105B7791863q43600r57860r15888q92046q24938p59102p71372p15682n37166
4096B0574209n06809n21933k88376l76102m12109l53645k56085r6458l37111k53374
4086A7172207k03061m8067j04702j65515j26163n6782j84648j31745L0944J7579
4076A6200047j20347o9637J16538N7953J4901q7342q6721N6075m1242J43971P0967
$$ y = [55147968, 52349336, 49738776, 47488467, 45516606, 43728540, 42131800, 40635374, 39279746, 38014803, 36955051, 35987116, 35265683, 34519652, 33791847, 33200316, 32715419, 32463444, 32172103, 31956628, 31847790, 31904978, 31830635, 31895261, 32036983, 32059790, 32104860, 32358938, 32445964, 32327152, 32232534, 32039100, 31555427, 30952597, 30466334, 29669776, 28691031, 27791863, 26948263, 25990403, 25074515, 24182469, 23357531, 22598429, 21827057, 21111375, 20574209, 20067400, 19545467, 19257091, 18880989, 18468880, 18115235, 17859150, 17762692, 17425581, 17172207, 16969146, 16921079, 16816377, 16650862, 16524699, 16467917, 16283269, 16151524, 16182468, 16200047, 16079700, 16010063, 16126601, 16184554, 16199455, 16112113, 16025392, 16081467, 16040225, 16184196, 16255163]
4065A6255163J7200J87975M6700J33264K24942P5623J60171J87078J56845L07465
4055A7752426K12368K15444K83304M53000M54530L41293L41324N08098M10318
4046B0972105M46991N70114L67063M00391L87059M23274L49105L30039L54619
4037B4600760K75576N18052N64223N32806O15912N03410P58435O14497N17530
4028B9501201O52125P21051O83831Q20223P84351J016279Q92112Q30790O80887
4019C6582850N97139O55223M77916M75530L96476M33758N35386N25134P75504
4010D1454916Q01940O14540R66804Q00486Q05474O99436Q40126P26601P95609
4001D8505932J078289J112674J147290J349925J479279J360581J425761J495884
$$ y = [16255163, 16272363, 16460338, 16507038, 16640302, 16865244, 16940867, 17101038, 17288116, 17444961, 17752426, 17964794, 18180238, 18463542, 18916542, 19371072, 19712365, 20053689, 20561787, 20972105, 21419096, 21989210, 22356273, 22756664, 23143723, 23566997, 23916102, 24246141, 24600760, 24876336, 25394388, 25958611, 26491417, 27107329, 27610739, 28369174, 28983671, 29501201, 30153326, 30874377, 31558208, 32378431, 33162782, 34179061, 35071173, 35901963, 36582850, 37179989, 37835212, 38313128, 38788658, 39185134, 39618892, 40154278, 40679412, 41454916, 42256856, 42871396, 43838200, 44638686, 45444160, 46143596, 46983722, 47710323, 48505932, 49584221, 50696895, 51844185, 53194110, 54673389, 56033970, 57459731, 58955615]
3993E8955615J403059J407158J283360J274472J337170J477158J699931J842311
3985G0680234J990363K253363K364079K707494L031090L087533L250305L767387
3977I3131848M105091M194163M500850N000587M999369N025709N128824M667296
3969A30753737M263391L901356L108670K759134K526863K384787K197366K216595
3961A54111899K310013K293618K382064K329230K136029J612110J251864O68190
3953A69095017o9948o84319j325586j779218k216282k706188k887453k834033
3945A54591990k905467k899160k742343k557806k312153k243177j907710k032533
3937A34991641k197389k181054k128230k357565k481011k511382k509864k441494
$$ y = [58955615, 60358674, 61765832, 63049192, 64323664, 65660834, 67137992, 68837923, 70680234, 72670597, 74923960, 77288039, 79995533, 83026623, 86114156, 89364461, 93131848, 97236939, 101431102, 105931952, 110932539, 115931908, 120957617, 126086441, 130753737, 135017128, 138918484, 142027154, 144786288, 147313151, 149697938, 151895304, 154111899, 156421912, 158715530, 161097594, 163426824, 165562853, 167174963, 168426827, 169095017, 169025069, 168340750, 167015164, 165235946, 163019664, 160313476, 157426023, 154591990, 151686523, 148787363, 146045020, 143487214, 141175061, 138931884, 137024174, 134991641, 132794252, 130613198, 128484968, 126127403, 123646392, 121135010, 118625146, 116183652]
3929A16183652k447893k581702k838464l235637l810732m270634m750330m984504
3921H7263756n146131m819363m441709l812463l273953k863706k417963k325629
3913E8162839k078984j866913j619973j237240j281217r37761o80848n04449m75668
3904D7479786l50002k52662j55326j14021k80781k53313k66310k78635m52147
3895D5076589n27967n09832m01130n22354m59280l10114k87933k14970k48947
3886D1594062m66483o70469r76514j175934j038650j042085j080015j035046j058010
3877C3050856r63708q45722o90345q30239o69850m32449n66786m98064l27458
3868B7226235k71910k02864j99085j83391k23142R4212J38256J18053K04373N8225
$$ y = [116183652, 113735759, 111154057, 108315593, 105079956, 101269224, 96998590, 92248260, 87263756, 82117625, 77298262, 72856553, 69044090, 65770137, 62906431, 60488468, 58162839, 56083855, 54216942, 52596969, 51359729, 50078512, 49140751, 48459903, 47955454, 47479786, 47129784, 46877122, 46721796, 46607775, 46326994, 46073681, 45807371, 45528736, 45076589, 44548622, 44038790, 43637660, 43115306, 42656026, 42345912, 42057979, 41843009, 41594062, 41127579, 40457110, 39480596, 38304662, 37266012, 36223927, 35143912, 34108866, 33050856, 32087148, 31241426, 30551081, 29720842, 29050992, 28618543, 28051757, 27553693, 27226235, 26954325, 26751461, 26552376, 26368985, 26145843, 26240055, 26378311, 26496364, 26700737, 26758962]
3858B6758962J39972K82735l3631q0069Q3420J20378K50358L41496L71835N75138
3848B8810594N71675P44013P48858R01557J092936J264205J346498J653107J763756
3839C8897199J816701J935787K394596K447899K443554K612378K601045K677183
3831E7826342K570199K634909K483586K353114K062185K027129J811694J517029
3823G5286187J490962J544003J790133K088078K383777K808920L457498M008491
3815I4858049M439776M964816N373724N771617N545097N263055M512414L510173
3807A34238721K058167M81063j274768l160703m848817o142619p157283p899193
3799A06294568q035230p883992p595560p034999o233329n830287n020238m400686
$$ y = [26758962, 26898934, 27181669, 27148038, 27067969, 27151389, 27271767, 27522125, 27863621, 28235456, 28810594, 29382269, 30126282, 30875140, 31776697, 32869633, 34133838, 35480336, 37133443, 38897199, 40713900, 42649687, 45044283, 47492182, 49935736, 52548114, 55149159, 57826342, 60396541, 63031450, 65515036, 67868150, 69930335, 71957464, 73769158, 75286187, 76777149, 78321152, 80111285, 82199363, 84583140, 87392060, 90849558, 94858049, 99297825, 104262641, 109636365, 115407982, 120953079, 126216134, 130728548, 134238721, 136296888, 136777951, 135503183, 132342480, 127493663, 121351044, 114193761, 106294568, 98259338, 90375346, 82779786, 75744787, 69511458, 63681171, 58660933, 54260247]
3791E4260247l927219l414653l013761k587912k428668k042619j779702j590594
3783C3475119j579774j373138j196941j142818q03368r44774r38211p38271p29343
3774B4028481p72091p49573o51438o03155n58008p35118n83574m28727n11289
3765A8435508m23648m16082l55218l82760l58971m17084l86088j79260m02913
3756A5113484k70401k57448j93312l01989k29233k41126j38184j80506k46132
3747A3055153k34703j79563k07720j45077j08909j31528j39900n2621m1260k11539
3737A1602333K2295j31611j69794p2570Q8422n3390j32067n1705j55231j50705
3727A0795977j80444L8964n8917n1324r6412l5840K9642j7010N7853K1486j17322
$$ y = [54260247, 50333028, 46918375, 43904614, 41316702, 38888034, 36845415, 35065713, 33475119, 31895345, 30522207, 29325266, 28182448, 27379080, 26434306, 25496095, 24757824, 24028481, 23256390, 22506817, 21855379, 21252224, 20694216, 19959098, 19375524, 18946797, 18435508, 18011860, 17595778, 17240560, 16857800, 16498829, 16081745, 15695657, 15516397, 15113484, 14843083, 14585635, 14392323, 14090334, 13861101, 13619975, 13481791, 13301285, 13055153, 12820450, 12640887, 12433167, 12288090, 12179181, 12047653, 11907753, 11855132, 11813872, 11602333, 11624628, 11493017, 11323223, 11250653, 11339075, 11285685, 11153618, 11101913, 10946682, 10795977, 10615533, 10654497, 10595580, 10544256, 10447844, 10412004, 10441646, 10424636, 10482489, 10503975, 10386653]
3716A0386653j63996J2719m2828P0453k08091n7268m2288r0021K030j21367p8810
3705I667186M4537K908P3662j37481P1931J13821k7696M1910K3967L6158Q0366
3694I991269M6271J33987N1663r459J61167J12819J33323N2196P649n1246M7721
3683A0677360L7482M7971K6458n8853J22052Q7373p611J15821K22019J54244R0605
3672A1514921P6635J72544K23607K12863J23819J29059J88633J44979J69885J40176
3662A3097121J11231K98866K78917K50058L39091K32140M06944L76359L53312
3653A5744039K93839L38274L61553M73165N06592M66523N52175N55939N62425
3644A9854524N38480N67373M38381M31817N47834M31937N07242M80586M67351
$$ y = [10386653, 10222657, 10235376, 10192548, 10263001, 10054910, 9997642, 9955354, 9865333, 9867363, 9745996, 9667186, 9711723, 9714631, 9788293, 9650812, 9722743, 9836564, 9808868, 9850778, 9874745, 9910903, 9991269, 10037540, 10171527, 10223190, 10213731, 10374898, 10487717, 10621040, 10673236, 10680885, 10629639, 10677360, 10714842, 10762813, 10789271, 10730418, 10852470, 10939843, 10932232, 11048053, 11270072, 11424316, 11514921, 11591556, 11764100, 11987707, 12200570, 12324389, 12453448, 12642081, 12787060, 12956945, 13097121, 13208352, 13507218, 13786135, 14036193, 14375284, 14607424, 15014368, 15390727, 15744039, 16037878, 16376152, 16737705, 17210870, 17717462, 18183985, 18736160, 19292099, 19854524, 20393004, 20960377, 21398758, 21830575, 22378409, 22810346, 23317588, 23798174, 24265525]
3635B4265525N00242M70278N44929M34184O00982O15440N98133O80371O74509
3626B9384593O34529O58739O54650O57878O09503Q92328Q48243Q18557O92354
3617C5851374N32515M78787M07453O25215P27054R79248R73476J214083J524538
3608D3313743J520416J639813J765523J950901K117772K300679K440127K534828
3600E9583802K836385K985532L342780L828847M024015M579914N089566N630952
3592I1901793O615142P331779P897086Q863243R912852J0957390J2143379J3429238
3584A69051902J4743275J5159233J4471321J2508612Q999940N437118K173633
3577B42545034p44338k355857j647118J327676N171737Q918098J2775308J6412314
$$ y = [24265525, 24765767, 25236045, 25780974, 26215158, 26816140, 27431580, 28029713, 28710084, 29384593, 30019122, 30677861, 31332511, 31990389, 32599892, 33492220, 34340463, 35159020, 35851374, 36383889, 36862676, 37270129, 37895344, 38622398, 39601646, 40575122, 41789205, 43313743, 44834159, 46473972, 48239495, 50190396, 52308168, 54608847, 57048974, 59583802, 62420187, 65405719, 68748499, 72577346, 76601361, 81181275, 86270841, 91901793, 98516935, 105848714, 113745800, 122609043, 132521895, 143479285, 155622664, 169051902, 183795177, 198954410, 213425731, 225934343, 234934283, 240371401, 242545034, 241800696, 239444839, 237797721, 239125397, 244297134, 253215232, 265990540, 282402854]
3569B82402854K0145747K4220953K8338653L2238116L4793586L4165093K7705448
3562D84010450J4345484m700280k5075826m0352188m6436485m5024126l9695851
3555B97071178l3561589k7978377k3744006k0252484j7654868j5368943j3439050
3548A45071861j1647454j0241835q903614p714888o907799o022498n380211m908992
3540H3344570m398950l885170l640034l193953k957770k695506k445098k312426
3532E7815663k265132k189521k161221j914295j840582j915335j591070j607395
3524D2331112j517622j336725j374962j222538j178129j008067j050432j019146
3516C2623491q66477q59923o85729p14413o83331o21482p00006n90363p60940
$$ y = [282402854, 302548601, 326769554, 355108207, 387346323, 422139909, 456305002, 484010450, 498355934, 493655654, 468579828, 428227640, 381791155, 336767029, 297071178, 263509589, 235531212, 211787206, 191534722, 173879854, 158510911, 145071861, 133424407, 123182572, 114278958, 106564070, 99656271, 93633773, 88253562, 83344570, 78945620, 75060450, 71420416, 68226463, 65268693, 62573187, 60128089, 57815663, 55550531, 53361010, 51199789, 49285494, 47444912, 45529577, 43938507, 42331112, 40813490, 39476765, 38101803, 36879265, 35701136, 34693069, 33642637, 32623491, 31757014, 30897091, 30211362, 29496949, 28813618, 28192136, 27492130, 26901767, 26140827]
3507B6140827p78743p09071n48292n48807n90274n39866n81237n11440m97026
3498B0836071n24182n28990m64615n01466l49448l08659l37513k95818k94770
3489A7230610l11648l77187l26464m53238l04447l04267m09501k81615l20757
3480A4141486l00341k90161k85735k56818l27454k24913j81636l05878k64156
3471A1704394j70047k55272l39976j87742k18643k54836k91089q7014m1656k93808
3461I564311k45809j93047k78789j93339k24045j93658j59883j49813j09033j25954
3451G690941M7019j03082j03170j03498j82455o3637j86772j45249j08766j37516
3441F603815j69413k2522M11j53989j5223J0561j01579j32740Q65p6309l6067
$$ y = [26140827, 25362084, 24653013, 24104721, 23555914, 22965640, 22425774, 21844537, 21333097, 20836071, 20311889, 19782899, 19318284, 18816818, 18467370, 18158711, 17821198, 17525380, 17230610, 16918962, 16541775, 16215311, 15762073, 15457626, 15153359, 14743858, 14462243, 14141486, 13841145, 13550984, 13265249, 13008431, 12680977, 12456064, 12274428, 11968550, 11704394, 11534347, 11279075, 10939099, 10751357, 10532714, 10277878, 9986789, 9899775, 9858119, 9564311, 9318502, 9125455, 8846666, 8653327, 8429282, 8235624, 8075741, 7925928, 7816895, 7690941, 7737960, 7634878, 7531708, 7428210, 7245755, 7182118, 6995346, 6850097, 6741331, 6603815, 6434402, 6411880, 6412291, 6258302, 6243079, 6253640, 6152061, 6019321, 6020186, 5943877, 5907810]
3430E907810k4987r2850q1443m9764j54674K4324l2112n7421O6915j44945j3147
3419E347706j45291j83741N0551J6335j58769j79107j01775r6434j00741j01155
3409D347579n8560j61338n5680J918j21161m7665j7385m2909m00n5152K4706o4519
3397C749434j031j28397k694j3765k9245j01905m7332j1784j8767j6622k8320
3386C349572o0846O9984q8888j82840j3845n114k9522j48583M5410l31K9410k5623
3374B938784q9022l7385R4935R561n0568j45840l7429l8652M4375k7607L9397
3363B700549l2246j91465m2275L1219j28571q6742m7900K781N317m3555o8897
3352B098215j56253o8378O4918O566k3530k0348p749O8957Q3086n5221N9558n5040
$$ y = [5907810, 5882823, 5789973, 5708530, 5658766, 5504092, 5528416, 5496304, 5438883, 5505798, 5360853, 5347706, 5202415, 5018674, 5069225, 5085560, 4926791, 4747684, 4645909, 4549475, 4448734, 4347579, 4289019, 4127681, 4072001, 4073919, 3952758, 3905093, 3887708, 3844799, 3844399, 3789247, 3813953, 3749434, 3748403, 3620006, 3617312, 3603547, 3574302, 3472397, 3425065, 3413281, 3394514, 3377892, 3349572, 3288726, 3358710, 3269822, 3086982, 3073137, 3068023, 3038501, 2889918, 2935328, 2934997, 2964407, 2938784, 2849762, 2812377, 2907312, 2916873, 2866305, 2720465, 2683036, 2644384, 2688759, 2661152, 2700549, 2668303, 2476838, 2434563, 2465782, 2337211, 2250469, 2202569, 2205350, 2210667, 2167112, 2098215, 1941962, 1873584, 1938502, 1945068, 1921538, 1901190, 1893441, 1962398, 2045484, 1990263, 2049821, 1994781]
3340A994781K36J8223J5694q302k2475j05709J29447Q1931L3622L627J12935O9331
3328B323341J42473J67160p6208O821R5112O8766L7155K7149l5620o4665n3938
3317B637546J23224n2077J7532O3566J30756K12583K53004J0414K01675J04349
3307C702572M3499L4530n3769j21716k66466k40061p4976k92229j85379j84818
3297B361187j48208l5563j32982j5583L4811j50544j56789M4038n9912o5679j29591
3286A545185p2189L0524J05622n2456j53248r210j3066m9132o3547J5556n3582
3275A230457Q2022p7098q6856N9625L043J6008j09823j26635o7330Q3492N2870
3264A059775M854n5781Q5783p3980p1599p8834o4727M9778N2603O8366n5891j33768
$$ y = [1994781, 1995017, 2013240, 2028934, 2020632, 1998157, 1892448, 2021895, 2103826, 2137448, 2141075, 2254010, 2323341, 2465814, 2632974, 2556766, 2563587, 2658699, 2727465, 2764620, 2791769, 2756149, 2691484, 2637546, 2760770, 2708693, 2726225, 2789791, 2920547, 3133130, 3386134, 3396548, 3598223, 3702572, 3746071, 3780601, 3726832, 3605116, 3338650, 3098589, 3023613, 2731384, 2546005, 2361187, 2212979, 2177416, 2044434, 2028851, 2063662, 1913118, 1756329, 1800367, 1740455, 1674776, 1545185, 1472996, 1503520, 1609142, 1556686, 1403438, 1394228, 1381162, 1332030, 1268483, 1284039, 1230457, 1312479, 1235381, 1148525, 1208150, 1211193, 1227201, 1117378, 990743, 923413, 1006905, 1059775, 1064629, 1008848, 1094631, 1020651, 949052, 870218, 805491, 855269, 907872, 976238, 920347, 786579]
3252G86579k9915m029K5695O8718q5732Q4538o3883K5581Q7491O4134M45n9296
3240I00326J5159r2094o4267P3593R6707l9531j09241m1536M944o1031N2091J07045
3228H42165j13713J9448k4321K8891J09706l5201r7412l9784n3252M4003j08436
3217E72094O8620N2537L3741J6725o7402p3236M324L7789j06375P6962M723r0207
3205E30295n0153Q65M1362R720O8170J14672L1951n8157j33073j992k2851K6226
3193E57035p0224J51779j7442k1915N8954m194m809J7646K3377o4066o060j4943
3181F05138l3245J14075k684q8918j2733q6664n556J22095p3813N5669J4719N7138
3169F65221J20757j44206J400k9212p7822k0112M0326O1582O7906J77092j67862
$$ y = [786579, 756664, 752635, 778330, 847048, 761316, 845854, 781971, 807552, 895043, 959177, 959622, 900326, 915485, 823391, 759124, 832717, 929424, 889893, 780652, 739116, 744060, 683029, 735120, 842165, 728452, 747900, 723579, 752470, 862176, 826975, 729563, 689779, 636527, 680530, 572094, 640714, 693251, 726992, 743717, 676315, 603079, 607403, 645192, 538817, 615779, 620502, 530295, 480142, 481007, 522369, 532089, 600259, 714931, 746882, 688725, 555652, 553660, 530809, 557035, 486811, 638590, 621148, 599233, 658187, 653993, 649184, 666830, 690207, 626141, 620081, 605138, 571893, 685968, 683284, 594366, 581633, 494969, 489413, 611508, 537695, 593364, 608083, 665221, 785978, 641772, 643172, 613960, 536138, 516026, 556352, 617934, 685840, 862932, 695070]
3158F95070j627j18805K1362O3936k9589p0176q0188J38456l3296L8867j6279
3147F07731P173R0184P4452n5063M9857N4562k0215L0149m7384k5213p4449o6510
3135F25274L1052M755k1212K9358K0018n8975q3805o1547O3931J00559J4968j25542
3123E38834N3622j69089j2703O6967R729J20880k2221k6364m9885M3261R6957
3112F49988m9429L8315m1511j29735R1089J61632o5878p2619p1330p6469O1807
3101D95860j19791K5353k0551j5911N401J6492N6486M9277j00943M7593J23270
3090E62536J0102m6360r3946R9313J7527p5595k9663m766o7060j2743o587M4639
3078C97397M1930r8107l339N5278P6497L8796k5326k30246J2460J55566k0188
$$ y = [695070, 693443, 574638, 596000, 659936, 630347, 560171, 479983, 618439, 585143, 624010, 607731, 614904, 705088, 779540, 724477, 774334, 828896, 808681, 838830, 791446, 766233, 691784, 625274, 656326, 661081, 639869, 669227, 689245, 630270, 546465, 484918, 548849, 649408, 664376, 538834, 592456, 423367, 410664, 477631, 487360, 608240, 586019, 559655, 509770, 553031, 649988, 600559, 638874, 597363, 467628, 558717, 720349, 654471, 581852, 510522, 434053, 495860, 376069, 401422, 380871, 364960, 370361, 386853, 443339, 492616, 391673, 439266, 562536, 572638, 526278, 432332, 531645, 549172, 473577, 443914, 439148, 372088, 359345, 352758, 397397, 439327, 341220, 337881, 393159, 469656, 508452, 483126, 252880, 265340, 420906, 400718]
3067D00718J28584j07899l2123P0787L3331m0485N5761j765j3303m0231M9157
3056E02532n2568O8005J12200n2234n2447j9150j10292j239M0913O2245r6758
3045D01207Q5296m7332j47919M3061M6341J51748K7213M748n4559p4611J02264
3034E37457l5699j44041K4684L5569P1220k5280k115n0102M4999O4340m3671L1389
3022E08750O7900j7608l4251M5668m0067j05464J17551k7201M8143L0496n5850
3011E38067M4371J5666p4927k4786J4342J59110J5233r5461m2713o1859m5669
3000D41374J15272R0508l3558k4938M5861J19871L8889p2100m966K740P2475Q2239
2988H73667J2535n2125M0754M7064K2416L7918l9768Q5022R4377N9723J22011
$$ y = [400718, 529302, 421403, 389280, 460067, 493398, 452913, 508674, 506909, 493606, 453375, 502532, 449964, 517969, 630169, 577935, 525488, 506338, 396046, 394807, 435720, 497965, 401207, 486503, 439171, 291252, 334313, 380654, 532402, 559615, 564363, 509804, 435193, 537457, 501758, 357717, 382401, 417970, 489190, 463910, 461795, 411693, 456692, 521032, 477361, 508750, 576650, 559042, 524791, 570459, 530392, 424928, 542479, 515278, 563421, 593917, 538067, 582438, 598104, 523177, 498391, 512733, 671843, 687076, 591615, 548902, 487043, 441374, 556646, 647154, 613596, 588658, 634519, 754390, 793279, 721179, 716213, 718953, 791428, 873667, 886202, 834077, 874831, 921895, 944311, 982229, 942461, 1027483, 1121860, 1181583, 1303594]
2977A303594O243r6766K4178M326J25437J12551m5716J7003k7745J6178J10335
2966A549618L2546o3305R91m7674O1244K3231K1983j5352m2437P4480K1686n7437
2954A559574j07944p656J41412J17261q4082j8053J81732M9243P6858P7874J35121
2943B121340L569j5635P3066J54091M6404Q8914r456K15212J40625K4261J27584
2932B969975J07175K35356J92091K56582J75284K93973K47541M56975L27870K30758
2922E493580J67110L97241M76564L72349M97836P24116Q28436J036852R89779
2913A0983863J010656R45032J296317J439136J779034K157199K601768L299188
2905B5512193M305315N390242P353523Q864471O639931K482865n855601j2051276
$$ y = [1303594, 1309837, 1213071, 1237249, 1241575, 1367012, 1479563, 1433847, 1450850, 1423105, 1439283, 1549618, 1582164, 1518859, 1519850, 1472176, 1533420, 1556651, 1578634, 1563282, 1520845, 1595325, 1617011, 1559574, 1451630, 1443974, 1585386, 1702647, 1618565, 1600512, 1782244, 1831487, 1908345, 1986219, 2121340, 2124909, 2109274, 2182340, 2336431, 2382835, 2471749, 2462293, 2677505, 2818130, 2842391, 2969975, 3077150, 3312506, 3504597, 3761179, 3936463, 4230436, 4477977, 4934952, 5262822, 5493580, 5660690, 6057931, 6534495, 6906844, 7404680, 8128796, 8957232, 9994084, 10983863, 11994519, 12939551, 14235868, 15675004, 17454038, 19611237, 22213005, 25512193, 29817508, 35207750, 42561273, 51425744, 58065675, 60548540, 54692939, 42641663]
2897D2641663r980962o468264m472690l168880k374928j945057j575094j309087
2889A1346701q40543p03350n50905o34611p74282p32021o90588n61601l79996
2880E478804k77081k96723k77522j98209k43731k57764j01572j97026j08993j40932
2870C379251n0036j75762r6731o0692j32227k3945j90066r5892j05669j37699
2860B310532j60382L577q7805q4716k8022N2467j64558j25013K3219q4267P7949
2849A732981q0864K2915q5146j9390j56485q8369j46962m4164J5099k4031O5406
2838A190990n9791k9080J1552n2490O9799j17829j47005n9045L2452J26859K5528
2827I91940k8684L9149q1743L8970m0191n1329K0678J1993N5928o4756k7719j14726
$$ y = [42641663, 32660701, 26192437, 21719747, 18550867, 16175939, 14230882, 12655788, 11346701, 10506158, 9802808, 9251903, 8617292, 7843010, 7110989, 6420401, 5858800, 5478804, 5201723, 4905000, 4627478, 4429269, 4185538, 3927774, 3826202, 3629176, 3520183, 3379251, 3329215, 3153453, 3056722, 2996030, 2863803, 2839858, 2649792, 2553900, 2448231, 2310532, 2150150, 2153727, 2065922, 1981206, 1953184, 2005651, 1841093, 1716080, 1739299, 1655032, 1732981, 1652117, 1675032, 1589886, 1570496, 1414011, 1325642, 1178680, 1134516, 1149615, 1125584, 1190990, 1131199, 1102119, 1113671, 1061181, 1130980, 1013151, 866146, 807101, 839553, 966412, 991940, 963256, 1002405, 920662, 959632, 919441, 868112, 888790, 900783, 956711, 891955, 864236, 749510]
2815G49510j13277N2581R8456q8393K905O9364j28172o776L336q566K0910o1908
2803E89970l5143J1908j00798M0076R2335n9828j11286j8318Q4128L3301P3723
2792F00068j9685j85401j37092J08542K7031M1420K7543o7568n1927N2975q5495
2781C10411j9087J0141J7049o6572n130M8852M6321k5251j06299K531J60332r1822
2769B81476O8865r5778l6247M1515Q6564J0124n9011l2349M4231K8045m4381l9060
2757B53994q5813P2135j2236n8388Q7239J0172j02454N2249n8375K0486l5674
2746A43335l6074n3160J78390l8226j52J8934j9405O3597j18862J0078O675O5518
2734B20648m6173N5293o944m7131M901p3541k2647j2456M2039K1123R4705j0P7320
$$ y = [749510, 636233, 688814, 787270, 698877, 701782, 771146, 642974, 636198, 639534, 630968, 651878, 589970, 554827, 566735, 465937, 506013, 598348, 538520, 427234, 408916, 493044, 526345, 600068, 580383, 394982, 257890, 366432, 393463, 434883, 462426, 394858, 342931, 395906, 310411, 291324, 301465, 318514, 251942, 246812, 295664, 341985, 316734, 210435, 212966, 373298, 281476, 350341, 254563, 218316, 259831, 346395, 356519, 297508, 265159, 309390, 337435, 293054, 253994, 168181, 240316, 228080, 169692, 256931, 267103, 164649, 216898, 158523, 179009, 143335, 107261, 54101, 232491, 194265, 194113, 213047, 193642, 257239, 138377, 148455, 155130, 220648, 174475, 229768, 222824, 175693, 180594, 107053, 84406, 71950, 113989, 135112, 229817, 229807, 307127]
2721C07127o4780n7704j8034L5745j24432M8508R3700P786L5951l9883p5493J22063
2709B70554m936o0578k4588J657m2335N7473m2366N6869K9351r6869P0722q685
2697B06269n5117l5561m9727j4424Q6014J2878O1605k0747M4713o2336m3500p6278
2685E3789J5064N2706M2555k9079O7379k8159L311j16265n4046j0025K2366m0519
2673b0923L2438J02010K893L7008r9498L8052R1360J24401l5091l0048l7790L9998
2661B44810N729N2727P235J14818R0671K7601j55530j46623K6053l5319J6414
2650B48586m3834l6958j5825q072M7810L5102j11692K2353k3952j22270m3796
2639e2548M1425P6875P3469o9778p213L1804J7437j6366L6529n6463M1651P1101
$$ y = [307127, 242347, 184643, 166609, 202354, 77922, 126430, 220130, 227916, 263867, 223984, 148491, 270554, 265618, 205040, 180452, 182109, 139774, 197247, 154881, 211750, 241101, 144232, 214954, 206269, 151152, 115591, 65864, 51440, 137454, 150332, 211937, 191190, 235903, 173567, 130067, 53789, 68853, 121559, 164114, 135035, 202414, 174255, 177566, 61301, 7255, -2770, 19596, -20923, 11515, 113525, 116418, 153426, 53928, 91980, 183340, 307741, 272650, 242602, 204812, 244810, 250539, 303266, 310501, 425319, 515990, 543591, 388061, 241438, 267491, 232172, 248586, 204752, 167794, 151969, 143897, 191707, 226809, 115117, 137470, 113518, -8752, -52548, -11123, 65752, 139221, 69443, 62230, 94034, 111471, 95105, 131634, 75171, 116822, 187923]
2627A87923j17147m3832R0691O6472J6523j06128p1198L269J23726p5101k0017
2616E5181m7931L0781J18117k8897j1261M36n0008n7277j5119K1967R659N2349
2604G7997L1628j24131j2727M2335j5824Q0997K790p6142j1370k001J4269K1238
2592B9059K9920m3181O8410n9888k8564O953L4916l8408j02127n0904K03374Q7495
2580A37055M6222q3857R9821j39800j12871J67636k6368r9959m2270K2884P7808
2569D6301m845p1460N8782O8450k8428j40912Q7290k0061p963N1574k9087o0304
2557e0663J21436J40684N9618j37764j8490P2255j04633j8427l0428j9965P5672
2546H9295J8032n1976p8552K9059k2263j01026O6324J7757J7252m9200J6452j8873
$$ y = [187923, 70776, 26944, 117635, 184107, 200630, 94502, 23304, 26573, 150299, 75198, 55181, 7250, 38031, 156148, 127251, 115990, 116426, 66418, 9141, -5978, 15989, 25648, 77997, 109625, -14506, -27233, 15102, -722, 80275, 83065, 6923, -4447, -6448, 7821, 29059, 58979, 15798, 84208, 24320, -4244, 2709, 37625, -783, -102910, -153814, 49560, 137055, 183277, 99420, 199241, 59441, -53430, 114206, 87838, -12121, -54391, -31507, 46301, 41456, -30004, 28778, 97228, 68800, -72112, 15178, -4883, -12846, 38728, 9641, -50663, 70773, 211457, 271075, 133311, 114821, 187076, 82443, 64016, 33588, 13623, 89295, 107327, 55351, -23201, 5858, -16405, -117431, -51107, -33350, -16098, -65298, -48846, -67719]
2534f7719J86652J7366j37245n5774Q5520K7307m5060J7756n4969L2138P7379
2523H3351n4663j01339N9346j8279K7064q802J12813n4517K0073p862l185r5566
2511d1566M0218R9404q4608O1445j00506M248J93769l4968k1846p5028j16348
2500g5786Q5832K11606l9472k6607N1358m0705o1277p0130L8597K8770j64995
2489f2809j19441R7245P3823J0133L493k3981l4161K2935l1746P3097j318J8159
2477B5429M3511R288l1558K1537j10994J1870p022O7409O067M2789k9401m5405
2465C520O9096R8417k4996j04190m8354K846P1905r7977p9943J03600p1384j70581
2453b48041J41068N4709K8402k4653o2001m2240J32267m8429L2666N2835j28236
$$ y = [-67719, 118933, 136299, -946, -56720, 28800, 56107, 11047, 28803, -26166, 5972, 83351, 28688, -72651, -13305, -31584, -4520, -13322, 99491, 44974, 65047, 57185, 54000, -41566, -1348, 98056, 13448, 74893, -25613, -21365, 172404, 137436, 115590, 40562, -75786, 10046, 221652, 182180, 155573, 206931, 166226, 104949, 34819, 73416, 102186, -62809, -182250, -85005, -11182, -1049, 2444, -21537, -55698, -32763, -64509, 8588, 7270, 25429, 68940, 78228, 46670, 68207, -42787, -30917, -37939, 29470, 35537, 78326, 48925, 3520, 72616, 171033, 146037, 41847, -6507, -3661, 68244, -29733, -109676, -6076, -77460, -248041, -106973, -52264, -23862, -48515, -110516, -152756, -20489, -68918, -36252, 16583, -111653]
2442a11653J15763N162j21039Q1524m872L022J7369j608M7578l7004R1691M6083
2430A32016p4593N9934k322j17870J23368m6673l2977L1168M8493o681r4468l7323
2418a7928n2065N7166M1498l0494m367M4331q0611K4567k7745K5493m99J7946
2406b708P1296p6627J08557Q159L5243m513j27168j7794N6783j2462J1927p7333
2394b6640n3123M8745j5876L5261l759O3803R607J6930n1444j34759K8250P6030
2382f975q1280P8603J7606m6477L942L9077p1072r211J15096o6861m1249R0718
2370B1917Q7290j44545m6306M4519j67355L6152M1754R1083K2410r8197R844l7306
2358a38740O5451P3314m354M9574O4389p4107o5408Q314Q863R6465p2743K650
$$ y = [-111653, 4110, 9272, -111767, -30243, -35115, -32093, -14724, -16332, 31246, -5758, 85933, 132016, 57423, 117357, 115035, -2835, 120533, 73860, 40883, 72051, 120544, 113863, 19395, -17928, -69993, -12827, 28671, -1823, -6190, 38141, -42470, -17903, -45648, -20155, -20654, -2708, 68588, -8039, 100518, 108677, 143920, 139407, 12239, -5555, 51228, 38766, 50693, -26640, -79763, -31018, -46894, -11633, -15392, 48411, 58018, 74948, 23504, -111255, -83005, -6975, -88255, -9652, 7954, -38523, -34581, 4496, -66576, -75787, 39309, -27552, -68801, 21917, 109207, -35338, -81644, -37125, -204480, -168328, -126574, -35491, -13081, -111278, -101434, -138740, -73289, 25, -4329, 45245, 109634, 35527, -29881, -21567, -12704, 83761, 11018, 13668]
2346A3668P6815j61246J03113j29534j5411J76900p3278J99199r3842q1045O5833
2335H1172k452N1992m4711j39743K6495L9903l1053k383p170n4976M5244P6109
2323C8427o4223k6459K9107P3746j30108o2202J30717r593M8491L1058j23328
2312f4367K4001Q1997l5911J7035N4317j31182m4998P9518j2960q605r9954O3905
2300g7204J852N5752P271m9960M3785m8533K957j3019L5797R9942J6858o6671
2288H827J3380n8909k0040m3914M0184n190N9374K1779K5612M7627P9719j27099
2276D1350n0156m5209o5421K6137k9666o9049P5878J8610J34591j30263J63788
2265G0590O5248r508l1007r3002r546p0047L6895q0253K23385K5590j1293M9q3125
$$ y = [13668, 90483, -70763, 32350, -97184, -112595, 64305, -8973, 190226, 96384, 15339, 81172, 78720, 130712, 86001, -53742, -27247, 12656, -18397, -20780, -27950, -82926, -37682, 38427, -25796, -52255, -23148, 50598, -79510, -141712, -10995, -20588, 27903, 58961, -64367, -40366, 41631, 5720, 22755, 77072, -54110, -99108, -19590, -32550, -41155, -141109, -77204, -75352, -19600, -12329, -62289, -18504, -67037, -64080, -77099, -41302, 58640, 75498, 8827, 22207, -36702, -56742, -100656, -60472, -65662, -6288, 15491, 41103, 88730, 168449, 41350, -8806, -54015, -119436, -93299, -122965, -192014, -116136, -97526, 37065, -93198, 70590, 135838, 126330, 95323, 2321, -7225, -77272, -40377, -120630, 102755, 128345, 117052, 117101, 33976]
2252C3976n6637m3475l2170J75139l3946o8456j1697m0837k425k3949M1086l8308
2240a01699o860P1146P2543P1588M2719l5773p2534q2245l7666L5536n7968j05406
2228b06619N4118K1474J56311k0917p492P8354j86667k2971Q3057L1680r9141
2217a18813q4973k3420J60933M7899o8936o107J22412j6224j26335P4914N0623
2206A1973L838n2470q9886L7712O3854k3037N2776N2604o8549O3499p5720m0592
2194f3998O8494o738j9110p0570k2612N0318r065L5947P9319L1208p0182r0993
2182h7982k5364L9974k0771J83850r981l1184r1133n1623n7348N0030Q136M0630
2170e2766J1949m3296J30891L0312J6655k0258N4527j78187o7483N9626P6978
$$ y = [33976, -22661, -66136, -98306, 76833, 42887, -25569, -37266, -78103, -80528, -104477, -63391, -101699, -108559, -37413, 35130, 106718, 149437, 113664, 41130, -41115, -78781, -43245, -101213, -206619, -152501, -131027, 25284, 4367, -3125, 75229, -111438, -134409, -51352, -19672, -118813, -203786, -227206, -66273, -18374, -87310, -93417, 28995, 12771, -113564, -38650, 11973, 15811, -36659, -126545, -88833, -24979, -48016, 4760, 57364, -11185, 52314, -23406, -63998, 4496, -2242, -21352, -91922, -114534, -64216, -73281, -37334, 41985, 73193, 3011, -87982, -113346, -73372, -94143, 89707, 79726, 48542, -42591, -94214, -151562, -101532, -93396, -52766, -40817, -84113, 46778, 77090, 93745, 73487, 128014, -50173, -117656, -58030, 18948]
2159A8948p3212L5743p3907K2702p092q1028N1877M3364m0690Q483R7063l2054
2147b9803L8218m2783M3797l343l1170l384P6723j16665N764l2396l6102J6296
2135a14848M0101J760N5534n2743J08092m0148j12964k6281m185R5232m698P7068
2123B1920k8157M5933O3988l6333j38774r328O8746m7012j0004N6409J5362q4327
2111h1577q1928J13784k1080M0744l3365k9456k1380J80863l547n7844l7007r8321
2099a30114R385M9595n195L2169k805r6586q0380J27987R1150Q464K6497l7540
2087g373P4148O8993j698j8857r204j8606j45972m1098l1425M8024k8237M8947
2075f2358J38962j13001j05246J10885J12260j31193M5100Q3682j34061r9493
$$ y = [18948, -54264, -18521, -92428, -69726, -76818, -157846, -105969, -62605, -103295, -94812, 2251, -29803, 8415, -34368, 9429, 6086, -25084, -28468, 48255, -68410, -62646, -95042, -131144, -114848, -74747, -72987, -17453, -70196, 37896, -2252, -115216, -141497, -145682, -50450, -55148, 21920, -6237, 39696, 103684, 67351, -71423, -80751, -12005, -59017, -69021, -12612, 2750, -81577, -163505, -49721, -70801, -30057, -63422, -92878, -114258, 66605, 63058, 5214, -31793, -130114, -120729, -71134, -76329, -44160, -46965, -143551, -223931, -95944, -4794, 3670, 30167, -7373, 66775, 135768, 134070, 115213, 106009, 87403, -58569, -99667, -131092, -83068, -111305, -62358, 76604, -36397, -141643, -30758, 81502, -49691, -4591, 79091, -54970, -154463]
2065a54463J9079M8751m152N8616O102n4397P5394R0812j23281m0301k6884J38508
2053C3784Q4611k885j33273K3559m0274J6466l5222J9905R2344j37310l513J11766
2041B9958K8312l6177O3451j18755n7406J5875R4458Q83l8969J2816L7521j76195
2029a44228k3048L2323o2892N1840O8471J71287p550J8033J3567j52004j11791
2018a45992O2172J32780k6889L8807j38753O0006Q157K498r2215l8048J09236
2007b8241o1712M4963N0850L486o6173j8400M5506J4229p0476L1602R2016q8638
1995e0988j29413P1687l4011n4041R7479j82281k952J67983P4089K8922n9686
1984g3212n7453n632M2091K2166J646M8099q2623J33255j865k0634r9476q1843
$$ y = [-154463, -135384, -86633, -90785, -32169, -26067, -80464, -5070, 85742, -37539, -77840, -104724, 33784, 118395, 115510, -17763, 5796, -34478, -18012, -53234, -33329, 59015, -78295, -81808, 29958, 58270, 22093, 85544, -33211, -90617, -74742, 19716, 20599, -18370, -5554, 31967, -144228, -167276, -134953, -197845, -146005, -77534, 93753, 86203, 104236, 117803, -34201, -145992, -83820, 48960, 22071, 60878, -77875, -17869, -9712, -7214, -99429, -137477, -28241, -89953, -44990, 5860, 9346, -56827, -75227, -29721, -15492, -85968, -54366, 37650, -50988, -180401, -108714, -142725, -196766, -99287, -281568, -284520, -116537, -42448, -13526, -73212, -130665, -136297, -94206, -72040, -70394, -22295, -104918, 28337, 26472, 5838, -93638, -175481]
1972a75481M1317J12570n2699L5018q072Q1153l5910o1880J1517M2827P2203q9969
1960b7406Q2919q0979l9568P8346P6728m3010q0740l6461Q3612p6999l2024P3631
1948b1951m4049l2315L311J2020P3483K5338o3841j2124m7260L4094q4241k480
1936a60015O5075J3707R4200r4060O6393k5790r1806L7397L5983O7517p9849L4542
1924c6706O1192o9913l9351k5753K0715J15474j6136o1193K006O49j0797O7350
1912G537j32766m1796R0939m9981j987L9966O6571N692J6368n5154N9387l5802
1900c1026r2613M4178Q1861o4550J36616j4726k6586r1830j5350m2245J08144
1889h127n9636j25591J3368J07781Q9950J09979n2504j43115J10540n1725j55128
$$ y = [-175481, -134164, -21594, -74293, -39275, -47347, 33806, -2104, -63984, -52467, -9640, 62563, -27406, 55513, -25466, -65034, 13312, 90040, 47030, -33710, -70171, 13441, -63558, -95582, -21951, -66000, -98315, -95004, -82984, -9501, 15837, -48004, -60128, -107388, -73294, -157535, -160015, -94940, -81233, 12967, -81093, -14700, -40490, -132296, -94899, -58916, 8601, -71248, -36706, 24486, -45427, -84778, -110531, -89816, 25658, 9522, -51671, -49665, -49016, -59813, 7537, -125229, -167025, -76086, -126067, -128054, -88088, -21517, -15825, 543, -54611, 4776, -31026, -123639, -79461, 2400, -62150, 74466, 59740, 33154, -58676, -74026, -116271, -8127, -67763, -193354, -179986, -72205, 17745, 127724, 75220, -67895, 42645, -9080, -164208]
1878a64208n9557j3368J91590P1110j336q4377K2911J07271r2228j09702L6629
1867i5265J39148j3598M250o654p3422o631m9645Q4948K967r6075Q1184J5614
1855a3179K1547m393K4864j04210m2874N1848l5756M5827p2003n4216K05122n618
1843A6959k09540p2778J40140m1596Q8883J47107J1719j33191k2857L4536m5319
1832h5937N3168Q9898N0095n9127j40492o9096N3359J63108j17448k6021N7698
1821c0795l9400J7579K4459M4751j65473k1352Q7857k7998M3495P5897R9325j37122
1809b8777P4306j32594r4635K1853j32451J80180J08659M8204o2875J0166K0857
1798A2893N8121j5155j1128K1193l42j8911o9487J0324r168k5502J7602l7657
$$ y = [-164208, -223765, -237133, -45543, 25567, 24231, -60146, -37235, 70036, -22192, -131894, -95265, 43883, 30285, 34535, 27881, -45541, -52172, -101817, -16869, -13902, -109977, -28793, -13179, 8368, 3975, 28839, -75371, -118245, -66397, -102153, -56326, -128329, -182545, 22577, 16959, -192581, -265359, -125219, -166815, -77932, 69175, 80894, -52297, -75154, -40618, -85937, -32769, 57129, 107224, 48097, -92395, -161491, -108132, 54976, -62472, -88493, -30795, -70195, -52616, -28157, 16594, -148879, -170231, -82374, -110372, -66877, 9020, 108345, -28777, 45529, -87065, -181700, -159847, -292298, -112118, -3459, 44745, -18130, -7964, 12893, 71014, 55859, 44731, 65924, 65582, 46671, -22816, -12492, -21660, -47162, -29560, -67217]
1786f7217m4884Q8718l5014K8753K3235n1999l2784l8365M4455Q5716m0815j5888
1774e6089R7006o2364m9817J59011m0922n00r9642P3558n0786m103O2258l1854
1762d244j12345j00237J01893N1966O5771L7150L9842k5180K4471q0525K5979
1751B4541l7875O6276l7923p0341N0582J1554K4495j5950n5886L4967j20299j0644
1739a36503R2322p7964O669J6006P4164L7858n7476M0618k0511k8888J0147L3897
1727i661o1702l2951p9524n8779L4670J28782L4889j21847J88445o9504N843j1985
1715e3324k5158O1911r890K1904O7669N1738n5098q1837L2706o29r0979k0850
1703a01837j13466J3090J16467J43294J94l3199k8600l159j29002o3717l6715
$$ y = [-67217, -112101, -23383, -58397, -29644, -6409, -58408, -91192, -129557, -85102, 614, -40201, -56089, 40917, -21447, -71264, 87747, 46825, 46325, -53317, 20241, -30545, -34648, 27610, -4244, -116589, -216826, -114933, -62967, 2804, 39954, 79796, 54616, 79087, -1438, 24541, -13334, 52942, 15019, -55322, -4740, 6814, 31309, 15359, -40527, -5560, -125859, -136503, -44181, -122145, -115476, -99470, -25306, 12552, -44924, -4306, -24817, -53705, -43558, -9661, -71363, -104314, -183838, -242617, -207947, -79165, -44276, -166123, 22322, -47182, -41339, -53324, -78482, -16571, -26461, -4557, 63112, 114850, 59752, -22085, 10621, 9992, -80987, -101837, -215303, -202213, -85746, 57548, 57742, 24543, -4057, -7216, -136218, -199935, -236650]
1692b36650Q3439N8422j11610N9494Q2800l495j42613J19415n2509P5438L7991
1681b9878J041K9993J7376p4686n0190m892Q447Q1230l7116O6039r017P4862j35065
1668f1856J00749m5062M6332o999P0480j0377j11004p0214J7593P7164j1338K4854
1656B0322J2498j389L515j6085j27513j2818P5641K0797n9114m1502n518P265
1644a23901n5627J25752Q0822r8359J163l1314q2138l704M0398L7805N3073J1189
1632d4841r1462J2462J2735J01741m286m0219m1266J48303n8310o14n1878r8857
1620a56492R7353r8764O3219J0984o7770O4414K112p074N2310j1511p329j2883
1608g1431J02944Q8716o8948j30644P8283K1523J0168P1115K6510J8707j09233
$$ y = [-236650, -153211, -94789, -206399, -146905, -64105, -67600, -210213, -90798, -143307, -67869, -29878, -28837, 1156, 18532, -56154, -106344, -111236, -102789, -21559, -58675, 7364, -1653, 73209, -61856, 38893, -6169, 40163, 33164, 103644, 93267, -17737, -87951, -70358, 6806, -4532, 20322, 32820, 31431, 34946, 18861, -108652, -121470, -45829, -25032, -84146, -125648, -131166, -123901, -179528, -53776, 27046, -71313, -70150, -101464, -183602, -187306, -146908, -109103, -56030, -44841, -136303, -123841, -111106, -9365, -13651, -53870, -95136, 53167, -5143, -5757, -57635, -156492, -59139, -157903, -94684, -83700, -151470, -87056, -84944, -92018, -39708, -51219, -58548, -71431, 31513, 120229, 51281, -79363, -1080, 20443, 30611, 101726, 128236, 146943, 37710]
1597C7710p6930K7661L380P1959P0072p1929l7761L3272n9205J2598k8452j8212
1585c5837Q6676J8057q6906p9080O5982o1098J78888j9771l5464n7749K6372l5108
1573c5038j08893K0613k9146K9382J1477J08894j16356k9330J23193o5411r860
1562a00475J3550K807K5102O7275Q4652o916R719l2289l2971l3130K4230k1457
1550I7O881J6067q5107j4243J14195o6722r8911Q9640M4975j2237q7399k4116
1538a16880J30823J19661q2216m2233j42761J8607J12504r8788J01472p8612R6582
1527A8159K8443j33735m6834n5472J15172j5527l747R2371r722R8025j0285j79163
1515a02315P6912m5358j2422L0646J453P497l4610M3745J22642j15046J4578j33539
$$ y = [37710, -39220, -11559, -8179, 63780, 133852, 61923, 24162, 57434, -1771, 10827, -17625, -35837, 50839, 68896, -18010, -97090, -31108, -92206, 86682, 66911, 31447, -26302, 70, -35038, -143931, -123318, -152464, -123082, -111605, -2711, -119067, -148397, -25204, -90615, -100475, -86925, -84118, -59016, 8259, 92911, 85995, 95714, 63425, 30454, -2676, 21554, 97, 6978, 23045, -62062, -76305, 37890, -28832, -127743, -38103, 6872, -5365, -92764, -116880, 13943, 133604, 51388, 9155, -133606, -114999, -2495, -101283, 189, -78423, 18159, 46602, -87133, -133967, -189439, -74267, -89794, -93541, -1170, -10892, 87133, 76848, -102315, -25403, -70761, -83183, -52537, -51084, -43587, -78197, -34452, 88190, -26856, -12278, -145817]
1503a45817N6672N4721r7372M6451O7141q002N8694N7632j11561L6890o5620k646
1491e2817K6196M3784p6896m4905k238J06685q1562R158k761K560j5056n96L8902
1478d9546m5947O0268L0418j34456m5411O7958L3227m5766O0905J13269m2020
1467B899n3650R0851K2461L5066Q2081j45981J3462n8075M0459Q1610q0360m9304
1455a8481l04J15746k5929j06802m2168J14892L2886r0389n5662m6649M3894J3891
1443f5075n9388Q6672n5391m2615J75559P3696k406r8857J891j6524N6312J2535
1431F6409o4523k9236L4903N6258o3232p0121M220n1050J3025J23195l9633m4044
1419f3829k103P737K6305J6834o5111O6548j0830N2568J5720m0973k4333J5915
$$ y = [-145817, -89145, -34424, -131796, -85345, -18204, -26206, 32488, 90120, -21441, 15449, -50171, -52817, -26621, 17163, -59733, -104638, -106876, -191, -81753, -72595, -75356, -72796, -87852, -88448, -49546, -95493, -35225, -4807, -139263, -184674, -116716, -83489, -129255, -68350, 44919, 2899, -50751, 40100, 62561, 97627, 179708, 33727, 47189, -10886, 29573, 111183, 30823, -18481, -18785, 96961, 71032, -35770, -77938, 36954, 69840, -20549, -76211, -122860, -78966, -65075, -124463, -37791, -93182, -135797, 39762, 113458, 111052, 12195, 14086, -2438, 53874, 66409, 1886, -27350, 7553, 63811, 579, -69542, -65322, -116372, -103347, 19848, -19785, -63829, -65932, -58195, -31890, -15056, -80167, -13619, -24449, 28119, 43839, 2866, -21467, -5552]
1407e552o4893J8559M873j22134L5275O5207r5341N9213J34430j16876P1087J7368
1395A216M552K7672q6173j06330J12220J2596j0074O5158q8505L9852o9778K0692
1383g6902K6612R222M365o4287K4041j1539N0252j3392K824K0264k135M668N180
1370b0827m4341j0221m275l8386M5331L7720p2253l3771k8687Q4003J5029j844
1358g2522K401l1256Q4254n387j09739k4374J10295P5967p4099Q2318M5745m5077
1346C8526k1667j6849K8993K6799p4095L4720j0782r4480R5850R3799j3889j14105
1334b7180j03965Q5007M8630p1955L9935J09n8255M277O6104p078q9981J26474
1322A2122Q812P139m4696j7515N225J4729Q944O4418n4609p4363R1338p8556j3497
$$ y = [-5552, -70445, -51886, -47013, -169147, -133872, -68665, -164006, -104793, 29637, -87239, -16152, 1216, 5768, 33440, -52733, -159063, -46843, -34247, -44321, 20837, -67668, -27816, -97594, -76902, -50290, -41068, -36703, -100990, -76949, -88488, -38236, -51628, -48804, -28540, -30675, -26007, -20827, -65168, -75389, -79664, -118050, -72719, -34999, -107252, -141023, -169710, -85707, -70678, -72522, -70121, -101377, -17123, -22510, -132249, -156623, -46328, 29639, -44460, 37858, 83603, 38526, 16859, 10, 29003, 55802, -18293, 16427, 5645, -88835, 7015, 100814, 86925, -27180, -131145, -46138, 2492, -69463, -29528, -29419, -87674, -83397, -17293, -24371, -114352, 12122, 20934, 28073, -16623, -34138, -28913, -14184, -5240, 59178, 4569, -69794, 21544, -57012, -70509]
1309g0509m792j2170k7068k7727o7091J443J10930M1166J63723q9675J04164l0409
1297I1985j14002j9951p5636l280j8476K5725J53354L2463p2744l293p3817O9298
1285h374l5510R5126l1384L4337k2618K0651k2873O6126l6702J3320r2911J54214
1273A33402j39122n6089J41940j18188j51425M0669J11971q9684K8990J35978
1263C8442M5373J5554j02068r7478j4600J11290m3798L8082J03592m3507n3915
1252c033l3955N1157j9706p6818o2166m9338N3360R9304l1729J18593r8319k6125
1240g8775q0123j1749N7467J95377J9080r7196l3460O722J09068R9166J788o3808
1228A23557j3556r5304O816k0530P7383J303o293k207l0293o0573q3337Q4040
$$ y = [-70509, -75301, -87471, -114539, -142266, -209357, -207914, -96984, -55818, 107905, 18230, 122394, 91985, -22017, -41968, -117604, -120884, -139360, -113635, 39719, 72182, -562, -3855, -77672, -8374, -43884, 51242, 19858, 54195, 31577, 52228, 29355, 95481, 58779, 72099, -20812, 133402, -5720, -61809, 80131, -38057, -189482, -148813, -36842, -126526, -97536, 38442, 83815, 99369, -2699, -100177, -114777, -3487, -47285, -9203, 94389, 50882, -3033, -36988, 14169, -5537, -82355, -144521, -193859, -140499, -41195, -72924, 45669, -52650, -78775, -158898, -170647, -113180, 82197, 101277, 4081, -29379, -22657, 86411, 185577, 187365, 123557, 110001, 14697, 21513, 983, 78366, 79669, 73376, 71169, 40876, -19697, -103034, -18994]
1216a8994r0948J30891K5166o5997J612M5976n0378L0491L6291j843l274j9997
1204A8996P6225j24846o7824L451L3177k0489J1969r8444J45488R3667r3588J2651
1192i567k7044k7270q167m9354j03126R9473N0617J29279r103o3298N2109l1578
1180B971L6028M4604j03152n2181j3697j7754J486J63172J6516l5538l2709m1121
1168c1375O9539n5915n0008o6710q3188J09769P9573Q3972o1098l0708m0805K3266
1156e3688O7354M0070j1489j39325N2394R9965Q98o6041n3143o668N427M7711
1144a6535j17795J1395N6643J482o6689L6788N0271M4646R2581q5563L8028m2762
1132B490j7377K6401n5092m2969Q0385m4932M9064n581K6640n719j52240J31026
$$ y = [-18994, -109942, 20949, 46115, -19882, -18270, 27706, -22672, 7819, 44110, 42267, 38993, 18996, 95221, -29625, -97449, -93998, -60821, -81310, -69341, -167785, -22297, 71370, -22218, -9567, -36611, -63881, -72048, -121402, -224528, -125055, -74438, 54841, 45738, -17560, 34549, 2971, 38999, 83603, -19549, -71730, -85427, -103181, -101695, 61477, 77993, 42455, 9746, -31375, 38164, -17751, -67759, -134469, -217657, -107888, -28315, 55657, -5441, -36149, -76954, -53688, 13666, 53736, 42247, -97078, -44684, 55281, 56179, -9862, -63005, -69673, -64246, -16535, -134330, -122935, -66292, -64810, -131499, -94711, -44440, 206, 92787, 7224, 45252, 2490, -14887, 11514, -43578, -86547, -6162, -51094, -2030, -7611, 19029, 13310, -138930, -7904]
1120g904M0145N063L6579j02431j05540J63228k9279q1496K7692k2812Q7841l5687
1108b4601J38864O8894k13550l7496J04482j03013M4870J6871p1155J8881N4967
1097a986o1009J14524j3035k4670L6897J8631p38m5209L4099j6734m6440Q5420
1085G9750M0888j0934j91481p1889M8083j321O6564M7367K4738N0141m0348L560
1073D5118j65186N898O1866o6243O1843N491M6718K0901j30354M3779M855L873
1061f1441q7085J08154M2605P5874j7289l3160j1030l410l62m2302o1255q545
1049i9246J13884K2483J27763j16077O0905m6686n7032k521N5140p5862p0806
1038h8055K7900m8556N2717J12131j52225n7449J2814M3482l7759R6148J51405
$$ y = [-7904, 32241, 37304, 73883, -28548, -134088, 29140, -139, -81635, -53943, -76755, 11086, -24601, 114263, 183157, -30393, -67889, 36593, -66420, -21550, -4679, -75834, -56953, -1986, -62995, 51529, 38494, 13824, 50721, 69352, 68614, 23405, 57504, 40770, -5670, 79750, 120638, 109704, -81777, -153666, -105583, -106904, -40340, 7027, 31765, 81906, 41558, 45118, -120068, -114170, -52304, -118547, -56704, -51213, -4495, 16406, -113948, -70169, -65314, -61441, -148526, -40372, 2233, 78107, 60818, 27658, 16628, 13218, 12856, -29446, -90701, -99246, 14638, 37121, 164884, 48807, 109712, 63026, 5994, 3473, 58613, -17249, -88055, -60155, -108711, -55994, 56137, -96088, -153537, -140723, -97241, -135000, -38852, 112553]
1027A12553Q385r0331J03212j26835j1090j10203j3305Q4754j5907Q218O9045
1016A8496j0085L8403p0523k158o6439o553O7905n3421K7408J3102J01518j05254
1004d7601R1265n0230n7788J10757j09816L1828N2368n234K344p3287j2780l0832
992i9006k5993j5120K5592P1293J3005j898k4030N185R736m3984j0342R6644k4522
979b3440j5140j10920J30483J011n452K6829j64067N0323J9109N5613n974O7637
967B6012O158L9988l7432k2681j10995K1681O1897O2878Q6575n3095j515L5445
955A14916q7629J4754q4727J59400M6170K8800j62237L4493K3328j69332j1853
944i3917J31594k2071Q9472N7256r7061J4143j584l1503o3083m4212j20681J54585
$$ y = [112553, 120938, 30607, 133819, 6984, -4106, -114309, -127614, -42860, -58767, -50549, 18496, 8411, 46814, -23709, -25867, -92306, -98859, -30954, -84375, -56967, -43865, 57653, -47601, 43664, -6566, -64354, 46403, -63413, -31585, 20783, 15549, 17893, -55394, -68174, -99006, -124999, -140119, -114527, -43234, -30229, -32127, -56157, -50972, -41236, -85220, -95562, 1082, -23440, -38580, -149500, -19017, -18006, -23458, 3371, -160696, -110373, -91264, -35651, -41625, 26012, 32170, 72158, 34726, 12045, -98950, -77269, -15372, 47506, 134081, 80986, 79471, 114916, 27287, 42041, -42686, 116714, 162884, 191684, 29447, 63940, 87268, -82064, -93917, 37677, 15606, 105078, 162334, 65273, 79416, 77832, 46329, -16754, -60966, -181647, -27062]
932b7062L6967M2035r1895q5302L8096K1102K7863K8211K5923N0465m962m3170
920A8271m2933O9683k914l9056M2899P1469P7030j46497q4998J00284m9828o557
908F853M1960n7054n1348L7999O5017r2335K0668P7899p5150j06891O0336R7409
896B5363n3646Q0625m566j09422J0813O7965L2144r0195k4455R5211J8738o182
884D2393O4100m6279j28204O5028j0217P2350R3923l1761m183L0814o2913l7240
872D7811R9799l8161j5804q9361m1563k7004M7842K4898j15098O1970J4820k8956
860e8807R9718r2690m7863K1674J6739m011K2370K6002o8834O5615J42200K0285
848A42398r4062l1705n1530L7859m2824N9960r930j06600l0262l590Q7407M3758
$$ y = [-27062, 9905, 51940, -39955, -125257, -87161, -66059, -38196, -9985, 15938, 66403, 61441, 18271, -24662, 45021, 42107, 3051, 45950, 117419, 194449, 47952, -37046, 63238, 13410, 6853, 48813, -8241, -59589, -21590, 43427, -48908, -28240, 49659, -25491, -132382, -72046, 25363, -28283, 52342, 47776, -61646, -50833, 17132, 49276, -40919, -65374, 29837, 48575, 42393, 106493, 60214, -67990, -2962, -13179, 59171, 153094, 121333, 117150, 147964, 85051, 47811, 147610, 109449, 93645, 4284, -37279, -64283, -16441, 8457, -106641, -44671, -29851, -58807, 40911, -51779, -99642, -77968, -61229, -65240, -42870, -16868, -85702, -20087, 122113, 142398, 48336, 16631, -34899, 2960, -39864, 20096, 10166, -96434, -126696, -130286, -42879, 879]
836H79P7333P7722l0272j13806q2869J7637M7611r907r1423J65656l5987l6940
824a4366J9459j5549n1524j273K0951m0784P410P4450m506k2632P195K5164J18039
811A22034k4681M8044p2644m917K9347j20238r5587J35530q7600J54295K7760
800A11343k8432n4954J4027N5737M1239J6375o1164p0188j8497m663n7746J46401
788H9478l7588L4512p7440J5231L270n1534Q3113J218R1273j570j7923j41221
776i181r05N0267j04887O4389N1841M1086j9618R7348k08995j07254R0203o517
764f2223m419K2771J32297M713p4050o5714R9988N8711j13441l4859k4913p078
752f8217O5546j2532Q296N4480q324p338j1828m3941q9948J44465l4911K5074
$$ y = [879, 78212, 155934, 125662, 11856, -71013, -53376, -5765, -15672, -107095, 58561, 22574, -14366, 5093, -10456, -61980, -63253, -42302, -83086, -75676, -1226, -5732, -28364, -21169, 3995, 122034, 97353, 145397, 72753, 67836, 97183, -23055, -118642, 16888, -70712, 83583, 111343, 82911, 27957, 41984, 97721, 138960, 155335, 94171, 23983, 5486, 823, -56923, 89478, 51890, 86402, 8962, 24193, 27463, -24071, 59042, 60260, 151533, 149963, 132040, -9181, -10086, 40181, -64706, -317, 51524, 92610, 72992, 170340, -38655, -145909, -55706, -62223, -66642, -43871, 88426, 93139, 19089, -46625, 53363, 112074, -1367, -36226, -61139, -68217, -2671, -15203, -6907, 47573, 39249, 31911, 20083, -23858, -113806, 30659, -4252, 20822]
740B0822j9268J49429r0495k6227L868j4092o4768m8513O7998L6309P7821r5198
728b314L1828p8715M3482n8168J19645j5688O02R1293p3698n8008l4025J5718
716a8048k9423J11431n9580k023m9731O662Q4430l2758L1811N002L3214K7062
704A08049L8073p1048p574j11157R5474k8778N2178K7290q646k7050J3598j7097
692F3312n0688j24229k7257M6680m9674N3434K3828k5083R5101L9778J4589j2075
680D7716N3628k6733K5704O7797n8232k6974k8410P924o6369N2562K0171p3759
668d975n7339M0771o9101N5334K2074R7964L3965k7532j29949m850Q6580L4751
656G7693P982O6441K0091j89053M1387O3761n910r103l4083k318n4055L1274n0974
$$ y = [20822, 1554, 150983, 60488, 34261, 38129, 24037, -40731, -89244, -21246, 15063, 92884, -2314, 29514, -49201, -5719, -63887, 55758, 40070, 40672, 131965, 58267, 259, -33766, -18048, -47471, 63960, 4380, 2357, -47374, -40712, 43718, 10960, 42771, 47773, 80987, 108049, 146122, 75074, 67500, -43657, 51817, 23039, 75217, 102507, 93861, 66811, 80409, 63312, 12624, -111605, -138862, -92182, -141856, -88422, -64594, -89677, 5424, 45202, 59791, 47716, 101344, 74611, 100315, 168112, 109880, 82906, 54496, 62420, -3949, 48613, 68784, -4975, -62314, -21543, -90644, -35310, -13236, 84728, 118693, 91161, -38788, -43638, 42942, 77693, 85675, 152116, 172207, -16846, 24541, 88302, 82392, 73289, 39206, 36888, -17167, 14107, -36867]
643c6867N4022K1795L2386J0014m5990n9499j9760N6249p7821k2919N0502J2489
631b5399J06634j9283p3171P3907n905l7855m350k2969O484J36631l7520m1491
619E5713r07m9382M2252O6787p1207J23248J235k0104j16135K0188J8162P9181
607A49031j26844m956P8170m8177N1230m8847l0119J30273L3589j19159j52201
596h8010O7441L4800j6492K8485N3524J70335j31571q8309l4985k9818O6819r9430
584f7211k0951P7170j11780R6943k1010J41632L9139p1116n5352J16753O282r3367
572C7132r5963J26749N4975o4361J13M2759r3141J14793L6625j05718M3764n9186
560C8541P5534J59348o0270j31796N7791q6260J9289r996K2762M3029l5731j08153
$$ y = [-36867, 17155, 38950, 71336, 81350, 35360, -24139, -43899, 12350, -65471, -88390, -37888, -25399, 81235, 61952, -11219, 62688, 56783, 18928, 14578, -8391, -1907, 134724, 97204, 55713, 54806, 5424, 47676, 114463, 43256, 166504, 167739, 147635, 31500, 51688, 69850, 149031, 22187, 17231, 95401, 47224, 98454, 49607, 19488, 149761, 183350, 64191, -88010, -20569, 14231, -2261, 26224, 79748, 250083, 118512, 30203, -4782, -34600, 32219, -67211, -88162, -10992, -122772, -25829, -46839, 94793, 133932, 62816, 7464, 124217, 130499, 37132, -58831, 67918, 122893, 58532, 58645, 101404, 8263, 123056, 159681, 53963, 97727, 38541, 114075, 273423, 213153, 81357, 139148, 52888, 72177, 62181, 84943, 127972, 92241, -15912]
548a5912l2843J31457p0382M9400J56308q5351m1347j08501O659O4884J0265l3105
536C1532k9242N1910J61103m5182r8858j7249P86R4107o8788M0556K967k9963
524I3679l4882q8873q5239J37006M5421l4051n0313Q0733j2196j1312n6908l375
512b0310N8683L1760k7080p2429Q9894L5237p9702L273J1122j0605Q6122o1249
500D4716k5033l6710n1430k0306M4395P0892P3156k0746N2763n3120J2352J20561
488B11490J65q3605l8480M127j16631L4491j9675j55740Q7441K9145J7679J943
476b7650P1625n7758N4488j8312l3294m525N092L3870j21219J16715m021k5669
464a0658Q1451j19019o2742Q7265O3692m2561K7925j633o4827q2007R3458O9768
$$ y = [-15912, -48755, 82702, 12320, 61720, 218028, 132677, 91330, -17171, -10512, 54372, 64637, 31532, 2290, 54200, 215303, 170121, 71263, 54014, 54800, 148907, 80119, 120675, 123642, 93679, 58797, -30076, -115315, 21691, 67112, 33061, -17252, 63481, 51285, 39973, -16935, -20310, 38373, 70133, 43053, -29376, 60518, 95755, 16053, 19326, 30448, 19843, 105965, 44716, 19683, -17027, -68457, -88763, -44368, 26524, 99680, 78934, 131697, 78577, 90929, 211490, 211655, 128050, 89570, 93697, -22934, 11557, -8118, -163858, -76417, -47272, -29593, -27650, 43975, -13783, 40705, 22393, -10901, -15426, -10334, 23536, -97683, 19032, 15011, -10658, 70793, -48226, -110968, -23703, 39989, -2572, 25353, 23720, -41107, -123114, -29656, 40112]
452D0112o7896r982j9446n7198J52268k1669r9625r093J62838m9310j04651N6593
440b7059k1110m1635Q9051j4685q4952J4113J11941q8016j7305k564M2288R1993
428E2060n1874O0623N793J8710j26166J41633J2871J281o9484M1676O2712j7578
416A32257j33869L8094n0752q1561N061O4871K874l7864K5113K561L5650L0828
404C3263n4882k3497j6694j13055L956J55740N9796M3507k5310n9792o9441N3913
392a2496j8338p0920J07792O4552r7483L6966K5070q7605N8715L4895q5666Q5702
380D1184j5636j09404J18225n70q301K1914m9669K2203J34789k9830o5017m0087
368A9801K1595p2244j03312k8048N7800J48127K9558k02709n4456J14906J33912
$$ y = [40112, -27784, -37766, -57212, -114410, 37858, 16189, -83436, -92529, 70309, 20999, -83652, -27059, -48169, -89804, -753, -15438, -100390, -86277, 25664, -62352, -79657, -82221, -39933, 52060, 186, 60809, 66602, 85312, -40854, 100779, 113650, 114931, 45447, 87123, 149835, 132257, -1612, 36482, -14270, -95831, -90770, -25899, -23025, -60889, -35776, -33215, 2435, 33263, -21619, -45116, -61810, -174865, -170909, -15169, 44627, 88134, 62824, 3032, -66409, -12496, -30834, -101754, 6038, 70590, -26893, 10073, 35143, -52462, 6253, 41148, -44518, 41184, 25548, -83856, 34369, 33799, 25498, 47412, -2257, 19946, 154735, 124905, 59888, 19801, 41396, -30848, -134160, -162208, -104408, 43719, 73277, -129432, -183888, -68982, 64930]
357F4930M6163m0240j33415p850O4426l3172K4452M9492j22682O104o1084P8012
345f4864m5920Q4396J04124K580L1277p5797j16864m1858M1702K5397o8903o7180
333a91910J32602R0217m6302L4213q639j30802L9561n3680J1181J63904Q3684
322A24029n8833M2973l7294r7486N804N9169k7867o3684j4034K9055L6371L2478
310C0681K7342J7336k3p0600k0203k1094l1830J55040l7666q3317M2267o9254
298f1321k9604J01741m1915j5106R98P0758j7376j4231p8968K4386Q563R5216
286D3141q7201J0324k3747M1488k8477N5856l2317q4222L5457p9317M4425n3215
274a57805P9783n960r5794O5204J83313J9202o0279K9621O4654r3936K6505p93
$$ y = [64930, 111093, 70853, -62562, -70412, -5986, -39158, -14706, 34786, -87896, -81792, -142876, -64864, -110784, -26388, 77736, 80316, 111593, 35796, -81068, -122926, -81224, -55827, -124730, -191910, -59308, 30909, -15393, 18820, 10181, -120621, -81060, -134740, -123559, 40345, 124029, 65196, 108169, 70875, -26611, -20807, 38362, 10495, -53189, -67223, -38168, -1797, 30681, 58023, 75359, 75336, 4736, -15467, -36561, -68391, 86649, 48983, -34334, 7933, -61321, -90925, 10816, -31099, -46205, -45207, 25551, 8175, -6056, -85024, -60638, -52075, 43141, -44060, -33736, -57483, -15995, -44472, 11384, -20933, -105155, -69698, -149015, -104590, -157805, -78022, -83982, -179776, -114572, 68741, 87943, 27664, 57285, 121939, 28003, 54508, 53715]
262E3715j8243M2303l2605k7477q153k0161l7557R1418L8158j09450J7241L85
250a0426o5284m0215P4818o9545N5784N0717j636J6662j0268o6310J8125L3064
238a4514N3079n0505J5274m8783L6416q164k7688N2940Q3100l8096j37264M1766
$$ y = [53715, 35472, 77775, 45170, 17693, 9540, -10621, -48178, 43240, 81398, -28052, -10811, -10426, -75710, -115925, -41107, -110652, -54868, -4151, -5787, 10875, 607, -65703, -47578, -14514, 38565, -11940, 3334, -45449, -9033, -17197, -44885, 8055, 91155, 53059, -84205, -42439]
$$ [...]
##END NTUPLES=NMR SPECTRUM
##END=
