##TITLE=1H_CG-1150-D2
 CDCl3,8 sc, 
 2.9.2021
##JCAMPDX= 6.0         $$ Bruker NMR JCAMP-DX V2.0
##DATA TYPE= NMR SPECTRUM
##DATA CLASS= NTUPLES
##ORIGIN= UXNMR, Bruker Analytische Messtechnik GmbH
##OWNER= root
$$ XWIN-NMR		Version 3.5
$$ Thu Sep  2 13:26:42 2021 Russian Standard Time (UT+4h)  she@DPX200
##.OBSERVE FREQUENCY= 200.1312
##.OBSERVE NUCLEUS= ^1H
##.ACQUISITION MODE= SIMULTANEOUS
##.ACQUISITION SCHEME= undefined
##.AVERAGES= 8
##.DIGITISER RES= 18
##SPECTROMETER/DATA SYSTEM= spect
##.PULSE SEQUENCE= zg30
##.SOLVENT NAME= CDCl3
##.SHIFT REFERENCE= (INTERNAL, CDCl3, 0, 15.9808)
##AUDIT TRAIL= $$ (NUMBER, WHEN, WHO, WHERE, WHAT)
$$ ##TITLE= Audit trail, XWIN-NMR		Version 3.5
$$ ##JCAMPDX= 5.01
$$ ##ORIGIN= Bruker BioSpin GmbH
$$ ##OWNER= she
$$ F:/spectra/data/she/nmr/H-F/1/pdata/1/auditp.txt
$$ ##AUDIT TRAIL=  $$ (NUMBER, WHEN, WHO, WHERE, WHAT)
(   1,<2021-09-02 13:24:04.50 +0400>,<she>,<DPX200>,
      <created by zg, POWCHK disabled, PULCHK disabled
       configuration hash MD5:
       00 E9 B6 7A A2 85 ED C7 34 08 36 98 17 FE 4E 26
       data hash MD5: 16K
       B5 54 0A AD EC C8 0E DA E9 96 AE 9F 64 94 03 9B>)
(   2,<2021-09-02 13:24:06.95 +0400>,<she>,<DPX200>,
      <Start of raw data processing
       efp BC_mod = 2 LB = 0.24 FT_mod = 6 PKNL = 1 PHC0 = -13360.66 PHC1 = 18.00097 SI = 16K 
       data hash MD5: 16K
       3D ED 50 39 66 EC 5E C8 7B 32 5F 31 9C F9 B7 AC>)
(   3,<2021-09-02 13:24:56.54 +0400>,<she>,<DPX200>,
      <pk PHC0 = 4.882696 PHC1 = -6.399999 
       data hash MD5: 16K
       53 D9 4B 91 B7 F2 3E CD 4D 9A F4 0C C3 26 01 CF>)
(   4,<2021-09-02 13:25:00.62 +0400>,<she>,<DPX200>,
      <abs ABSG = 5 
       data hash MD5: 16K
       0B 59 8A B7 4A 28 7D 3F B1 F4 AF 73 6D BD 2C 88>)
$$ ##END=
$$ 
$$ hash MD5
$$ 38 1D 46 EF F8 05 A2 14 01 12 1C 63 83 61 CE 4A
##$RELAX= 
##$RELAX= 
##$RELAX= 
##$RELAX= 
##$RELAX= 
##$RELAX= 
$$ Bruker specific parameters
$$ --------------------------
##$DU= <F:/spectra>
##$EXPNO= 1
##$NAME= <H-F>
##$PROCNO= 1
##$TYPE= <nmr>
##$USER= <she>
##$AMP= (0..31)
100 100 100 100 100 100 100 100 100 100 100 100 100 100 100 100 100 100 
100 100 100 100 100 100 100 100 100 100 100 100 100 100 
##$AQSEQ= 0
##$AQ_mod= 1
##$AUNM= <au_zg>
##$AUTOPOS= <>
##$BF1= 200.13
##$BF2= 200.13
##$BF3= 200.13
##$BF4= 200.13
##$BF5= 200.13
##$BF6= 200.13
##$BF7= 200.13
##$BF8= 200.13
##$BYTORDA= 1
##$CFDGTYP= 0
##$CFRGTYP= 5
##$CHEMSTR= <none>
##$CNST= (0..31)
1 1 145 1 1 1 1 1 1 1 1 1 1 1 1 1 1 1 1 1 1 1 1 1 1 1 1 1 1 1 1 1 
##$CPDPRG= <>
##$CPDPRG1= <>
##$CPDPRG2= <>
##$CPDPRG3= <>
##$CPDPRG4= <mlev>
##$CPDPRG5= <mlev>
##$CPDPRG6= <mlev>
##$CPDPRG7= <mlev>
##$CPDPRG8= <mlev>
##$CPDPRGB= <>
##$CPDPRGT= <>
##$D= (0..31)
0 1.2 0 0 0 0 0 0 0 0.06 0 0.03 0 0 0 0 0.0002 0 0 0 0 0 0 0 0 0 0 0 0 
0 0 0 
##$DATE= 1630574644
##$DBL= (0..7)
120 120 120 120 120 120 120 120 
##$DBP= (0..7)
150 150 150 150 150 150 150 150 
##$DBP07= 0
##$DBPNAM0= <>
##$DBPNAM1= <>
##$DBPNAM2= <>
##$DBPNAM3= <>
##$DBPNAM4= <>
$$ [...]
##$SUBNAM3= <"">
##$SUBNAM4= <"">
##$SUBNAM5= <"">
##$SUBNAM6= <"">
##$SUBNAM7= <"">
##$SUBNAM8= <"">
##$SUBNAM9= <"">
##$SW= 20.0189188712717
##$SWIBOX= (0..15)
0 0 2 0 0 0 0 0 0 0 0 0 0 0 0 0 
##$SW_h= 4006.41025641026
##$TD= 16384
##$TD0= 1
##$TE= 0
##$TE2= 300
##$TE3= 300
##$TEG= 300
##$TL= (0..7)
0 120 120 120 120 120 120 120 
##$TP= (0..7)
150 150 150 150 150 150 150 150 
##$TP07= 0
##$TPNAME0= <>
##$TPNAME1= <>
##$TPNAME2= <>
##$TPNAME3= <>
##$TPNAME4= <>
##$TPNAME5= <>
##$TPNAME6= <>
##$TPNAME7= <>
##$TPOAL= (0..7)
0.5 0.5 0.5 0.5 0.5 0.5 0.5 0.5 
##$TPOFFS= (0..7)
0 0 0 0 0 0 0 0 
##$TUNHIN= 0
##$TUNHOUT= 0
##$TUNXOUT= 0
##$USERA1= <user>
##$USERA2= <user>
##$USERA3= <user>
##$USERA4= <user>
##$USERA5= <user>
##$V9= 5
##$VALIST= <valist>
##$VCLIST= <CCCCCCCCCCCCCCC>
##$VD= 0
##$VDLIST= <DDDDDDDDDDDDDDD>
##$VPLIST= <PPPPPPPPPPPPPPP>
##$VTLIST= <TTTTTTTTTTTTTTT>
##$WBST= 1024
##$WBSW= 4
##$XGAIN= (0..3)
0 0 0 0 
##$XL= 0
##$YL= 0
##$YMAX_a= 564067
##$YMIN_a= -609349
##$ZGOPTNS= <>
##$ZL1= 120
##$ZL2= 120
##$ZL3= 120
##$ZL4= 120
##$ABSF1= 17.87836
##$ABSF2= -2.140717
##$ABSG= 5
##$ABSL= 3
##$ALPHA= 0
##$AQORDER= 0
##$ASSFAC= 0
##$ASSFACI= 0
##$ASSFACX= 0
##$ASSWID= 0
##$AUNMP= <proc_1d>
##$AZFE= 0.1
##$AZFW= 0.1
##$BCFW= 0
##$BC_mod= 2
##$BYTORDP= 0
##$COROFFS= 0
##$CY= -3
##$DATMOD= 1
##$DC= 0
##$DFILT= <>
##$DTYPP= 0
##$F1P= 0
##$F2P= 0
##$FCOR= 1
##$FTSIZE= 16384
##$FT_mod= 6
##$GAMMA= 0
##$GB= 0
##$INTBC= 1
##$INTSCL= 1.334414e-10
##$ISEN= 128
##$LB= 0.24
##$LEV0= 0
##$LPBIN= 0
##$MAXI= 10000
##$MC2= 0
##$MEAN= 0
##$ME_mod= 0
##$MI= 1.114404
##$NCOEF= 0
##$NC_proc= -6
##$NLEV= 6
##$NOISF1= 3.799351
##$NOISF2= 2.8
##$NSP= 0
##$NTH_PI= 0
##$NZP= 0
##$OFFSET= 15.98077
##$PC= 1
##$PHC0= -13355.78
##$PHC1= 11.60097
##$PH_mod= 1
##$PKNL= yes
##$PPARMOD= 0
##$PSCAL= 0
##$PSIGN= 0
##$REVERSE= no
##$SF= 200.130004972331
##$SI= 16384
##$SIGF1= 3
##$SIGF2= 2
##$SINO= 5.538805
##$SIOLD= 16384
##$SREGLST= <1H.CDCl3>
##$SSB= 0
##$STSI= 16384
##$STSR= 0
##$SW_p= 4006.41025641025
##$SYMM= 0
##$S_DEV= 0
##$TDeff= 16384
##$TDoff= 0
##$TI= <>
##$TILT= no
##$TM1= 0
##$TM2= 0
##$TOPLEV= 0
##$USERP1= <user>
##$USERP2= <user>
##$USERP3= <user>
##$USERP4= <user>
##$USERP5= <user>
##$WDW= 1
##$XDIM= 16384
##$YMAX_p= 426064064
##$YMIN_p= -308153
$$ End of Bruker specific parameters
$$ ---------------------------------
##NTUPLES= NMR SPECTRUM
##VAR_NAME=  FREQUENCY,     SPECTRUM/REAL,   SPECTRUM/IMAG
##SYMBOL=    X,             R,               I
##VAR_TYPE=  INDEPENDENT,   DEPENDENT,       DEPENDENT
##VAR_FORM=  AFFN,          ASDF,            ASDF
##VAR_DIM=   16384,         16384,           16384
##UNITS=     HZ,            ARBITRARY UNITS, ARBITRARY UNITS
##FACTOR=    0.24454680195387, 1,            1
##FIRST=     3198.23160179292, 0,            0
##LAST=      -808.178654617333, 0,           0
##MIN=       -808.178654617333, -308153,     0
##MAX=       3198.23160179292, 426064064,    0
$$ Real data points
##PAGE= N=1
##DATA TABLE= (X++(R..R)), XYDATA
$$ [...]
6795A33694Q5009J18192n6955q9116m9887q7882K54878j35121o0989J7229l6370
6784I2682m3135M1748j9343o6624L8705j4882K4358j8056P0098L3477j0970l2807
6772I5251j08158N2367J00075n467K8737j05013N3354O3658O1907P0091q851p1087
6760B26864p0869j15107N4962J06673j53907n602Q5478J9637J17632K2400n0346
6749B37815j88201K182M89M1242P0420l3782m7776Q471L3012L868n8806J4526
6737H3460K0781k0704l0772P2842N1088j63806O2910L4220J8426n953q2212Q1210
6725A21490j7759R9742k899o4399O3811m4986j4672N5240n6416R8673j7404q7352
6713A33069j2780J10641O789n3066O9562Q4481o2936M7679K2169o0999J25543
$$ plain form
6795 133694 218703 336895 279940 190824 140937 53055 307933 172812 111823 129052 92682
6784 92682 49547 91295 71952 5328 44033 29151 53509 35453 105551 139028 128058 95251
6772 95251 -12907 39460 139535 134068 162805 57792 111146 174804 236711 306802 297951 226864
6760 226864 155995 40888 95850 202523 48616 43014 128492 148129 265761 288161 237815
6749 237815 49614 51796 52285 93527 163947 130165 82389 90860 123872 127740 68934 83460
6737 83460 104241 83537 52765 125607 176695 12889 75799 110019 128445 122492 40280 121490
6725 121490 103731 203473 200574 136175 199986 155000 140328 195568 139152 237825 220421 133069
6713 133069 120289 230930 237719 184653 254215 338696 275760 323439 345608 284609 410152
6702D10152k6550l5721q4901p804j5993L1035O4254K2953m9786m5479k0788J00191
6690C41563K983j24516K9331M3446p7448J3699J15252m4805p0316j2248j7253
6679A99688J3371q4145K47965N3111p1172N7133P1847M783l0902o6458Q8892o6418
6667D17695l2343J18399J41453o7779P4588m5937j3655P397R2305l999K0693O706
6655G15523J33660Q5540J01185K62450L1236K9704J38144J53058K10539J71104
6645B032143K16108L32294K24191M93583N51103P43645O94304R65052Q53700O29810
6635G735933J6926q97570j371806j248449q12435m64516m90507k30814j00977
6626B135785k24565P8573j13735l2889L0181j08019q5193j72010l7162J7162J716
$$ plain form
6702 410152 383602 347881 262980 255176 239183 270218 334472 357425 307639 262160 241372 341563
6690 341563 344546 220030 249361 292807 215359 229058 344310 299505 229189 216941 199688
6679 199688 213059 128914 376879 429990 358818 415951 487798 492581 461679 395221 484113 417695
6667 417695 385352 503751 645204 577425 652013 606076 592421 599818 692123 688124 708817 715523
6655 715523 849183 934723 1035908 1298358 1329594 1359298 1497442 1650500 1861039 2032143
6645 2032143 2248251 2580545 2804736 3298319 3849422 4593067 5287371 6252423 7106123 7735933
6635 7735933 7752859 6855289 5483483 4235034 3422599 2958083 2467576 2236762 2135785
6626 2135785 1911220 1989793 1876058 1843169 1873350 1765331 1680138 1508128 1470966 1488128 1489844
6615A489844P7034J14612L3944O9348p0694p7539j95834j56261k07132o1047j07387
6604I08888j46674J16056p1190j09810r136N4439O258j66942j18711K0204R488
6593D92870o4339k1081k9723J01358r8944j21793L4899P0114l38r0039Q2156N2045
6581D07185l3467r6632L698L1790L002L019m0714j7231R4888O2985K6933n5448
6569C90008j03897M7805j10380l6821L7147Q5180N8512r7159Q3252m4874l9011
6558B69762J49073l2111j02297q845m3846n784J660n5246M1863M7387k9411r3532
6546A38673J4476J8337P8694L8778p8936j0436K6741K8217j67374M9844J90720
6535C27734P1720p770m2086l8353j53546K3637P90J29902j03165p0103J39269
$$ plain form
6615 1489844 1566878 1681490 1715434 1784782 1714088 1636549 1440715 1284454 1077322 1016275 908888
6604 908888 762214 878270 807080 697270 688134 742573 748831 581889 463178 483382 492870
6593 492870 428531 407450 377727 479085 380141 258348 293247 363361 363023 272984 355140 407185
6581 407185 373718 277086 280784 312574 315576 318595 277881 260650 355538 418523 445456 390008
6569 390008 286111 333916 223536 186715 223862 309042 367554 270395 353647 308773 269762
6558 269762 418835 386724 284427 275582 231736 225952 227612 172366 214229 261616 232205 138673
6546 138673 153149 171486 250180 288958 210022 199586 226327 254544 87170 137014 327734
6535 327734 399454 391684 349598 311245 157699 181336 182126 312028 208863 138760 278029
6524B78029m0777k5527l208k5117q9854J09390Q8960P314k8640L5710L020K8443
6512C37743l3557l883J5223J3529M754p8248J0135k385m2160k8122j03455N7383
6500A46957J94643J0773j22650K6257p4444L542N2088r418M6880l7592P2266Q9160
6488C98462o2363M3639P8060o5349Q3811J01388m0051J3793k5840M2598q7807
6477D80341l689L2009J04628L0488Q002q6798P0660m6769p6428R8286J1728j00539
6465E21919L0984J48845J15892p8987k2588N9733K5722M3228M1167K1804l1020
6454H76699J88174o3312k505n7949L8172n2357l6645R1515R0913O1149R8714L7470
6442A270038P1394l0100j63916m7817P1863J36818P8964m3885j3385q4121j1009
$$ plain form
6524 278029 237252 211725 208517 183400 93546 202936 291896 299210 270570 306280 309300 337743
6512 337743 304186 300303 315526 329055 333809 255561 265696 263311 221151 193029 89574 146957
6500 146957 341600 352373 229723 255980 181536 185078 237166 227748 274628 237036 309302 398462
6488 398462 336099 379738 457798 392449 476260 577648 537597 551390 525550 568148 480341
6477 480341 476652 508661 613289 643777 651779 564981 635641 588872 512444 610730 622458 521919
6465 521919 552903 701748 817640 738653 716065 775798 801520 844748 885915 907719 876699
6454 876699 1064873 1001561 999056 941107 979279 926922 890277 981792 1072705 1133854 1232568 1270038
6442 1270038 1341432 1311332 1147416 1099599 1171462 1308280 1387244 1343359 1329974 1245853 1234844
6431A234844Q4935J39114J75888K2304k9J95699J03315J52166J16444K07519J99861
6420B632060J16084K71010L93925L33333M03177N22934O80263Q93329R54217J218981
6410H419313J258389J030188J053110K77661j099513j847080j865350j368050
6402E858668q37127o60955m14871l55263k77929j70465k76685k85548p4842M6112
6392B551095q6817M4456J030n1906K7703J05421P9782Q8370J33050J40593j10554
6381B922223r6496k83796j25547j94048k10663p2278n770j62901N7686J5610j51403
6370A692617R289J0481J00803J11214P8445Q035J24880L7456J75740L9570p9673
6359B308857o3364j59053j74190j30415j27609n8819O3327n2686k1573q2803J09009
$$ plain form
6431 1234844 1319779 1458893 1634781 1657085 1657056 1852755 1956070 2108236 2224680 2432199 2632060
6420 2632060 2748144 3019154 3413079 3746412 4149589 4672523 5352786 6246115 7200332 8419313
6410 8419313 9677702 10707890 11761000 12038661 10939148 9092068 7226718 5858668
6402 5858668 5021541 4360586 3945715 3590452 3312523 3142058 2865373 2579825 2504983 2551095
6392 2551095 2464278 2508734 2509764 2457858 2485561 2590982 2670764 2759134 2892184 3032777 2922223
6381 2922223 2825727 2541931 2416384 2222336 2011673 1939395 1933625 1770724 1828410 1844020 1692617
6370 1692617 1701906 1712387 1813190 1924404 2002849 2010884 2135764 2173220 2348960 2388530 2308857
6359 2308857 2245493 2086440 1912250 1781835 1654226 1595407 1658734 1606048 1584475 1501672 1610681
6348A610681Q1110k1019J02120J996J51945O4985J66531O1649N8541J74802K58979
6337B712320M87626M48568L06764K62046K63923K32320l5013m07466k94688n04136
6327C472264m01471m05863k50000j08876j23885m6319j45554m673Q659P9902J1908
6316B086092m9301J8334J32027J71798P7218K11322L02015L75793L24145L14262
6306C963705K51098J38504L40556K49770k11794m06547n85631m97447l22630k94600
6296B624984k02547j96988k18864j01314j25171n529j2891j31709J05575m7623
6286A687923L0567P0126j35365n0230Q5743L7999J49899o779M4309K03496K0113
6275B137801J36657O6484j64332k20193o2117k38992r2090j58059k21404J34282
$$ plain form
6348 1610681 1691791 1670772 1772892 1774888 1926833 1991818 2158349 2219998 2278539 2453341 2712320
6337 2712320 3199946 3648514 3955278 4217324 4481247 4713567 4678554 4271088 3976400 3472264
6327 3472264 3070793 2664930 2414930 2306054 2182169 2135850 1990296 1985623 1994282 2074184 2086092
6316 2086092 2036791 2055125 2187152 2358950 2436168 2647490 2949505 3325298 3649443 3963705
6306 3963705 4214803 4353307 4693863 4943633 4731839 4325292 3739661 3242214 2919584 2624984
6296 2624984 2422437 2225449 2006585 1905271 1780100 1774571 1761680 1629971 1735546 1687923
6286 1687923 1718490 1788616 1653251 1603021 1688764 1726763 1876662 1869883 1914192 2117688 2137801
6275 2137801 2274458 2340942 2176610 1956417 1894300 1655308 1563218 1405159 1183755 1318037
6265A318037j13685k2860P7481m8285j62458l2528p6537J1192q3339j44628N3914
6254G76304N8314Q439J3045q693k8079k8638L0193k11618N2541P4493M571n8212
6242F82660M607O933n5253P4219M4273N490j70712P4613J21959q4646k8309m8495
6230F27339K8511k2444k9366L2383o9689r0467K34036J31693j72798j83793O77
6219D86082J72307l844l5830M3734l1662L5150k154j22176K7835J0299J4439M7324
6207F41504Q4939j0399R535j0883l9300M9260l9545k2536l4314J33172k4194j00280
6195F36959J47104o1319M8913q6897k2312r4338J67430O235j16521J7548m7412
6184E95390N3998j40476K0348M5916l19K6097n4675j453j32538J64206J58807
$$ plain form
6265 1318037 1204352 1181492 1258973 1210688 1048230 1015702 939165 950357 867018 722390 776304
6254 776304 834618 843057 856102 847409 819330 790692 820885 609267 661808 736301 740872 682660
6242 682660 687267 694200 638947 713166 757439 762929 592217 666830 788789 704143 675834 627339
6230 627339 655850 633406 604040 636423 566734 476267 710303 841996 669198 485405 486082
6219 486082 658389 654545 618715 662449 630787 665937 663783 541607 569442 579741 594180 641504
6207 641504 726443 716044 725579 714696 675396 724656 685111 662575 628261 761433 737239 636959
6195 636959 784063 722744 771657 684760 662448 568110 735540 741775 625254 642802 595390
6184 595390 649388 508912 529260 575176 574857 600954 546279 544826 412288 576494 735301
6173G35301m0257o9363M2256M134J6864J48195r8501l6075J41688l3710k7214
6162G83318o9029N7172J29745q1314M2010K2544q5909O686k0118L5140n1261L3519
6150H02503J01970q4413n4501m3940l1703J45662j31551n0721L6240J10322L5971
6139H35839J0178r060q6068R9802K6459l2878K5557J22220J00572j4707M6274
6128A124188P0978M0956J36390J84567K57575J02783J52147J53364M0642k51700
6118B011890l79930j66528k17681j67898j16274r2488L3127L308m2719m405K0851
6107H81253L4524R2902o0884N9360j22427l4847j1724O2932q6468m7159N4502
6096H21964J238n6271O4308K5794K9403n8105m5873N0751K0658N529r4397O088
$$ plain form
6173 735301 695044 625681 667937 672071 688935 837130 738629 702554 844242 810532 783318
6162 783318 714289 771461 901206 819892 861902 884446 798537 805223 785105 820245 768984 802503
6150 802503 904473 820060 765559 721619 689916 835578 704027 653306 689546 799868 835839
6139 835839 846017 836957 750889 850691 877150 844272 869829 992049 1092621 1077914 1124188
6128 1124188 1195166 1236122 1372512 1557079 1814654 1917437 2069584 2222948 2263590 2011890
6118 2011890 1631960 1465432 1247751 1079853 963579 871091 904218 907526 864807 860402 881253
6107 881253 915777 1008679 947795 1007155 884728 849881 838157 901089 814621 767462 821964
6096 821964 823202 766931 831239 857033 886436 828331 782458 833209 853867 859396 764999 771087
6084G71087j4238N0686m206N5493p6355j24772L1402J28438l8204j83898O9032
6073F64465P7423J2838j08k7529Q0066N4247J20146q6919j08232J70350m5957
6062I10790p6961L9015K8969J0877J5308K6205J23491m1242K3962j2455L8581
6051A086540J3141j2936J7945P3332M758j46582J02681J41158K05M3031R9864
6040A423137R4693q381J37439J07042j6131P4395R803Q0511K08482J54649J65466
6029B431105J44586J14145K35573K29409J44154K02927J30631p8646j6603p7343
6019C459938j17304m1614l6350r0569M5253J8352L8402J03658q8278L1825K38575
6008C561888J82506M5944J32243K11127R3370J1499j57140O5042m4213j53577
$$ plain form
6084 771087 756849 807535 803329 858822 782467 657695 689097 817535 779331 595433 664465
6073 664465 741888 754726 754618 727089 807155 861402 981548 894629 786397 956747 910790
6062 910790 833829 872844 901813 912690 927998 954203 1077694 1036452 1060414 1047959 1086540
6051 1086540 1099681 1086745 1104690 1178022 1182780 1036198 1138879 1280037 1280242 1323273 1423137
6040 1423137 1517830 1509449 1646888 1753930 1737799 1812194 1821997 1902508 2110990 2265639 2431105
6029 2431105 2575691 2689836 2925409 3154818 3298972 3501899 3632530 3553884 3537281 3459938
6019 3459938 3342634 3301020 3264670 3174101 3219354 3237706 3276108 3379766 3291488 3323313 3561888
6008 3561888 3744394 3790338 3922581 4133708 4227078 4238577 4081437 4146479 4102266 3948689
5998C948689k00532k22394j9595m3241P5444N1195K27922J87216J8682K70725
5988D294111J32329J71024J9979J95077J61684j16035M269j00923q3729j58513
5978D519273j99332j36233j29921J07035n3422r343q08j10230q2698n4577K7256
5967C877000k4952q5297n7604k66111k03437k28824k19655l27086k01762r0557
5957B171715o5623p4023j51261n9733l913j00495m3893K3572j54197j68142J00226
5946A474233j998q4012L861m8840j16245M3104J6977j14717Q758r067L6455p2246
5934A136263o0323J54623j6901q1364J83838M2601J9898Q457M2460L7489n6666
5923A410375P6334q3946Q0728P8616p0936l6821k84499M463p2282K9240m1469
$$ plain form
5998 3948689 3748157 3525763 3506168 3462927 3538371 3589566 3817488 4004704 4023386 4294111
5988 4294111 4426440 4597464 4617443 4812520 4974204 4858169 4862438 4761515 4677786 4519273
5978 4519273 4319941 4183708 4053787 4160822 4107400 4098057 4097249 3987019 3904321 3849744 3877000
5967 3877000 3852048 3766751 3709147 3443036 3239599 3010775 2791120 2464034 2262272 2171715
5957 2171715 2106092 2032069 1880808 1821075 1817162 1716667 1672774 1696346 1542149 1374007 1474233
5946 1474233 1472235 1388223 1392084 1343244 1226999 1270103 1287080 1172363 1181121 1172054 1208509 1136263
5934 1136263 1075940 1230563 1213662 1132298 1316136 1358737 1378635 1387092 1429552 1467041 1410375
5923 1410375 1486709 1402763 1483491 1562107 1491171 1454350 1169851 1174314 1102032 1131272 1089803
5912A089803n8649M3301L5654l4254J47921N6824j01302j71965L858K1439l2828
5901I99802N6548l0838L515J37824J5233j89933Q4916N4400j01098P2127O826
5890A109322J3849j05984k8754P2708k7766l259M5709M5545L8071o1037M8782
5879A147186q197n0782J36779K6772l385q0828O9871Q1293L7505L4384q1406J6860
5867A326052R886M8791J0868M8738M7580J2205k1169R3879N2008k3120L7784j11719
5855A531783N964O2133R9935l3755R6921J37037N8134Q4710L845K7981M4399o649
5843B112438J8396Q5416M9535J36441m1668O6782R8438J19129p0874O6962Q8867
5832B729862R2237J77838Q57O2789K6215P6342P5715l704l1310M739O6643o2592
$$ plain form
5912 1089803 1031154 1074455 1110109 1075855 1223776 1280600 1179298 1007333 1011191 1032630 999802
5901 999802 1056350 1025512 1029027 1166851 1182084 992151 1077067 1131467 1030369 1102496 1109322
5890 1109322 1123171 1017187 988433 1061141 1033375 1030116 1075825 1121370 1159441 1098404 1147186
5879 1147186 1138989 1088207 1224986 1251758 1248373 1167545 1237416 1318709 1356214 1390598 1309192 1326052
5867 1326052 1335938 1384729 1395597 1444335 1491915 1504120 1482951 1576830 1628838 1605718 1643502 1531783
5855 1531783 1537747 1599880 1699815 1666060 1762981 1900018 1958152 2042862 2046707 2074688 2119087 2112438
5843 2112438 2130834 2216250 2265785 2402226 2360558 2427340 2525778 2644907 2574033 2640995 2729862
5832 2729862 2822099 2999937 3000794 3063583 3089798 3166140 3241855 3238151 3206841 3211580 3278223 3215631
5820C215631K6729k4534J21660L8300j14150J28714L1251J27887l4505l17R4372
5809C611038J23243R3648J72423l2165J03172O5120L560J00707Q46J28672K16300
5798D586564M1180N6245k08773J85333J06556N6659O6235Q2886J11640O0544M6653
5787E191722k1313J59762J47182J12281q1285o1289k3710J41475Q5502M2711J74710
5776E867748J72803l893J27378J10508J21045k5290R1942J37512N4544L4334R5796
5765F784427J27585N2730M2456J2110Q7819Q4557J01722O286J07595J08781J08360
5754G624428K5456L4608J04615J09173J31544P7931J67559J96974O2855M9137
5744H584280n9075J29141Q7576m1165J28624J25377o6911J27967K55526K35064
$$ plain form
5820 3215631 3242360 3217826 3339486 3377786 3263636 3392350 3423601 3551488 3516983 3516666 3611038
5809 3611038 3734281 3827929 4000352 3968187 4071359 4136479 4140039 4240746 4241592 4370264 4586564
5798 4586564 4627744 4683989 4475216 4660549 4767105 4823764 4889999 4972885 5084525 5145069 5191722
5787 5191722 5170409 5330171 5477353 5589634 5508349 5447060 5423350 5564825 5650327 5693038 5867748
5776 5867748 6040551 6036658 6164036 6274544 6395589 6370299 6462241 6599753 6654297 6688631 6784427
5765 6784427 6912012 6964742 7007198 7019308 7107127 7191684 7293406 7299692 7407287 7516068 7624428
5754 7624428 7649884 7684492 7789107 7898280 8029824 8107755 8275314 8472288 8535143 8584280
5744 8584280 8525205 8654346 8741922 8700757 8829381 8954758 8887847 9015814 9271340 9506404
5734I506404J72303J88572K86792L54674K30945K93148K47006K03272L67092M57022
5724A2307230O66267N41599O85628P93613Q24186Q62843J089041J400978J735792
5715B0907177K192012K205916K735272L242484L808368M514172N363892O426269
5707E1395562P877147Q751182Q620408Q525017N655994J021348n442361j1126724
5699G5277573j2676623j1417002q118032n780472m112433l325059k955849k247807
5691B4644296j971568j642865j352828j128478r63920q08000p20819n60431o05192
5682A4890195n81140n40845l74633m70523j86843k67629j47843j70877r3793n3576
5672A2002493R7237Q7319J9536M1345k7511N7166M2688R7802J81939J91910L02188
$$ plain form
5734 9506404 9678707 9867279 10154071 10508745 10739690 11032838 11279844 11483116 11850208 12307230
5724 12307230 12973497 13515096 14200724 14994337 15818523 16681366 17770407 19171385 20907177
5715 20907177 23099189 25305105 28040377 31282861 35091229 39605401 44969293 51395562
5707 51395562 59272709 68023891 76644299 85169316 90825310 91846658 86404297 75277573
5699 75277573 62600950 51183948 43065916 37285444 33173011 29847952 26892103 24644296
5691 24644296 22672728 21029863 19677035 18548557 17584637 16776637 16055818 15495387 14890195
5682 14890195 14309055 13768210 13393577 12923054 12736211 12468582 12320739 12149862 12056069 12002493
5672 12002493 12099730 12187049 12206585 12247930 12220419 12277585 12320273 12418075 12600014 12791924 13094112
5661A3094112L30519M26266O55389O63133O70850J069298J337195J636035J865700
5652B1748497K220990K662358L026310L727935M681412N391399O654575P898115
5644E8011591P853663Q319167Q256544L699476p63140n056644r514076j1236472
5636E9570109j0902260q281214n910531m395498l414319k647267k207229k005859
5628A9805932j632271j297455j054962r30328r25938p73198n97484m47564o16308
5619A1530424n73214m98537m17093m99073l32753m08080r3726l22077l20023k71936
5609G793912k94263k70676j68501k44553k36617k54916j61431k19843k01167j77994
5599E563951j94850K0779k9910j59708j30511q7566j97354K703o9406j32622m5655
$$ plain form
5661 13094112 13424631 13850897 14506286 15169419 15840269 16909567 18246762 19882797 21748497
5652 21748497 23969487 26631845 29658155 33386090 38067502 43458901 50113476 58011591
5644 58011591 65865254 74184421 82440965 86140441 85377301 80320657 70806581 59570109
5636 59570109 48667849 40386635 34476104 30080606 26666287 24019020 21811791 19805932
5628 19805932 18173661 16876206 15821244 14890916 13964978 13191780 12594296 12146732 11530424
5619 11530424 10957210 10458673 10041580 9542507 9209754 8801674 8707948 8385871 8065848 7793912
5609 7793912 7499649 7228973 7060472 6815919 6579302 6324386 6162955 5943112 5741945 5563951
5599 5563951 5369101 5389880 5359970 5200262 5069751 4982185 4784831 4787534 4718128 4585506 4539851
5588D539851n3581j78145r3220M5010l1442o3094l0278j03743k29877l2006J6334
5577C785809p3094k215q8991o6799N1494o6374r844P8346j9849m6322p2929l6453
5565C432779k95m3025J6105p3539n5800J13899j0942j57771p1153j39082L3129
5554C044305l3176J27624P384m5180m8515k6910J30513j10809L6719j0534j5579
5543C055842R6523N0566j27500n9518q2433Q2320Q0136n9699J613p3957J0076
5532B973969j897P0517P010m9221N7619j27284J4100R0610K1979j58590J11279
5521C010091o5470J27566N962k7540j9703J66429K2356k18913J03010N4793P195
5510C165776Q7099r7772l354j07743o1179Q2372m2727M925J70713Q5759r2861
$$ plain form
5588 4539851 4486270 4308125 4214905 4259915 4228473 4165379 4135101 4031358 3801481 3769475 3785809
5577 3785809 3712715 3710500 3621509 3554710 3606204 3539830 3529986 3608332 3588483 3542161 3469232 3432779
5565 3432779 3432484 3389459 3405564 3332025 3276225 3390124 3379182 3221411 3150258 3011176 3044305
5554 3044305 3011129 3138753 3146137 3100957 3052442 3025532 3156045 3045236 3081955 3071421 3055842
5543 3055842 3152365 3202931 3075431 3015913 2933480 3015800 3095936 3036237 3037850 2963893 2973969
5532 2973969 2972072 3042589 3049599 3000378 3057997 2930713 2944813 3035423 3057402 2898812 3010091
5521 3010091 2944621 3072187 3078149 3050609 3030906 3197335 3219691 3000778 3103788 3158581 3165776
5510 3165776 3252875 3155103 3151749 3044006 2982827 3065199 3022472 3027397 3198110 3283869 3191008
5499C191008p6462j02788R3664M2082O1474M6008q9921O5860J01464J27872L4616
5488C494877n9312K500M6883K2167K3062j3343J18903J34839L7241O1489p3332
5477C795974J65338o8465L9879N3595M6119J83118M3940P8794L9350L5872N6243
5466D469757R9197P8393P7782J67469J22278K8447L2818J18617J32193Q2684o287
5455E403348N8955Q1353K76953M6346O7418J44946K88753J40442l7636K68017
5445F738895P6189M8401J73494P6029j7595J43426J87311K11906J84658J61012
5435G983726K43326J62304K38090K14024K32980K99115K39937L57209L92375L89465
5425A0752551K83488N65611M94185L95141N70063P31619P31652N89890P53412
$$ plain form
5499 3191008 3114546 3011758 3105422 3147504 3208978 3254986 3165065 3230925 3332389 3460261 3494877
5488 3494877 3435565 3438065 3484948 3507115 3530177 3516834 3635737 3770576 3807817 3869306 3795974
5477 3795974 3961312 3892847 3932726 3986321 4032440 4215558 4259498 4338292 4377642 4413514 4469757
5466 4469757 4568954 4647347 4725129 4892598 5014876 5043323 5076141 5194758 5326951 5409635 5403348
5455 5403348 5462303 5543656 5820609 5866955 5934373 6079319 6368072 6508514 6470878 6738895
5445 6738895 6815084 6863485 7036979 7113008 7095413 7238839 7426150 7638056 7822714 7983726
5435 7983726 8227052 8389356 8627446 8841470 9074450 9373565 9613502 9970711 10363086 10752551
5425 10752551 11036039 11601650 12095835 12490976 13061039 13792658 14524310 15114200 15867612
5416A5867612O63296R27400Q91884J146980J107106J263563J229292J142644J234555
5407B5474332J314704J172251R35605P30462O91376P34344N89795O05705N50627
5398C2799201N76427Q23939O78184P52150J064492J018547J148774R99297Q21372
5389D0682383Q24921P21175L90058N05908J50401R2624M179K9420o5521k5151
5379D3310397m2364r7373m0554J51530J93096L95378N58693M96109Q10957Q82972
5369D6618841O90399O77480O09920L80114J01685J07116K11684J44644P0013M3336
5359D9655232J50654k40584m22306o54010r58296j169879j499777j677196j808503
5350D1375335j913823j862334j954416j891517j921679j667028j472397j470257
$$ plain form
5416 15867612 16530908 17458308 18350192 19497172 20604278 21867841 23097133 24239777 25474332
5407 25474332 26789036 27961287 28896892 29627354 30318730 31053074 31642869 32248574 32799201
5398 32799201 33375628 34199567 34877751 35629901 36694393 37712940 38861714 39861011 40682383
5389 40682383 41507304 42228479 42618537 43124445 43274846 43367470 43371649 43401069 43335548 43310397
5379 43310397 43268033 43170660 43130106 43281636 43474732 43870110 44428803 44924912 45735869 46618841
5369 46618841 47309240 47986720 48596640 48976754 49078439 49185555 49397239 49541883 49611896 49655232
5359 49655232 49805886 49565302 49142996 48488986 47530690 46360811 44861034 43183838 41375335
5350 41375335 39461512 37599178 35644762 33753245 31831566 30164538 28692141 27221884
5342B7221884j194674j013267r29409q04886p28171o17994n87388m11848l48136
5333B0586111m73297j90182l18473k03441j81124k27996j62089j65451o1522j19289
5323A8483247j4174K1352n9095J53134N7629J0541K8238J10469j5460J43728J38972
5312A9058581K17167K02505K73275L35275M31548M85640L78636M51131O29503
5303B2463261P48271O41210P99116Q00612J018177R49502J051898J015208J066411
5294C0553666J083741J357446J595828J563694J601074J670664J702454J821141
5286D2949708J651912J584509J348859J206313R36025P47674N61467K69435O6540
5277E1322442K9768j85554l46701l63769l99740k97388m04994m08274m21502l68217
$$ plain form
5342 27221884 26027210 25013943 24084534 23279648 22551477 21933483 21346095 20934247 20586111
5333 20586111 20112814 19922632 19604159 19400718 19219594 18991598 18829509 18664058 18602536 18483247
5323 18483247 18469073 18490425 18431330 18584464 18642093 18652634 18680872 18791341 18775881 18919609 19058581
5312 19058581 19275748 19478253 19751528 20086803 20518351 21003991 21382627 21833758 22463261
5303 22463261 23211532 23852742 24651858 25452470 26470647 27420149 28472047 29487255 30553666
5294 30553666 31637407 32994853 34590681 36154375 37755449 39426113 41128567 42949708
5286 42949708 44601620 46186129 47534988 48741301 49677326 50425000 50986467 51255902 51322442
5277 51322442 51352210 51166656 50819955 50456186 50056446 49759058 49354064 48945790 48524288 48156071
5267D8156071m32139n53745m44328l65345r6037k16757j46890J5551r6401j9721
5257D5800259J74736o0024q5510j36108k54824o7629l10779m23529m83472o52902
5247D3500218q19418r36357j006562r93611p46549q04178q54263n64580q60006
5238C5914694o12613o18656o47513o11718o73717r27845r80499r85018j051211
5229B8805904j152092j121222r96471q44933j066040r53707r07817o85893n32843
5220B0544886o05245n09924m26984l49419l35634l64906j94435j74617l08182
5211A7275540k39288k44233k50018k47844j21550l11964k96399l81850j89964
5202A4992430k31243l73720k51895j98541k2194j6587n0502o9924j69949o0374
$$ plain form
5267 48156071 47723932 47170187 46725859 46360514 46264477 46047720 45900830 45916381 45819980 45800259
5257 45800259 45974995 45914971 45829461 45693353 45438529 45370900 45060121 44636592 44153120 43500218
5247 43500218 42680800 41744443 40737881 39744270 38997721 38193543 37339280 36774700 35914694
5238 35914694 35302081 34683425 34035912 33424194 32750477 31822632 30842133 29857115 28805904
5229 28805904 27653812 26532590 25536119 24691186 23625146 22671439 21763622 21077729 20544886
5220 20544886 19939641 19429717 19002733 18653314 18317680 17952774 17758339 17583722 17275540
5211 17275540 17036252 16792019 16542001 16294157 16172607 15860643 15564244 15182394 14992430
5202 14992430 14761187 14387467 14135572 13937031 13914837 13898250 13847748 13777824 13607875 13547501
5192A3547501j1569j3852j26267j1366J66684J34131N0912m5778j04268j2585
5182A3573543q7129p7966N4764J35856J46035J10129O7641R9006R008J01513M0864
5171A4173264J22688J12239J18828K33571J61006J34466N6446J23696n7088j05350
5161A5073766k05557j5857J21787N989M4891J50742K7086R3701J74990K09817
5151A5681355J37330k9043J885J58176K43439K26382L38999K56605K74129M20732
5141A7709989M95431O54388P75191N75796N72781N84960L80186M00926L44439
5132B2494087P6800r6747j42607k92217j20033r1878J15977K64815K83111L56426
5122B2847734O44293O83245M71623K39605K22641n9132k70688l19744l08278K6835
$$ plain form
5192 13547501 13535932 13522080 13395813 13384447 13551131 13685262 13736174 13690396 13586128 13573543
5182 13573543 13486414 13408448 13463212 13599068 13745103 13855232 13922873 14021879 14030887 14132400 14173264
5171 14173264 14295952 14408191 14527019 14760590 14921596 15056062 15112508 15236204 15179116 15073766
5161 15073766 14868209 14852352 14974139 14980128 15025019 15175761 15202847 15296548 15471538 15681355
5151 15681355 15818685 15789642 15791527 15949703 16193142 16419524 16758523 17015128 17289257 17709989
5141 17709989 18205420 18859808 19634999 20210795 20783576 21368536 21748722 22149648 22494087
5132 22494087 22570887 22474140 22331533 22039316 21919283 21827405 21943382 22208197 22491308 22847734
5122 22847734 23492027 24175272 24646895 24886500 25109141 25050009 24779321 24459577 24151299 24178134
5112B4178134L3866J53722J57408J23317j160J55594K77808J63614L2109K52276
5102B5526688L13167K84817K86812L23396K62396L35404M64778M06887N10150
5093B8714495O09330O38023O69215O85697R30321R01252R35596J033520J024226
5084C6141675J125156J362312J519071J764077J841670K048557K438069K787606
5076E1028193L360911L617114M216570M633594M700883M785232M061190K262132
5068H2665819N38824m22815j301678j293264m50007O82751J823481K796436L509168
5059H8548715M360668N229367O035793P154551Q304455R387444J0335548J1201854
5051A50558395J1550397J1333561J0530304Q833368O639414L516424l41516m130265
$$ plain form
5112 24178134 24212000 24365722 24523130 24646447 24645287 24800881 25078689 25242303 25274412 25526688
5102 25526688 25839855 26124672 26411484 26734880 26997276 27332680 27797458 28204345 28714495
5093 28714495 29323825 29961848 30631063 31316760 32247081 33148333 34083929 35117449 36141675
5084 36141675 37266831 38629143 40148214 41912291 43753961 45802518 48240587 51028193
5076 51028193 54389104 58006218 62222788 66856382 71557265 76342497 80403687 82665819
5068 82665819 83204643 82781828 81480150 80186886 79736879 80419630 82243111 85039547 88548715
5059 88548715 92909383 98138750 104174543 111329094 119633549 129020993 139356541 150558395
5051 150558395 162108792 173442353 183972657 192806025 199445439 202961863 202620347 198490082
5043A98490082o762158p941740q130487p797053o993639n700356n735894p509567
5035A41919188q757805r125013q564059p145502o059298m912247m220783l492139
5027H9642342l020655k435003k000666j841598j732783j850904j870738k042862
5019G2847133k127638k143643k069867j972348j860268j763875j564815j347538
5011E7997141j300399j339726j291790j298820j582344j719203j625135j532066
5003D6307658j677915j732916j447782j447387j379963j083300j093535j125628
4995C5319232j230132j081967j164119j080025j024669j012936j053348j103323
4987B6568713r83263r45973p67831o16919n93489o81233o27202m88923m77885
$$ plain form
5043 198490082 191727924 183786184 175655697 167858644 160865005 155164649 149428755 141919188
5035 141919188 133161383 124036370 115472311 108326809 102267511 97355264 93134481 89642342
5027 89642342 86621687 84186684 82186018 80344420 78611637 76760733 74889995 72847133
5019 72847133 70719495 68575852 66505985 64533637 62673369 60909494 59344679 57997141
5011 57997141 56696742 55357016 54065226 52766406 51184062 49464859 47839724 46307658
5003 46307658 44629743 42896827 41449045 40001658 38621695 37538395 36444860 35319232
4995 35319232 34089100 33007133 31843014 30762989 29738320 28725384 27672036 26568713
4987 26568713 25585450 24639477 23871646 23254727 22661238 21980005 21352803 20863880 20385995
4978B0385995m14590m21823n17505m25988l64363l14346k49399m50097m79439
4969A6748445m25760l69741m85225k37410k53935k70249k92802k92999k76110
4960A3844214j27837j44990k56635j21290j65023Q3146k16178j62906o1679N5522
4950A2726344L0267q9130q5449L93J37378J19527K28081J57111K68792K80809
4940A3774123K35279L49034N39227M56192N20225P58009Q05919P99591Q80324
4931A9117923J060762R66188P74709O77547K51544q80o54515j323546j380014
4922A9489718j311481j138134q96197o48073o87352m87376n32340m26811l49581
4913A3012373k01494l69854l17649k30165j45278j89932o8301j80358j21156N9196
$$ plain form
4978 20385995 19971405 19549582 19032077 18606089 18241726 17927380 17677981 17227884 16748445
4969 16748445 16322685 15952944 15467719 15230309 14976374 14706125 14413323 14120324 13844214
4960 13844214 13716377 13571387 13314752 13193462 13028439 13111585 12895407 12732501 12670822 12726344
4950 12726344 12756611 12667481 12582032 12582425 12719803 12839330 13067411 13224522 13493314 13774123
4940 13774123 14009402 14358436 14897663 15353855 15874080 16632089 17438008 18237599 19117923
4931 19117923 20178685 21144873 21919582 22597129 22848673 22847793 22193278 20869732 19489718
4922 19489718 18178237 17040103 16143906 15495833 14808481 14321105 13788765 13361954 13012373
4913 13012373 12810879 12441025 12123376 11893211 11747933 11558001 11489700 11309342 11188186 11247382
4903A1247382j7119j68692j11700O4752j00287m4385O0820j37530M834j0481o3315
4892A0724279k05269j05150r3349j70988j41768j99420R7567M0254m7412j8024
4882I880720M2370J35554N7350K1951N1848J8755M7048q0243n1668o1980j08182
4871I953523p2698j06729j01382n9983q8880R4636J25431P0895O6819K7538J37822
4860A0046992K40268J00047p543M1484O8269J07511R6188j6087L0245J46070L7029
4849A0890473L828J90939J83453J57406J8459J13462N7466J75340J13151J67733
4839A2071710J68827Q7334K84523K98840K33074O0400j077j974J98979J41733
4829A3542369J96590K32444K31741L2553J88153L70732J05420J72707J79803J69857
$$ plain form
4903 11247382 11230263 11061571 10949871 11014623 10914336 10869951 10930771 10793241 10798075 10787594 10724279
4892 10724279 10519010 10413860 10320511 10149523 10007755 9808335 9905902 9946156 9898744 9880720
4882 9880720 9923090 10058644 10115994 10137945 10189793 10208548 10255596 10175353 10123685 10061705 9953523
4871 9953523 9880825 9774096 9672714 9612731 9523851 9618487 9743918 9814813 9881632 9909170 10046992
4860 10046992 10287260 10387307 10379764 10421248 10489517 10597028 10693216 10677129 10707374 10853444 10890473
4849 10890473 10894301 11085240 11268693 11426099 11444558 11558020 11615486 11790826 11903977 12071710
4839 12071710 12240537 12327871 12612394 12911234 13144308 13204708 13203631 13201657 13400636 13542369
4829 13542369 13738959 13971403 14203144 14235697 14423850 14794582 14900002 15072709 15252512 15422369
4819A5422369J01599J25066L18827J15088J42021J31526Q8699K68878K20764L58436
4809A7293273K63682K63093L22869L12680M00365M40726M25753O05560M68596
4800B0796597O19475O75724P04036P53249O71603R26545R24113J084952J104821
4791B8261115J018286J424251J358662J480202J471946J490846J573347J397417
4783C9476072J491184J270875R40484R45542N98628M04557N75520L62622L39910
4774D6405394L07889M80884N15023O49843O07845O03846P47756O83975N65086
4765E1567541N68831Q01090R57172J001211J183586J511704J778274K130071K571190
4756F4070670K702263K580469K698838K696564K411206J961597J582822J086958
$$ plain form
4819 15422369 15523968 15649034 15967861 16082949 16224970 16356496 16445195 16714073 16934837 17293273
4809 17293273 17556955 17820048 18142917 18455597 18855962 19296688 19722441 20328001 20796597
4800 20796597 21416072 22091796 22795832 23549081 24220684 25147229 26071342 27156294 28261115
4791 28261115 29279401 30703652 32062314 33542516 35014462 36505308 38078655 39476072
4783 39476072 40967256 42238131 43178615 44124157 44722785 45127342 45702862 46065484 46405394
4774 46405394 46713283 47194167 47709190 48359033 48966878 49570724 50318480 51002455 51567541
4765 51567541 52136372 52937462 53894634 54895845 56079431 57591135 59369409 61499480 64070670
4756 64070670 66772933 69353402 72052240 74748804 77160010 79121607 80704429 81791387
4748H1791387O94529L35097K392j77939m05587n23979m20413m32306n78144r60136
4738G9324901j091298j264990j933408k196605k333335k657180k758138k852371
4730F2237576k770974k588205k584147k443020k135640j910566j760200j689076
4722D4355748j646101j558966j332994j184733j149305j008293r45273q94378
4714C4635705q77517q39015p50039p91240q53763q16826p69032q00462q19971
4705B7317840q04093q46729n92886p39248o38105n03890n09143o05051m97916
4696B1580779l45711k95915l40390k28321j78530j35820j67124n1704n2020j08039
4686A9677205n2728J55278R0748n6699Q2798K43302J05253J51306K15427J02518
$$ plain form
4748 81791387 82485916 82821013 82823405 82645466 82239879 81715900 81295487 80863181 80285037 79324901
4738 79324901 78233603 76968613 75035205 72838600 70505265 67848085 65089947 62237576
4730 62237576 59466602 56878397 54294250 51851230 49715590 47805024 46044824 44355748
4722 44355748 42709647 41150681 39817687 38632954 37483649 36475356 35530083 34635705
4714 34635705 33758188 32919173 32169134 31377894 30524131 29707305 28938273 28137811 27317840
4705 27317840 26513747 25667018 25074132 24334884 23696779 23192889 22683746 22078695 21580779
4696 21580779 21235068 20939153 20598763 20370442 20191912 20056092 19888968 19837264 19785244 19677205
4686 19677205 19624477 19779755 19870503 19813804 19896602 20139904 20245157 20396463 20611890 20714408
4676B0714408P7133J20381J67723J17526J55913J30246O9200M5049K1363r897
4666B1609045J41439J56617J16673J16672K47425K21799K04438J39977L14436
4657B3268521L56607L27478J83149M05197N75271O18327O33918O98699P20823
4648B7787990P98244Q87070J088980J000292J196623J405832J486173J771931
4640C7423135J786560J929062K031009K297821K487301K612726K548888K791982
4632E5908484K876019K861857L046736L100682L272278L123233L043276L041566
4624H0274131K742380K460456J981136J444046R11229K20441m77091j200788j670661
4615H6685279k056993k585760k659910k572234k633581k426386k222119j859826
$$ plain form
4676 20714408 20791541 20911922 21079645 21197171 21353084 21483330 21552530 21597579 21618942 21609045
4666 21609045 21750484 21907101 22023774 22140446 22387871 22609670 22814108 22954085 23268521
4657 23268521 23625128 23952606 24135755 24540952 25116223 25734550 26368468 27067167 27787990
4648 27787990 28586234 29473304 30562284 31562576 32759199 34165031 35651204 37423135
4640 37423135 39209695 41138757 43169766 45467587 47954888 50567614 53116502 55908484
4632 55908484 58784503 61646360 64693096 67793778 71066056 74189289 77232565 80274131
4624 80274131 83016511 85476967 87458103 88902149 89813378 90033819 89556728 88355940 86685279
4615 86685279 84628286 82042526 79382616 76810382 74176801 71750415 69528296 67668470
4607F7668470j469194j141206o09665k02444L65852O45576J269786J694354K094410
4598G0315939K655840L145824L658410M006496M569959N020191N459839N709625
4590A04542123O008514N882014N681821N371154M807975M155011L220269K471259
4582A42140140J783903R39016K79635k26683o05516r38754j210862j633538j811111
4573A38716230k070029k307220k667590l076231l089444l516048m037116m330909
4565A13621643m396636m575709m799172n020313n064749m995698m852188m615572
4557G5301606m489317m001583l904920l712760l254611k981804k644509k510121
4549D7801981k261196k113994j765640j567300j494085j321901j280860j068745
$$ plain form
4607 67668470 66199276 65058070 64448405 64245961 64611813 65257389 66527175 68221529 70315939
4598 70315939 72971779 76117603 79776013 83782509 88352468 93372659 98832498 104542123
4590 104542123 110550637 116432651 122114472 127485626 132293601 136448612 139668881 142140140
4582 142140140 143924043 144863059 145142694 144916011 144310495 143371741 142160879 140527341 138716230
4573 138716230 136646201 134338981 131671391 128595160 125505716 121989668 117952552 113621643
4565 113621643 109225007 104649298 99850126 94829813 89765064 84769366 79917178 75301606
4557 75301606 70812289 66810706 62905786 59193026 55938415 52956611 50312102 47801981
4549 47801981 45540785 43426791 41661151 40093851 38599766 37277865 35997005 34928260
4541C4928260r71929q51070q79295o75932m75726n38957l37671l01327k61096
4532B9635257l06969j61217j48294o5752m4735j62722j65622k61422r0796k28049
4522B7999679m84516p12537n80635o65648o31267n87295p49862p46012o75955
4513B2165952o72510o12427n89334n03168m63080n87264m65444l34220l38541
4504A7599964l61811m97578l02092j57409k87650k45875k56509k23860k47828
4495A5019352r8598o2277p0480k19833p4153m8895j50956l6159j22037j27662
4485A4008302P4583j28942j46899N0286J17537n5342L9770J44152L8206p1670
4475A4069983Q1088J25410p9650P1206L5102J87124J25043L2156K58160J63942
$$ plain form
4541 34928260 33956331 33105261 32225966 31550034 31074308 30535351 30197680 29896353 29635257
4532 29635257 29328288 29167071 29018777 28953025 28908290 28745568 28579946 28318524 28227728 27999679
4522 27999679 27515163 26802626 26221991 25556343 24925076 24337781 23587919 22841907 22165952
4513 22165952 21493442 20881015 20291681 19788513 19325433 18738169 18272725 17938505 17599964
4504 17599964 17238153 16740575 16438483 16281074 15993424 15747549 15491040 15267180 15019352
4495 15019352 14920754 14858477 14787997 14568164 14494011 14445116 14294160 14258001 14135964 14008302
4485 14008302 14082885 13953943 13807044 13857330 13974867 13919525 13959295 14103447 14141653 14069983
4475 14069983 14151071 14276481 14196831 14268037 14303139 14490263 14615306 14647462 14905622 15069564
4465A5069564K74279K13295N5639K36801L13687L88925K58280L66524L94440M68880
4455A8040314M05387L62899L13436L82275M30302L22920K99112L66382K86013
4446B1209040L72211L97413L68858M11161L85032M78197M83747N66962O71287
4437B5343908O71212O00992Q26361O79129O93950O72871P98850Q35668P82761
4428C1905702P73964O63438M92118M38774M17426M96588M35629M14933N89619
4419C6628191N27810O20372Q64627O60299P31271Q16648P77617P15110O70315
4410D3012260Q23821R81795Q40435J034464J198904J241461J323010J201151J341002
4401E2998303J216309J196867J281745J193441J259309J297849J323481J500823
$$ plain form
4465 15069564 15343843 15557138 15612777 15849578 16163265 16552190 16810470 17176994 17571434 18040314
4455 18040314 18445701 18808600 19122036 19504311 19934613 20257533 20556645 20923027 21209040
4446 21209040 21581251 21978664 22347522 22758683 23143715 23621912 24105659 24672621 25343908
4437 25343908 26015120 26616112 27442473 28121602 28815552 29488423 30287273 31122941 31905702
4428 31905702 32679666 33343104 33835222 34273996 34691422 35188010 35623639 36038572 36628191
4419 36628191 37156001 37776373 38641000 39301299 40032570 40849218 41626835 42341945 43012260
4410 43012260 43836081 44817876 45658311 46692775 47891679 49133140 50456150 51657301 52998303
4401 52998303 54214612 55411479 56693224 57886665 59145974 60443823 61767304 63268127
4393F3268127J716813J727096J953405K294595K450911K582039K619169L028307
4385H1640462L458507L534320L776758M043155L921579L998399L766782L730688
4377A11870650L317621L018071K634012K186690K172660J952999J927525J955623
4369A31035851J964873J917145J796571J622453J623412J408042Q68833M86236
4361A42723416J55390j75465o49306r43993j262677j301367j676007j756579j906774
4352A33206638j793992j818775j998481j727186j753055j760000j638307j546739
4344A19170103j651441j782707j800607j732541j917943j927574j915137j730058
4336A04712095j887649j772655j840598j983155k431881k590160l064682l624659
$$ plain form
4393 63268127 64984940 66712036 68665441 70960036 73410947 75992986 78612155 81640462
4385 81640462 85098969 88633289 92410047 96453202 100374781 104373180 108139962 111870650
4377 111870650 115188271 118206342 120840354 123027044 125199704 127152703 129080228 131035851
4369 131035851 133000724 134917869 136714440 138336893 139960305 141368347 142237180 142723416
4361 142723416 142878806 142703341 142054035 141110042 139847365 138545998 136869991 135113412 133206638
4352 133206638 131412646 129593871 127595390 125868204 124115149 122355149 120716842 119170103
4344 119170103 117518662 115735955 113935348 112202807 110284864 108357290 106442153 104712095
4336 104712095 102824446 101051791 99211193 97228038 94796157 92205997 89141315 85516656
4328H5516656l795100l863610l734093l497645l237827l346467l138345k849448
4320E8054121k532545k357371j714250j542827j176158j047780q84575p36798
4312D6061817n09799n36451l21436j21706j35220j44061r0260j00589r4945L6888
4302D4044238Q7255J11742J71653K86474K39075J17352K86447k54905j271451
4293D3817880j569124j807907j574588j420485j325603j053071q99460j054378
4285C3113264q89045j029297q89268p15561p26107n67712m85974m64539k84810
4276B7060951j93429k42822q0179J08796J13356K80308K95542J79111L80760J96596
4266B8098990O569k60325m84106m34835m50232m5899K6084L0818Q3804K91417
$$ plain form
4328 85516656 81721556 77857946 74123853 70626208 67388381 64041914 60903569 58054121
4320 58054121 55521576 53164205 51449955 49907128 48730970 47683190 46798615 46061817
4312 46061817 45552018 45015567 44694131 44572425 44437205 44293144 44202884 44102295 44007350 44044238
4302 44044238 44131493 44243235 44414888 44701362 44940437 45057789 45344236 45089331 43817880
4293 43817880 42248756 40440849 38866261 37445776 36120173 35067102 34167642 33113264
4285 33113264 32224219 31194922 30305654 29590093 28863986 28296274 27810300 27345761 27060951
4276 27060951 26867522 26624700 26544521 26653317 26766673 27046981 27342523 27521634 27902394 28098990
4266 28098990 28105559 27845234 27361128 26926293 26476061 26430162 26456246 26487064 26570868 26862285
4256B6862285L26307N89150P74384O20632Q94622R45612J099388J201908J442969
4247C4757257J636559J584437J744157J864537K145738K010414K057251K174037
4239D9974387J979660K088421K029416J771560J783442J588532J433998J449757
4231F4099173J454436J403807J635942J824670K240567K473634K880196L212027
4223H1224452L381735M052222M209540M275245M402425M322761L889061L365975
4215A13123416K469555J396974K17103j308549k510092l730921m856102n769424
4207I9031960o044097o384041o337694o082520n733750n254523m765019m325560
4199E4104756l844412l338292k949940k715381k480993k007926j913964j764839
$$ plain form
4256 26862285 27188592 27777742 28552126 29172758 30067380 31012992 32112380 33314288 34757257
4247 34757257 36393816 37978253 39722410 41586947 43732685 45743099 47800350 49974387
4239 49974387 51954047 54042468 56071884 57843444 59626886 61215418 62649416 64099173
4231 64099173 65553609 66957416 68593358 70418028 72658595 75132229 78012425 81224452
4223 81224452 84606187 88658409 92867949 97143194 101545619 105868380 109757441 113123416
4215 113123416 115592971 116989945 117207048 115898499 113388407 109657486 104801384 99031960
4207 99031960 92987863 86603822 80266128 74183608 68449858 63195335 58430316 54104756
4199 54104756 50260344 46922052 43972112 41256731 38775738 36767812 34853848 33089009
4191C3089009j610701j368305j372558j149792j069454q55990q78465r50550q09045
4182B3024149p62189p01349o94153o97573o37750o49161n08552l92606n79464
4173A7401352m33565m27236l75868m64091l95647k91945l12344k61924l26098
4164A4112634k58254k61794k69176j98222j06813l58645j52361k71627k08202
4155A2027540k09084k45396j72178k05715j56204p0594j86494j23616j27862j06115
4145A0424282j32881M4791j60398j82885q4934q5079r9624m3297j9311Q785j00857
4134I568592j47541j43327q7725o6598K5441R6274j29264q990o8431j22328k4989
4123H891114J45035p4615k0152o0365N3483p0277j7798M7811p0341o60O8902O0731
$$ plain form
4191 33089009 31478308 30110003 28737445 27587653 26518199 25662209 24783744 23833194 23024149
4182 23024149 22261960 21560611 20866458 20168885 19531135 18881974 18373422 17980816 17401352
4173 17401352 16967787 16540551 16164683 15700592 15304945 15013000 14700656 14438732 14112634
4164 14112634 13854380 13592586 13323410 13125188 13018375 12659730 12507369 12235742 12027540
4155 12027540 11818456 11573060 11400882 11195167 11038963 10968369 10781875 10658259 10530397 10424282
4145 10424282 10291401 10336192 10175794 9992909 9907975 9822896 9723272 9679975 9660664 9669449 9568592
4134 9568592 9421051 9277724 9189999 9123401 9148842 9245116 9115852 9106862 9038431 8916103 8891114
4123 8891114 9036149 8961534 8941382 8881017 8934500 8864223 8846425 8894236 8823895 8823235 8892137 8952868
4111H952868m0481j2074o4118J05107m00j52291K5351l5639M3437M3111J65190
4100I030061j6665j21738l6547L9399J13944M4772j07124L7351Q3988n7884Q810
4089I018367J33678P7581n6023J05931K7521q199K03942O1197J87361J11918K3140
4078I886414J51586J11300O7028N0663K28700K61176m5803J95392L12718J76814
4068A1395988K25264K02513J98083K39559J74631K98195L78010J62570K75443
4059A3550256L94613L98619L03432M40325L58737M40867L66614K82430M37813
4050A6973706N27988M13068M71714M11911M45559O41860N28182M22762O04178
4041B1440928O70052O05367M64013M30618P55129O97427O78435O61551N31268
$$ plain form
4111 8952868 8912387 8900313 8836195 8941302 8940902 8788611 8813962 8778323 8821760 8864871 9030061
4100 9030061 9013396 8891658 8855111 8894510 9008454 9053226 8946102 8983453 9067441 9009557 9018367
4089 9018367 9152045 9229626 9173603 9279534 9307055 9298856 9502798 9563995 9751356 9863274 9886414
4078 9886414 10038000 10149300 10216328 10266991 10495691 10756867 10711064 10906456 11219174 11395988
4068 11395988 11621252 11823765 12021848 12261407 12436038 12734233 13112243 13274813 13550256
4059 13550256 13944869 14343488 14646920 15087245 15445982 15886849 16253463 16535893 16973706
4050 16973706 17501694 17914762 18386476 18798387 19243946 19885806 20413988 20836750 21440928
4041 21440928 22110980 22716347 23180360 23610978 24366107 25063534 25741969 26403520 26934788
4032B6934788O50537P06557P55252Q03242Q09959Q33086Q92496R08599P53316
4023C4047832P14232O69127O88250P91530R37253R10655J121642J270118J364744
4014D2515383J336357J549632J706218J762889K128998K349486K483449K743234
4006E8575646L245718L710668M035153M601969M977530N463808O203576O921904
3998I7735972P932081Q806569R547276J0060538R993365R208457P543341N010003
3990A65837602K692960K138865L236990N250818P294171Q514240Q199356O548078
3982B09713080M216206K935175L794206O720737J0302313J3877797J7572790K1077508
3974B90209812K4428752K6799877K7681971K5842902K0328873J0771877k775804
$$ plain form
4032 26934788 27585325 28291882 29047134 29850376 30660335 31493421 32385917 33294516 34047832
4023 34047832 34762064 35431191 36119441 36910971 37848224 38758879 39880521 41150639 42515383
4014 42515383 43851740 45401372 47107590 48870479 50999477 53348963 55832412 58575646
4006 58575646 61821364 65532032 69567185 74169154 79146684 84610492 90814068 97735972
3998 97735972 105668053 114474622 124021898 134082436 144075801 153284258 160827599 165837602
3990 165837602 168530562 170669427 173906417 179157235 186451406 194965646 203165002 209713080
3982 209713080 213929286 216864461 220658667 227379404 237681717 251559514 269132304 290209812
3974 290209812 314638564 341438441 369120412 394963314 415292187 426064064 423288260
3967D23288260j8270090l1149433l7228299l7048936l3322819k8576265k4077769
3960B13614649k0143193j7284135j5039210j3246030j1407792j0125741q861513
3953A17507035p829744o901414o184117n578590n093523m689687m120892l891631
3945G3217437l665562l460886l159569k836243k776183k420481k314720k119170
3937E0464623j873368j892459j779651j785695j800537j612397j604048j526818
3929C6589650j300513j244910j234244j154682j025889j093378r19051q01134
3921B7815849q81171q09991o78273p35487o50660n16336o05550m68484n90039
3912B1879858m09391m33740o45995m52042m72529n31089m78095k83223l78725
$$ plain form
3967 423288260 405018170 373868737 336640438 299591502 266268683 237692418 213614649
3960 213614649 193471456 176187321 161148111 147902081 136494289 126368548 117507035
3953 117507035 109677291 102775877 96591760 91013170 85919647 81229960 77109068 73217437
3945 73217437 69551875 66090989 62931420 60095177 57318994 54898513 52583793 50464623
3937 50464623 48591255 46698796 44919145 43133450 41332913 39720516 38116468 36589650
3929 36589650 35289137 34044227 32809983 31655301 30629412 29536034 28616983 27815849
3921 27815849 26934678 26124687 25446414 24710927 24060267 23543931 22938381 22469897 21879858
3912 21879858 21470467 21036727 20390732 19938690 19466161 18935072 18456977 18173754 17795029
3903A7795029n02216m38962l21338m10669l31934l59117l78665k42845k21852
3894A4587431l10870l28547l33651l23989l73005l47030l77291k88428k96630
3885A1607990k56349k36470k80028l54389k38673k84172j76612j02023k25482
3876I453792k28872q6241j67784k93323k29645j24844o3040j48233j43399k19125
3866G749286j26182m8919k20618j23828q6886j02734J3219j14508j07897r4430
3856F736503j59378o5285k21072j11389Q2699j46811j70931k19564m3918j17387
3846E563467R3453k10435j16702R7143m9967j83113p7336j10159m9501k00695
3836D756155j36807J88227j6063R4630n6292j63858m0911j61819j07936j1720
$$ plain form
3903 17795029 17292813 16853851 16532513 16121844 15789910 15430793 15052128 14809283 14587431
3894 14587431 14276561 13948014 13614363 13290374 12917369 12570339 12193048 11904620 11607990
3885 11607990 11351641 11115171 10835143 10480754 10242081 9957909 9781297 9679274 9453792
3876 9453792 9224920 9138679 8970895 8677572 8447927 8323083 8260043 8111810 7968411 7749286
3866 7749286 7623104 7574185 7353567 7229739 7142853 7040119 7053338 6938830 6830933 6736503
3856 6736503 6577125 6511840 6290768 6179379 6262078 6115267 5944336 5724772 5680854 5563467
3846 5563467 5656920 5446485 5329783 5426926 5376959 5193846 5116510 5006351 4956850 4756155
3836 4756155 4619348 4807575 4791512 4886142 4829850 4665992 4625081 4463262 4355326 4343606
3826D343606K5394j0059j06908N1890M4477Q8735k8912o8226o3592l008L7026
3815D310423k30125p3113j08117q6055j47794l2334N974R2583r5500j01644R2047
3804C626345r4429j79052j03020J8132m1614r0310n7804K7228j53756J8291o3791
3793B906220p6045j09916R6796o7965n370l3790p155R7926q0028j39836p0098
3782B510739l179j77059M7522n6908o1037P8188O0598j64433M4793L1531m5733
3771B265022o0822L8668Q7068j58366L3016n332M9358n9084N771q9866K6948o652
3759B125729r6686J0933J48857j3416j10882n9631Q5067l3140L8125J2715m1047
3748B066624Q4226J9417j5878J6982r9248J07907M6728J0903q0377l0115K06859
$$ plain form
3826 4343606 4369000 4358941 4252033 4303923 4348400 4437135 4408223 4339997 4276405 4273397 4310423
3815 4310423 4080298 4007185 3899068 3813013 3665219 3632885 3638859 3731442 3635942 3534298 3626345
3804 3626345 3531916 3352864 3249844 3267976 3226362 3136052 3078248 3105476 2951720 2970011 2906220
3793 2906220 2830175 2720259 2817055 2749090 2743720 2709930 2702775 2800701 2720673 2580837 2510739
3782 2510739 2507560 2330501 2378023 2321115 2260078 2338266 2398864 2234431 2279224 2310755 2265022
3771 2265022 2204200 2242868 2329936 2171570 2204586 2199254 2248612 2189528 2195299 2105433 2132381 2125729
3759 2125729 2029043 2039976 2188833 2175417 2064535 2004904 2089971 2056831 2094956 2107671 2066624
3748 2066624 2150850 2170267 2154389 2171371 2072123 2180030 2226758 2237661 2157284 2127169 2334028
3737B334028J16223p8000k1923O8134k2660K9930j2083J25182m5872k9356O0341
3726B523944m4730J42324R3417o4262k0793J35448J07684P7274J26029J990M3466
3715C121791N3796Q7273j0617N3288q2860k87093k49541o4723k26834k02633n768
3704B186079m2574k60255l9669m1132j53240m5990q3935k0446J2707k4389M5979
3693A533135J3190q7526j38437j8394o2187k7384j18202J3864o0005j5218M474
3682A037310L4984P8782j06188p7547m1406L9461Q9853L48q5198n1937K964J00637
3670A022063r6326J4691K6145j16270k1833R0183j1189J2395l7087j06008l0703
3659G46061P6389M2384q9596n201J6995n4286K4378N4129j33469J22884l9371
$$ plain form
3737 2334028 2450251 2372251 2350328 2418462 2395802 2425732 2413649 2538831 2492959 2463603 2523944
3726 2523944 2479214 2621538 2714955 2650693 2629900 2765348 2873032 2950306 3076335 3078325 3121791
3715 3121791 3175587 3262860 3252243 3305531 3222671 2935578 2686037 2621314 2394480 2191847 2186079
3704 2186079 2143505 1883250 1843581 1802449 1649209 1603219 1519284 1498838 1511545 1487156 1533135
3693 1533135 1546325 1458799 1320362 1301968 1239781 1212397 1094195 1108059 1048054 1032836 1037310
3682 1037310 1072294 1151076 1044888 967341 925935 965396 1055249 1055597 970399 918462 921426 1022063
3670 1022063 925737 940428 966573 850303 828470 918653 907464 919859 882772 776764 746061
3659 746061 822450 864834 775238 770037 787032 732746 757124 811253 677784 800668 761297
3648G61297j26257o3913O8296k8738Q8220j4490l5346L8339j2201n6104o629m7096
3636E65378r4891P0587L2980n5403O6946j6811j4078J3489k8427O1171m2310l0225
3624E28406m12J4150L9823l0433l3418n2586j02032P9814O8985j3621K1886R4380
3612F14942K2282n6928M22p015k9423n2720J7589O4415m4428M5359o3159M5327
3600E56663j08555n9025J58062k0987K1161n9092n1075k8349L5161p5351Q99J16272
3588D85784m4446j8251p625L7705n11J5107k8562L9321k19433J2914n9390N9589
3576B72202J06269M0305q8864L8272j12093J3619J6378O3945j40834J17065P3117
3565C99381k0170j8952K2542K5515j23367M3156R406m1243O0641J30927k0494
$$ plain form
3648 761297 635040 571127 639423 610685 698905 684415 649069 687408 675207 619103 612474 565378
3636 565378 470487 541074 574054 518651 585597 568786 554708 568197 539770 600941 558631 528406
3624 528406 527994 542144 581967 551534 518116 465530 363498 443312 512297 498676 520562 614942
3612 614942 637224 580296 580718 573703 544280 491560 509149 573564 529136 574495 511336 556663
3600 556663 448108 389083 547145 526158 547319 488227 437152 408803 443964 368613 369512 485784
3588 485784 441338 423087 415462 453167 452656 467763 439201 478522 259089 272003 212613 272202
3576 272202 378471 418776 329912 368184 256091 269710 286088 350033 209199 326264 399381
3565 399381 379211 360259 382801 408316 284949 328105 337511 296268 356909 487836 467342
3554D67342M9918L1992r9097R215N6781J04588q7169L4184P8373j01841L2106
3543E76392j88600R6572M9036j45172K3058n8492m6157J33463o803m6941p3368
3532C12988J8105j1900m853R6097M4525j26508K1545l4785L8341M4513j00953
3521B97115m8556J21588n100j8854j0073R958j20162O240J39449M7965r8272L4365
3509C55663l3008J4666O8627n6873n8468J48829o1458k1243Q912l4000J02145
3498D33792k4985L5866o2608k0475m0443M2140J5000j6610o3792j51623J07543
3487B53805j6790J09452L9822o5593m5131Q0932q801l4775L85K3147P3669K4281
3475D34403m2808N9p2116o0342N812L8933K3674P109l2424N4248M9986K9887m2278
$$ plain form
3554 467342 517260 549252 450155 459370 516151 620739 533570 567754 646127 544286 576392
3543 576392 387792 484364 533400 388228 411286 352794 306637 440100 433297 386356 312988
3532 312988 331093 319193 314340 410437 454962 328454 349999 315214 353555 398068 297115
3521 297115 248559 370147 365047 346193 336120 346078 225916 232156 371605 419570 321298 355663
3509 355663 322655 337321 405948 349075 290607 439436 377978 356735 365647 331647 433792
3498 433792 408807 444673 382065 361590 321147 363287 378287 361677 297885 146262 253805
3487 253805 237015 346467 386289 320696 275565 356497 347696 312921 313306 336453 410122 434403
3475 434403 391595 391654 319538 259196 265008 303941 327615 334724 302300 356548 406534 436421 394143
3462C94143n3187j04577O8078Q5771n3831O9142k5404l8926o2774Q7803J73043
3451E39281m2920j42671O6743r0622J15301M0468m4568j14383N8840R9642m2559
3440D42552N7454n762M878R4678r9254p129n0983J7572J3550q3385K0275J18791
3428E23237K5816o1217j38823J68677M4608j26203O0187J8990j26536J162L3827
3417D23725Q49r2171p958J44293k3069M4450J1629m1545P9221L9688J50588J24443
3405H54143r6061m8236r0631j20620N3689L6662j7787m0949r0087j452N8618O3070
3393E60359J0147M6368o5900J06775R3168R7969p1275J403J5291l1533K0063J6898
3381G99733J50414N1166Q0481N7373K0715J9112O0356Q6823k2719O5000o3008
$$ plain form
3462 394143 340956 236379 304457 390228 336397 405539 380135 341209 278435 366238 539281
3451 539281 496361 353690 420433 329811 445112 485580 441012 326629 385469 485111 442552
3440 442552 500006 494244 499122 593800 494546 487417 436434 454006 467556 384171 404446 523237
3428 523237 549053 487836 349013 517690 562298 436095 496282 515272 388736 389898 423725
3417 423725 424574 332403 324445 468738 445669 490119 501748 460203 539424 579112 729700 854143
3405 854143 758082 709846 619215 498595 552284 588946 571159 530210 440123 438671 497289 560359
3393 560359 570506 616874 550974 657749 750917 848886 777611 779014 794305 762772 782835 799733
3381 799733 950147 1001313 1081794 1139167 1159882 1178994 1239350 1326173 1303454 1368454 1305446
3370A305446P264L6126J64236r255n1358J13701m5786P5922K2059L7884J33134
3359A789373j5340o7346N2509M5271J15992K9814M5344o1916J6834J64876J75938
3348B291349k3534o9679R8678P8463M7336N7919M9289Q4628Q0206J17198J08480
3337B920333K55714K44052p058K70521J67443J99276K20493K35089K63085K19303
3327D988251L49509K61598M73976M92836O62384P37622Q99435J142787J125790
3318A1134188J084050Q49689J292172J859708K038135K559954L150142M019861
3310B7987899N175986O019305P866061Q860533O089269J288854r364291j3770811
3302D0152805q728457n762323l859435k901682k079197j715899j375570j259603
$$ plain form
3370 1305446 1312710 1348836 1513072 1503817 1452459 1566160 1520374 1596296 1618355 1656239 1789373
3359 1789373 1774033 1706687 1759196 1804467 1920459 1950273 1995617 1933701 1950535 2115411 2291349
3348 2291349 2267815 2198136 2296814 2375277 2422613 2480532 2529821 2614449 2694655 2811853 2920333
3337 2920333 3176047 3420099 3413041 3683562 3851005 4050281 4270774 4505863 4768948 4988251
3327 4988251 5337760 5599358 6073334 6566170 7228554 7966176 8865611 10008398 11134188
3318 11134188 12218238 13067927 14360099 16219807 18257942 20817896 23968038 27987899
3310 27987899 33163885 39183190 47049251 55909784 61999053 63287907 53923616 40152805
3302 40152805 31424348 25662025 21802590 18900908 16821711 15105812 13730242 12470639
3294A2470639q40421q24238n97227p13629q55289p28469n70102m28807l88938
3285F523519m39001l55399m77632l19244j67786k54265k52020j80513j93428q1878
3275C802353o9178j05428j00714k01446j51660j82509l6492j94637j55695j32660
3265B471934r9572N448j97269j04934o858p6952J2694j14052q9106j2050n1868
3254A737415j79584r1227K6764K116j0557r1559j41023J67457q3680o2810l8434
3243A234878j6146r6609J18843j02308L1341L1574j14996j9678N9247N9585p6703
3232A109028m6141l3115j44579j6625J06962n3812l8646M5137l1839r4512K6112
3221H27970l5172q3015Q2209k4310r4597J29012K802j58703m5275J62453j47945
$$ plain form
3294 12470639 11630218 10805980 10208753 9495124 8639835 7911366 7341264 6912457 6523519
3285 6523519 6084518 5729119 5251487 4932243 4764457 4510192 4258172 4077659 3884231 3802353
3275 3802353 3733175 3627747 3527033 3325587 3173927 2991418 2954926 2760289 2604594 2471934
3265 2471934 2372362 2377810 2180541 2075607 2068749 1991797 2004491 1890439 1801333 1789283 1737415
3254 1737415 1557831 1466604 1493368 1495484 1484927 1393368 1252345 1419802 1336122 1273312 1234878
3243 1234878 1218732 1122123 1240966 1138658 1169999 1201573 1086577 1066899 1126146 1185731 1109028
3232 1109028 1062887 1029772 885193 868568 975530 921718 883072 928209 896370 801858 827970
3221 827970 792798 709783 791992 767682 673085 802097 804899 646196 600921 763374 615429
3210F15429K0565O1127k6477q5303o6641M5911n8697n5907J6182k7673O4438L1049
3198E34003l3140k8134o8300p1341N1225m0939L7969N519J58N22n2797p7879J67193
3185D24059Q801J5929m3804o8749k7059o990M7645Q630r2075J00001k1606r497
3173C35285Q841q7606O6562K7926R8149P375j21209P1099o7173j14159l3629q860
3161A82601K3486m5116O5586o7804Q5798m229J4975P2779n6149j81661N5333J44860
3149B90459o4596l1050k9689N6789J3892m8798j063L5277r384j0735j4571n2717
3137A33814m0816O9759J8300N0050K4395j21154P0879r2462j4015J2386j9289
3126I1847L5554N9773l6549l3182k2942m3858j068R807n068R1993L8705q1137
$$ plain form
3210 615429 635994 697121 670644 585341 518700 564611 505914 450007 466189 438516 502954 534003
3198 534003 500863 472729 404429 333088 384313 343374 381343 386862 387020 387542 334745 256866 424059
3185 424059 432860 448789 404985 336236 309177 302187 349832 358462 266387 366388 344782 335285
3173 335285 344126 256520 323082 351008 449157 456532 335323 406422 339249 225090 191461 182601
3161 182601 206087 160971 226557 158753 244551 240322 255297 328076 271927 90266 145599 290459
3149 290459 225863 194813 165124 221913 235805 187007 185944 221221 211837 201102 186531 133814
3137 133814 92998 162757 181057 231107 255502 134348 205227 112765 98750 111136 91847
3126 91847 127401 187174 150625 117443 94501 50643 49575 59382 54314 146307 185012 103875
3114A03875m7709Q3691m8834P8670k7190o2672Q591M8289L2393L4634M3040k6102
3102B20676P6747K1215o3531O373j93911P5213J1490k8449L074q4393L8788Q2466
3090A65758J01244r9136N6684m1041j6704j5386l8442N0767J5462j9531M166j9327
3078A44514m057K0989r2095Q7756m3470N9176k4639m824l3619L7197M9830Q4462
3066B81220o6654N0112Q1312P290j5289o125O7286k05462j3569o5024Q8423N9883
3054B63403k5784K5961j17376l5537K16687m7394j17342L2604P2984J22192r4370
3043B96028j42964m1119k8994m0738n3887J55150r1654j25558N6842P0070Q4404
3032A37580P8382j46020L352O9826j6556k5427j8117K0609n1511J6783J1774r2657
$$ plain form
3114 103875 56166 139857 91023 169693 142503 79831 88422 136711 169104 203738 246778 220676
3102 220676 297423 318638 255107 261480 67569 142782 154272 125823 128897 44504 83292 165758
3090 165758 267002 167866 224550 183509 166805 151419 112977 163744 179206 159675 163841 144514
3078 144514 140457 161446 69351 157107 113637 172813 148174 143350 109731 146928 196758 281220
3066 281220 214566 264678 345990 353280 337991 331866 399152 193690 180121 115097 203520 263403
3054 263403 237619 263580 146204 110667 327354 279960 162618 195222 268206 390398 296028
3043 296028 153064 111945 82951 42213 -11674 143476 51822 -73736 -16894 53176 137580
3032 137580 215962 69942 73294 143120 126564 101137 83020 103629 52118 68901 80675 -11982
3020a1982J6047J52r170N8610O6612n785N2768q6225L2358k0690M7531q0811P317
3007F6732N5284P8846j21456k0299O917p8042J37765q5886l5628P1284j4457L0109
2995I1169J859q208j12124o8745J18104q7473M2866M4336N3739L2054j3068P9959
2983A74468m8197r1131l1462J3756j6816K2079o2307J13455M4976m7927o89J8330
2971H8535N6786o9250k0322l270k02296Q4917J86011J3190M0061L1467n2685j43133
2959A0011K2332n4759p7166K1973J08409N8932l7122o6524j19805J20775K23774
2948B10830j01619J9308n0418n3068P7314o7473o6888J7985k7516k3812M4369
2937b0988J43714l1436q6739N490P7117o3770K3127j35125J07997k7293l8197
$$ plain form
3020 -11982 4065 4217 -4953 53657 120269 114484 167252 81027 113385 92695 140226 59415 66732
3007 66732 122016 200862 79406 59107 66024 -12018 125747 39861 4233 75517 61060 91169
2995 91169 93028 84820 -27304 -96049 22055 -65418 -22552 21784 75523 107577 94509 174468
2983 174468 126271 35140 3678 17434 618 22697 -39610 73845 118821 70894 70205 88535
2971 88535 145321 76071 55749 52479 -149817 -64900 121111 134301 174362 205829 153144 10011
2959 10011 32343 -22416 -99582 -77609 30800 89732 52610 -13914 -133719 -12944 210830
2948 210830 109211 128519 78101 25033 102347 34874 -32014 -14029 -41545 -65357 -20988
2937 -20988 122726 91290 4551 10041 87158 23388 46515 -88610 19387 -7906 -46103
2926d6103P8205n9487K335P4210p3687N600J07323O7106l0432j14224M5341q855
2914D7332j49772L4818P8906J04623j36960L3075J9684m0214q3627m2476J42288
2903G677q8727M2560J31419l4353n3882J07281o7465n6520J06836L8135q8894
2892D4067P0777j34748q526M8198K0513k5508m3840J24222m2384J4996N275m1371
2880C1671l1374J5016m6507p5555k2195J15213L1986l1294l3227m4802J59208
2869F8140N987K3171J929m4021n4166J810j1279n6632J9769k9112L0307l725m7842
2856i5664j3987J45156N9968j00841k7872q512M9442N7970K8785k6307P812q9873
2844a3923K6232J12778l5989q1884l8483K4107P0332j378j09747l1818R9108O2879
$$ plain form
2926 -46103 32102 -27385 -25050 49160 -24527 -18927 88396 155502 125070 10846 56187 47332
2914 47332 -102440 -67622 11284 115907 -21053 12022 31706 -8508 -92135 -134611 7677
2903 7677 -81050 -38490 92929 58576 4694 111975 44510 -12010 94826 132961 44067
2892 44067 114844 -19904 -28430 19768 40281 14773 -29067 95155 52771 67767 73042 31671
2880 31671 297 15313 -31194 -106749 -128944 -13731 18255 -13039 -46266 -91068 68140
2869 68140 74127 97298 99227 55206 1040 2850 -8429 -65061 -45292 -74404 -44097 -47822 -95664
2856 -95664 -109651 35505 95473 -5368 -33240 -41752 7690 65660 94445 68138 75950 -13923
2844 -13923 12309 125087 89098 7214 -31269 -7162 63170 61792 -47955 -79773 19335 82214
2832H2214J373L192N190o6625r3370n679O6404O1862o619j09708o4039K09765
2820H3960Q4279l4603K6897l4770n9400l8727N9661m6277M338J00382p4834m0396
2808C0510M2963n7226M7596p2907r974k6930K4297o4397L844J556j821p1459l279
2795a57227l4956J28088N8495J09532j6473j13882j19787Q539O8321l7916p983
2784a15249J00924K1364p535P7751N655k8636o6938r8254k4357M7362j8069J2617
2772i3365j5122j0879M4907L2536o0935J08717J4587K1223Q553L7941j00992Q5908
2760G3079n9754l5688r1997o2602Q8073J35809n6450J1470N9459m0482m8423r3831
2748a21337J27126k515m7303r521K0906j4824p1962N2242r0252Q3304P5053q0750
$$ plain form
2832 82214 83587 86779 91969 25344 -68026 -73705 -7301 54561 47942 -61766 -125805 83960
2820 83960 168239 133636 160533 125763 66363 27636 87297 41020 45358 145740 70906 30510
2808 30510 73473 16247 63843 -9064 -19038 -45968 -21671 -86068 -82224 -80668 -82489 -153948 -157227
2795 -157227 -192183 -64095 -5600 103932 87459 -26423 -146210 -137671 -69350 -107266 -115249
2784 -115249 -14325 7039 -496 77255 82910 54274 -12664 -110918 -135275 -87913 -105982 -93365
2772 -93365 -108487 -119366 -74459 -41923 -102858 5859 20446 41669 50222 88163 -12829 73079
2760 73079 13325 -22363 -114360 -176962 -88889 46920 -9530 1940 61399 20917 -27506 -121337
2748 -121337 5789 3274 -44029 -53550 -32644 -47468 -119430 -67188 -157440 -74136 917 -79833
2736g9833n3545r5265J10422J34635l2418j21102J5885J10680K3200J19311j37207
2725e237p5138L7983n6795O3426L8534j9737k8019l2554L9169p2308M5434k51
2713f5493n0972j7725J4272p2070J10128O3964m5034N7311n3233m9980J05818
2702c014K1483j12160o8883Q6715J40607K3269P535q4567n8705K6227L4644j0972
2690B179O2499n0676l4522R2680p2110P851r880Q658p403k7899J23783R333M725
2677A09218j55535J0210K6335l2918K6603K9855p6745j05771J15567Q2540O3292
2666I2651O397n7352j5005j23740O6021p2103k0291J4425O4283J9782k4003m5286
2654i4221l8632Q952R1288j4663r2576n5407J63019Q9314n0337r7589J46696j280
$$ plain form
2736 -79833 -133378 -228643 -118221 16414 -16004 -137106 -121221 -10541 12659 131970 -5237
2725 -5237 -80375 -42392 -99187 -35761 2773 -16964 -44983 -77537 -38368 -110676 -65242 -65493
2713 -65493 -116465 -134190 -119918 -191988 -81860 -17896 -62930 -5619 -58852 -108832 -3014
2702 -3014 18469 -93691 -162574 -75859 64748 88017 95552 10985 -47720 -21493 13151 2179
2690 2179 64678 14002 -20520 72160 50 7901 -1979 6679 -724 -28623 95160 104493 109218
2677 109218 -46317 -36107 -9772 -42690 -16087 13768 -62977 -168748 -53181 29359 92651
2666 92651 99048 41696 26691 -97049 -31028 -103131 -123422 -108997 -44714 -24932 -48935 -94221
2654 -94221 -132853 -123901 -32613 -47276 -139852 -195259 -32240 57074 6737 -90852 55844 54564
2642E4564k6755M9697p9063K442K4722N183N576m9244J4547P5794p0724K2663
2630B9402q0705j7520J03097J5946J6900p1754j2149O6564K2152L7788l4757p5464
2618e00l5117R3136j36931k0815O9022J58517q6903j4466j3457l1838l0501J0682
2606c9171N2599J5074J8724r8177k7750K8203n2106o747J30669j39622j9818Q3062
2594e5060r560J07223q085m7776l7799J7312L0971m989k8482N6910o544j7272
2582c151m7013r5124J9631N6783k386P0091M7220n106j9976M2628r9203q8697
2570a24303J47006q8678l2162R3557l9485J2827Q6084o0088M009J13346j12846
2559g33p2035j28663P2039P2013j07770O1104J90915L9871m1594j51156L2156
$$ plain form
2642 54564 27809 77506 -1557 885 25607 30790 36366 -12878 1669 77463 6739 29402
2630 29402 -51303 -68823 34274 50220 67120 -4634 -16783 49781 71933 109721 74964 -500
2618 -500 -35617 57519 -79412 -100227 -31205 127312 40409 25943 12486 -19352 -49853 -39171
2606 -39171 13428 28502 47226 -50951 -78701 -50498 -102604 -109351 21318 -118304 -138122 -55060
2594 -55060 -64620 42603 34518 -13258 -51057 -33745 -2774 -7763 -36245 20665 14121 -3151
2582 -3151 -50164 -145288 -125657 -68874 -71260 -1169 46051 40945 20969 63597 -35606 -124303
2570 -124303 22703 -65975 -98137 -4580 -44065 -31238 54846 -5242 -1233 112113 -733
2559 -733 -72768 -201431 -129392 -57379 -165149 -104045 86870 126741 85147 -66009 -33853
2548c3853j8051L5952O6578q1471j5214J44777M2577o9655M9671j66861J6984
2537b8566L5217k7622p344Q3156L338M9426Q359k1526m2183m2686j508L899J3837
2524B5797P7441r7428j1970j10579k816L0390R3276J6132j8651j3996J5896j31101
2512a27609P9356k427j02344J1477M3534M3842J696J02776L1509o7763M0165q719
2500D5493j13672J4135l3615q415P5992n9894p9591J25434J8689K7162q1603R5672
2488B5787p751p2344j3779J4254P8578j6250J41477m0958r2833J5942o7760m422
2476d0059k0584K9565j3709L4821N348o6047N1340P8399j25752K3925n2758j4818
2464a10329J53628K7719P7997K322j48090j32821N3442J11644n6726J8115M0982
$$ plain form
2548 -33853 -51904 -15952 50626 -30845 -46059 98718 141295 71640 121311 -45550 -28566
2537 -28566 6651 -20971 -28315 54841 58179 107605 115964 94438 52255 9569 8061 11960 25797
2524 25797 103238 5810 -6160 -116739 -119555 -89165 4111 20243 1592 -12404 3492 -127609
2512 -127609 -48253 -50680 -153024 -141547 -98013 -54171 -52475 50301 81810 14047 54212 45493
2500 45493 -68179 -54044 -87659 -96074 -20082 -79976 -159567 -34133 -15444 11718 -69885 25787
2488 25787 18036 -54308 -68087 -53833 24745 8495 149972 109014 16181 32123 -35637 -40059
2476 -40059 -60643 -31078 -44787 -9966 -4618 -70665 -19325 59074 -66678 -42753 -95511 -110329
2464 -110329 43299 71018 149015 151337 3247 -129574 -76132 35512 -21214 -3099 37883
2453C7883k7673j2141q7581j2426J15405J6450l9617K5394j51748O5769O1161
2442i124l5794k2661J03827L0907k0222j5684j66254q8120L7136J06982q0495
2431a59502Q9625j40448O5662K20993m8149r909k3695j0285k6058m1295n8019
2420a41080O7739O0274P218n2009o5056N3172L3129j8942L448k0866k6560J16496
2408A6963n6471p628j3789J03424P9930j06787o12P5642j01892M8702j29587m9537
2396a41642L6312l011K9343j3857P6342j5625m4686R4850o2591l0078K5980k3203
2384g1866P9468m4895l3353P2005O2562J8040n3223j5006N2360J3198p0278j8619
2372i607r0329P85O1894l795J03450k9673l9641L7946K7382r4851K1260k464J1932
$$ plain form
2453 37883 10210 -1931 -89512 -101938 13467 29917 -9700 15694 -136054 -70285 -9124
2442 -9124 -44918 -67579 36248 67155 46933 31249 -135005 -223125 -185989 -79007 -159502
2431 -159502 -69877 -210325 -144663 76330 28181 18272 -5423 -15708 -41766 -83061 -141080
2420 -141080 -73341 -13067 -5849 -57858 -122914 -69742 -36613 -55555 -52107 -72973 -99533 16963
2408 16963 -39508 -47136 -60925 42499 122429 15642 15030 90672 -11220 37482 -92105 -141642
2396 -141642 -105330 -108341 -78998 -92855 -16513 -32138 -76824 18026 -44565 -74643 -48663 -71866
2384 -71866 7602 -37293 -70646 1359 63921 81961 28738 13732 66092 79290 9012 -9607
2372 -9607 -99936 -99151 -37257 -41052 62398 32725 -6916 31030 58412 -36439 -15179 -17643 -5711
2359e711P4173O4034p3928m6671q4178k004L5571l8641k6949n37R2667N3809J26248
2346A67883o2687l5166k8359o4993m1717m8700K1144l529J55323o5001J4776n674
2334C300n778j9666m0327m0526J5407Q8857P5325N565J25012n9432j12708j2601
2322B2428k966o8400j9649M1594P4877n2249o2544O8073J74639p5214j28848q7576
2310a15835J6527J2861q852r837o372J11893N5503J1484o0158J7646l5957Q8685
2298G7588j6693j56107J34547M1406q4190L9189L7013l2818J5048k08l4231j56009
2286a35465k4551J25420L6356N173K8063j18862n7924J02139N406r717J8085r592
2274c5469j2386r8140O0635P2195n7371L4302O5951R691n607n6938l9663Q2798
$$ plain form
2359 -5711 68462 132496 58568 11897 -72281 -74285 -38714 -77355 -104304 -104841 -12174 41635 167883
2346 167883 105196 70030 41671 -23322 -65039 -113739 -92595 -96124 59199 -5802 8974 3300
2334 3300 -2478 -22144 -62471 -102997 -87590 1267 76592 82157 207169 147737 35029 22428
2322 22428 19462 -48938 -68587 -26993 47884 -4365 -66909 1164 175803 100589 -28259 -115835
2310 -115835 -99308 -86447 -95299 -105136 -111508 385 55888 67372 7214 24860 -11097 77588
2298 77588 60895 -95212 39335 80741 -3449 35740 72753 39935 54983 54775 20544 -135465
2286 -135465 -160016 -34596 1760 6933 34996 -83866 -141790 -39651 -34245 -43962 -25877 -35469
2274 -35469 -47855 -145995 -85360 -13165 -70536 -36234 29717 39408 33801 -23137 -62800 19998
2262A9998R1163K3218r0731m0312p9281L2036l1943Q1305o5837Q2518m0311n0721
2250f8898j11863J3138l7276M1793J61621Q1441P351p8502n2547O3664M2097j01470
2238c9451j7671N2098N2212k7405o7381N3123j20062j1848N5522m1150n6274M2169
2226a26118R4253M9551n1439o5263l5576P7283P3879K9530o3986N3848k7439p06
2214G817L0460O022m6620o8614P8884m2811l1591j5076P708N023p0760M5198J69502
2201G5142R689j29396m4152M2683M7220J5166M7693J8788j82116n7445J04904
2190e1824J47649o3106R10K7013j2890p4330K7785p8591J20011O3979j7675j4794
2178G4137l1398o8616o204n5981J1362J3715q908j08102J01393J54319o5377r9056
$$ plain form
2262 19998 111161 134379 43648 3336 -75945 -43909 -75852 5453 -60384 22134 -18177 -68898
2250 -68898 -180761 -167623 -204899 -163106 -1485 79956 87307 8805 -43742 19922 62019 -39451
2238 -39451 -57122 -5024 47188 19783 -47598 5525 -114537 -126385 -70863 -112013 -168287 -126118
2226 -126118 -31865 17686 -33753 -99016 -134592 -57309 16570 46100 -17886 35962 8523 7817
2214 7817 38277 44299 -2321 -70935 7949 -34862 -66453 -81529 -73821 -68798 -139558 -94360 75142
2201 75142 84831 -44565 -88717 -46034 1186 16352 64045 82833 -99283 -156728 -51824
2190 -51824 95825 32719 33629 60642 47752 -26578 1207 -77384 42627 106606 88931 74137
2178 74137 42739 -25877 -32081 -88062 -76700 -62985 -71893 -179995 -78602 75717 10340 -88716
2166h8716k8398L2473j257k1216Q6418J04854j11130j24210l5722M1345J33169
2155a2390L3268M8050n7537j45972J39709K2121o4697L1732N1307r3603J13543
2144F5531m4825m2669J7868J677j8301n1549R537N3724L392p3433l1814m6622
2132a57484L8619J13266P7909p7929k2622m9549R114k0029L4268M8203l0226P91
2120c5669M7602k5406O3368M2296j84567J12221Q4470L6520j28383l5371J07835
2109H4916q5128j29975l3687L0879K9972M5318O5921M2201k5619K373J9239L8407
2097H4817p0370M1997q3641j75108J63020j32562K8867J51060M0223j5891j7500
2086A4912L4317k1219M5655K9992p3887q5044O0262n8972J5249M5029l7833k6382
$$ plain form
2166 -88716 -117114 -84641 -85898 -107114 -20696 84158 -26972 -151182 -186904 -145559 -12390
2155 -12390 20878 68928 11391 -134581 5128 27249 -37448 -5716 45591 -48012 65531
2144 65531 20706 -21963 -4095 -2418 -20719 -72268 -62731 -9007 -5615 -79048 -110862 -157484
2132 -157484 -118865 -5599 72310 -5619 -28241 -77790 -68676 -88705 -54437 -6234 -36460 -35669
2120 -35669 11933 -13473 49895 92191 -92376 19845 104315 140835 12452 -22919 84916
2109 84916 -212 -130187 -163874 -132995 -103023 -57705 8216 50417 24798 27171 46410 84817
2097 84817 14447 56444 -27197 -202305 -39285 -171847 -142980 8080 48303 32412 14912
2086 14912 49229 28010 73665 103657 29770 -55274 4988 -53984 -38735 6294 -31539 -57921
2074e7921J23656k6236L8886Q09p0864O0247n5994o486Q6508j5402l9706m9136
2062a1639L9480m2206j4523q503L2554q611n0208L4162P3108R794k5481q8405
2050f0478L0250n097N387o426K5852M5031o5734K9698K0121Q652J05518L652n9266
2037G7160j72450J9178k2327K0480J12680p320j65589L7692N3447l1062P7976
2026a35l8196J19632l4785N1153j75391l5279L1772L5854L4761l5944l6737N7813
2014b5482l2532m3994J5853K799J2486Q0290o0868k1756R1678P559p0555k1533
2002f6055r301P0974n2282l7671Q3567k7348l2088Q767l7433J18627j682L3503
1990E1578O9144k0462r1881o3216m6280O0611l6801J9306k2508n3362P3233p5033
$$ plain form
2074 -57921 65735 39499 78385 79194 8330 68577 12583 6097 92605 77203 37497 -11639
2062 -11639 27841 -14365 -28888 -37391 -4837 -13448 -63656 -29494 43614 53408 27927 -60478
2050 -60478 -30228 -35325 -29938 -36364 -10512 34519 -31215 -1517 18604 27256 132774 136426 77160
2037 77160 -95290 -76112 -98439 -77959 34721 27401 -138188 -100496 -47049 -78111 -135
2026 -135 -38331 81301 46516 97669 -77722 -113001 -81229 -45375 -10614 -46558 -83295 -25482
2014 -25482 -58014 -102008 -86155 -83356 -70870 9420 -51448 -73204 18474 26033 -44522 -66055
2002 -66055 -75356 -4382 -56664 -94335 -10768 -38116 -70204 -61437 -98870 19757 18075 51578
1990 51578 120722 100260 8379 -54837 -101117 -40506 -77307 -58001 -80509 -133871 -60638 -135671
1978a35671O0336l4285N7061O3558J34325L3699k04624j3253P0477K9493j34763
1967g3647j2703l4694J06601J4320J7354K0276j4323K6588J2661M2165j14306
1956i708P519L1345k2665K4608K612n1385L6260K3470k009k9734O0905q7496N6247
1943C9969m075K5666K8309k781r2470M7828k6377m7165j4980j2262L9962m6488
1931f4864Q5833l4053r4332M6187R3195n3562K3851n435k6229N3529R4221K8859
1919A47200j51535o539j2117n6987n7334M6261p4234O0020K6570J09375k4189
1908F491l3717K8028N685J24906j17761j38329J8176m0032P3274L6950q8992j4431
1896a39752j9456P6871K803M9001n7302l7885J47374j91207l068J57435L2609
$$ plain form
1978 -135671 -75335 -109620 -52559 10999 145324 179023 -25601 -38854 31623 61116 -73647
1967 -73647 -86350 -121044 -14443 -123 17231 37507 23184 49772 62433 104598 -9708
1956 -9708 -2189 29156 6491 31099 33711 -17674 18586 42056 40047 10313 71218 -16278 39969
1943 39969 35894 61560 89869 87088 -5382 42446 16069 -31096 -46076 -58338 -18376 -64864
1931 -64864 20969 -13084 -107416 -61229 31966 -21596 2255 -3180 -29409 24120 118341 147200
1919 147200 -4335 -10874 -22991 -79978 -137312 -91051 -165285 -105265 -78695 30680 6491
1908 6491 -27226 802 6487 131393 13632 -124697 -106521 -146553 -73279 -36329 -125321 -139752
1896 -139752 -159208 -82337 -79534 -30533 -87835 -125720 21654 -169553 -172621 -15186 17423
1885A7423r2102N024R752P1404M3057j24977O3312K0117j4969O252K5323k5022
1873D594J00013q135q1610j315j196n7980r468K1498J33906J1737k320j07775
1861A949K8705J1756R2849k9831p0277O4018j26038o5528k0300O4876N5081M7279
1849E4539j17794m3996O5066j3125M6869J5111o1092l0878L3694j10856L4198
1838a28264j0169o8196N0923J27650P9038L779R862J7233j47948m1553J78085
1827G0440K4282K4304q0679K9767l5209Q2810j5985j16317m2530M1919l9743J27167
1815G0226M4009q4814K6573K8146M6290j16792l6337j23219L2865K8190M6143
1804c8720n8870K645m3059J24316J30650o8795q3654q2576J17696M0468k7053
$$ plain form
1885 17423 -74679 -69655 -59903 11501 54558 -70419 -7107 13010 -1959 4293 29616 4594
1873 4594 104607 96472 14862 13547 12351 -45629 -55097 -33599 100307 112044 109724 1949
1861 1949 30654 42410 135259 105428 35151 99169 -26869 -92397 -112697 -47821 7260 54539
1849 54539 -63255 -107251 -42185 -55310 -8441 6670 -54422 -85300 -51606 -162462 -128264
1838 -128264 -138433 -206629 -155706 -28056 50982 54761 64623 81856 -66092 -107645 70440
1827 70440 94722 119026 38347 68114 32905 115715 99730 -16587 -59117 -17198 -56941 70226
1815 70226 114235 29421 55994 84140 130430 13638 -22699 -145918 -113053 -84863 -38720
1804 -38720 -97590 -94945 -138004 -13688 116962 48167 -35487 -118063 -367 40101 13048
1793A3048o10M7055j8784n1703q2923M605P3778R7098j1512r6147o3951O0358
1781b9688L1409O1468o2764o8470j6819r882j0907J34746K2135K0115J05321o4939
1769A11725L608r9059j4319N9982l2912K2603p3020r694N3497J116j2016J6667
1757B8178q1144O0695Q948o2764O1230j5664L2630j00528K7623k7831K7337k6452
1745f7742l998O6849Q1772j15484r0148O1887j6659m9091m6694n7725J17108J12901
1733g024l8557J5419L369J0566Q2804r6722L9140O2487p9805j8289P9645k813
1721E0220j7614m8377m429l0239M698m6578O732M0689o5081N3958L0882l22M6626
1708B1165Q8877k1258l7421j31584Q2396J03504l1015K9628r3383r6511P7041
$$ plain form
1793 13048 12438 59493 40709 -10994 -93917 -89312 -15534 81564 70052 -26095 -90046 -29688
1781 -29688 1721 63189 425 -68045 -84864 -94746 -105653 29093 51228 71343 176664 111725
1769 111725 115333 16274 1955 61937 29025 51628 -21392 -31086 22411 23527 11511 28178
1757 28178 -52966 7729 16677 -46087 15143 -521 32109 -68419 -40796 -68627 -41290 -67742
1745 -67742 -71740 -4891 76881 -38603 -128751 -66864 -83523 -132614 -179308 -237033 -119925 -7024
1733 -7024 -45581 -30162 -26793 -16227 66577 -30145 8995 71482 -8323 -26612 53033 50220
1721 50220 32606 -15771 -20200 -50439 -45741 -92319 -85587 -44898 -109979 -56021 -25139 -25461 21165
1708 21165 110042 88784 51363 -80221 2175 105679 74664 104292 10909 -85602 -8561
1697h561N8019N9016r9807o2352L4053k9665j1402O0527l0955M1980L282j04388
1685i0253L6704J22091J380k2327k1257k2427n272R212k9729p2647o593Q2099
1673a9019p76j0364p9661j1267J73542j43018o3104J3849l0337M7053N3663J51245
1661H1806p7785k0743k9332l0213l3360M552N1212P4748j74419m2234J11910K6543
1649e7315J02860Q1422k1674j15827L0484j4309r2432l6853L6081K0457J84835
1638A17729O9995j93206j16978O2755m9101J61322l8066m7962Q9682p8371n3867
1627g6068m2029L5097M4787L5230p0474R7850L7457j65685n4681M1931O0452K3561
1615c2572R443J21452L8076k11677n1261R0299j12264K01797l3201J5547n0479
$$ plain form
1697 -8561 49458 108474 8667 -53685 -19632 -49297 -60699 -172 -31127 10853 14135 -90253
1685 -90253 -53549 68542 69922 47595 26338 3911 -1361 7851 -21878 -94525 -101118 -19019
1673 -19019 -19795 -30159 -109820 -121087 52455 -90563 -153667 -139818 -170155 -123102 -69439 81806
1661 81806 4021 -16722 -46054 -76267 -109627 -105075 -53863 20885 -153534 -195768 -83858 -57315
1649 -57315 45545 126967 105293 -10534 19950 5641 -86791 -123644 -87563 -67106 117729
1638 117729 187724 -5482 -122460 -59705 -108806 52516 14450 -33512 56170 -22201 -76068
1627 -76068 -118097 -83000 -38213 -2983 -73457 24393 61850 -103835 -158516 -116585 -56133 -32572
1615 -32572 -23129 98323 136399 -75278 -126539 -36240 -148504 53293 20092 35639 -14840
1604a4840l4863N5874N7605l7036j16080M1338j604l6609Q7690O9133m8676J16191
1592A38123o7284n4506J2689K7555j37652N7146J19693K9198j45941r656o7861
1581i8496j8741R5130M5518j7579P7875k3345q9131N6083j0289Q0670j89542o389
1569i8236R6505L65J06592O209q5743L7734P8404j550o3255r5605N0687p265o3601
1556c8759p5641J10335l6793O3751P8696L7388j68638j25474K7159J13881O6374
1545E2279j41497N7357O0814K0212l6370j19893p7585J10652J36519l5649r3322
1534f6483M0350n274j4527q2036M3080j7081N6750l2447Q479J14493j59528m6394
1522a60618J01159M4654L2133l3581J34059j09963q4912m6051n7580N33m0913
$$ plain form
1604 -14840 -49703 6171 63776 26740 -89340 -48002 -49606 -86215 1475 70608 21932 138123
1592 138123 70839 16333 29022 56577 -81075 -23929 95764 124962 -20979 -30635 -98496
1581 -98496 -117237 -22107 23411 5832 83707 60362 -28769 27314 17025 97695 -91847 -98236
1569 -98236 -1731 -1366 105226 111435 25692 63426 141830 140280 77025 -18580 32107 24842 -38759
1556 -38759 -114400 -4065 -40858 22893 101589 138977 -29661 -155135 -127976 -14095 52279
1545 52279 -89218 -31861 28953 49165 12795 -107098 -184683 -74031 62488 26839 -66483
1534 -66483 -26133 -31407 -45934 -127970 -84890 -101971 -45221 -77668 -69189 45304 -114224 -160618
1522 -160618 -59459 -14805 17328 -16253 117806 7843 -77069 -123120 -180700 -180167 -221080
1511b21080R4272R2328k0519l188O5390L0009M9613j00486n3187N3542K3467r1179
1499h1018M4777M7857J8632j35053M7213K0319j16886J13862l7498P1589L5218
1488B9012l5295J21408o8621M1992k144l9330J3099M2218j15881o1917J9773P2121
1476A6435j64r9679Q797J13735j6525r7085K7894J8104l190P8654j40392m1120
1464a34536Q4505l2924L2228K07906k7779j78868q0780O5424J03463j4942p1180
1453d7483m6576O1566n3492R8961k5092k9517R9369k7276p5098J3516P743Q2237
1441E8858o4267O0329Q503q1818l97n116q7821K2306O6764k6465R695L5829k3416
1428b7016k497J09449j02410n0680P9729K2629J8523O804N7865j14274K3286N9183
$$ plain form
1511 -221080 -126808 -34480 -54999 -58187 7203 37212 86825 -13661 -66848 -13306 10161 -81018
1499 -81018 -36241 11616 30248 -104805 -57592 -37273 -154159 -40297 -77795 -6206 29012
1488 29012 -6283 115125 46504 88496 86352 47022 60121 102339 -13542 -75459 -55686 16435
1476 16435 16271 -83408 -74611 39124 22599 -74486 -46592 -28488 -31678 46976 -93416 -134536
1464 -134536 -50031 -82955 -50727 157179 129400 -49468 -130248 -64824 38639 23697 -47483
1453 -47483 -94059 -32493 -85985 12976 -12116 -41633 57736 30460 -44638 -31122 -23379 58858
1441 58858 -5409 54920 63423 -18395 -18792 -23908 -111729 -89423 -22659 -49124 -39429 -3600 -27016
1428 -27016 -29513 79936 -22474 -73154 6575 29204 47727 54531 112396 -1878 21408 80591
1416H0591J9042j81029k1255L3513l831L4979R9278q9461L1127K295n6038M4561
1404f228k6118L3625P1106K2226k4310n9214k9706l5001L1994O0189q625r945
1392A9993m5785k9655K7303j6433k4558L3452J56419m2581o7116K1631j6108M2193
1380E8755L414r391q6268n4343O4756Q3960q989J23482L8886j27264j13456J12012
1368H5554p540l6168p5810k6814N1576N3065J5189l6381L4832o2291N962J55740
1356A56914q5221j53027m3370J9433j1906M2074L1312K0624j05039L4342k3170
1345a17034O6254O0721l4969j8600J42639n0116p9096J0984j10270M9024N8653
1334b1810J21801n2739j35385J7212M5751o7607Q4660o3019j26790J12067J6792
$$ plain form
1416 80591 99633 -81396 -102651 -69138 -72969 -37990 61288 -28173 2954 5249 -50789 -6228
1404 -6228 -32346 1279 72385 94611 70301 11087 -18619 -53620 -21626 38563 29938 19993
1392 19993 -25792 -55447 -28144 -44577 -69135 -35683 120736 78155 11039 32670 16562 58755
1380 58755 62169 52778 -33490 -87833 -23077 60883 51894 175376 214262 86998 -26458 85554
1368 85554 78014 41846 -33964 -60778 -9202 43863 59052 22671 57503 -4788 1174 156914
1356 156914 71693 -81334 -124704 -105271 -117177 -75103 -43791 -23167 -128206 -93864 -117034
1345 -117034 -50780 9941 -25028 -43628 99011 48895 -30201 -19217 -129487 -80463 -21810
1334 -21810 99991 47252 -88133 -70921 -25170 -92777 -8117 -71136 -197926 -85859 -69067
1323f9067m0469j5429J04117P4395j65902n6109J78569Q3856l727j34121N6609
1312A2722R017j29626o5913R6270m4246K0447J30344J70693j47749n2859l5366
1301c6266o0381K8166R0794n1526P440J00124r0197k838J10472q0882j64974J51830
1289A762K2214L0937j7319P7709L9876k2210n4420K1812j44087J6462J04729l0309
1277D7156K1752j6115R803p8321m5948n8776p127j029N7009M6408l5015Q328n7788
1264a09663J5745n1297J41725Q1287J0969n7105K9118R2275p1180j12905J1839
1253a9192K3779M817j13484J06196N0021J11846o8726r5719R191J9129N3141j36085
1241e5086n994R1713j08r0641J960K0212P9074j10268m8714Q754M7256K8114j999
$$ plain form
1323 -69067 -109536 -124965 -20848 53547 -112355 -168464 10105 93961 90234 -43887 12722
1312 12722 21739 -107887 -173800 -77530 -121776 -101329 29015 199708 51959 -900 -36266
1301 -36266 -96647 -68481 22313 -29213 -21773 78351 -11846 -14684 95788 14906 -150068 1762
1289 1762 23976 54913 37594 115303 155179 132969 78549 100361 -43726 -27264 77465 47156
1277 47156 68908 52793 62596 -15725 -61673 -120449 -127576 -128605 -71596 -25188 -60203 -51875 -109663
1264 -109663 -93918 -145215 -3490 77797 88766 31661 60779 153054 81874 -31031 -19192
1253 -19192 4587 9404 -104080 2116 52137 163983 95257 -462 8729 27858 80999 -55086
1241 -55086 -61080 30633 30525 -60116 -58156 -37944 41130 -69138 -117852 -109098 -61842 -33728 -35727
1228c5727Q2335l3753k4885j09309J71236j00810l9594M1464L0581L8586n2684
1217c2560Q0071j01513l743M4729L9707O434J5280N3968J2817j5825l0510L1069
1205I9924r6891L7882R4276p7926l4767O5955J1036j06109O5501j14721J6184
1194c9656j1039N6937j0412j95m8328J9866J4494q418J78896j07377n0196m8304
1182e3732J855Q7983J1575m4510J13097L6560M1147j06723o2835j4294k6727n0145
1170f6749k7009J5145p6780L0082P012j2716J93597l818j25931J4319J24656n4497
1158A7311r44K1856j1439P8536j54174n9637k3340J04253j32102J50603L469M6347
1146D0739L2632J07566j19308j39534Q6275M0002L4312Q96O9111l2816q5358k3689
$$ plain form
1228 -35727 46608 12855 -12030 -121339 49897 -50913 -90507 -49043 -18462 20124 -32560
1217 -32560 47511 -54002 -57745 -13016 26691 33125 48405 102373 115190 99365 68855 99924
1205 99924 3033 40915 135191 57265 22498 88453 99489 -6620 58881 -55840 -39656
1194 -39656 -50695 6242 -4170 -4365 -52693 -32827 -18333 -26751 152145 44768 -5428 -53732
1182 -53732 -51877 36106 47681 3171 116268 152828 193975 87252 24417 10123 -16604 -66749
1170 -66749 -93758 -78613 -155393 -125311 -118299 -131015 62582 58764 -67167 -52848 71808 17311
1158 17311 16367 38223 26784 105320 -48854 -108491 -131831 -27578 -159680 -9077 -5608 40739
1146 40739 73371 180937 61629 -77905 8370 48372 82684 83580 152691 119875 34517 10828
1134A0828J7787L8650r5531p49j5772l8241L3302o469M8979J905j9686J5369m3333
1121e2961Q141o7136Q9583L9924q8628L1612k6842p7455k740M1592m5639M4806
1109a05743L7017J03455j2871O543M1147o8016j9821M8192R7332L4993j58957
1098C271j0597n864M7532J6507n1p7797N5388L3814q3100O3568J6092r6858m3787
1085h1882l8262N3704J1262p283J45892m3518m1642K9812j6982p603j21854N4743
1073f3613Q5801L6173j02034L8244N4756o3156j0999p0110P2128J5809j6350l9254
1061f2605N8062J1041q0812M5100r7704J70989P1969o0173l0898n9277M5900R9133
1049A10725j53709j8712l8003J0157j5093Q5597K1328j21596R5208N0108l6176
$$ plain form
1134 10828 28615 67265 -28266 -29015 -44787 -83028 -49726 -56195 -7216 -5311 -24997 -9628 -52961
1121 -52961 -44820 -111956 -22373 17551 -71077 -39465 -66307 -143762 -146502 -104910 -150549 -105743
1109 -105743 -68726 34729 21858 28401 69548 1532 -18289 29903 127235 162228 3271
1098 3271 -7326 -13190 34342 50849 50798 -26999 28389 62203 -20897 42671 58763 -38095 -81882
1085 -81882 -120144 -66440 -55178 -62461 83431 39913 -1729 28083 11101 3498 -118356 -63613
1073 -63613 22188 58361 -43673 -5429 49327 -13829 -24828 -94938 -22810 -7001 -23351 -62605
1061 -62605 -4543 6498 -74314 -29214 -126918 44071 116040 55867 24969 -34308 11592 110725
1049 110725 -42984 -61696 -99699 -89542 -104635 -19038 2290 -119306 -24098 26010 -10166
1038a0166J35027n2006j20241L2305k3314n141R6129M1563j63185M2754L091R3609
1026G0425r3204j8574q4136P2510J40248K9771N829M6808j80459k868R3308j6599
1014F3059m9025R2363m4569j24711K3584j9740l6196J39542K8985m2981m5965
1003a5654q0586J8501j6868J40978J4714k5054o1509j1766l7398j02053J25856
992e0839K6350J6260j5173k8535L6135N1140J7306M299j25517j3424O7101o0505
980g5402J52521N8387m3779J755j23040j6577O9220p1628q327k3726L5061M8878
968C343m6404M6892l1508k8328J03053O1109N0728n8319l5014r349l2867j38031
956a14695N8825k2736r1223Q0371R5315m2280n3111K7529L054l9737m2256Q4789
$$ plain form
1038 -10166 124861 72855 -47386 -15081 -38395 -43536 52593 94156 -69029 -26275 -23184 70425
1026 70425 -22779 -41353 -125489 -52979 87269 117040 122869 169677 -10782 -13650 79658 63059
1014 63059 14034 106397 61828 -62883 -39299 -59039 -95235 44307 73292 30311 -15654
1003 -15654 -96240 -77739 -94607 46371 61085 36031 -25478 -37244 -74642 -176695 -50839
992 -50839 -24489 -8229 -23402 -51937 -15802 35338 52644 56943 -68574 -81998 -14897 -75402
980 -75402 77119 135506 91727 93482 -29558 -46135 23085 -48543 -56870 -80596 -45535 3343
968 3343 -43061 3831 -27677 -56005 47048 108157 158885 100566 65552 56203 23336 -114695
956 -114695 -55870 -78606 -169829 -89458 5857 -36423 -89534 -62005 -58951 -98688 -140944 -56155
944e6155J16837L1395K0469p055j0081N7785j02019j09781K4068Q7538L5322n6054
932C2269J5301q9267L1774K1260Q572j7415p113j5893j2494M2205q854m638R5658
919I1365j58437n1089R2950O63Q3199J2495J5316J1832r3667k4929M1053L6019
907E6770p958r64Q8178j1278j84650j5701Q4585p8876L6771Q1288M4365N834J0920
894A09284q2783n5849J19931j85016k9701R8319k1309N2957p4145J06407J43690
883A81785p7873o9349n7181l2652J53328l9102l1065K4997l9688p2360l1694M8096
871d2758l0506p0741P1597L0111Q9000j0244o5775o4780K0253J45262k28m941
859F6250m8484p7805Q608O1440K4036j22876P1618n195O4887K3315p480m4989
$$ plain form
944 -56155 60682 92077 112546 105491 95410 153195 51176 -58605 -34537 53001 88323 32269
932 32269 47570 -41697 -9923 11337 19909 2494 -4619 -20512 -33006 9199 345 -4293 91365
919 91365 -67072 -118161 -25211 -24548 58651 71146 86462 98294 4627 -20302 20751 56770
907 56770 48812 47848 136026 124748 -59902 -75603 8982 -69894 -33123 48165 92530 98364 109284
894 109284 26501 -29348 90583 -94433 -124134 -25815 -47124 5833 -68312 38095 181785
883 181785 103912 34563 -22618 -55270 98058 58956 27891 52888 13200 -59160 -90854 -42758
871 -42758 -73264 -144005 -72408 -42297 46703 36459 -29316 -94096 -73843 71419 71191 66250
859 66250 17766 -60039 -51431 10009 34045 -88831 -17213 -22408 42479 65794 58314 13325
847A3325j3877K497L6394O0845n1842m0063n433j29639K3602R4608L1096J03100
835A24613l003K6515j34502l2687n0328N3242M7268j00481l3568M1463J35609
824G4141o3810p475k9238j8921R543k7011l4587O2651R9333j4950m0374o5550
812e6248R7475r271o5691R7436K6324j26654N7294P0o9905R8070N6843r8339o9629
799f2225p636Q9691L5441p5890O7480j39995Q7542K3524j05361J15937R2164j6731
787A03941o3122m0176j14660R6978k7756n234j9917P5744j6744q6002O2467O7797
775C3316j06563J23642Q5821N438p2014O750r8158K3080N5106l309M2909j21172
763b5154m3030m2684N2265O8957o547P5813N7490j50931m941j3057J62935M2218
$$ plain form
847 13325 -552 1945 38339 99184 47342 7279 1846 -127793 -104191 -9583 21513 124613
835 124613 121610 148125 13623 -19064 -69392 -16150 31118 -69363 -102931 -61468 74141
824 74141 10331 2856 -26382 -45303 -35760 -62771 -97358 -34707 64626 49676 9302 -56248
812 -56248 41227 31956 -33735 63701 90025 -36629 20665 20735 -49170 48900 105743 7404 -62225
799 -62225 -69861 19830 55271 -20619 46861 -93134 -5592 17932 -87429 28508 120672 103941
787 103941 40819 643 -114017 -17039 -44795 -50029 -69946 5798 -10946 -96948 -34481 33316
775 33316 -73247 50395 136216 141654 69640 76390 -21768 1312 56418 53109 96018 -25154
763 -25154 -68184 -110868 -58603 10354 3807 79620 137110 -13821 -18762 -31819 131116 173334
751A73334k47563K4242J04343R470j24970p4893N2584j863O169k8906N3367J4549
739d0137J2509p34K482J5294K4558p0140R0138J6022r4598m8617O3078M417K0883
726d845M5703o3676J01639k3074o6783N9314N6512n1717o1013L219J7410l7393
714b4704N4693R4523l6331q3048L9125L5630r8744p8349J60421J13088l6904p1987
702F7413j9612j7442j8339l6152P9848j37942N9811Q094l4597N0263r4159O7211
690b5603J2108j7330J6304J02481n8324o6150q0744Q4805p507o2522R5897n8066
678f4651j00069R6176J7731J72703o8591j03715k8827R4513j44345O998J04626
667a7451r8608K5908p9477J21661J49042n7367o3044Q3543o4469P7787k0480j30927
$$ plain form
751 173334 -74229 -49987 54356 63826 -61144 -136037 -83453 -85316 -79147 -108053 -54686 -40137
739 -40137 -27628 -28362 -25880 -10586 13972 -56168 33970 49992 -44606 -93223 -30145 -25728 -4845
726 -4845 40858 -22818 78821 55747 -11036 48278 104790 53073 -7940 -4721 12689 -24704
714 -24704 29989 124512 88181 5133 44258 79888 -18856 -97205 63216 176304 139400 67413
702 67413 47801 30359 12020 -24132 55716 -82226 -22415 -14321 -48918 1345 -92814 -25603
690 -25603 -13495 -30825 -14521 87960 29636 -36514 -117258 -32453 -39960 -102482 -6585 -64651
678 -64651 -164720 -68544 -50813 121890 53299 -50416 -79243 15270 -129075 -122077 -17451
667 -17451 -116059 -90151 -169628 -47967 101075 43708 -19336 64207 -262 77525 57045 -73882
655g3882P7723J00829K7036j54840k9495P6117j09492o8068J06531K8205P4564
644E5228O4160n2674N1021j65955j5443Q579J0180O0810m9316J31034l3718n5475
$$ plain form
655 -73882 3841 104670 131706 -23134 -52629 23488 -86004 -154072 -47541 -19336 55228
644 55228 119388 66714 117735 -48220 -63663 -55084 -44904 15906 -33410 97624 63906 8431
$$ [...]
##END NTUPLES=NMR SPECTRUM
##END=
