##TITLE=1H_CG-1150-Cl
 CDCl3, 8 sc, 
 27.08.2021
##JCAMPDX= 6.0         $$ Bruker NMR JCAMP-DX V2.0
##DATA TYPE= NMR SPECTRUM
##DATA CLASS= NTUPLES
##ORIGIN= UXNMR, Bruker Analytische Messtechnik GmbH
##OWNER= root
$$ XWIN-NMR		Version 3.5
$$ Fri Aug 27 11:57:34 2021 Russian Standard Time (UT+4h)  she@DPX200
##.OBSERVE FREQUENCY= 200.131506
##.OBSERVE NUCLEUS= ^1H
##.ACQUISITION MODE= SIMULTANEOUS
##.ACQUISITION SCHEME= undefined
##.AVERAGES= 8
##.DIGITISER RES= 18
##SPECTROMETER/DATA SYSTEM= spect
##.PULSE SEQUENCE= zg30
##.SOLVENT NAME= D2O
##.SHIFT REFERENCE= (INTERNAL, D2O, 0, 17.5081)
##AUDIT TRAIL= $$ (NUMBER, WHEN, WHO, WHERE, WHAT)
$$ ##TITLE= Audit trail, XWIN-NMR		Version 3.5
$$ ##JCAMPDX= 5.01
$$ ##ORIGIN= Bruker BioSpin GmbH
$$ ##OWNER= she
$$ F:/spectra/data/she/nmr/H-F/1/pdata/1/auditp.txt
$$ ##AUDIT TRAIL=  $$ (NUMBER, WHEN, WHO, WHERE, WHAT)
(   1,<2021-08-27 11:56:06.64 +0400>,<she>,<DPX200>,
      <created by zg, POWCHK disabled, PULCHK disabled
       configuration hash MD5:
       00 E9 B6 7A A2 85 ED C7 34 08 36 98 17 FE 4E 26
       data hash MD5: 16K
       A3 FB 4A E3 A7 3F 32 CB A5 8D AC 81 E7 07 67 E9>)
(   2,<2021-08-27 11:56:09.14 +0400>,<she>,<DPX200>,
      <Start of raw data processing
       efp BC_mod = 2 LB = 0.24 FT_mod = 6 PKNL = 1 PHC0 = -13357.29 PHC1 = 10.60099 SI = 16K 
       data hash MD5: 16K
       CF 6F A8 18 9C 87 65 AD BF B8 37 12 65 5C D6 36>)
(   3,<2021-08-27 11:56:32.45 +0400>,<she>,<DPX200>,
      <pk PHC0 = -0.6621013 PHC1 = 1.800001 
       data hash MD5: 16K
       D2 70 6F 00 B7 BE 99 2B 76 ED 99 01 71 37 13 C6>)
(   4,<2021-08-27 11:56:36.37 +0400>,<she>,<DPX200>,
      <abs ABSG = 5 
       data hash MD5: 16K
       6E 73 8F EB C9 B0 95 59 0B 41 34 99 B9 14 89 1D>)
$$ ##END=
$$ 
$$ hash MD5
$$ 1B 1E BB 3B 30 F7 A7 43 77 F4 AF 41 44 3B 24 12
##$RELAX= 
##$RELAX= 
##$RELAX= 
##$RELAX= 
##$RELAX= 
##$RELAX= 
$$ Bruker specific parameters
$$ --------------------------
##$DU= <F:/spectra>
##$EXPNO= 1
##$NAME= <H-F>
##$PROCNO= 1
##$TYPE= <nmr>
##$USER= <she>
##$AMP= (0..31)
100 100 100 100 100 100 100 100 100 100 100 100 100 100 100 100 100 100 
100 100 100 100 100 100 100 100 100 100 100 100 100 100 
##$AQSEQ= 0
##$AQ_mod= 1
##$AUNM= <au_zg>
##$AUTOPOS= <>
##$BF1= 200.13
##$BF2= 200.13
##$BF3= 200.13
##$BF4= 200.13
##$BF5= 200.13
##$BF6= 200.13
##$BF7= 200.13
##$BF8= 200.13
##$BYTORDA= 1
##$CFDGTYP= 0
##$CFRGTYP= 5
##$CHEMSTR= <none>
##$CNST= (0..31)
1 1 145 1 1 1 1 1 1 1 1 1 1 1 1 1 1 1 1 1 1 1 1 1 1 1 1 1 1 1 1 1 
##$CPDPRG= <>
##$CPDPRG1= <>
##$CPDPRG2= <>
##$CPDPRG3= <>
##$CPDPRG4= <mlev>
##$CPDPRG5= <mlev>
##$CPDPRG6= <mlev>
##$CPDPRG7= <mlev>
##$CPDPRG8= <mlev>
##$CPDPRGB= <>
##$CPDPRGT= <>
##$D= (0..31)
0 1.2 0 0 0 0 0 0 0 0.06 0 0.03 0 0 0 0 0.0002 0 0 0 0 0 0 0 0 0 0 0 0 
0 0 0 
##$DATE= 1630050966
##$DBL= (0..7)
120 120 120 120 120 120 120 120 
##$DBP= (0..7)
150 150 150 150 150 150 150 150 
##$DBP07= 0
##$DBPNAM0= <>
##$DBPNAM1= <>
##$DBPNAM2= <>
##$DBPNAM3= <>
##$DBPNAM4= <>
$$ [...]
##$SUBNAM3= <"">
##$SUBNAM4= <"">
##$SUBNAM5= <"">
##$SUBNAM6= <"">
##$SUBNAM7= <"">
##$SUBNAM8= <"">
##$SUBNAM9= <"">
##$SW= 20.0188882624521
##$SWIBOX= (0..15)
0 0 2 0 0 0 0 0 0 0 0 0 0 0 0 0 
##$SW_h= 4006.41025641026
##$TD= 16384
##$TD0= 1
##$TE= 0
##$TE2= 300
##$TE3= 300
##$TEG= 300
##$TL= (0..7)
0 120 120 120 120 120 120 120 
##$TP= (0..7)
150 150 150 150 150 150 150 150 
##$TP07= 0
##$TPNAME0= <>
##$TPNAME1= <>
##$TPNAME2= <>
##$TPNAME3= <>
##$TPNAME4= <>
##$TPNAME5= <>
##$TPNAME6= <>
##$TPNAME7= <>
##$TPOAL= (0..7)
0.5 0.5 0.5 0.5 0.5 0.5 0.5 0.5 
##$TPOFFS= (0..7)
0 0 0 0 0 0 0 0 
##$TUNHIN= 0
##$TUNHOUT= 0
##$TUNXOUT= 0
##$USERA1= <user>
##$USERA2= <user>
##$USERA3= <user>
##$USERA4= <user>
##$USERA5= <user>
##$V9= 5
##$VALIST= <valist>
##$VCLIST= <CCCCCCCCCCCCCCC>
##$VD= 0
##$VDLIST= <DDDDDDDDDDDDDDD>
##$VPLIST= <PPPPPPPPPPPPPPP>
##$VTLIST= <TTTTTTTTTTTTTTT>
##$WBST= 1024
##$WBSW= 4
##$XGAIN= (0..3)
0 0 0 0 
##$XL= 0
##$YL= 0
##$YMAX_a= 921194
##$YMIN_a= -814693
##$ZGOPTNS= <>
##$ZL1= 120
##$ZL2= 120
##$ZL3= 120
##$ZL4= 120
##$ABSF1= 17.49833
##$ABSF2= -2.520708
##$ABSG= 5
##$ABSL= 3
##$ALPHA= 0
##$AQORDER= 0
##$ASSFAC= 0
##$ASSFACI= 0
##$ASSFACX= 0
##$ASSWID= 0
##$AUNMP= <proc_1d>
##$AZFE= 0.1
##$AZFW= 0.1
##$BCFW= 0
##$BC_mod= 2
##$BYTORDP= 0
##$COROFFS= 0
##$CY= -3
##$DATMOD= 1
##$DC= 0
##$DFILT= <>
##$DTYPP= 0
##$F1P= 0
##$F2P= 0
##$FCOR= 1
##$FTSIZE= 16384
##$FT_mod= 6
##$GAMMA= 0
##$GB= 0
##$INTBC= 1
##$INTSCL= 1.334414e-10
##$ISEN= 128
##$LB= 0.24
##$LEV0= 0
##$LPBIN= 0
##$MAXI= 10000
##$MC2= 0
##$MEAN= 0
##$ME_mod= 0
##$MI= 1.114404
##$NCOEF= 0
##$NC_proc= -5
##$NLEV= 6
##$NOISF1= 3.799351
##$NOISF2= 2.8
##$NSP= 0
##$NTH_PI= 0
##$NZP= 0
##$OFFSET= 17.50811
##$PC= 1
##$PHC0= -13357.95
##$PHC1= 12.40099
##$PH_mod= 1
##$PKNL= yes
##$PPARMOD= 0
##$PSCAL= 0
##$PSIGN= 0
##$REVERSE= no
##$SF= 200.130005307128
##$SI= 16384
##$SIGF1= 3
##$SIGF2= 2
##$SINO= 5.538805
##$SIOLD= 16384
##$SREGLST= <1H.CDCl3>
##$SSB= 0
##$STSI= 16384
##$STSR= 0
##$SW_p= 4006.41025641026
##$SYMM= 0
##$S_DEV= 0
##$TDeff= 16384
##$TDoff= 0
##$TI= <>
##$TILT= no
##$TM1= 0
##$TM2= 0
##$TOPLEV= 0
##$USERP1= <user>
##$USERP2= <user>
##$USERP3= <user>
##$USERP4= <user>
##$USERP5= <user>
##$WDW= 1
##$XDIM= 16384
##$YMAX_p= 296851425
##$YMIN_p= -309831
$$ End of Bruker specific parameters
$$ ---------------------------------
##NTUPLES= NMR SPECTRUM
##VAR_NAME=  FREQUENCY,     SPECTRUM/REAL,   SPECTRUM/IMAG
##SYMBOL=    X,             R,               I
##VAR_TYPE=  INDEPENDENT,   DEPENDENT,       DEPENDENT
##VAR_FORM=  AFFN,          ASDF,            ASDF
##VAR_DIM=   16384,         16384,           16384
##UNITS=     HZ,            ARBITRARY UNITS, ARBITRARY UNITS
##FACTOR=    0.24454680195387, 1,            1
##FIRST=     3503.89815650115, 0,            0
##LAST=      -502.512099909105, 0,           0
##MIN=       -502.512099909105, -309831,     0
##MAX=       3503.89815650115, 296851425,    0
$$ Real data points
##PAGE= N=1
##DATA TABLE= (X++(R..R)), XYDATA
$$ [...]
5667a96813M8318m4796L1287k4753N3142o9302K826J2423K1949L1331k7496k7156
$$ -196813 -148495 -193291 -162004 -186757 -133615 -202917 -200091 -187668 -165719 -134388 -161884 -189040
5655a89040L2395O690K98J0038j3978K9446J802j8371m3362m4291K9090j2106
$$ -189040 -156645 -149955 -149657 -139619 -153597 -124151 -122349 -140720 -184082 -228373 -199283 -211389
5643b11389L7994M06j2404l2573j0759j2727K0064Q3132l9332R998k7055K7537
$$ -211389 -173395 -172989 -185393 -217966 -228725 -241452 -221388 -138256 -177588 -167590 -194645 -167108
5631a67108k0275j816P310J7177m7232K8898L1900k3363p696K4576K2573m1945
$$ -167108 -187383 -189199 -181889 -164712 -211944 -183046 -151146 -174509 -182205 -157629 -135056 -177001
5619a77001j6342j2184l426k586L0309q249R945M9577k4889n8827O4538m7798
$$ -177001 -193343 -205527 -208953 -211539 -181230 -189479 -179534 -129957 -154846 -213673 -149135 -196933
5607a96933L1581L7202k7637J7199j3877J2117M6712m2979K273J238K587J3501
$$ -196933 -165352 -128150 -155787 -138588 -152465 -140348 -93636 -136615 -134342 -133104 -130517 -117016
5595a17016j9903P6595p540l3627r401K1037l473l2172l961L0115O2574K2341
$$ -117016 -136919 -60324 -67864 -101491 -110892 -89855 -93328 -125500 -129461 -99346 -36772 -14431
5583a4431r7952l306j1029O9846l3762n6497Q1083J4505r2918K2156N2399O8712
$$ -14431 -112383 -115689 -126718 -56872 -90634 -147131 -66048 -51543 -144461 -122305 -69906 -1194
5571a194o8418o8402J2366P6032q206M100J0818p0061j1130k5886j6125P9168
$$ -1194 -69612 -138014 -125648 -49616 -57822 -53722 -42904 -112965 -124095 -149981 -166106 -86938
5559h6938m5239k1743O1916O364j2821k9864P492j96L3684o5055j1378J048J6043
$$ -86938 -132177 -153920 -92004 -85640 -98461 -128325 -120833 -121029 -87345 -152400 -163778 -162730 -146687
5546a46687J19120M1423o4371j6161M407j9637n7114J9571J2964n313j6243p459
$$ -146687 -27567 13856 -50515 -66676 -62269 -81906 -139020 -119449 -106485 -111798 -128041 -135500
5534a35500L1063j1650l7948M312O4131j4551l7001o1513J05951L3775p2153M2480
$$ -135500 -104437 -116087 -154035 -149723 -85592 -100143 -137144 -198657 -92706 -58931 -131084 -88604
5522h8604L6240K6875J7598m7427p3800P066L134J1706r438k3192L3842M1498
$$ -88604 -52364 -25489 -7891 -55318 -129118 -122052 -118918 -107212 -116650 -139842 -106000 -64502
5510f4502K7648m3821l4680M5246j0325L6715k2672J073m9549j2644k0694M4176
$$ -64502 -36854 -80675 -115355 -70109 -80434 -43719 -66391 -65318 -114867 -127511 -148205 -104029
5498a04029J6874j4962N9213K2504K0599j03628o498K2729k7411K6837N8190L9759
$$ -104029 -87155 -102117 -42904 -20400 199 -103429 -109927 -87198 -114609 -87772 -29582 10177
5486A0177n3879P5807q0108k0649j3443q245j7188k9728L6616L864l6863M3737
$$ 10177 -43702 32105 -48003 -68652 -82095 -90340 -107528 -137256 -100640 -96776 -133639 -89902
5474h9902k6719N4599P9884j3138n4427J6714m610n4740O4703J7874k2019j260
$$ -89902 -116621 -62022 17862 4724 -49703 -32989 -37599 -92339 -27636 -9762 -31781 -33041
5462c3041l4148j2120J7068K4904n581l8763P6538n8700m049k5281P6603l464
$$ -33041 -67189 -79309 -62241 -37337 -42918 -81681 -5143 -63843 -67892 -93173 -16570 -20034
5450b0034M3147j0770l5008L470k4236M3885j4857j0735L4482m6631O080J1875
$$ -20034 23113 12343 -22665 -19195 -43431 454 -14403 -25138 9344 -37287 -31207 -19332
5438a9332q490l360j3973O2718l5021q615L7361J8244L0173J2701j5231m2855
$$ -19332 -27822 -31182 -45155 17563 -17458 -26073 11288 29532 59705 72406 57175 14320
5426A4320K175n216l5295k1611K9684J1828q4497L9471K7839M4544N1570m5106
$$ 14320 16495 11279 -24016 -45627 -15943 -4115 -88612 -49141 -21302 23242 74812 29706
5414B9706o1739j7222N1466M7329J354k8284J8773J2383K8958k6187M038m008
$$ 29706 -32033 -49255 2211 49540 50894 22610 41383 53766 82724 56537 60575 56567
5402E6567N3279K9173l3829K7367j2081m5314N2216Q4882k8727J4495M8182O3228
$$ 56567 109846 139019 105190 132557 120476 75162 127378 212260 183533 198028 246210 309438
5390C09438O7954N4768j8726J10129O8408J32304J88667R2671J24348J75796J35206
$$ 309438 377392 432160 413434 523563 591971 724275 912942 1005613 1129961 1305757 1440963
5379A440963J45887J2351k34792k83951k05850j14455r7457j13765o0067o5578
$$ 1440963 1586850 1599201 1364409 1080458 874608 760153 662696 548931 488864 423286
5369D23286r5626N2779L2931l2013n8653j9594k8881o1613k6575M7896k0992j5188
$$ 423286 327660 380439 413370 381357 322704 303110 274229 212616 186041 233937 212945 197757
5357A97757k9376L6812J968J1067m1799k5640m827p2155j2825M2347r888O272
$$ 197757 168381 205193 207161 218228 176429 150789 145962 73807 60982 103329 93441 99713
5345I9713N7451o6987k4277J1873L603j1790j4374K4953l6544k5808L2273k9372
$$ 99713 157164 90177 65900 77773 81376 69586 55212 80165 43621 17813 50086 20714
5333B0714m2715M6117k9546M361M244J3615L8668k7044n9750M7031q065K8304
$$ 20714 -22001 24116 -5430 -1069 3175 16790 55458 28414 -31336 15695 7630 35934
5321C5934q85n0905n729J550K4518K3855j68j3650j2397k023P3253n2057o883
$$ 35934 35049 -15856 -21585 -20035 4483 28338 28170 14520 2123 100 73353 21296 14413
5308A4413j3828J8649l3237l5401N648n977N5975k1507n090N4538n5748J9244
$$ 14413 585 19234 -14003 -49404 -43756 -49733 6242 -15265 -20355 34183 -21565 -2321
5296b321p693k9207M054m96K9074o6917j5645K1535M3185L8216m165K2716n473
$$ -2321 -10014 -39221 -35167 -35663 -6589 -73506 -89151 -67616 -24431 13785 9620 32336 26863
5283B6863M075M2985J5773L1984l4781n0171j3754m0845J8452J8525l0689k7591
$$ 26863 30938 73923 89696 121680 86899 36728 22974 -17871 581 19106 -11583 -39174
5271c9174M4702P722K5942J4880p1130n6755P0910P296k4681N7231K7569j4895
$$ -39174 5528 13250 39192 54072 -17058 -73813 -2903 4393 -20288 36943 64512 49617
5259D9617L5170p9422l1246M1824Q9739p166j8090j2217r058L2252l4183m4382
$$ 49617 84787 5365 -25881 15943 105682 98516 80426 68209 59151 91403 57220 12838
5247A2838K1075L8601j9964K1804l8186K7784K0878n0327K2128o629n94l5148
$$ 12838 33913 72514 52550 74354 36168 63952 84830 34503 56631 50002 49408 14260
5235A4260J3052J7388N6431r0392j713J2525L1306Q3667j6154L4195n3834L4425
$$ 14260 27312 44700 101131 10739 9026 21551 52857 136524 120370 154565 100731 135156
5223A35156K2838K3900K063k2682j5975l3335RP4590L4659r1929M1556L7188P765
$$ 135156 157994 181894 183957 161275 145300 111965 111974 186564 221223 129294 170850 208038 215803
5210B15803M2308K143Q8230J7925K2825J0031J3766N9578R2790J312J8388L0554
$$ 215803 258111 260254 348484 366409 389234 399265 413031 472609 565399 566711 585099 615653
5198F15653k5127L5587N1847o0997k8191K8812j0715m5333k5842M523M2387J241
$$ 615653 590526 626113 677960 616963 588772 617584 606869 561536 535694 540217 582604 583845
5186E83845n738K7704M1860j09500n2700n616m0399l1407j7259L8702K0830l8065
$$ 583845 578107 605811 647671 538171 485471 479855 439456 408049 390790 429492 450322 412257
5174D12257M4482n257l4105k7775J3020j8817M7955Q9263k6958K2172L0791O4229
$$ 412257 456739 451482 417377 389602 402622 383805 431760 521023 494065 516237 547028 611257
5162F11257M5287Q2704O0102Q1520Q1785J31269J64664K67094K09807K15526J61407
$$ 611257 656544 739248 799350 880870 962655 1093924 1258588 1525682 1735489 1951015 2112422
5151B112422J34334K18573J95986o1895k99824l87298m19191k29181j53553j17620
$$ 2112422 2246756 2465329 2661315 2599420 2299596 1912298 1493107 1263926 1110373 992753
5141I92753m9984j02864j26356l303j7629m9382m3829l7837l1407L1225m8877
$$ 992753 942769 839905 713549 710246 692617 643235 599406 561569 530162 561387 512510
5130E12510l2566l70M4762O536j0837J64l9722l2054o7513n1744m1892O726l3589
$$ 512510 479944 479574 524336 530872 520035 520199 480477 448423 380910 329166 287274 294000 260411
5117B60411L0475M3339j02166m2331M391K2781k6276j5573j257l1041P7834k0176
$$ 260411 290886 334225 232059 189728 194119 216900 190624 175051 173794 142753 220587 200411
5105B00411j2152m7909j4092L3289j2762N1834o3006K0653k4135K2001K1667M5645
$$ 200411 188259 140350 126258 159547 146785 198619 135613 156266 132131 154132 175799 221444
5093B21444K8331K0635n1930O3459l6528j01876Q1546m9057J3099k0016j5778
$$ 221444 249775 270410 218480 281939 245411 143535 225081 176024 189123 169107 153329
5082A53329N7666K7749n4783R663k9893N6132k8853K9916p644J018r456P480L0068
$$ 153329 210995 238744 183961 193624 163731 219863 191010 220926 213282 214300 204844 212324 242392
5069B42392J6287M6328M5134J7605k5464j7075j8168j2823k0945j1090K919N378
$$ 242392 258679 305007 350141 367746 342282 325207 307039 294216 273271 262181 265100 270478
5057B70478L8946Q7469l6245l1275N09p4361P1159k6193j0030N6470j431k554
$$ 270478 309424 396893 360648 329373 329882 255521 326680 300487 290457 346927 345496 342942
5045C42942O018j7931L3700M6043k4521j1631L5604N9448o2266L8744j3537q3561
$$ 342942 348960 331029 364729 410772 386251 374620 410224 469672 407406 446150 432613 349052
5033C49052M7176N987j6964j2530l7922K3204Q133o3791j2202J8981K8621o9196
$$ 349052 396228 402215 385251 372721 334799 358003 366136 302345 290143 309124 337745 268549
5021B68549j0642P211Q977J6828M8758k4565n2623m336j9167M7499J3858J2844
$$ 268549 257907 265118 274095 290923 339681 315116 262493 258157 238990 286489 300347 313191
5009C13191l0144l267L7307L2713m7307r272J4838j8467J1123K1904J0358M8821
$$ 313191 283047 279780 317087 349800 302493 293221 308059 289592 300715 322619 332977 381798
4997C81798l3672k1479k4137L5640J513j1230l3178j3046M1799l7521K3403K5883
$$ 381798 348126 326647 302510 338150 339663 328433 295255 282209 324008 286487 309890 335773
4985C35773l5840M5494m021o1152k2707m242K4895l4086l9366O989L8342k0182
$$ 335773 299933 345427 341406 280254 257547 253305 278200 244114 204748 211737 250079 229897
4973B29897K162L341J677L9137p02k504k9603N5065l4504j8706K161M5550l9029
$$ 229897 232059 235400 237077 276214 275512 273008 243405 298470 263966 245260 247421 292971 253942
4960B53942m3346N8364J8110M0616q231j4479k1608r815J4375J9571n003m4939
$$ 253942 210596 268960 287070 327686 319455 304976 283368 273553 287928 307499 302496 257557
4948B57557J408L925O052O9029k7270l9719M1999J9503j4006j052l7845L2491
$$ 257557 258965 262890 268942 337971 310701 270982 312981 332484 318478 317426 279581 312072
4936C12072J6070K8745K1063p2008n820p216K7211m6284R811l2971K6220N3958
$$ 312072 328142 356887 377950 305942 300122 292906 320117 273833 283644 250673 276893 330851
4924C30851k1414k0486L1349M0147n9171k3982J0535J4743k9037O6679k7564L5719
$$ 330851 309437 288951 320300 360447 301276 277294 287829 302572 273535 340214 312650 348369
4912C48369O6919o0627j2168K2310R533J4046K5416J1175m507k4885m3740J7175
$$ 348369 415288 354661 342493 364803 374336 388382 413798 424973 420466 395581 351841 369016
4900C69016k3163P666N717Q544J7895k2203l586K923o215m3102M3312l5039L9730
$$ 369016 345853 353519 359236 367780 385675 363472 359886 362809 356594 313492 356804 321765 361495
4887C61495l3669p77J4980n9477R4922n4973M3265M287k2869K040N5051J2316
$$ 361495 327826 327049 342029 282552 377474 322501 365766 370053 347184 349224 404275 416591
4875D16591j6517J7100L0324q605m2474N9694K5742j4398m4137J3613L6801l0157
$$ 416591 400074 417174 447498 438893 396419 456113 481855 467457 423320 436933 473734 443577
4863D43577L2829j0021R705k0590l1193q5505k1424K4922l5630j61N0636n354
$$ 443577 476406 466385 476090 455500 424307 338802 317378 342300 306670 306509 357145 351791
4851C51791q0083R0945N9897L5890k5677p630K4448p7L1233p19R172L391K5127
$$ 351791 271708 362653 422550 458440 432763 425133 449581 449504 480737 480018 489190 492581 517708
4838E17708j1746P576n1983P111L0735l700M7882p659M440o4163L772M4843k3227
$$ 517708 505962 513538 461555 468666 499401 495701 543583 535924 540364 476201 479973 524816 501589
4825E01589m6595p2613j4019Q5544q636M1016j1480K616n8494l2384O38J5121
$$ 501589 454994 382381 368362 453906 445270 486286 474806 477422 418928 386544 387182 402303
4813D02303L2217M595O560O662k9456k0254N0739m5897j1557n059P197P4875M7185
$$ 402303 434520 439115 445675 452337 422881 402627 453366 407469 395912 390853 398050 472925 520110
4800E20110n9697J0581P1451N7997R504o1559m2969L395K7656K3196J6696J6536
$$ 520110 460413 470994 542445 600442 609946 548387 505418 508813 536469 559665 576361 592897
4788E92897N7313J4944J2353m6844k8114P3191j1428L5179O5405k0948M3346R0740
$$ 592897 650210 665154 677507 630663 602549 675740 664312 699491 764896 743948 787294 878034
4776H78034M9243M7544O4104Q9670O6628M7158R3489N6714J06072J04005J12039
$$ 878034 927277 974821 1038925 1128595 1195223 1242381 1335870 1392584 1498656 1602661 1714700
4765A714700J34123P1219J02922O8530o250M7315M1955l8449j0582n1638N638
$$ 1714700 1848823 1920042 2022964 2091494 2085244 2132559 2174514 2136065 2125483 2073845 2079483
4754B079483m5058J0166K9615K275N236O2045J10764O3542J04632O5507L1738
$$ 2079483 2034425 2044591 2074206 2076481 2081717 2143762 2254526 2318068 2422700 2488207 2519945
4743B519945m418O4849N0247n9600p9739p2306n0070J2365n9950l1237k8326Q6954
$$ 2519945 2515527 2580376 2630623 2571023 2491284 2418978 2368908 2381273 2321323 2290086 2261760 2348714
4731B348714J11568Q3697P3036P1901R4311N6861J08619K5969j3245O143M3676
$$ 2348714 2460282 2543979 2617015 2688916 2783227 2840088 2948707 2974676 2961431 2967574 3011250
4720C011250j05419r9777o3850p9291j27130j6681j3687j3515j355m9810O0216
$$ 3011250 2905831 2806054 2742204 2662913 2535783 2519102 2505415 2491900 2490545 2440735 2500951
4709B500951K5401l4209j03473j1959n0537j69446j2328j01835j65538j54408
$$ 2500951 2526352 2492143 2388670 2376711 2326174 2156728 2144400 2042565 1877027 1722619
4699A722619j28533r4664j05425j04483o0519l2485n3572o3756p2354r0141l3882
$$ 1722619 1594086 1499422 1393997 1289514 1228995 1196510 1142938 1079182 1006828 916687 882805
4688H82805m3357K0118n816l7473j1294j7567M0298n7644k7117m0262k290l0635
$$ 882805 839448 859566 853750 816277 804983 787416 827714 770070 742953 702691 700401 669766
4676F69766l1193J6245k710R573j5491o5r00k1873J4771o9073l1487N7899q1276
$$ 669766 638573 654818 652108 661681 646190 646125 645225 623352 638123 569050 537563 595462 514186
4663E14186J5108O4523j5656K7418n9197m5191j7986P9408J8934m6512l3113l345
$$ 514186 529294 593817 578161 605579 546382 501191 483205 562613 581547 535035 501922 498577
4651D98577J4214M6341Q439n2602l6629J0265j2083p506r847l5215j2870L8834
$$ 498577 512791 559132 567571 514969 478340 488605 476522 469016 459169 423954 411084 449918
4639D49918m4961o5715M906Q4472K7722j2732r690m8757K8545Q241J1152l1559
$$ 449918 404957 339242 344148 428620 456342 443610 433920 385163 413708 421949 433101 401542
4627D01542k7498J8205L943M0742K7781p3810k7445K7104O1669J9062j4642o036
$$ 401542 374044 392249 396192 436934 464715 390905 363460 390564 452233 471295 456653 450617
4615D50617L0555l4271J2564j0015j9981N7723J5472J2761k2309j4617k9280L2087
$$ 450617 481172 446901 459465 449450 429469 487192 502664 515425 493116 478499 449219 481306
4603D81306L4991J330M7729k2712o9385N5307k8812J1851N5611n135N7317k1473
$$ 481306 516297 517627 565356 542644 473259 528566 499754 511605 567216 562081 619398 597925
4591E97925j4210l539K2370m2295N7176j22k5424L6454j7335j7640M3282K006
$$ 597925 583715 580176 602546 560251 617427 617305 591881 628335 611000 593360 636642 638648
4579F38648k1399O4637j079m2139j3367J2307M6490Q7040L459n6628j9617L4571
$$ 638648 617249 681886 680807 638668 625301 637608 684098 771138 774597 717969 698352 732923
4567G32923J23174J4534r5017j9606K7454J6351Q694P059j3751M6263J1120K2471
$$ 732923 856097 870631 775614 756008 783462 799813 808507 815566 801815 848078 859198 881669
4555H81669o0243K947L9112N0240L3109l5587L2957j3682N4965O9108L1544K8370
$$ 881669 821426 824373 863485 913725 946834 911247 944204 930522 985487 1054595 1086139 1114509
4543A114509j2096K6984K9059K9090m074M4556o971k8583J17742j5767n817L5514
$$ 1114509 1102413 1129397 1158456 1187546 1183472 1228028 1221057 1192474 1310216 1294449 1288632 1324146
4531A324146M9984M310Q3691R2986k0231L3870J6069M131N4012j7212k1121k444
$$ 1324146 1374130 1378440 1462131 1555117 1534886 1568756 1584825 1588956 1642968 1625756 1604635 1602191
4519A602191P593p617J7173O2725P775J4927J3313r349P0983N6860r610J4661
$$ 1602191 1609784 1602167 1619340 1682065 1689840 1704767 1718080 1708731 1779714 1836574 1826964 1841625
4507A841625K417P7997K1364m4929L9594L6113J9590L4196M9921N1921j5124J3329
$$ 1841625 1844042 1922039 1943403 1898474 1938068 1974181 1993771 2027967 2077888 2129809 2114685 2128014
4495B128014L0361O4152P0599M9481K6604P2881K7311O5082Q1073P5130N7398
$$ 2128014 2158375 2222527 2293126 2342607 2369211 2442092 2469403 2534485 2615558 2690688 2748086
4484B748086J02970L9371Q8428J43673P7405P9171P6637Q6785Q6273J42763R5189
$$ 2748086 2851056 2890427 2978855 3122528 3199933 3279104 3355741 3442526 3528799 3671562 3766751
4473C766751P6917Q2137P0337K0461N1134N7713J18673O1357R8444O4839J28549
$$ 3766751 3843668 3925805 3996142 4016603 4067737 4125450 4244123 4305480 4403924 4468763 4597312
4462D597312J69806K20846J90612K94730K74585L73289M12893M53344O59264O74540
$$ 4597312 4767118 4987964 5178576 5473306 5747891 6121180 6534073 6987417 7646681 8321221
4452H321221P31283R83617J116264J302801J603482J823994J956522J846366J815459
$$ 8321221 9052504 10036121 11152385 12455186 14058668 15882662 17839184 19685550 21501009
4443B1501009J646022J710410J302197J78402j257817k499018l052360k741107
$$ 21501009 23147031 24857441 26159638 26338040 25080223 22581205 19528845 16787738
4435A6787738k278794j673367j291336r98408p93480o67410n58088m57908m62345
$$ 16787738 14508944 12835577 11544241 10545833 9752353 9084943 8526855 8068947 7606602
4426G606602l88831l34242l58235k72075j86411j99955j80340j58609j74586q6837
$$ 7606602 7217771 6883529 6525294 6253219 6066808 5866853 5686513 5527904 5353318 5266481
4416E266481l9574q1355j41526k9063p2549J2569k9935j00211m1609o5575k9701
$$ 5266481 5226907 5145552 5004026 4974963 4902414 4914983 4885048 4784837 4743228 4677653 4647952
4405D647952K0621l7698Q7099Q4810O5208J14700J33103J87326J66225K25128
$$ 4647952 4668573 4630875 4717974 4802784 4867992 4982692 5115795 5303121 5469346 5694474
4395E694474K80570L76428M29356M92717N87154P84268Q79747J030873J324467
$$ 5694474 5975044 6351472 6780828 7273545 7860699 8644967 9524714 10555587 11880054
4386A1880054J545838J768325J942339K001345J861172J774497J724079J239959
$$ 11880054 13425892 15194217 17136556 19137901 20999073 22773570 24497649 25737608
4378B5737608K68757r58127k271320l051539l027742k555267j892018j407607
$$ 25737608 26006365 25048238 22776918 19725379 16697637 14142370 12250352 10842745
4370A0842745j158939r10469p36077o69882n89589m50616m02228m06667k96167
$$ 10842745 9683806 8773337 8037260 7367378 6777789 6327173 5924945 5518278 5222111
4361E222111l17661k53142j84638k43531j02606j68963k18381j52889j98230q5586
$$ 5222111 4904450 4651308 4466670 4223139 4120533 3951570 3733189 3580300 3382070 3296484
4351C296484j49897j13829q9663j27661k3300r9770j29847j04477n7876j19071
$$ 3296484 3146587 3032758 2943095 2815434 2792134 2692364 2562517 2458040 2400164 2281093
4341B281093m940k669p1775o1184N7j4014r6220p4089L9021j177o9224r7165O1027
$$ 2281093 2276153 2273484 2201709 2140525 2140582 2126568 2030348 1956259 1995280 1994103 1924879 1827714 1888741
4328A888741m1656r952M9102n1329L0147m4064k1364L6109n5856m1252k5821L4072
$$ 1888741 1847085 1837133 1886235 1834906 1865053 1820989 1799625 1835734 1779878 1738626 1712805 1746877
4316A746877l6090L5639m0761n8757P0334n9843J7532j8748j7076N885j5020n9471
$$ 1746877 1710787 1746426 1705665 1646908 1717242 1657399 1674931 1656183 1639107 1644992 1629972 1570501
4304A570501K0796l7862l2002L5713Q183K2027j5222j1847N862l9848M3654m5334
$$ 1570501 1591297 1553435 1521433 1557146 1565329 1587356 1572134 1560287 1566149 1526301 1569955 1524621
4292A524621J3505L8851K7434l4023K0344J9129n2909k6253j5541N7119j7886
$$ 1524621 1538126 1576977 1604411 1570388 1590732 1609861 1556952 1530699 1515158 1572277 1554391
4281A554391L8336j4795J0592L0510P719j1832K7760L5003n7280M032Q491M3387
$$ 1554391 1592727 1577932 1588524 1619034 1626753 1614921 1642681 1677684 1620404 1624436 1632927 1676314
4269A676314l574M1077q208J8858O7793o3061j0361L4973L1151M0806N6466m3392
$$ 1676314 1672740 1713817 1705609 1724467 1792260 1729199 1718838 1753811 1784962 1825768 1882234 1838842
4257A838842k2841R7811l140M6408j82m8018O4646N9789k5431J4374M1801M0645
$$ 1838842 1816001 1913812 1910672 1957080 1956898 1908880 1973526 2033315 2007884 2022258 2064059 2104704
4245B104704m485K2149K468l3924R4891J3327r629J6369P3085J4385n7467j876
$$ 2104704 2100219 2122368 2124836 2090912 2185803 2199130 2189501 2205870 2278955 2293340 2235873 2233997
4233B233997O7754J5882N5651K2365K8018L3649J5516Q587L2356Q586K7482K6917
$$ 2233997 2301751 2317633 2373284 2395649 2423667 2457316 2472832 2481419 2513775 2522361 2549843 2576760
4221B576760P7094j2281L9694K2941K0592M3124j3811O9902J547J7513N6012K2353
$$ 2576760 2653854 2641573 2681267 2704208 2724800 2767924 2754113 2824015 2825562 2843075 2899087 2921440
4209B921440K1486J13138j874J14659P9072O0641J1735O8232R7452K0166M7553
$$ 2921440 2942926 3056064 3054190 3168849 3247921 3308562 3320297 3388529 3485981 3506147 3553700
4198C553700Q5640R3827Q7663R5861J19019J15816R7918Q8601J48292J14078M0920
$$ 3553700 3639340 3733167 3820830 3916691 4035710 4151526 4249444 4338045 4486337 4600415 4641335
4187D641335J7319M6112N7084r566O8905M0346M9698R7441P8301J26436Q0614
$$ 4641335 4658654 4704766 4761850 4752284 4821189 4861535 4911233 5008674 5086975 5213411 5294025
4176E294025J40966J35903P0866J48099J16348J27214J74628J60430L9208J57198
$$ 5294025 5434991 5570894 5641760 5789859 5906207 6033421 6208049 6368479 6407687 6564885
4166F564885J98609J58601J97755J77507K00639J95885K38636K25947K13182K62845
$$ 6564885 6763494 6922095 7119850 7297357 7497996 7693881 7932517 8158464 8371646 8634491
4156H634491K67826L04240K74173L12384M15348L43803L96876M11487M69475M94500
$$ 8634491 8902317 9206557 9480730 9793114 10208462 10552265 10949141 11360628 11830103 12324603
4146A2324603O03696N96544O27781O67839O88706P24298P77396P65494P46243
$$ 12324603 12928299 13524843 14152624 14820463 15509169 16233467 17010863 17776357 18522600
4137A8522600R24934P72111P96317Q81128Q31236P60441Q35325P58605P40247
$$ 18522600 19447534 20219645 21015962 21897090 22728326 23488767 24324092 25082697 25822944
4128B5822944P65044P01880O60685P64979O75589O92036P26310O51755P17833
$$ 25822944 26587988 27289868 27950553 28715532 29391121 30083157 30809467 31461222 32179055
4119C2179055O64052O28302N10650N40556M45580K56090K49589K50361K98965
$$ 32179055 32843107 33471409 33982059 34522615 34968195 35224285 35473874 35724235 36023200
4110C6023200K41210K15997K47235K54794K46126K20867K27264K64914K05441
$$ 36023200 36264410 36480407 36727642 36982436 37228562 37449429 37676693 37941607 38147048
4101C8147048K45204J90270J70317R4342J19384M4247m6812q5630j25717j96603
$$ 38147048 38392252 38582522 38752839 38847181 38966565 39010812 38964000 38878370 38752653 38556050
4091C8556050k81202l72346m60204n02180n76263o80446q44762q11587q21189
$$ 38556050 38274848 37902502 37442298 36940118 36363855 35683409 34838647 34027060 33205871
4082C3205871r15610r71987r26442j022012j013019j030490r31330q84033q21227
$$ 33205871 32290261 31318274 30391832 29369820 28356801 27326311 26394981 25510948 24689721
4073B4689721p60128p92626p61071o62537o19198n96725n58290m80613n07796
$$ 24689721 23929593 23136967 22375896 21713359 21094161 20497436 19939146 19458533 18950737
4064A8950737m02091l39948l30224k95972k54144k99248k38695j66290j71254
$$ 18950737 18548646 18208698 17878474 17582502 17328358 17029110 16790415 16624125 16452871
4055A6452871j66220j91417j68731n1440k4621o0163L6411K2306J13060Q4993
$$ 16452871 16286651 16095234 15926503 15875063 15850442 15790279 15826690 15848996 15962056 16047049
4045A6047049Q8848J39396J90102K07858J87627K48321K85131K64743L04625L08716
$$ 16047049 16135897 16275293 16465395 16673253 16860880 17109201 17394332 17659075 17963700 18272416
4035A8272416K78475L86224L27483L53049M59494M49198N02354N31221N72817
$$ 18272416 18550891 18937115 19264598 19617647 20077141 20526339 21028693 21559914 22132731
4026B2132731O24722N58480O81949P16993Q00726Q01054P78303Q88513Q48312
$$ 22132731 22757453 23315933 23997882 24714875 25515601 26316655 27094958 27983471 28831783
4017B8831783Q44456Q14845Q43462P10537O18065N88178M68783L50346L08364
$$ 28831783 29676239 30491084 31334546 32045083 32663148 33251326 33720109 34070455 34378819
4008C4378819K16312J56951Q6909J10596N4250P336r5041l6968l7957k4384o9657
$$ 34378819 34595131 34752082 34838991 34949587 35003837 35011173 34916132 34879164 34841207 34816823 34747166
3997C4747166q4587p5963j20630j79129j82160q1579j08957j20300j04639p8931
$$ 34747166 34662579 34586616 34465986 34286857 34104697 34023118 33914161 33793861 33689222 33610291
3987C3610291o5994n5817j37877j86431j97496k06025k81896k28690k56396l61152
$$ 33610291 33544297 33488480 33350603 33164172 32966676 32760651 32478755 32250065 31993669 31632517
3977C1632517m03373m03302m56253n07986m42067m94132n33497m87751n49499
$$ 31632517 31229144 30825842 30369589 29861603 29419536 28925404 28391907 27904156 27354657
3968B7354657n32290m54813n28198m91039n01505o49128m76371n43243n12124
$$ 27354657 26822367 26367554 25839356 25348317 24846812 24197684 23721313 23178070 22665946
3959B2665946n23771n13611m64885n13178n59993m69318m80757m55700l94659
$$ 22665946 22142175 21628564 21163679 20650501 20090508 19621190 19140433 18684733 18290074
3950A8290074m07514l46471l65479l12814l10422l02178k76324k71969k55422
$$ 18290074 17882560 17536089 17170610 16857796 16547374 16245196 15968872 15696903 15441481
3941A5441481k59516k67754k39337k02938k82564l00289k88698k57387k11742
$$ 15441481 15181965 14914211 14674874 14471936 14189372 13889083 13600385 13342998 13131256
3932A3131256l09335k52786j97081j59146j86979j46873r3769q5064q2806J5k6251
$$ 13131256 12821921 12569135 12372054 12212908 12025929 11879056 11785287 11700223 11617417 11617432 11591181
3921A1591181L0897j0441k1075m42M3422L0736R5972Q3883P7471P1200J7611K24427
$$ 11591181 11622078 11611637 11590562 11590120 11633542 11664278 11760250 11844133 11921604 11992804 12010415 12234842
3909A2234842J46410J02982N8291M5065n9611m8727p7348n4707r4477j31116l8658
$$ 12234842 12381252 12484234 12542525 12587590 12527979 12479252 12401904 12347197 12252720 12121604 12082946
3898A2082946M8792J0943j0829L9681K8980O4594N9000O3621L5307Q2198L5531
$$ 12082946 12131738 12142681 12131852 12171533 12200513 12265107 12324107 12387728 12423035 12505233 12540764
3887A2540764n3720J6506J10215R2054N2291J10180J15696J28956K08446K05428
$$ 12540764 12487044 12503550 12613765 12705819 12758110 12868290 12983986 13112942 13321388 13526816
3877A3526816J69963J05169J50523J07526N3292l752j33254j10311o8823j62791
$$ 13526816 13696779 13801948 13952471 14059997 14113289 14109537 13976283 13865972 13797149 13634358
3867A3634358k07390q5467l0393p6099n1724m1007J0274J7045O7089M2593M3599
$$ 13634358 13426968 13341501 13311108 13235009 13183285 13142278 13152552 13169597 13236686 13279279 13322878
3856A3322878R3357J08489J13485J60952J63048J71920J57777J66951J44790J35261
$$ 13322878 13416235 13524724 13638209 13799161 13962209 14134129 14291906 14458857 14603647 14738908
3846A4738908K27073J97378K45090J42331J61762K63233K19498K04569K35724
$$ 14738908 14965981 15163359 15408449 15550780 15712542 15975775 16195273 16399842 16635566
3837A6635566K38822K42440K87643K75478L24703L75821L85918M78747M34335
$$ 16635566 16874388 17116828 17404471 17679949 18004652 18380473 18766391 19245138 19679473
3828A9679473M85322O06576N99629O63979O73074Q13033Q73880J013483J108401
$$ 19679473 20164795 20771371 21371000 22034979 22708053 23521086 24394966 25408449 26516850
3819B6516850J285376J387172J514418J745523J930926K039117K135846K195610
$$ 26516850 27802226 29189398 30703816 32449339 34380265 36419382 38555228 40750838
3811D0750838K071882K164567J926308J312681N41568k90009r21112j303226j166373
$$ 40750838 42822720 44987287 46913595 48226276 48767844 48477835 47556723 46253497 45087124
3802D5087124q95620m23376p0618J82785N06406O85515Q77587J048530J269778
$$ 45087124 44191504 43768128 43697510 43880295 44386701 45072216 45949803 46998333 48268111
3793D8268111J438991J638784J933226K196031K425110K730421L147526L520064
$$ 48268111 49707102 51345886 53279112 55475143 57900253 60630674 63778200 67298264
3785F7298264L913610M301618M646137N186412N633386O108280O585906O911642
$$ 67298264 71211874 75513492 80159629 85346041 90979427 97087707 103673613 110585255
3777A10585255P011473P053066O833925O369303N596962M524089K995589J104372
$$ 110585255 117596728 124649794 131483719 137853022 143449984 147974073 150969662 152074034
3769A52074034r75950k907054m558861o042962p263070p763032p568368p083206
$$ 152074034 151098084 148191030 143632169 137589207 130326137 122563105 114994737 107911531
3761A07911531o306852n776236n269987m831187m412893m051303l731569l388205
$$ 107911531 101604679 95828443 90558456 85727269 81314376 77263073 73531504 70143299
3753G0143299l140846k850290k662259k416435k256123k145738k188350k018813
$$ 70143299 67002453 64152163 61489904 59073469 56817346 54671608 52483258 50464445
3745E0464445k019162j965510j819044j846315j821867j619680j568388j453649
$$ 50464445 48445283 46479773 44660729 42814414 40992547 39372867 37804479 36350830
3737C6350830j384608j278694j246487j268142j115679j101386j065804r76247
$$ 36350830 34966222 33687528 32441041 31172899 30057220 28955834 27890030 26913783
3729B6913783r35610q99438q38737q61886p45487o91988o24259n96318m89771
$$ 26913783 25978173 25078735 24239998 23378112 22632625 21940637 21316378 20720060 20230289
3720B0230289n45513m95120m80041m39939l87772m37139m39195l96648l84796
$$ 20230289 19684776 19189656 18709615 18269676 17881904 17444765 17005570 16608922 16224126
3711A6224126l57364l92794l12612k60356k81702l43334k55104j83240k64753
$$ 16224126 15866762 15473968 15161356 14901000 14619298 14275964 14020860 13837620 13572867
3702A3572867k44166k63775k12965k07445j70027k19424k48222k22739k69957
$$ 13572867 13328701 13064926 12851961 12644516 12474489 12255065 12006843 11784104 11514147
3693A1514147k84749j87009k51709k15954k15128j69804j32809j40635k02202
$$ 11514147 11229398 11042389 10790680 10574726 10359598 10189794 10056985 9916350 9714148
3684I714148j15632o9044j70792q6364n5380j31648r7560j00381j01507l4179
$$ 9714148 9598516 9529472 9358680 9272316 9216936 9085288 8987728 8887347 8785840 8751661
3674H751661m1813m7514p5363j08917n3550q1086m3911j2457j03620k7018j19861
$$ 8751661 8709848 8662334 8586971 8478054 8424504 8343418 8299507 8287050 8183430 8156412 8036551
3663H036551q7435j4651K5331o8894l702j20937o6226K0374n8355k0209K8439
$$ 8036551 7949116 7934465 7959796 7890902 7887200 7766263 7700037 7720411 7662056 7641847 7670286
3652G670286r217o970l0108J7451k6906L3003M9760K0450N310n856Q2942J3371
$$ 7670286 7661069 7654099 7623991 7641442 7614536 7647539 7697299 7717749 7723059 7717203 7800145 7813516
3640G813516O020O7461M3498m8802j1215M6201J8283N0o799K2222M0032l7433
$$ 7813516 7819536 7886997 7930495 7881693 7870478 7916679 7934962 7935012 7928213 7950435 7990467 7953034
3628G953034r5124m8350j9445n4512m1959n2958R700J8283q824j9250P1467L020
$$ 7953034 7857910 7809560 7790115 7735603 7693644 7640686 7650386 7668669 7659845 7640595 7712062 7715082
3616G715082K4640K0575k6243K4363J3533l392n62o6065M5643j2173o8423M1601
$$ 7715082 7739722 7760297 7734054 7758417 7771950 7768558 7767996 7701931 7747574 7735401 7666978 7708579
3604G708579m57m5275M2371N6996Q7311O9360J9654Q2914R7287O8602K3892O5842
$$ 7708579 7708122 7662847 7705218 7762214 7849525 7918885 7938539 8021453 8118740 8187342 8211234 8277076
3592H277076O4096j5073K0629P8464K9987J11754M8086L0189O4242J00728J36296
$$ 8277076 8341172 8326099 8346728 8425192 8455179 8566933 8615019 8645208 8709450 8810178 8946474
3581H946474Q0683J26996J28540R8346J93053J36850J51827J09332J45439J07117
$$ 8946474 9027157 9154153 9282693 9381039 9574092 9710942 9862769 9972101 10117540 10224657
3571A0224657J11737J00388J7689J19858Q5424J44783J25570L5617Q7440J34159
$$ 10224657 10336394 10436782 10454471 10574329 10659753 10804536 10930106 10965723 11053163 11187322
3561A1187322J10635J18629J04371P9960J08725J86756J56549N1065J05863J88209
$$ 11187322 11297957 11416586 11520957 11600917 11709642 11896398 12052947 12104012 12209875 12398084
3551A2398084J59947J66919J78194K00369J88513J67711J91104K51392K99182
$$ 12398084 12558031 12724950 12903144 13103513 13292026 13459737 13650841 13902233 14201415
3542A4201415K30050L07224L81700M24101L93273M08183N64635N38770O19068
$$ 14201415 14431465 14738689 15120389 15544490 15937763 16345946 16910581 17449351 18068419
3533A8068419O65868O69164P13420Q23807Q36373Q45858P48817P88198P06703
$$ 18068419 18734287 19403451 20116871 20940678 21777051 22622909 23371726 24159924 24866627
3524B4866627O42969N86992N63797M22841M40987M65611M56282M97158M13392
$$ 24866627 25509596 26096588 26660385 27083226 27524213 27989824 28446106 28943264 29356656
3515B9356656L62999L39223L93729L62259K86610K34931K38905J70861K33620
$$ 29356656 29719655 30058878 30452607 30814866 31101476 31336407 31575312 31746173 31979793
3506C1979793K33877K66532L69462N24373O41631O88240R25325J102137J264446
$$ 31979793 32213670 32480202 32849664 33374037 34015668 34703908 35629233 36731370 37995816
3497C7995816J381761J604020J783641J824912K054749K097302K116820K064493
$$ 37995816 39377577 40981597 42765238 44590150 46644899 48742201 50859021 52923514
3489E2923514J992170J771855J540334J305253J007368P85681N10458K84819R3724
$$ 52923514 54915684 56687539 58227873 59533126 60540494 61326175 61836633 62121452 62215176
3480F2215176q1214k34112k83628m54354n88240p12985q83602j144815j466368
$$ 62215176 62133962 61899850 61616222 61161868 60573628 59860643 58977041 57832226 56365858
3471E6365858j625750j831884k000883k141054k133436k198534k237411k106544
$$ 56365858 54740108 52908224 50907341 48766287 46632851 44434317 42196906 40090362
3463D0090362k003496j883002j715514j640131j543458j373736j220220j164937
$$ 40090362 38086866 36203864 34488350 32848219 31304761 29931025 28710805 27545868
3455B7545868j098678j023224r03300q24480p77126p13747o79304o15778o23746
$$ 27545868 26447190 25423966 24520666 23696186 22919060 22205313 21526009 20910231 20286485
3446B0286485n85821n10090m68971m14006l77561l15885l15067l03240k35517
$$ 20286485 19700664 19190574 18721603 18307597 17930036 17614151 17299084 16995844 16760327
3437A6760327j77702j65595j34784j31290r1445j14634j14489l1744l5988R435
$$ 16760327 16582625 16417030 16282246 16150956 16059511 15944877 15830388 15798644 15762656 15772091
3427A5772091P1371J345M5465R049P1747N4947N8130R2210J24706R6749M5828
$$ 15772091 15843462 15844807 15890272 15899321 15971068 16026015 16084145 16176355 16301061 16397810 16443638
3416A6443638J02610J06981O2689M3391N3249K1530J14354J7082J8523N0991R0270
$$ 16443638 16546248 16653229 16715918 16759309 16812558 16834088 16948442 16965524 16984047 17035038 17125308
3405A7125308J40387P8359J06643J30893J12085Q3969J80728K51029J58405K28189
$$ 17125308 17265695 17344054 17450697 17581590 17693675 17777644 17958372 18209401 18367806 18595995
3395A8595995K26451K03161K97941L00749L17648L78881M57382M54100N72541
$$ 18595995 18822446 19025607 19323548 19624297 19941945 20320826 20778208 21232308 21804849
3386B1804849O16078O24107P79084Q33244R00530R53471J184368J143386J303104
$$ 21804849 22420927 23045034 23824118 24657362 25557892 26511363 27695731 28839117 30142221
3377C0142221J415041J506675J695535J871127J798991J902675K010376J989681
$$ 30142221 31557262 33063937 34759472 36630599 38429590 40332265 42342641 44332322
3369D4332322J981320J866643J738762J623258J420716J139568R89857O20383
$$ 44332322 46313642 48180285 49919047 51542305 52963021 54102589 55092446 55712829
3361E5712829K75769L2846k32599n47020p56108r70151j000768j114084j121391
$$ 55712829 55988598 56021444 55788845 55241825 54485717 53515566 52514798 51400714 50279323
3352E0279323j146894j102556r21291r05819p81867n79915m57140k88025j59440
$$ 50279323 49132429 48029873 47108582 46202763 45420896 44840981 44383841 44095816 43936376
3343D3936376M6034J61314M36772N27827P07981R82542J193272J433868J727130
$$ 43936376 43982410 44143724 44580496 45108323 45816304 46798846 47992118 49425986 51153116
3334E1153116J935846K167769K457204K765006L021906L279799L585784L704996
$$ 51153116 53088962 55256731 57713935 60478941 63500847 66780646 70366430 74071426
3326G4071426L834216L936800L886860L799670L623120L336805K968262K574950
$$ 74071426 77905642 81842442 85729302 89528972 93152092 96488897 99457159 102032109
3318A02032109K041449J470515J088604N54935R7254k76367n90255r33681j266552
$$ 102032109 104073558 105544073 106632677 107187612 107284866 107008499 106418244 105484563 104218011
3309A04218011j648145j885545k190581k434963k722662l000093l231496l338758
$$ 104218011 102569866 100684321 98493740 96058777 93336115 90336022 87104526 83765768
3301H3765768l484565l595601l665325l683196l589222l517914l329757l187239
$$ 83765768 80281203 76685602 73020277 69337081 65747859 62229945 58900188 55712949
3293E5712949k996828k759165k580656k385585k216823k029473j910655j699268
$$ 55712949 52716121 49956956 47376300 44990715 42773892 40744419 38833764 37134496
3285C7134496j568438j436358j322283j159325j065451r87252q48328p87910o62994
$$ 37134496 35566058 34129700 32807417 31648092 30582641 29595389 28747061 27959151 27296157
3276B7296157n49374n76128n47485n17412l46395k41228k77649j71350j02222
$$ 27296157 26746783 26170655 25623170 25105758 24759363 24518135 24240486 24069136 23966914
3267B3966914j14220j01941r7063k7707m4467k7115q2011o1200r9791k04753k35467
$$ 23966914 23852694 23750753 23653690 23625983 23581516 23554401 23472390 23411190 23311399 23106646 22871179
3256B2871179k91814l09716m14324m58570n36790m45037n84131n45506m27280
$$ 22871179 22579365 22269649 21855325 21396755 20859965 20414928 19830797 19285291 18858011
3247A8858011n27008m98161m65154l86965l33749l86278k98824k76374k97477
$$ 18858011 18331003 17832842 17367688 16980723 16646974 16260696 15961872 15685498 15388021
3238A5388021k28407k56763j51451j89613j81289j29737j21349m8242j49871j01929
$$ 15388021 15159614 14902851 14751400 14561787 14380498 14250761 14129412 14081170 13931299 13829370
3228A3829370j40227o2807q2678r4268m4006k0186j7069m2246l0848j6278J0781
$$ 13829370 13689143 13626336 13543658 13449390 13405384 13385198 13368129 13325883 13295035 13278757 13289538
3217A3289538J18092N0696j0669J8476J12396K3707N0469J36089J49361J41777
$$ 13289538 13407630 13458326 13447657 13466133 13578529 13602236 13652705 13788794 13938155 14079932
3207A4079932Q4077J91309J78191J81471J70140J95423K27651K51205K35306K51328
$$ 14079932 14164009 14355318 14533509 14714980 14885120 15080543 15308194 15559399 15794705 16046033
3197A6046033K69482K79184K04301K16971L04268J89118J86569J88480K10711
$$ 16046033 16315515 16594699 16799000 17015971 17320239 17509357 17695926 17884406 18095117
3188A8095117K35238K70006K14310K68724L40340K94464L45240M00353L19178
$$ 18095117 18330355 18600361 18814671 19083395 19423735 19718199 20063439 20463792 20782970
3179B0782970L70858M39451M33207M92909N06856N59787N81168O21800O63365
$$ 20782970 21153828 21593279 22026486 22519395 23026251 23586038 24167206 24789006 25452371
3170B5452371P37029O37842O12495O33099N45715N27811M51212N59582N63634
$$ 25452371 26189400 26827242 27439737 28072836 28618551 29146362 29597574 30157156 30720790
3161C0720790M82759N61402O76917N88483O96672P54213O94141O94953O72513
$$ 30720790 31203549 31764951 32441868 33030351 33727023 34481236 35175377 35870330 36542843
3152C6542843P08949P32613P24218P56726P92987Q05443Q02445Q13114P76993
$$ 36542843 37251792 37984405 38708623 39465349 40258336 41063779 41866224 42679338 43456331
3143D3456331Q25207Q48583P88857R03119R26052R30592R81803J130543J216417
$$ 43456331 44281538 45130121 45918978 46822097 47748149 48678741 49660544 50791087 52007504
3134E2007504J345212J364505J463862J594412J745380J927503K011546K240085
$$ 52007504 53352716 54717221 56181083 57775495 59520875 61448378 63459924 65700009
3126F5700009K353984K609150K814677L051751L254066L264522L404921L239064
$$ 65700009 68053993 70663143 73477820 76529571 79783637 83048159 86453080 89692144
3118H9692144L107418K969723K826140K509684K216308K055932J916010J879318
$$ 89692144 92799562 95769285 98595425 101105109 103321417 105377349 107293359 109172677
3110A09172677J845718J817257J875415J865476J834429J693322J473281J202698
$$ 109172677 111018395 112835652 114711067 116576543 118410972 120104294 121577575 122780273
3102A22780273R61766O48986M06695J34980r0953k18008k98851k64484j70124
$$ 122780273 123742039 124391025 124797720 124932700 124841747 124623739 124324888 124060404 123890280
3093A23890280o5584J74943L84190N52424Q65931J001144R77668Q83164N64587
$$ 123890280 123824696 123999639 124383829 124936253 125802184 126803328 127780996 128664160 129228747
3084A29228747P2592o84917j713709k841689m057140n081026n946007o407770
$$ 129228747 129301339 128616422 126902713 124061024 120003884 114922858 108976851 102569081
3076A02569081o564803o359221n916984n307843m795253m247026l720033l298460
$$ 102569081 96004278 89645057 83728073 78420230 73624977 69377951 65657918 62359458
3068F2359458k898532k608959k270288k136043j964260j850913j575059j509596
$$ 62359458 59460926 56851967 54581679 52445636 50481376 48630463 47055404 45545808
3060D5545808j299945j117105j068083q99900q58843p27415o50757n40683m55285
$$ 45545808 44245863 43128758 42060675 41160775 40301932 39574517 38923760 38383077 37927792
3051C7927792m91031m30992m19391l74843l84065m48576m35632l97861m68085
$$ 37927792 37436761 37005769 36586378 36211535 35827470 35378894 34943262 34545401 34077316
3042C4077316m38478m00659m77970l98962l65432m10984l88548m43632m67104
$$ 34077316 33638838 33238179 32760209 32361247 31995815 31584831 31196283 30752651 30285547
3033C0285547m41819n68539n57514n64856o49448o70929n97934n84146o30872
$$ 30285547 29843728 29275189 28717675 28152819 27503371 26832442 26234508 25650362 25019490
3024B5019490o29836o08378m41225l64509l75187l15211l38965k83213k30217
$$ 25019490 24389654 23781276 23340051 22975542 22600355 22285144 21946179 21662966 21432749
3015B1432749k11766j23212j11726j02994j7735L387j6866M5593Q0976M6589J37791
$$ 21432749 21220983 21097771 20986045 20883051 20865316 20868703 20851837 20897430 20978406 21024995 21162786
3004B1162786J70571J61106J91674K62233K52981L39062L63774M45180M72942
$$ 21162786 21333357 21494463 21686137 21948370 22201351 22540413 22904187 23349367 23822309
2995B3822309N28346N79083P53833P60421Q56744R53680J048798J131124J169272
$$ 23822309 24350655 24929738 25683571 26443992 27300736 28254416 29303214 30434338 31603610
2986C1603610J250376J308510J333228J278486J266294J328619J272211J142553
$$ 31603610 32853986 34162496 35495724 36774210 38040504 39369123 40641334 41783887
2978D1783887R74064R16951Q29534P06428N47938O35023O78597N67665P91189
$$ 41783887 42757951 43674902 44504436 45210864 45758802 46393825 47072422 47640087 48431276
2969D8431276R87616J281339J644637J920810K262657K667599L042856L298665
$$ 48431276 49418892 50700231 52344868 54265678 56528335 59195934 62238790 65537455
2961F5537455L434917L483245L540270L373884K884858K422587J649865P03799
$$ 65537455 68972372 72455617 75995887 79369771 82254629 84677216 86327081 87030880
2953H7030880k70426j262181k249387l132462l784931m266582m453245m450801
$$ 87030880 86760454 85498273 83248886 80116424 76331493 72064911 67611666 63160865
2945F3160865m404932m098638l804850l506329l222822k834665k553287k315985
$$ 63160865 58755933 54657295 50852445 47346116 44123294 41288629 38735342 36419357
2937C6419357k053282j943672j634095j550998j407113j253338j185204j050746
$$ 36419357 34366075 32422403 30788308 29237310 27830197 26576859 25391655 24340909
2929B4340909r99112q53311q21033p59011p44712p01276o18033o67288o00897
$$ 24340909 23341797 22488486 21667453 20908442 20163730 19462454 18844421 18177133 17576236
2920A7576236n25504m96603m48121m81915m18317l56074l10187l62072l06977
$$ 17576236 17050732 16554129 16106008 15624093 15205776 14849702 14539515 14177443 13870466
2911A3870466k71928l20148k72417k21926j79617j43956k18427j74762j72698
$$ 13870466 13598538 13278390 13005973 12784047 12604430 12460474 12242047 12067285 11894587
2902A1894587j31206j25376q7535j17846j12308j36820j74707j36633j13142j38962
$$ 11894587 11763381 11638005 11550470 11432624 11320316 11183496 11008789 10872156 10759014 10620052
2892A0620052j79756j58067j13555m0696j22034j34460o3715j16640j22498k7547
$$ 10620052 10440296 10282229 10168674 10127978 10005944 9871484 9807769 9691129 9568631 9541084
2882I541084r5654j44808j10149p1069p5401j33449o7162n6853j17018l5468l0053
$$ 9541084 9445430 9300622 9190473 9119404 9044003 8910554 8843392 8786539 8669521 8634053 8604000
2871H604000l6828l2676m1699l0294p267j03643J0853K0899j9783M8810q3035
$$ 8604000 8567172 8534496 8492797 8462503 8455236 8351593 8362446 8383345 8363562 8412372 8329337
2860H329337J9617M7467N8264N5304M6472L7345Q661k1159L8010O3694P5166L127
$$ 8329337 8348954 8396421 8454685 8509989 8556461 8593806 8602467 8581308 8619318 8683012 8758178 8761305
2848H761305K7400K0569l100Q9636N2721N9163Q0552M9016P1709P3172J05347
$$ 8761305 8788705 8809274 8806174 8895810 8948531 9007694 9088246 9137262 9208971 9282143 9387490
2837I387490P1452P8280R9497M1399J31612R9937P4639J5626P9916P8581O0335
$$ 9387490 9458942 9537222 9636719 9678118 9809730 9909667 9984306 9999932 10079848 10158429 10218764
2826A0218764M0694J28103N5831M8522R6660J50483K02449J24741J69841J62045
$$ 10218764 10259458 10387561 10443392 10491914 10588574 10739057 10941506 11066247 11236088 11398133
2816A1398133K07035K18733K45453J76264K72962K83177K61217L03913K84411
$$ 11398133 11605168 11823901 12069354 12245618 12518580 12801757 13062974 13366887 13651298
2807A3651298K68629K74197L24961K96385L35933L21129K87704L15198L11079
$$ 13651298 13919927 14194124 14519085 14815470 15151403 15472532 15760236 16075434 16386513
2798A6386513L60049K73362K66022L06351K45096L67725K47376L65694M34080
$$ 16386513 16746562 17019924 17285946 17592297 17837393 18205118 18452494 18818188 19252268
2789A9252268M35918L93283N50305N22771M89712N98290O34626P41126P25646
$$ 19252268 19688186 20081469 20631774 21154545 21644257 22242547 22877173 23618299 24343945
2780B4343945P00417P33983P04818O83857O82832O45453N72130M60370L19361
$$ 24343945 25044362 25778345 26483163 27167020 27849852 28495305 29067435 29527805 29847166
2771B9847166O9617J09893J07394K79799M32878N61740O09485P17095Q30525Q96415
$$ 29847166 29916783 30026676 30134070 30413869 30846747 31408487 32017972 32735067 33565592 34462007
2761C4462007R97945J037724J097242J215009J217813J340695J416063J554915
$$ 34462007 35459952 36497676 37594918 38809927 40027740 41368435 42784498 44339413
2753D4339413J679156J774624K037527K166208K351580K529919K701172K956856
$$ 44339413 46018569 47793193 49830720 51996928 54348508 56878427 59579599 62536455
2745F2536455L228917L496856L811053M167323M681861N046716N555825N846803
$$ 62536455 65765372 69262228 73073281 77240604 81922465 86969181 92525006 98371809
2737I8371809O030842O081716N989103N418897M517496L440747K372762J365162
$$ 98371809 104402651 110484367 116473470 121892367 126409863 129850610 132223372 133588534
2729A33588534Q4819r64801j140868k14062J346882L112059M929573O685761Q476165
$$ 133588534 133673353 132708552 131567684 131353622 132700504 135812563 140742136 147427897 155904062
2720A55904062J0436423J2384779J4309683J6158099J7409715J7901110J7298772
$$ 155904062 166340485 178725264 193034947 209193046 226602761 244503871 261802643
2713B61802643J5449874J2252007P338186Q715r044322j7316967k2406222k3751466
$$ 261802643 277252517 289504524 296842710 296851425 287807103 270490136 248083914 224332448
2705B24332448k2305102j9785601j7056670j4545752j2450081j0903819r695389
$$ 224332448 202027346 182241745 165185075 150639323 138189242 127285423 117590034
2698A17590034q601710p723741o826662o179765n481723m942625m515741m161100
$$ 117590034 108988324 101264583 94437921 88258156 82776433 77833808 73318067 69156967
2690F9156967l826097l657805l298133l055275k936836k664867k479218k316724
$$ 69156967 65330870 61673065 58374932 55319657 52382821 49717954 47238736 44922012
2682D4922012k061016j913196j769603j677710j571102j477645j397823j202587
$$ 44922012 42860996 40947800 39178197 37500487 35929385 34451740 33053917 31851330
2674C1851330j070690j012298q76116r07413p74511p90558p69051p35535o91998
$$ 31851330 30780640 29768342 28892226 27984813 27210302 26419744 25650693 24915158 24223160
2665B4223160n83912n79802m62461m10947l96810m44816m26799l03693l25053
$$ 24223160 23639248 23059446 22596985 22186038 21789228 21344412 20917613 20613920 20288867
2656B0288867l11788l23174m08073l81597m22861m35649l89700m36282m36578
$$ 20288867 19977079 19653905 19245832 18864235 18441374 18005725 17616025 17179743 16743165
2647A6743165n30453m62765m59169m15622m46823m82792m24910m42964m03088
$$ 16743165 16212712 15749947 15290778 14875156 14428333 13945541 13520631 13077667 12674579
2638A2674579m18106l93343l42094l19611l60487k74879k78646k42023k75048
$$ 12674579 12256473 11863130 11521036 11201425 10840938 10566059 10287413 10045390 9770342
2629I770342k82981k13680k10525k09489k24420j62984j40025j71562j43823j94038
$$ 9770342 9487361 9273681 9063156 8853667 8629247 8466263 8326238 8154676 8010853 7816815
2619G816815k14457j69147j63541j25097j54643j37401j64712j03076j31629r2435
$$ 7816815 7602358 7433211 7269670 7144573 6989930 6852529 6687817 6584741 6453112 6360677
2609F360677j72848j67651l6163o6654j1985p7720o2310j25099j06493j07691
$$ 6360677 6187829 6020178 5984015 5917361 5905376 5827656 5765346 5640247 5533754 5426063
2599E426063n1653r6900j09736o0175j16787q4737n0424j45241j02000m9882J6109
$$ 5426063 5374410 5277510 5167774 5107599 4990812 4906075 4855651 4710410 4608410 4558528 4574637
2588D574637o2911k8418j6778P528J8346k8855k9673M8768Q973m0126o4804k7518
$$ 4574637 4511726 4483308 4466530 4474058 4492404 4463549 4433876 4482644 4491617 4451491 4386687 4359169
2576D359169M6448k7363m5405o7778l8011J4286M881j8228j8878j5091k6041K085
$$ 4359169 4405617 4378254 4332849 4265071 4227060 4241346 4246227 4227999 4209121 4194030 4167989 4170074
2564D170074l0270m1528J8481l1940r7347n5143r0551n4735m9720j01252j09338
$$ 4170074 4139804 4098276 4116757 4084817 3987470 3932327 3841776 3787041 3737321 3636069 3526731
2553C526731r6520n6463o9658o4308q4851l7976j26371j8579l6560r8880j1734
$$ 3526731 3430211 3373748 3304090 3239782 3154931 3116955 2990584 2972005 2935445 2836565 2824831
2542B824831p4626q248n8457k8817m4498l8977m5402j02935N2400L7638o6617
$$ 2824831 2750205 2741957 2683500 2654683 2610185 2571208 2525806 2422871 2475271 2512909 2446292
2531B446292p4556n2327m9511q086k4057n9847o4955l0888j5281j8733m1531l4736
$$ 2446292 2371736 2319409 2269898 2261812 2237755 2177908 2112953 2082065 2066784 2048051 2006520 1971784
2519A971784J311m8398q62Q1227M658m3179k4586m247r5489L617k1253l2708n4851
$$ 1971784 1973095 1924697 1923835 2005062 2009720 1966541 1941955 1937708 1842219 1845836 1824583 1791875 1737024
2506A737024k6751k3708j06202n0257k0064O244K1710L8448l4222K6486J2941
$$ 1737024 1710273 1686565 1580363 1530106 1510042 1516286 1537996 1576444 1542222 1568708 1581649
2495A581649K4907q105J1145R898j3585P7131J4774n163M7533r856k9225R4518
$$ 1581649 1606556 1598451 1609596 1619494 1605909 1683040 1697814 1692651 1740184 1730328 1701103 1795621
2483A795621J7583p3392J7780k8519K1639j6976n6725N3454L4064m6897J8356
$$ 1795621 1813204 1739812 1757592 1729073 1750712 1733736 1677011 1730465 1764529 1717632 1735988
2472A735988M9015k1253L6838k2064J1436M668Q532Q1664N8043Q2274N4083N3861
$$ 1735988 1785003 1763750 1800588 1778524 1789960 1794628 1803160 1884824 1942867 2025141 2079224 2133085
2460B133085N3201O5577K8137P0857j8055l214K6334r6706o6117j38097j28409
$$ 2133085 2186286 2251863 2280000 2350857 2332802 2329588 2355922 2259216 2193099 2055002 1926593
2449A926593q6540r9209r0791n9121j08237j39177p4082j1999n9200L065n1274
$$ 1926593 1840053 1740844 1650053 1590932 1482695 1343518 1269436 1257437 1198237 1201302 1150028
2438A150028k9267p0305n0343l5262j1624j9143k9227L2239l5229j6279j0225
$$ 1150028 1120761 1050456 1000113 964851 953227 934084 904857 937096 901867 885588 875363
2427H75363Q841R646j2128l0204k7405J0610J7861n3981j7359k3340L5082L9049
$$ 875363 884204 893850 881722 851518 824113 834723 852584 798603 781244 757904 792986 832035
2415H32035l4664l6677J4998P863n4929n0624J7474J6108j2714q441k4978k4166
$$ 832035 797371 760694 775692 783555 728626 678002 695476 711584 698870 690429 665451 641285
2403F41285j7542Q897Q2375K2619k843k9365m6750K1928J2264l241q9530l1002
$$ 641285 623743 632640 715015 737634 734791 705426 658676 680604 692868 689627 600097 569095
2391E69095n6461K1254O685m8946o686L3501k2398K8759n4617m4825j668O846
$$ 569095 512634 533888 540573 491627 484941 518442 496044 524803 470186 425361 423693 430539
2379D30539K9242o2511k9517L0546k1211m2570K5747M4519N6448k1554l3881o483
$$ 430539 459781 397270 367753 398299 377088 334518 360265 404784 461232 439678 405797 399314
2367C99314k1969j3541j615l2798j6357M9425O8751l9123J510N3207k5230k0980
$$ 399314 377345 363804 362189 329391 313034 362459 431210 392087 393597 446804 421574 400594
2355D00594J8725r447Q231m0512J9091j2151q824M052k7696M1378K7069j4602
$$ 400594 419319 409872 418103 377591 396682 384531 375707 379759 352063 393441 420510 405908
2343D05908M8403r291k9401K2200L1020J2776n072o5202J2429Q069j2981r763
$$ 405908 454311 445020 415619 437819 468839 481615 476543 411341 423770 431839 418858 409095
2331D09095L8385j991n8548n007m0634L006K2416M2600R066o0815l908N2145J7599
$$ 409095 447480 445489 386941 381934 341300 344306 366722 409322 418388 357573 353665 405810 423409
2318D23409j0301M0238l4475j3413K5727K3168O943L8586j1282n1888M101n752
$$ 423409 413108 453346 418871 405458 431185 454353 461296 499882 488600 436712 440813 435061
2306D35061o9170n183P1176P5257k2020j9132j4403R780J6295o462M6348l0867
$$ 435061 365891 360708 431884 507141 485121 465989 451586 461366 477661 471199 517547 486680
2294D86680k2304J707K2540k1859p158m1778m5251p196M7877Q401l9718p986l7169
$$ 486680 464376 466083 488623 466764 459606 417828 372577 365381 413258 421659 381941 373955 336786
2281C36786J269L5331m1395j9179J7973j5577k2808m4119J7421K3778N9472q08
$$ 336786 338055 373386 331991 312812 330785 315208 292400 248281 265702 289480 348952 348144
2269C48144l0022N7028j8229n6897R257J8922K0895J8234n30k4243K8707J0362
$$ 348144 318122 375150 356921 300024 309281 328203 349098 367332 366802 342559 371266 381628
2257C81628r0120J0604M444r03j7788O314k4181Q126P714j0780J5633J8457l7926
$$ 381628 291508 302112 306556 305653 287865 294179 269998 278124 285838 275058 290691 309148 271222
2244B71222M838J2114P402l0578L5014K1035l3889l2139N2515j4916k0333J438
$$ 271222 276060 288174 295576 264998 300012 321047 287158 255019 307534 292618 272285 273723
2232B73723K346K460j3586l9749L5706K2539K2908K6934J8928j3087l8427J6671
$$ 273723 276069 278529 264943 225194 260900 283439 306347 333281 352209 339122 300695 317366
2220C17366j6683n333r5288n606K4112J2857k5076J9209Q412m2396J2987M7006
$$ 317366 300683 295350 200062 194456 218568 231425 206349 225558 233970 191574 204561 251567
2208B51567n5960k7928k418P6803N076o2949j4206J2084Q4057L063k6441J1234
$$ 251567 195607 167679 165261 242064 247140 184191 169985 182069 266126 269189 242748 253982
2196B53982l7205q306k261m418o265O042K9783M7091j7731m8284M1333j9816n9856
$$ 253982 216777 208471 206210 201792 195527 201569 231352 278443 260712 212428 253761 233945 174089
2183A74089M4025N768K7931M781l418L927j3461Q8424o3538K0700N3075o1340
$$ 174089 218114 223882 251813 256594 253176 257103 243642 332066 268528 289228 342303 280963
2171B80963l3683k0860K1185L1521j0812K0839m3956J1367N7170L9304k9496K3807
$$ 280963 247280 226420 247605 279126 268314 289153 245197 256564 313734 353038 323542 347349
2159C47349j138j4574L304N734J2080n1342P0792K9921q9829k2345K1443K0974
$$ 347349 346211 331637 334941 340675 352755 301413 372205 402126 312297 289952 311395 332369
2147C32369k5339l6401O3479N1538L1032L5111m7691L6612l5773n4645J18913
$$ 332369 307030 270629 334108 385646 416678 451789 404098 440710 404937 350292 469205
2136D69205q9716Q542J02798m5893j1773J12346l7227k4292M000L3230K1503J8242
$$ 469205 379489 388031 490829 444936 433163 545509 508282 483990 487990 521220 542723 560965
2124E60965M5139r499n9263J4766j7192L9914K7575J3733P63o0265K5784K3503
$$ 560965 606104 596605 537342 552108 534916 574830 602405 616138 616901 556636 582420 605923
2112F05923O3008m146M6731K1685r260P8167J0116N0581O079R2942M5296k0440
$$ 605923 668931 664785 711516 733201 723941 802108 812224 862805 868884 961826 1007122 986682
2100I86682P345O1362N8449l0099J6494J12988k6388Q712J00858L9392R5644K0174
$$ 986682 994027 1055389 1113838 1083739 1100233 1213221 1186833 1195545 1296403 1335795 1431439 1451613
2088A451613P2891M2684O8368P8715L5441J10137P3386L1391P4615R2533J45237
$$ 1451613 1524504 1567188 1635556 1714271 1749712 1859849 1933235 1964626 2039241 2131774 2277011
2077B277011J15319J65257K42848K31089L00347K73692L48629M24729M15841N29829
$$ 2277011 2392330 2557587 2800435 3031524 3331871 3605563 3954192 4378921 4794762 5324591
2067E324591N02531O24135P42117R28412J285719J626072J919849K230475K725530
$$ 5324591 5827122 6451257 7193374 8121786 9407505 11033577 12953426 15183901 17909431
2058A7909431K905959K179919K386878K715167j132379n260792m844852l435506
$$ 17909431 20815390 22995309 25382187 28097354 26964975 21704183 16859331 13423825
2050A3423825k232341j596712j135693p97196p22610m96109n20694m14580k87576
$$ 13423825 11191484 9594772 8459079 7661883 6939273 6443164 5922470 5507890 5220314
2041E220314l02198l91082m33467l38487k37730k15914k17857k60213j56784j73014
$$ 5220314 4918116 4527034 4093567 3755080 3517350 3301436 3083579 2823366 2666582 2493568
2031B493568j42356r2981j70475j31859j46639m2248q3459j06845m8021q9373
$$ 2493568 2351212 2258231 2087756 1955897 1809258 1767010 1683551 1576706 1528685 1439312
2021A439312o1916j12658p0868J2980n9315p6890Q647o8561m7725j5607j4530
$$ 1439312 1377396 1264738 1193870 1206850 1147535 1070645 1079292 1010731 963006 947399 932869
2010I32869l0048j8965l2716o2613J4908L9228m5598J4091r95q34k2101O576j9063
$$ 932869 902821 883856 851140 788527 803435 842663 797065 811156 810161 809327 787226 793802 774739
1997G74739l9227n4179l8748m2832J8001j6578J3151j1747k5367k0658k1714n3362
$$ 774739 735512 681333 642585 599753 617754 601176 614327 602580 577213 556555 534841 481479
1985D81479m3474q02J7210o986J0081j2676R600l935k812o9485p2435N2559n343
$$ 481479 438005 437203 454413 447427 457508 444832 454432 450497 447685 378200 305765 358324 352981
1972C52981m6387n9747K0418k5694p540R524K4269n789K7474l0466K7378l8864
$$ 352981 306594 246847 267265 241571 234031 243555 267824 262035 289509 259043 286421 247557
1960B47557o9658P195J9525k1947P980M249J8301k2875M371n5479O6279r378J5638
$$ 247557 177899 185094 204619 182672 190652 194901 213202 190327 194698 139219 205498 196120 211758
1947B11758J0222l4891O192n7044l5844O2224k9020l3851O0744l5177M0754k8900
$$ 211758 221980 187089 193281 136237 100393 162617 133597 99746 160490 125313 166067 137167
1935A37167q796n8636K8452M1752j5567L7999k6652M3613M2806o0739n712m9358
$$ 137167 128371 69735 98187 139939 124372 162371 135719 179332 222138 161399 155687 106329
1923A06329k943M4380L9794o7867k3899J6351m9852K0771N6568n0742P781L7904
$$ 106329 103386 147766 187560 119693 95794 112145 62293 83064 139632 88890 96671 134575
1911A34575l750n7147M9371j7583o1651L1800l3094J6733k153R198j7017j0878
$$ 134575 130825 73678 123049 105466 43815 75615 42521 59254 57101 66299 49282 38404
1899C8404N6395J5732J168j0723M460J061R480J8599m4103j4560n7061O8293m213
$$ 38404 94799 110531 111699 100976 105436 106497 115977 134576 90473 75913 18852 87145 82932
1886H2932q8777l5104P1947J9685l772M2575m7311p3547M427L3963Q917O0027
$$ 82932 -5845 -40949 30998 50683 46911 89486 42175 -31372 -26945 7018 15935 75962
1874G5962m9573J7803k4649P753P5075P19j6412o3017j6721P316l940R024M3875
$$ 75962 26389 44192 19543 27296 102371 103090 86678 23661 6940 14256 10316 19340 63215
1861F3215Q078L389N6102j0823o3243o373M4862K6621k5101o4103l6238Q384j4346
$$ 63215 71293 74682 130784 119961 56718 50345 95207 121828 96727 32624 -3614 4770 -9576
1848i576k1021L9702K0984K6023m4178L5524k9217j5152K0065L2811l534k594
$$ -9576 -30597 9105 30089 56112 11934 47458 18241 3089 23154 55965 52431 49837
1836D9837p23m6141k24L8283k3632Q098m9445K4111o1481J8196N2059M3044M2449
$$ 49837 49114 2973 2749 41032 17400 25498 -23947 164 -61317 -43121 8938 51982 94431
1823I4431k5858L9664l6321k3466l0898P618J5351N6699k9264N9871L5432l4800
$$ 94431 68573 108237 71916 48450 17552 25170 40521 97220 67956 127827 163259 128459
1811A28459N431J8936J2743j3888l1969m9979p2308O2727L0196j03039l4477O6686
$$ 128459 133890 152826 165569 151681 119712 69733 -2575 60152 90348 -12691 -47168 19518
1799A9518j3026j6677K7757M0228p0740J7564j0730m045J0260m5716J4117m349
$$ 19518 6492 -10185 17572 57800 -12940 4624 -6106 -10151 109 -45607 -31490 -35839
1787c5839j6861O9259j5744k1662n8868P3923k8800J8618M6239K5643m4733m7042
$$ -35839 -52700 16559 815 -20847 -79715 -5792 -34592 -15974 30265 55908 11175 -35867
1775c5867J9262L5881m2688l9269m465L1872L3725p1240L0104L4703M0919k7560
$$ -35867 -16605 19276 -23412 -62681 -67146 -35274 -1549 -72789 -42685 -7982 32937 5377
1763E377k9073j4636Q1443l0741J6371k4426K1592K0909K1506m8765j6150K3217
$$ 5377 -23696 -38332 43111 12370 28741 4315 25907 46816 68322 19557 3407 26624
1751B6624o151l3637n619j0363L9563K165j5022P829o700K6231j1424p4013K5326
$$ 26624 20473 -13164 -18783 -29146 10417 12582 -2440 5389 -1311 24920 13496 -60517 -35191
1738c5191j0896l2430L4767L6166L6306n0682q6599n350K7141J3480K3010L112
$$ -35191 -46087 -78517 -43750 -7584 28722 -21960 -108559 -113909 -86768 -73288 -50278 -47166
1726d7166M0199j6357N4582p2037j7376l9503j154K1724Q502O6947K334j3306
$$ -47166 -6967 -23324 31258 -40779 -58155 -97658 -98812 -77088 -68586 -1639 695 -12611
1714a2611l0482m8722R5410N8005m2748o2988k7998O838m6826N6048J4892j7584
$$ -12611 -43093 -91815 3595 61600 18852 -44136 -72134 -65296 -112122 -56074 -41182 -58766
1702e8766p4338O609J2659M1016K4878k6494j772M1886K2519j5130L5290J247
$$ -58766 -133104 -126495 -113836 -72820 -47942 -74436 -76208 -34322 -11803 -26933 8357 9604
1690I604l242k8639l0271q575K9637P171j9349P114K9918o0q007q960J1190N2026
$$ 9604 6362 -22277 -52548 -61123 -31486 -24315 -43664 -36550 -6632 -6692 -14699 -23659 -12469 39557
1676C9557p969k3614N885J0199r5029P025L9031l0494K2481m118l9115r832M2950
$$ 39557 31588 7974 13859 24058 -70971 -63946 -24915 -55409 -32928 -37046 -76161 -85993 -43043
1663d3043L7319J8996m1552K1006L5681R759M4610n416k6610o5329M4575O0416
$$ -43043 -5724 13272 -28280 -7274 28407 38166 82776 77360 50750 -14579 29996 90412
1651I0412n2336J7123l380k0293Q85m4169j0945M078J1384K485M0513K182j2490
$$ 90412 38076 55199 51819 31526 32411 -11758 -22703 -18625 -7241 -4756 35757 37939 25449
1638B5449J5675k5834l3431j6033J494K9187o1815L7012L4576m6716K1894l8951
$$ 25449 41124 15290 -18141 -34174 -32680 -3493 -65308 -28296 6280 -40436 -18542 -57493
1626e7493L5848N6516r2698j0579O2124J7380N359L3680k8623J0693j5659k1613
$$ -57493 -21645 34871 -57827 -68406 -6282 11098 16457 50137 21514 32207 16548 -5065
1614e065K2867l5366j4957K0677N6275l8806k2105K2811m9758M469L3249j1441
$$ -5065 17802 -17564 -32521 -11844 44431 5625 -16480 6331 -43427 -38958 -5709 -17150
1602a7150k8363J2029J4695j6533J5539K2517o628j5868j8330o103N8727m5699
$$ -17150 -45513 -33484 -18789 -35322 -19783 2734 -3894 -19762 -38092 -44195 14532 -31167
1590c1167m9163L1076J6366m0120N4262k1284m0367J7508L8408K2138l2068o439
$$ -31167 -80330 -49254 -32888 -73008 -18746 -40030 -80397 -62889 -24481 -2343 -34411 -40850
1578d0850J228j4882P7584k2277m8405M2267k3836J1975L5319j0082j9090k4963
$$ -40850 -39622 -54504 23080 803 -47602 -5335 -29171 -17196 18123 8041 -11049 -36012
1566c6012O73j6372J486k5100K5932L0243m3860K3444J0240K2706M633l3336J3754
$$ -36012 -35339 -51711 -50225 -75325 -49393 -19150 -63010 -39566 -29326 -6620 -1987 -35323 -21569
1553b1569o412J7643k8603q962J4391k853L3460n9165Q155M8898R511o5214J40
$$ -21569 -27981 -10338 -38941 -47903 -33512 -36365 -2905 -62070 -53915 -5017 4494 -60720 -60580
1540f0580K6536l1656K382K0667J1376M3228N2139k2762P5K2420l2657j0823p211
$$ -60580 -34044 -65700 -63318 -42651 -31275 11953 64092 41330 41405 63825 31168 20345 13134
1527A3134l1375J1471l7756O965j982o8856J0990J00786p671l0507m6626J7312
$$ 13134 -18241 -6770 -44526 -37561 -39543 -108399 -97409 3377 -4294 -34801 -81427 -64115
1515f4115K966l311M2989M3043j06698o7288O2700J0150P6796M2202p9815n6304
$$ -64115 -61149 -64460 -21471 21572 -85126 -152414 -89714 -79564 -2768 39434 -40381 -96685
1503i6685k5904M6898K2884N9216m4987l9176L6769m4310O1816j9766q462m0157
$$ -96685 -122589 -75691 -52807 6409 -38578 -77754 -40985 -85295 -23479 -43245 -51707 -91864
1491i1864Q045J2378J9044M2664m646m3937k9908N1504o289j9613K5864l2078
$$ -91864 -83819 -71441 -52397 -9733 -14379 -58316 -88224 -36720 -43009 -62622 -36758 -68836
1479f8836M8960j9185l1234M2581Q8039p3182o4580M2445L4354m1590j2488P3077
$$ -68836 -19876 -39061 -70295 -27714 60325 -12857 -77437 -34992 -638 -42228 -54716 18361
1467A8361l0582L4835l2664l4169L4705j2805j097j6319L1258p5376K4479L1736
$$ 18361 -12221 22614 -10050 -44219 -9514 -22319 -23416 -39735 -8477 -83853 -59374 -27638
1455b7638j8301l9005P591m967M454O019K0048L8768O042l6313j8870k4504K7725
$$ -27638 -45939 -84944 -77353 -82320 -77866 -71847 -51799 -13031 -6989 -43302 -62172 -86676 -58951
1442e8951M1597P659o615o0602o3865L2476M3789j103M5187j8179l0663L6729
$$ -58951 -17354 -9695 -16310 -76912 -140777 -108301 -64512 -65615 -20428 -38607 -69270 -32541
1430c2541K3796O33k8643k1213M8957N6626j8443j7203l2145J2330l3572n913
$$ -32541 -8745 -8112 -36755 -57968 -9011 47615 29172 11969 -20176 -7846 -41418 -47331
1418d7331L7123m7079N756k9017Q7546l2575J928M962m5764N428K7614P706q777
$$ -47331 -10208 -57287 -51531 -80548 6998 -25577 -23649 -18687 -64451 -59023 -31409 -23703 -32480
1405c2480n0014L0227L7928m1288m1779P8931O140k9352k5216N80M1543m8558
$$ -32480 -82494 -52267 -14339 -55627 -97406 -18475 -12335 -41687 -66903 -66323 -24780 -73338
1393g3338r551K750n356K4950m511K1282j474l086J8618J3466o2751M5370P049
$$ -73338 -82889 -80139 -85495 -60545 -65056 -43774 -45248 -48334 -29716 -16250 -79001 -33631 -26582
1380b6582m1354J6197L3793m025M6333m2613M692k6550m3013K6606j4920J7254
$$ -26582 -67936 -51739 -17946 -21971 24362 -18251 -13559 -40109 -83122 -56516 -71436 -54182
1368e4182l564j658n2138k89K4685K7947k8883N9195M7293n630l3609m3566m5143
$$ -54182 -57746 -59404 -111542 -111831 -87146 -59199 -88082 -28887 18406 12776 -20833 -64399 -109542
1355a09542P9890J9185j5182k0508j6781j2611P267j9291N5195J67j6928j5301
$$ -109542 -29652 -10467 -25649 -46157 -62938 -75549 -68282 -87573 -32378 -32211 -49139 -64440
1343f4440m3728O1016N512p235l2355J1573J9336P121M182J0809o943P352M428
$$ -64440 -108168 -47152 -41640 -48875 -81230 -69657 -50321 -43200 -39018 -28209 -35152 -27800 -23372
1330b3372l055K9056L709n2126n4038M9671Q850k2665j914K5943N690m855L3839
$$ -23372 -26427 2629 6338 -45788 -99826 -50155 -41305 -63970 -65884 -39941 -34251 -39106 -5267
1317e267j3383M9374j4796L034K0695n6111l3892M319k1006O751j4971K6108J2397
$$ -5267 -18650 30724 15928 18962 39657 -16454 -50346 -46027 -67033 -60282 -75253 -49145 -36748
1304c6748M1923j3263m3419K0021K1776j7299m0603M365L329j1061k7128N0534
$$ -36748 5175 -8088 -51507 -31486 -9710 -27009 -67612 -63247 -59918 -70979 -98107 -47573
1292d7573p333N7095m5356m2774N8146j4630j8645L1013J6863p0033Q304N078
$$ -47573 -54906 2189 -43167 -85941 -27795 -42425 -61070 -30057 -13194 -83227 -74923 -69845
1280f9845N9441j9293o1254L8608J1446Q715k1080m3078M9169J9854j0233l9705
$$ -69845 -10404 -29697 -90951 -52343 -40897 -32182 -53262 -96340 -47171 -27317 -37550 -77255
1268g7255O0612j4528j736K9275K6740k0971k733L919l5513j269r294K9313k9011
$$ -77255 -16643 -31171 -32907 -3632 23108 2137 -596 3323 -32190 -33459 -42753 -13440 -42451
1255d2451j170l740L5708m0297R159j1318k416J2395o490l6190L8985Q580k753
$$ -42451 -43621 -47361 -11653 -51950 -42791 -54109 -56525 -44130 -50620 -86810 -47825 -39245 -41998
1242d1998m2640L7228K9615j4661j539J6816j5334K4506L197M3918p0038l0752
$$ -41998 -84638 -47410 -17795 -32456 -33995 -17179 -32513 -8007 -4810 39108 -30930 -61682
1230f1682J7524K5251l9360K4746J6748k6374K385o734n8664M4901P0133m3476
$$ -61682 -44158 -18907 -58267 -33521 -16773 -43147 -40762 -47496 -106160 -61259 8874 -34602
1218c4602O052k0552N0093K9876j9793j4037k8578j9963J4454N4605K8531o1930
$$ -34602 -28550 -49102 991 30867 11074 -2963 -31541 -51504 -37050 17555 46086 -15844
1206a5844J2978M9834L4806l4016j4316p7788j1901k7344O6951J3044m4113k2564
$$ -15844 -2866 46968 81774 47758 33442 -44346 -56247 -83591 -16640 -3596 -47709 -70273
1194g0273P208L3728P825K0871r305l5686J2338l2336L8453J5180r72L4904n0058
$$ -70273 -63065 -29337 -21512 -641 -9946 -45632 -33294 -65630 -27177 -11997 -12969 21935 -28123
1181b8123K9433R587k3439o9468O853N2005r666L071j8840l5003j2680M3131p700
$$ -28123 1310 10897 -12542 -82010 -75157 -23152 -32818 -29747 -48587 -83590 -96270 -53139 -60839
1168f0839K9847m0590Q336L4160J9541p308L1707P156j3071L8059j1296p0693
$$ -60839 -30992 -71582 -63246 -29086 -9545 -16853 14854 22010 8939 46998 35702 -34991
1156c4991p4o6870K6556o468J573N9989l308j5562k1268p421o61R536R245l8442
$$ -34991 -35065 -101935 -75379 -81847 -80274 -20285 -23593 -39155 -60423 -67844 -68505 -58969 -49724 -88166
1142h8166M891Q0858j9972l3343K5310l2040K9551J968k0412Q673J7762K5934
$$ -88166 -83275 -2417 -22389 -55732 -30422 -62462 -32911 -30943 -51355 -42682 -24920 1014
1130A014j6947k4938n6378M6131j929K282P591K5868k050p6177j4310L4300m356
$$ 1014 -15933 -40871 -97249 -51118 -53047 -50765 -43174 -17306 -19356 -95533 -109843 -75543 -79899
1117g9899O6818L3565m6420K692R854o8434J1701J1894N3035l8309k0114r158
$$ -79899 -13081 20484 -25936 -23244 -13390 -81824 -70123 -58229 -5194 -43503 -63617 -72775
1105g2775k6277p528J4778N5809n594p4964L8963R680k2882M361L2170M2764l9850
$$ -72775 -99052 -106580 -91802 -35993 -41587 -116551 -77588 -67908 -90790 -86429 -54259 -11495 -51345
1092e1345l6201o025K6904M1107j2145m0262J9286k9415l1053L1355M3600j0892
$$ -51345 -87546 -93571 -66667 -25560 -37705 -77967 -58681 -88096 -119149 -87794 -44194 -55086
1080e5086k0543K6898M142k3190K579P4816o8723m9192N0595N819k2463L7647
$$ -55086 -75629 -48731 -44589 -67779 -65200 9616 -59107 -108299 -57704 -51885 -74348 -36701
1068c6701j0864r05P458n5110j8509N6940P2964r668R369q2235J8842k0968k3886
$$ -36701 -47565 -48470 -41012 -96122 -114631 -57691 15273 5605 14974 -67261 -48419 -69387 -93273
1055i3273L1990N2519j8987K2170M6724k5722l1915l1712l6019j5117Q775K5395
$$ -93273 -61283 -8764 -27751 -5581 41143 15421 -16494 -48206 -84225 -99342 -90567 -65172
1043f5172K4070j09K8105j9095n1013O2785L4179k0402M4377k7591J4747M172
$$ -65172 -41102 -41211 -13106 -32201 -83214 -20429 13750 -6652 37725 10134 24881 29053
1031B9053p3245j4327l0319N3822J1089j0219p315m9675O8944R762K8435m9683
$$ 29053 -44192 -58519 -88838 -35016 -23927 -34146 -41461 -91136 -22192 -12430 16005 -33678
1019c3678n3464J0724Q9263O514L6611Q074p1095n8688L5858n171j0935L9421
$$ -33678 -87142 -76418 12845 19359 55970 64044 -7051 -65739 -29881 -35052 -45987 -6566
1007f566k8923M037p187M2785K1155l4113l4178o559N2818L0523r2755o4074O5095
$$ -6566 -35489 -31452 -38639 4146 25301 -8812 -42990 -49549 3269 33792 -58963 -123037 -57942
994e7942N4091m223N988J555N545j5711j1804l7344l0770M7581O5728m9684L4721
$$ -57942 -3851 -8074 -2086 -531 5014 -10697 -22501 -59845 -90615 -43034 22694 -26990 7731
981G731p309j0999j1799k3031N5282O589j7818J2148k996n3268m266K8432N287
$$ 7731 422 -10577 -22376 -45407 9875 16464 -1354 10794 7798 -45470 -49736 -21304 -16017
968a6017k066L6981k6116k5133n424j2107J1809j1430K7421Q647J7294k7257m5923
$$ -16017 -18083 18898 -7218 -32351 -37775 -49882 -38073 -49503 -22082 -13435 3859 -23398 -69321
955f9321L3163M0341k7741R369L8519N0087J854j17697O0225P924q984k8135k5374
$$ -69321 -36158 4183 -23558 -14189 24330 74417 76271 -41426 18799 26723 17739 -10396 -35770
942c5770J2942P4932l5571j0751N3124J077J7278l1586l1757J2174K478n2214
$$ -35770 -22828 52104 16533 5782 58906 59983 77261 45675 13918 26092 28570 -23644
930b3644r937L712L1761l3920K8420j1845K1454j7912q718k5773M211M5403l960
$$ -23644 -33581 -29869 1892 -32028 -3608 -15453 6001 -11911 -20629 -46402 -42191 3212 -748
917g48M2054p145m4870N0798k5274k2993n4177M5345M9180k3624J0066l0291k9820
$$ -748 41306 34161 -10709 40089 14815 -8178 -62355 -17010 32170 8546 18612 -11679 -41499
904d1499J7461M8416l3389Q956Q320L8120j568l9577k6394j5150Q8340r854n5793
$$ -41499 -24038 24378 -9011 -55 8265 46385 44817 5240 -21154 -36304 52036 42182 -13611
891a3611j2862J160l0697J1490L0009M2442l3269m548j1751P162J6538J3491K472
$$ -13611 -26473 -25313 -56010 -44520 -14511 27931 -5338 -9886 -21637 -14475 2063 15554 18026
878A8026k3759q105R750k387l1572L072P373L0544k724n324r855L0185k5802O0899
$$ 18026 -5733 -13838 -4088 -6475 -38047 -34975 -27602 2942 218 -5106 -14961 15224 -10578 50321
864E0321J3042j1929o8828r21l8562k908O8983J8280n3148K7252k0354r500N5571
$$ 50321 63363 51434 -17394 -18315 -56877 -59785 9198 27478 -25670 1582 -18772 -28272 27299
851B7299n7534j412m1125N2219Q0849o8019r707l148j9380J7573j2786O655p585
$$ 27299 -30235 -31647 -72772 -20553 60296 -7723 -17430 -20578 -39958 -22385 -35171 -28516 -36101
838c6101L0416K8348j3666m0516J8116j1386M9019o578p5844j7306K2150N5181
$$ -36101 -5685 22663 8997 -31519 -13403 -24789 24230 17652 -58192 -75498 -53348 1833
826A833L1995o9654J8576L9002o9259J4570K7708j8104K989K8351j0938j9297
$$ 1833 33828 -35826 -17250 21752 -47507 -32937 -5229 -23333 -20344 8007 -2931 -22228
814b2228j031L0846j8557O430m2538k4640K8521L5480j6122K8327j9182M2575
$$ -22228 -23259 7587 -10970 -4540 -47078 -71718 -43197 -7717 -23839 4488 -14694 27881
802B7881L8232j2843o2259q736j5215Q214r709K7924j9764m3082l7249O7422P8144
$$ 27881 66113 53270 -8989 -17725 -32940 -24726 -34435 -6511 -26275 -69357 -106606 -39184 38960
789C8960l2817j6873k6713l180Q741l0624N2311l1646j3482R597k558L4500m5302
$$ 38960 6143 -10730 -37443 -40623 -31882 -62506 -10195 -41841 -55323 -45726 -48284 -13784 -59086
776e9086O2219k0063J4941M4092m7212l6640M6237J5041L588k049k9902j8012
$$ -59086 3133 -16930 -1989 42103 -5109 -41749 4488 19529 23117 21068 -8834 -26846
764b6846K6532j2095K3487N6546R845j9160l6358j6543l8307N191N8532p1231
$$ -26846 -314 -12409 11078 67624 77469 58309 21951 5408 -32899 -27708 30824 -40407
752d0407J1487L150J4244J2238j9751k4821M0474J5790M9210k7251p519o1237
$$ -40407 -28920 -25770 -11526 712 -19039 -43860 -3386 12404 61614 34363 26844 -34393
740c4393j9639P2098m882l1330M1118J3720k1490r30n722l2834O0528M3085m8449
$$ -34393 -54032 18066 13184 -18146 22972 36692 15202 14272 8550 -24284 36244 79329 30880
727C0880L9859l2866J33M461o9091J6888K3635k3353k3955K5705n7240n2011K0460
$$ 30880 70739 37873 38006 42467 -26624 -9736 13899 -9454 -33409 -7704 -64944 -116955 -96495
714i6495J2218P948O699N5815K7116o4119K8727l295J1700Q507n1735N9502J5303
$$ -96495 -84277 -76329 -69630 -13815 13301 -50818 -22091 -25386 -13686 -5179 -56914 2588 17891
701A7891k2701k8043N98R179l3466K0675M5961j6847J6530r2303K4350P7656J050
$$ 17891 -4810 -32853 -32255 -23076 -56542 -35867 10094 -6753 9777 -82526 -58176 19480 20530
688B0530J8906p0990m1304P4674J803L8596L9748m906j8423p4891K3008K2509
$$ 20530 39436 -31554 -72858 1816 3619 42215 81963 77057 58634 -16257 6751 29260
676B9260N087l7433m6528M871J0009K6498J6491m290j1780o8742M0081J5525K8108
$$ 29260 34347 -3086 -49614 -44743 -34734 -8236 8255 3965 -7815 -76557 -36476 -20951 7157
663G157M3385o3730L1188m5644J4216J6278o8272M6819L1315j7437k6114J2513
$$ 7157 50542 -13188 18000 -27644 -13428 2850 -65422 -18603 12712 -4725 -30839 -18326
651a8326L4351j431J4378q096o6743R7482j7340j7027K8073J2212j0900j848m078
$$ -18326 16025 14594 28972 20876 -45867 51615 34275 17248 45321 57533 46633 44785 40707
638D0707j9535l4021l2365L0825k0769N3968l148j1633l0500J7659l972J6837
$$ 40707 21172 -12849 -45214 -14389 -35158 18810 15662 4029 -26471 -8812 -12784 4053
626D053m9120K3230J3779L5887J6658L3368k5815L8093m2404m3537L7500j3384
$$ 4053 -45067 -21837 -8058 27829 44487 77855 52040 90133 47729 4192 41692 28308
614B8308m3595J3031m7128O3591L689p7961N4238o200O1635k5258j8816J9426
$$ 28308 -15287 -2256 -49384 14207 17896 -60065 -5827 -12027 49608 24350 5534 24960
602B4960L2035j673j0900l9548o759O631k5227N2498n1235K7139P738O2097J730
$$ 24960 56995 55322 44422 4874 -1885 4746 -20481 32017 -19218 7921 15659 77756 79486
589G9486j5292m4777k8902j1194J0672L8276j6735J6990K8043J4531o8064J0542
$$ 79486 64194 19417 -9485 -20679 -10007 28269 11534 28524 56567 71098 3034 13576
577A3576m368N6815J4144n2735m9061J3893J7091n824k7783j5579q53Q2885J2180
$$ 13576 9208 66023 80167 27432 -21629 -7736 9355 3531 -24252 -39831 -40684 42201 54381
564E4381j01341k7959N6346N3021l5737n7402L3522Q127O031j1248L8680M4585
$$ 54381 -46960 -74919 -18573 34448 -1289 -58691 -25169 -17042 -11011 -22259 16421 61006
552F1006m3177k097K1764P3190r427n2457m2758M057J6100K8449J5873n8832J6852
$$ 61006 17829 15732 37496 110686 101259 48802 6044 10101 26201 54650 70523 11691 28543
539B8543K8056n3803l7846O143J2947M4560k2277n385O420L9331o7340j4360l4258
$$ 28543 56599 2796 -35050 -28907 -15960 28600 6323 938 7358 46689 -20651 -35011 -69269
526f9269O1116J3608k4056L4828M4294o7881K2247J4085l3438L2955L0075l3711
$$ -69269 -8153 5455 -18601 16227 60521 -7360 14887 28972 -4466 28489 58564 24853
514B4853J4440r655r7316P817M42J7672L5690K0374J5429N762m9340R578O3610
$$ 24853 39293 29638 -67678 -59861 -59419 -41747 -6057 14317 29746 35508 -13832 -4254 59356
501E9356k3539L8673J0877o3010l0440N135K1306M5277o872k2021n1615M7680
$$ 59356 35817 74490 85367 22357 -8083 -2948 18358 63635 56763 34742 -16873 30807
489C0807L6538k6058k5991l6899l9953j6215N5992K9046j1133n772j0465L7170
$$ 30807 67345 41287 15296 -21603 -61556 -77771 -21779 7267 -3866 -9638 -20103 17067
477A7067j8983l3494j7290j145J7950K8588P4658k6607J8836l0994J8189M1331
$$ 17067 -1916 -35410 -52700 -53845 -35895 -7307 67351 40744 59580 28586 46775 88106
465H8106o197r2353K709K7251L5394o4953l1370K9540K4869M0547n1204k9342
$$ 88106 81909 -10444 -7735 19516 54910 -10043 -41413 -11873 12996 53543 2339 -27003
453b7003k0854K7722Q4160M4019p3878n6831J2663k3486L0101j4549N660K8022
$$ -27003 -47857 -20135 64025 108044 34166 -22665 -10002 -33488 -3387 -17936 -12276 15746
441A5746J7137O090j4310l9897K9001R797J5944j3226J0935m686j107K4434n6027
$$ 15746 32883 38973 24663 -15234 13767 23564 39508 26282 37217 32531 31424 55858 -169
428a69J179J0826J6778J9923k2538l3132j6875K9431L7111M4771k0452Q879l3020
$$ -169 1010 11836 28614 48537 25999 -7133 -24008 5423 42534 87305 66853 75732 42712
415D2712L3048m6029k9086J6860L1439k7341l6184Q64P014j6287K2014o366l9666
$$ 42712 75760 29731 645 17505 48944 21603 -14581 -13717 -6703 -22990 -976 -7342 -47008
402d7008O2593N5443k8637k3894N7090m6896k0009O4586n496p6769L9144k988
$$ -47008 15585 71028 42391 18497 75587 28691 8682 73268 67772 -8997 30147 27159
390B7159J7585J11900k4323l2476q2481l1509R9324j215o8637M6624l3199l1024
$$ 27159 44744 156644 132321 99845 17364 -14145 85179 83964 15327 61951 28752 -2272
378b272K1665m0325j0201M9157j8426J4769Q0347n0182o464j988m7552J3322K9579
$$ -2272 19393 -20932 -31133 18024 -402 14367 94714 44532 38068 36080 -11472 1850 31429
365C1429n0761K9560K5269j9477j8103J0154k6568j800L7471L2160o3761M7622
$$ 31429 -19332 10228 35497 16020 -2083 8071 -18497 -20297 17174 49334 -14427 33195
353C3195N803j020j6952j5601R684N7634L7904p0640j9993N4626K1802p350k7316
$$ 33195 38998 37978 21026 5425 15109 72743 110647 40007 20014 74640 96442 89092 61776
340F1776m0677M2454k2994o7685R112N3953J6844l8361M7370M160n2669J0031
$$ 61776 21099 63553 40559 -27126 -18014 35939 52783 14422 61792 65952 13283 23314
328B3314J1343J2115L6157o930j7719M102j4739o844J3048n2744N250m175P584
$$ 23314 34657 46772 82929 75999 58280 62382 47643 40799 53847 1103 6353 2178 9762
315I762L181k4810J1366J0210k3306O134P5727j3308m2050m1437J851j8779K2442
$$ 9762 12943 -11867 -501 9709 -13597 -7463 68264 54956 12906 -28531 -26680 -45459 -23017
302b3017N5844j3797K2889l3694J7064K6519j2927k9291N5213m0389r63P0805
$$ -23017 32827 19030 41919 8225 25289 51808 38881 9590 64803 24414 23451 94256
290I4256O31o1186NJ0968n5811j564O4801K418l2781N8984m2668o6118K8469J8009
$$ 94256 94887 33701 33706 44674 -11137 -12701 52100 54518 21737 80721 38053 -28065 404 18413
276A8413O6801m6144J1775j861l1454L3448q362j332k9169j7974N0737K2624n9400
$$ 18413 85214 39070 50845 48984 17530 50978 42616 41284 12115 -5859 44878 67502 8102
263H102K0880O882j6304j5609J2317M681J0255J241K0042O484l5690j2575k6879
$$ 8102 28982 35864 19560 3951 16268 20949 31204 32445 52487 58971 23281 10706 -16173
250a6173J7139N3750M1789M868o2545k111l5804M1292J0065L1320J5558P463m7198
$$ -16173 966 54716 96505 101373 38828 36717 913 42205 52270 83590 99148 106611 59413
237E9413k3995k330J2312J910k685n9576j3548J1527J0886M9290J0737o9513L7160
$$ 59413 35418 33088 45400 47310 44625 -14951 -28499 -16972 -6086 43204 53941 -15572 21588
224B1588K8729P889l1716K9276o938K5590k237J644r963J5553P100l9215j7402
$$ 21588 50317 58206 26490 55766 48828 74418 72181 73825 63862 79415 86515 47300 29898
211B9898n5766k3858J5890K9217L6682o288O1951l2689k1890O3230n154l3246
$$ 29898 -25868 -49726 -33836 -4619 32063 25775 87726 55037 33147 96377 91223 57977
199E7977K3616J0728m588j2757p6378j5228M7593J2184K236M6546k1682l332r31
$$ 57977 81593 92321 87733 74976 -1402 -16630 30963 43147 45383 91929 70247 66915 65984
186F5984k0630j8147R036J4019j4869j1488K4025k7917K2528r998K7197n5474
$$ 65984 45354 27207 36243 50262 35393 23905 47930 20013 42541 32543 59740 4266
174D266L8918K3245m5098N422K7660k076k657j3461M12o2230N8670l5487J3379
$$ 4266 43184 66429 21331 26753 54413 52337 49680 36219 36631 -25599 33071 -2416 10963
161A0963M5862R319k3180J3676k017n619K3930l1435L688J0346R806K887k8933
$$ 10963 56825 66144 42964 56640 54623 49004 72934 41499 45187 55533 65339 68226 39293
148C9293J9826j1620n4041K966J8995M3378j197k3143N5727m2675j9821K2055
$$ 39293 59119 47499 -6542 -3576 15419 58797 57600 34457 90184 47509 27688 49743
136D9743K1323J8830o0282J6616M490j6061r572J1296J5383n1459K2575J9591
$$ 49743 71066 89896 29614 46230 50720 34659 25087 36383 51766 307 22882 42473
124D2473l5652J2501J8979P4797m8309k1842J0299R853N2877j4395l6139J8908
$$ 42473 6821 19322 38301 113098 64789 42947 53246 63099 115976 101581 65442 84350
112H4350k7993p024K376J4391l8760J0821p610K091M5957J837L7406o3138n0012
$$ 84350 56357 49333 51709 66100 27340 38161 30551 32642 78599 80436 117842 54704 4692
99D692M3342K9734n1271L2486P539K8932l6736k3264m690m029L5856J186k0223
$$ 4692 48034 77768 26497 58983 66522 95454 58718 35454 30764 26735 62591 63777 43554
86D3554k5314K8623m6662L9569r756j2125K5858K3312l7446p088M303n19M9798
$$ 43554 18240 46863 201 39770 30014 17889 43747 67059 29613 22525 26828 26309 76107
73G6107L388j0990N088K3893n644l7174n1982J8611L50M6494K0901k8063N323
$$ 76107 79495 68505 73593 97486 91842 54668 2686 21297 21647 68141 89042 60979 66302
60F6302k2684J2073j7257M3508J9258q440l6000m0636j1384L0664J2822N706q011
$$ 66302 43618 55691 38434 81942 101200 92760 56760 16124 4740 35404 48226 53932 45921
47D5921J7974K0868l4784l0658J6625J3525M986j5500l3776J3789L9578k496J6900
$$ 45921 63895 84763 49979 19321 35946 49471 54457 38957 5181 18970 58548 56052 72952
34G2952K1533m1393l6717O866M6953j6123K2532Q746L776K4701j0528o7482J0895
$$ 72952 94485 53092 16375 23241 70194 54071 76603 85349 89125 113826 103298 35816 46711
21D6711j8687j8633L6854K8952J4696j9401j0372p56O937j569j8005M252L3059
$$ 46711 28024 9391 46245 75197 89893 70492 60120 59364 66301 64732 46727 50979 84038
8H4038L445k5762j6684J2985j2352J4625N140l3634
$$ 84038 87483 61721 45037 58022 45670 60295 65435 31801
0C1801
$$ 31801
$$ Imaginary data points
##PAGE= N=2
##DATA TABLE= (X++(I..I)), XYDATA
16383a980259O977J1309O6540r803J5786L4612L0045K7109M5402K8598k9428J7802
$$ -1980259 -1973282 -1961973 -1895433 -1905236 -1889450 -1854838 -1824793 -1797684 -1752282 -1723684 -1753112 -1735310
16371a735310K2894L1997R0162K8067j5632N380R164O0354J1047M2998p106L8987
$$ -1735310 -1712416 -1680419 -1590257 -1562190 -1577822 -1572442 -1563278 -1502924 -1491877 -1448879 -1455985 -1416998
16359a416998N7396K7071K6009M8537J7418K2640J2824n649O6612M5828O29K3621
$$ -1416998 -1359602 -1332531 -1306522 -1257985 -1240567 -1217927 -1205103 -1210752 -1144140 -1098312 -1097683 -1074062
16347a074062L4889Q795K6134N5783K3287J4433M3318p914L4937j6547M7299O5272
$$ -1074062 -1039173 -1030378 -1004244 -948461 -925174 -910741 -867423 -875337 -840400 -856947 -809648 -744376
16335g44376J6079L4759K5987J1988p578K9563L9455K9062K0167K6428N3570J5305
$$ -744376 -728297 -693538 -667551 -655563 -663141 -633578 -594123 -565061 -544894 -518466 -464896 -449591
16323d49591p148L737K5642L3620M9928K3114L5323J4720M1963L6458m3217P1427
$$ -449591 -456739 -453002 -427360 -393740 -343812 -320698 -285375 -270655 -228692 -192234 -235451 -164024
16311a64024J1004M3659j6J6057M6603j7618P7538l8354n8L5991R329K6047M5886
$$ -164024 -153020 -109361 -109377 -93320 -46717 -64335 13203 -25151 -25209 10782 20111 46158 92044
16298I2044N4725J8839O297k2232N3835N6075j2676J9423L8873J3187K7090l999
$$ 92044 146769 165608 171905 149673 203508 259583 246907 266330 305203 318390 345480 341481
16286C41481k367Q0084j2383M0510j7000K9002J4204k479P284L2193L7765M5742
$$ 341481 339114 419198 406815 447325 430325 459327 473531 471052 478336 510529 548294 594036
16274E94036l2647R072P0312L7742M3259j4539K2253J6103L9345J2431J2896k7440
$$ 594036 561389 570461 640773 678515 721774 707235 729488 745591 784936 797367 810263 782823
16262G82823L4889K4301o373O1790j396r390M1955O954j2352k3440Q2244K0373
$$ 782823 817712 842013 835640 897430 896034 886644 928599 935553 923201 899761 982005 1002378
16250A002378M5169R615l1845L9865K9413N9767L540k0982q553L3425k9779k3832
$$ 1002378 1047547 1057162 1025317 1065182 1094595 1154362 1157902 1136920 1128367 1161792 1132013 1108181
16238A108181Q3971j1274r583L4550J2278N2137j9823l9509J7895Q076L0606O1449
$$ 1108181 1192152 1180878 1171295 1205845 1218123 1270260 1250437 1210928 1228823 1236899 1267505 1328954
16226A328954J5139l297Q1229P5511m1978k7922L3640K3020j5918P498K2038j497
$$ 1328954 1344093 1340796 1422025 1497536 1455558 1427636 1461276 1484296 1468378 1475876 1497914 1496417
16214A496417j2205o002R7803j2298R952J859m131M997N5162o564J1550N7906
$$ 1496417 1484212 1478210 1576013 1563715 1573667 1575526 1571395 1576392 1631554 1624990 1636540 1694446
16202A694446J896k4857p862l2222M2769K5804o2509M9408K5724l0248M5625J4411
$$ 1694446 1696342 1671485 1663623 1631401 1674170 1699974 1637465 1686873 1712597 1682349 1727974 1742385
16190A742385K0574l0423m8845L8662L1489m0803q155M1328m2155L5650M3682
$$ 1742385 1762959 1732536 1683691 1722353 1753842 1713039 1704884 1746212 1704057 1739707 1783389
16179A783389M9712O81J6325o5423q80J6923L7708K2871m0099O286N5723L630
$$ 1783389 1833101 1833782 1850107 1784684 1783804 1800727 1838435 1861306 1821207 1827493 1883216 1886846
16167A886846r468J6219j0840o936k668L9493J6562K0765M9038K3912j7529n4679
$$ 1886846 1877378 1893597 1882757 1875821 1873153 1912646 1929208 1949973 1999011 2022923 2005394 1950715
16155A950715j574o069K1558k648L7790K368q0904J2286K5895M9173l0506J1463
$$ 1950715 1949141 1943072 1964630 1961982 1999772 2002140 1921236 1933522 1959417 2008590 1978084 1989547
16143A989547P854K9536K1182p4157L5240k0627j3261J2731J4891L2187k2747
$$ 1989547 1997401 2026937 2048119 1973962 2009202 1988575 1975314 1988045 2002936 2035123 2012376
16132B012376J724J2318R322k0511K9666J1419L5800J7204J9404o5745m804O5522
$$ 2012376 2014100 2026418 2035740 2015229 2044895 2056314 2092114 2109318 2128722 2062977 2058173 2123695
16120B123695k16l810m368k0319j2352k0765O954L7021l9134M8345q213k5721
$$ 2123695 2123479 2119669 2115301 2094982 2082630 2061865 2068819 2105840 2066706 2115051 2106838 2081117
16108B081117J7732M5032j0074j3420j6916J7969M1097m6630L7777k2506L6026
$$ 2081117 2098849 2143881 2133807 2120387 2103471 2121440 2162537 2115907 2153684 2131178 2167204
16097B167204k2892k899J3123J4069K7289j2513Q191k8833M9032j4859j4749j398
$$ 2167204 2144312 2141413 2154536 2168605 2195894 2183381 2191572 2162739 2211771 2196912 2182163 2180765
16085B180765J3333j7333J277q102P213k3900K3787L6910k4084j7606J7382J5289
$$ 2180765 2194098 2176765 2178042 2169940 2177153 2153253 2177040 2213950 2189866 2172260 2189642 2204931
16073B204931L6175o5730L632O6909n5437l614l7669K0555J1979j7088J9830j4751
$$ 2204931 2241106 2175376 2179008 2245917 2190480 2186866 2149197 2169752 2181731 2164643 2184473 2169722
16061B169722J2681R867K507j3504j8918N3158k5253q9970M6727M5904k4515n6897
$$ 2169722 2182403 2192270 2194777 2181273 2162355 2215513 2190260 2100290 2147017 2192921 2168406 2111509
16049B111509J00887M8472p3663o535P9675l0214j0405L160K2245J9984r60O9
$$ 2111509 2212396 2260868 2187205 2180670 2260345 2230131 2219726 2222886 2245131 2265115 2264155 2264224
16037B264224n5215M7776l8767N8272k3768k8850o8j8563o1702K1169N4415M7027
$$ 2264224 2209009 2256785 2218018 2276290 2252522 2223672 2223604 2205041 2143339 2164508 2218923 2265950
16025B265950j2290n8000K0865j1941L7818m0203k8033j1506M9602j0207k7027
$$ 2265950 2253660 2195660 2216525 2204584 2242402 2202199 2174166 2162660 2212262 2202055 2175028
16014B175028Q4128k8120L0615k1478o5142R3170J7069p1124k0588J3282M4566
$$ 2175028 2259156 2231036 2261651 2240173 2175031 2268201 2285270 2214146 2193558 2206840 2251406
16003B251406l0737J0348k5793M79K5350n738O854N352l6453J5459j2858o683
$$ 2251406 2220669 2231017 2205224 2205703 2231053 2225315 2232169 2237521 2201068 2216527 2203669 2196986
15991B196986K2699L329r351P9325j2065o921N89n9353K4025o5461j2455J6107
$$ 2196986 2219685 2223014 2213663 2292988 2280923 2274002 2274591 2215238 2239263 2173802 2161347 2177454
15979B177454L323j8298M3912K5711M2416J3336M3436k8369m7431K0355J2637
$$ 2177454 2180777 2162479 2206391 2232102 2274518 2287854 2331290 2302921 2255490 2275845 2288482
15968B288482R428j2316j2368R99o0177J4070j5008J0222J1248k9265K169N562
$$ 2288482 2297910 2285594 2273226 2274225 2214048 2228118 2213110 2223332 2234580 2205315 2207484 2213046
15956B213046N475j9749j0768J8956K3450K5995N4954n6327k0067L056L4857M3396
$$ 2213046 2218521 2198772 2188004 2206960 2230410 2256405 2311359 2255032 2234965 2238021 2272878 2316274
15944B316274l8652m6295M716m9052J1411P3087L003M2750k0071K9762j8114j0001
$$ 2316274 2277622 2231327 2236043 2186991 2198402 2271489 2274492 2317242 2297171 2326933 2308819 2298818
15932B298818M5153q4210k6016p720P7880k153j1813o534q584j9560J7886O048
$$ 2298818 2343971 2259761 2233745 2226025 2303905 2301752 2289939 2283405 2274821 2255261 2273147 2279195
15920B279195r936n648O785j8783R408J7267n2685K8257k0335M1550Q081J7563
$$ 2279195 2269259 2263611 2270396 2251613 2261021 2278288 2225603 2253860 2233525 2275075 2283156 2300719
15908B300719J0694K9705n8574k8470L4060n538L6153o6323K8255o1463K6156
$$ 2300719 2311413 2341118 2282544 2254074 2288134 2282596 2318749 2252426 2280681 2219218 2245374
15897B245374N246k8736N6560p0423j7452J9315M0079j6069k5585K0303j1836
$$ 2245374 2250620 2221884 2278444 2208021 2190569 2209884 2249963 2233894 2208309 2228612 2216776
15886B216776L0476K0774p586K328m5686q852K3805M927j3844K8586L3062n166
$$ 2216776 2247252 2268026 2260440 2262768 2217082 2208230 2232035 2236962 2223118 2251704 2284766 2279600
15874B279600m8387P0721K9421n0130J5350J4687m6997P928k7598J1756K3070
$$ 2279600 2231213 2301934 2331355 2281225 2296575 2311262 2264265 2272193 2244595 2256351 2279421
15863B279421l8537l2212M401K4638P341M3853J1582k6203p53k3566k1030L490
$$ 2279421 2240884 2208672 2213073 2237711 2245052 2288905 2300487 2274284 2273531 2249965 2228935 2232425
15851B232425K1372M1875m5320M2621m4632p4775M7473K1678J2704l6338M4606
$$ 2232425 2253797 2295672 2250352 2292973 2248341 2173566 2221039 2242717 2255421 2219083 2263689
15840B263689L197L089L4595j0373k4255K564K9279k2360J5590l5135K2971k1212
$$ 2263689 2266886 2269975 2304570 2294197 2269942 2272506 2301785 2279425 2295015 2259880 2282851 2261639
15828B261639K517J1433q322o327R074j1266L8776Q772l6126j7020k2521M8081
$$ 2261639 2264156 2275589 2267267 2260940 2270014 2258748 2297524 2306296 2270170 2253150 2230629 2278710
15816B278710n1039L5806L6583K1377p5620l8495L1876N962l4568R8387L8468
$$ 2278710 2227671 2263477 2300060 2321437 2245817 2207322 2239198 2245160 2210592 2308979 2347447
15805B347447p7284m7045O3410J6664J3984K5795p9022Q821M270P303l7628K3209
$$ 2347447 2270163 2223118 2286528 2303192 2317176 2342971 2263949 2272770 2277040 2284343 2246715 2269924
15793B269924M6574K1094n3655N211m4087K5024L0450l5990Q187q125j2348k053
$$ 2269924 2316498 2337592 2283937 2289148 2245061 2270085 2300535 2264545 2272732 2264607 2252259 2250206
15781B250206O0947K6841J2490m9958k9202j983L4694j9491k8637L5742l3333
$$ 2250206 2311153 2337994 2350484 2300526 2271324 2269341 2304035 2284544 2255907 2291649 2258316
15770B258316K7615L2592m7594o4155J3687l080M5120j070l626M6169k1414j1737
$$ 2258316 2285931 2318523 2270929 2206774 2220461 2217381 2262501 2261431 2257805 2303974 2282560 2270823
15758B270823L7094k8950K6351O7679n6478K4877P616j8738m0680K798O460L746
$$ 2270823 2307917 2278967 2305318 2372997 2316519 2341396 2349012 2330274 2289594 2292392 2298852 2302598
15746B302598K3082L9135J6056r4596N629J4604j5083K7407L0612o7226m5078
$$ 2302598 2325680 2364815 2380871 2286275 2291904 2306508 2291425 2318832 2349444 2282218 2237140
15735B237140M1134Q523M9297j9496o3492J6462K4723M2899l4881J5233k9415
$$ 2237140 2278274 2286797 2336094 2316598 2253106 2269568 2294291 2337190 2302309 2317542 2288127
15724B288127k476J8762k5795k8666O2120J6N019J4487o2618P9268K1463k9265
$$ 2288127 2285651 2304413 2278618 2249952 2312072 2312088 2317107 2331594 2268976 2348244 2369707 2340442
15712B340442j0368l2690j8354k3644j4176L7084J5241O7881j5186m8475R990
$$ 2340442 2330074 2297384 2279030 2255386 2241210 2278294 2293535 2361416 2346230 2297755 2307745
$$ [...]
##END NTUPLES=NMR SPECTRUM
##END=
