##TITLE=1H_CG-1150-C3
 CDCl3, 8 sc, 
 27.08.2021
##JCAMPDX= 6.0         $$ Bruker NMR JCAMP-DX V2.0
##DATA TYPE= NMR SPECTRUM
##DATA CLASS= NTUPLES
##ORIGIN= UXNMR, Bruker Analytische Messtechnik GmbH
##OWNER= root
$$ XWIN-NMR		Version 3.5
$$ Fri Aug 27 12:05:05 2021 Russian Standard Time (UT+4h)  she@DPX200
##.OBSERVE FREQUENCY= 200.131506
##.OBSERVE NUCLEUS= ^1H
##.ACQUISITION MODE= SIMULTANEOUS
##.ACQUISITION SCHEME= undefined
##.AVERAGES= 8
##.DIGITISER RES= 18
##SPECTROMETER/DATA SYSTEM= spect
##.PULSE SEQUENCE= zg30
##.SOLVENT NAME= D2O
##.SHIFT REFERENCE= (INTERNAL, D2O, 0, 17.5069)
##AUDIT TRAIL= $$ (NUMBER, WHEN, WHO, WHERE, WHAT)
$$ ##TITLE= Audit trail, XWIN-NMR		Version 3.5
$$ ##JCAMPDX= 5.01
$$ ##ORIGIN= Bruker BioSpin GmbH
$$ ##OWNER= she
$$ F:/spectra/data/she/nmr/H-F/1/pdata/1/auditp.txt
$$ ##AUDIT TRAIL=  $$ (NUMBER, WHEN, WHO, WHERE, WHAT)
(   1,<2021-08-27 12:03:45.68 +0400>,<she>,<DPX200>,
      <created by zg, POWCHK disabled, PULCHK disabled
       configuration hash MD5:
       00 E9 B6 7A A2 85 ED C7 34 08 36 98 17 FE 4E 26
       data hash MD5: 16K
       81 F1 B0 AE 2C 22 1F 04 BB AA CA 23 24 63 E8 90>)
(   2,<2021-08-27 12:03:48.39 +0400>,<she>,<DPX200>,
      <Start of raw data processing
       efp BC_mod = 2 LB = 0.24 FT_mod = 6 PKNL = 1 PHC0 = -13357.95 PHC1 = 12.40099 SI = 16K 
       data hash MD5: 16K
       12 61 34 13 E4 B6 6A BD 91 71 D7 79 7C 7C 2C 72>)
(   3,<2021-08-27 12:04:11.81 +0400>,<she>,<DPX200>,
      <pk PHC0 = 1.872921 PHC1 = -2.2 
       data hash MD5: 16K
       CE 35 3F 82 40 D8 3D 90 03 B0 31 EC DE C5 EF DA>)
(   4,<2021-08-27 12:04:14.96 +0400>,<she>,<DPX200>,
      <abs ABSG = 5 
       data hash MD5: 16K
       E1 DB 35 9A 74 C0 DC 4E 0C CE 2D 6D 75 7C 48 00>)
$$ ##END=
$$ 
$$ hash MD5
$$ 64 A0 6F BA C6 E8 36 F1 F1 3E 5C EA B5 4B F2 66
##$RELAX= 
##$RELAX= 
##$RELAX= 
##$RELAX= 
##$RELAX= 
##$RELAX= 
$$ Bruker specific parameters
$$ --------------------------
##$DU= <F:/spectra>
##$EXPNO= 1
##$NAME= <H-F>
##$PROCNO= 1
##$TYPE= <nmr>
##$USER= <she>
##$AMP= (0..31)
100 100 100 100 100 100 100 100 100 100 100 100 100 100 100 100 100 100 
100 100 100 100 100 100 100 100 100 100 100 100 100 100 
##$AQSEQ= 0
##$AQ_mod= 1
##$AUNM= <au_zg>
##$AUTOPOS= <>
##$BF1= 200.13
##$BF2= 200.13
##$BF3= 200.13
##$BF4= 200.13
##$BF5= 200.13
##$BF6= 200.13
##$BF7= 200.13
##$BF8= 200.13
##$BYTORDA= 1
##$CFDGTYP= 0
##$CFRGTYP= 5
##$CHEMSTR= <none>
##$CNST= (0..31)
1 1 145 1 1 1 1 1 1 1 1 1 1 1 1 1 1 1 1 1 1 1 1 1 1 1 1 1 1 1 1 1 
##$CPDPRG= <>
##$CPDPRG1= <>
##$CPDPRG2= <>
##$CPDPRG3= <>
##$CPDPRG4= <mlev>
##$CPDPRG5= <mlev>
##$CPDPRG6= <mlev>
##$CPDPRG7= <mlev>
##$CPDPRG8= <mlev>
##$CPDPRGB= <>
##$CPDPRGT= <>
##$D= (0..31)
0 1.2 0 0 0 0 0 0 0 0.06 0 0.03 0 0 0 0 0.0002 0 0 0 0 0 0 0 0 0 0 0 0 
0 0 0 
##$DATE= 1630051425
##$DBL= (0..7)
120 120 120 120 120 120 120 120 
##$DBP= (0..7)
150 150 150 150 150 150 150 150 
##$DBP07= 0
##$DBPNAM0= <>
##$DBPNAM1= <>
##$DBPNAM2= <>
##$DBPNAM3= <>
##$DBPNAM4= <>
$$ [...]
##$SUBNAM3= <"">
##$SUBNAM4= <"">
##$SUBNAM5= <"">
##$SUBNAM6= <"">
##$SUBNAM7= <"">
##$SUBNAM8= <"">
##$SUBNAM9= <"">
##$SW= 20.0188882624521
##$SWIBOX= (0..15)
0 0 2 0 0 0 0 0 0 0 0 0 0 0 0 0 
##$SW_h= 4006.41025641026
##$TD= 16384
##$TD0= 1
##$TE= 0
##$TE2= 300
##$TE3= 300
##$TEG= 300
##$TL= (0..7)
0 120 120 120 120 120 120 120 
##$TP= (0..7)
150 150 150 150 150 150 150 150 
##$TP07= 0
##$TPNAME0= <>
##$TPNAME1= <>
##$TPNAME2= <>
##$TPNAME3= <>
##$TPNAME4= <>
##$TPNAME5= <>
##$TPNAME6= <>
##$TPNAME7= <>
##$TPOAL= (0..7)
0.5 0.5 0.5 0.5 0.5 0.5 0.5 0.5 
##$TPOFFS= (0..7)
0 0 0 0 0 0 0 0 
##$TUNHIN= 0
##$TUNHOUT= 0
##$TUNXOUT= 0
##$USERA1= <user>
##$USERA2= <user>
##$USERA3= <user>
##$USERA4= <user>
##$USERA5= <user>
##$V9= 5
##$VALIST= <valist>
##$VCLIST= <CCCCCCCCCCCCCCC>
##$VD= 0
##$VDLIST= <DDDDDDDDDDDDDDD>
##$VPLIST= <PPPPPPPPPPPPPPP>
##$VTLIST= <TTTTTTTTTTTTTTT>
##$WBST= 1024
##$WBSW= 4
##$XGAIN= (0..3)
0 0 0 0 
##$XL= 0
##$YL= 0
##$YMAX_a= 739701
##$YMIN_a= -670566
##$ZGOPTNS= <>
##$ZL1= 120
##$ZL2= 120
##$ZL3= 120
##$ZL4= 120
##$ABSF1= 17.50811
##$ABSF2= -2.510929
##$ABSG= 5
##$ABSL= 3
##$ALPHA= 0
##$AQORDER= 0
##$ASSFAC= 0
##$ASSFACI= 0
##$ASSFACX= 0
##$ASSWID= 0
##$AUNMP= <proc_1d>
##$AZFE= 0.1
##$AZFW= 0.1
##$BCFW= 0
##$BC_mod= 2
##$BYTORDP= 0
##$COROFFS= 0
##$CY= -3
##$DATMOD= 1
##$DC= 0
##$DFILT= <>
##$DTYPP= 0
##$F1P= 0
##$F2P= 0
##$FCOR= 1
##$FTSIZE= 16384
##$FT_mod= 6
##$GAMMA= 0
##$GB= 0
##$INTBC= 1
##$INTSCL= 1.334414e-10
##$ISEN= 128
##$LB= 0.24
##$LEV0= 0
##$LPBIN= 0
##$MAXI= 10000
##$MC2= 0
##$MEAN= 0
##$ME_mod= 0
##$MI= 1.114404
##$NCOEF= 0
##$NC_proc= -5
##$NLEV= 6
##$NOISF1= 3.799351
##$NOISF2= 2.8
##$NSP= 0
##$NTH_PI= 0
##$NZP= 0
##$OFFSET= 17.50688
##$PC= 1
##$PHC0= -13356.08
##$PHC1= 10.20099
##$PH_mod= 1
##$PKNL= yes
##$PPARMOD= 0
##$PSCAL= 0
##$PSIGN= 0
##$REVERSE= no
##$SF= 200.130005552565
##$SI= 16384
##$SIGF1= 3
##$SIGF2= 2
##$SINO= 5.538805
##$SIOLD= 16384
##$SREGLST= <1H.CDCl3>
##$SSB= 0
##$STSI= 16384
##$STSR= 0
##$SW_p= 4006.41025641026
##$SYMM= 0
##$S_DEV= 0
##$TDeff= 16384
##$TDoff= 0
##$TI= <>
##$TILT= no
##$TM1= 0
##$TM2= 0
##$TOPLEV= 0
##$USERP1= <user>
##$USERP2= <user>
##$USERP3= <user>
##$USERP4= <user>
##$USERP5= <user>
##$WDW= 1
##$XDIM= 16384
##$YMAX_p= 277677286
##$YMIN_p= -189706
$$ End of Bruker specific parameters
$$ ---------------------------------
##NTUPLES= NMR SPECTRUM
##VAR_NAME=  FREQUENCY,     SPECTRUM/REAL,   SPECTRUM/IMAG
##SYMBOL=    X,             R,               I
##VAR_TYPE=  INDEPENDENT,   DEPENDENT,       DEPENDENT
##VAR_FORM=  AFFN,          ASDF,            ASDF
##VAR_DIM=   16384,         16384,           16384
##UNITS=     HZ,            ARBITRARY UNITS, ARBITRARY UNITS
##FACTOR=    0.24454680195387, 1,            1
##FIRST=     3503.65195288665, 0,            0
##LAST=      -502.758303523613, 0,           0
##MIN=       -502.758303523613, -189706,     0
##MAX=       3503.65195288665, 277677286,    0
$$ Real data points
##PAGE= N=1
##DATA TABLE= (X++(R..R)), XYDATA
$$ [...]
7984 17064391 16485267 16035415 15687864 15424401 15148219 14968387 14649879 14519992 14265967
7975 14265967 14088306 14030545 13989938 13997539 14112607 14175271 14327827 14403169 14692285 14958951
7965 14958951 15215652 15593204 16135441 16739987 17423375 18036093 18729553 19436702 20223296
7956 20223296 21025543 21827761 22506827 23206372 23676305 23947350 24158708 24352023 24223881
7947 24223881 23854181 23118489 22390362 21656897 20934202 20098616 19384192 18767806 18377230
7938 18377230 18186475 18095793 18094304 18337347 18712732 19331486 19928901 20475698 20838740 21198911
7928 21198911 21559744 22104689 22684787 23331667 24049165 24772498 25446148 26066783 26486341
7919 26486341 26607130 26111494 25067586 23559727 21828260 20214075 18850815 17750364
7911 17750364 16774180 15958286 15231060 14550287 14046187 13551284 13146663 12769337 12546448
7902 12546448 12383648 12231346 12094296 12041248 12011853 12101129 12184052 12340789 12520844 12605224
7892 12605224 12680817 12654266 12544517 12389769 12079706 11606492 10982421 10394794 9703340 9075604
7882 9075604 8412747 7767725 7223059 6727503 6301756 6020114 5760921 5491173 5229154 5051747
7872 5051747 4901866 4754297 4614516 4534335 4482269 4339548 4161251 4027751 3925344 3811550
7862 3811550 3710983 3632931 3627927 3505124 3348302 3243117 3208003 3137948 3039967 2915213 2810251
7851 2810251 2754562 2658043 2515307 2484015 2413403 2383907 2340677 2328580 2243508 2297701 2240853
7840 2240853 2353544 2246157 2094054 2010679 1948805 1962090 1928437 1872665 1862141 1813331 1833181
7829 1833181 1854869 1771345 1754153 1691259 1660740 1720289 1685973 1576721 1472625 1464030 1452253
7818 1452253 1452341 1426202 1393968 1406899 1431870 1413598 1357683 1327060 1352857 1330151 1288541 1272360
7806 1272360 1300917 1257314 1227127 1227875 1247956 1262168 1233758 1196468 1184376 1137468 1115095 1114132
7794 1114132 1077847 1094312 1138599 1090891 1145332 1127365 1075109 1058762 1058843 1086624 1049023 1039291
7782 1039291 1003216 1036687 1014490 1043362 1046034 973316 1015328 1063653 1026849 984347 945173 966303
7770 966303 929565 866237 925141 890598 879936 868985 866176 832825 835141 758754 758669 761257 778617
7757 778617 748618 768090 802584 764103 765868 743584 789087 771048 740970 758727 743391 772896
7745 772896 813194 786645 811765 804471 836970 809242 782560 746166 765856 712643 674350 675716
7733 675716 625845 617646 648273 631993 577714 512914 537065 523642 513461 509005 466706 503702
7721 503702 497124 432559 447888 424814 412791 423522 446831 441796 448000 423371 373747 417037
7709 417037 436049 454768 478166 496202 417246 386520 430927 420866 411991 424267 405124 379811
7697 379811 396486 395176 416165 372745 332384 367373 375119 333591 385790 420250 376820 367547
7685 367547 331213 352421 397230 362011 264369 262584 345269 344709 341220 314947 354462 391011
7673 391011 398861 302615 335137 288043 255891 308849 343397 283253 330198 336464 277612 307026
7661 307026 309595 282617 299995 267458 226655 256707 268593 306516 245446 194754 198279 265049
7649 265049 297102 294756 267970 226974 239106 268475 307493 278084 261172 281961 290130 225262
7637 225262 282020 299457 247411 305953 355259 338828 299208 300193 252867 277354 321687 280792
7625 280792 318190 339870 305291 294403 330068 329056 316579 321240 333129 367122 353283 370505
7613 370505 349209 339972 379745 320323 257632 317183 332295 346530 291872 273685 308840 332394
7601 332394 333022 355861 407693 410765 383991 414656 450320 373951 408974 435440 497850 488742
7589 488742 524907 571410 606895 659216 654239 726720 856170 1028220 1086033 1127883 1035951
7578 1035951 932670 770393 646305 532840 456549 401519 398396 393062 379800 317589 313901
7567 313901 258483 305324 271500 268254 242332 295641 313313 313392 226564 186609 211845 171570
7555 171570 182223 208352 188312 247879 224427 182337 201741 212450 213073 182354 172036 115139
7543 115139 119444 125154 128548 98650 146718 100684 129964 78515 49681 58938 77419 71061 50546
7530 50546 112184 87304 64310 74818 84462 60586 73337 31598 14180 71602 45473 30211
7518 30211 25246 53217 11189 14535 28669 7934 38589 73785 72967 21151 -6998 18537 43988
7505 43988 15184 -7406 43559 52468 33136 -32726 -19830 42141 35738 23793 39181 18245
7493 18245 14303 31883 38164 11018 -3729 68947 29788 9157 1016 -11764 44938 19619
7481 19619 44385 -48172 -59277 -49040 -31789 26156 13406 -17089 25837 41173 -22890 -24431
7469 -24431 2682 15926 71384 66878 30260 32782 50099 44147 25919 4710 -4071 -66020 -74265
7456 -74265 -28025 -31040 3806 5760 -31986 -1102 -75887 -93028 -24757 12470 -42961 -49849
7444 -49849 42402 41214 61595 75107 65528 54177 32759 -4324 4250 27166 -12515 -27971
7432 -27971 -8839 -4772 -53910 -56242 -23059 36361 24058 2115 -13979 -11854 27964 -11861
7420 -11861 10509 13489 -29607 1610 -39096 -35045 6038 48818 -2713 -29442 9362 -36408
7408 -36408 24671 14998 54752 -19678 12335 -16976 -35033 21371 11268 57405 19507 -8078
7396 -8078 9536 -47560 -38660 -19594 -15838 -26619 -44646 -11097 -21675 -27944 -83625 -74746 -46943
7383 -46943 -59875 -81955 -28992 72886 25535 -56053 -21637 446 -23254 -8157 -21655 8926
7371 8926 -11683 -70790 -74643 -81551 -28350 -3925 2925 -6737 -14440 -20578 -26570 -7182 1555 33418
7357 33418 31227 -19605 -3727 -41317 -91493 -38395 -34609 -55091 -77451 -51819 -44177 -62896
7345 -62896 -26298 -16103 -23259 -41412 -18106 -36311 -80146 -34947 -5742 -24125 -69906 30042
7333 30042 7128 -27620 -35985 -4011 14714 4402 61616 29906 -2327 -22611 -44195 -34588
7321 -34588 -170 63201 58793 16436 5429 -5091 12426 64471 52433 15481 9087 81866
7309 81866 30498 -26191 17003 22602 55930 45200 -14845 -38545 23200 26692 24557 68878
7297 68878 -2838 -44483 -15024 -68140 -36478 20802 71612 77188 12670 -42824 -44916 -64640
7285 -64640 -69120 1886 -20411 2270 -5965 -50598 -52131 -40529 -86557 -115615 -64560 -77613
7273 -77613 -72851 -66354 -32653 3760 -46986 -68536 -63552 13304 14357 -17755 830 -22709 -4200
7260 -4200 -67340 -76030 -80175 -79049 -83917 -10100 33079 -20774 -4455 -38002 -10758 -39377 -60352
7247 -60352 -14609 -86275 -108138 -73547 -23732 -30548 -58553 -100754 -113242 -61127 -50045 -76724
7235 -76724 -104223 -57286 -41094 -41228 -41272 -88718 -92539 -71193 -71670 -144042 -124732 -60029 -6249
7222 -6249 -47920 -35801 -56345 -29083 -54844 -6509 -13730 -1894 -57395 -98224 -117883 -72729
7210 -72729 -65005 -16176 51597 12538 29028 -62910 -58716 -106298 -118389 -61919 -22756 -51397
7198 -51397 -4163 -6207 24785 10141 -28242 -19391 -17569 -3958 -13494 -45272 688 -40074 -27043
7185 -27043 -12277 -42754 -15753 -34052 -52444 -28694 5204 19164 22753 51912 -14589 -34561
7173 -34561 -22878 -56982 -20689 18180 97 -17704 -40441 44688 91792 57995 37439 9278
7161 9278 29437 20723 26166 21302 -9874 10438 2179 -25388 8253 -4748 -30125 -44414 -7104
7148 -7104 -25247 -12522 -9021 -22012 -19225 -24736 -5431 12410 -38984 -47556 -2357 -2310 -23900
7135 -23900 24802 56918 54919 34320 10022 -36441 -43727 9595 -26479 -20428 6558 11862 56098
7122 56098 66191 2788 -52072 -529 47483 26310 44243 47834 2076 8396 75466 37027
7110 37027 45057 -6220 8209 67771 -4469 27270 46541 27880 33515 25782 64555 29709
7098 29709 -4487 -31937 26010 18514 6578 41584 35826 34092 59318 12963 19138 16374 41838
7085 41838 98373 86820 42764 48230 62774 107678 76620 27541 24081 -10468 25920 16350
7073 16350 101829 129162 85003 131318 116469 68979 110011 66570 107933 117316 70940 9269
7061 9269 11614 34365 66737 73552 67996 64734 52161 22816 115987 143811 84573 125308 115952
7048 115952 143168 131879 14737 47865 95013 91715 89876 86990 60665 30417 47965 80960
7036 80960 40409 8617 96862 90649 89740 51465 94006 118741 134240 113011 107703 89744 96229
7023 96229 107132 80343 51672 90822 118814 90045 135295 202601 188361 136079 164109 218193
7011 218193 177128 149258 150439 172068 147076 66808 112094 140160 112404 111951 149176 184757
6999 184757 191807 160807 155706 115539 149637 180496 148764 182747 218003 193543 174311 232281
6987 232281 226285 238382 256910 186437 197095 222039 211227 222963 198818 172826 210147 217813
6975 217813 267938 296777 335193 331123 289428 259636 257789 253485 286823 296346 261132 237370
6963 237370 246057 332315 347451 328816 338533 275839 275739 326203 383933 350538 355758 395930 431724
6950 431724 416615 448426 429945 435544 390148 345376 436971 447480 481209 453312 458685 497165
6938 497165 489325 497245 500414 454942 508649 483522 409877 422857 487100 503331 539675 586670
6926 586670 547439 497757 457853 529971 512468 541971 524631 525052 547349 562012 552227 598883
6914 598883 641792 705219 772594 765497 791366 773277 735117 785555 779650 780708 818623 845614
6902 845614 855211 803506 910421 905858 874321 902851 923169 939051 964637 972240 1027684 1036209
6890 1036209 1136879 1147131 1200412 1179874 1193428 1208192 1243420 1318080 1283287 1365014 1369787
6879 1369787 1394703 1475799 1489503 1520160 1541111 1547710 1605926 1711000 1675962 1729980 1749306
6868 1749306 1805840 1866556 1855249 1884025 1889484 1855016 1842128 1884562 1982401 2015263 2054216 2147453
6856 2147453 2210615 2253663 2248250 2264521 2285705 2337265 2419699 2462824 2530821 2532779 2555258 2588284
6844 2588284 2651310 2753252 2790264 2834312 2926577 3007321 3040282 3044299 3094449 3265760 3275794
6833 3275794 3369729 3480620 3572531 3661295 3711251 3805463 3881809 4053444 4176294 4270955 4414186
6822 4414186 4488908 4619385 4748065 4915800 5091181 5254292 5432801 5609905 5825326 6000834
6812 6000834 6154716 6354275 6572264 6834146 7062468 7297596 7549699 7830755 8155032 8469483
6802 8469483 8758586 9081877 9495165 9884962 10314706 10750018 11115311 11641800 12110173 12556362
6792 12556362 13071240 13535902 14073241 14602482 15133184 15715851 16263436 16794154 17313364
6783 17313364 17874899 18413013 18832397 19218369 19536755 19742210 19943264 20038745 20085931 20138481
6773 20138481 20075276 19993389 19873730 19634223 19418919 19200875 18994072 18625429 18236323 17826296
6763 17826296 17305700 16769467 16189060 15582168 14898477 14219322 13559812 12921367 12222605
6754 12222605 11594919 11005155 10482247 9988581 9500271 9040480 8524876 8073599 7681177
6745 7681177 7351081 7026143 6679281 6376644 6153308 5825526 5593486 5324644 5110981 4893755
6735 4893755 4777903 4660441 4417932 4221642 4051336 3940737 3826574 3696147 3533792 3449501
6725 3449501 3381109 3248343 3174418 3077168 2997880 2905514 2778237 2761766 2702625 2623690 2476293
6714 2476293 2402281 2366182 2332165 2305694 2244410 2169836 2133473 2101963 2035495 1965731 1916883
6703 1916883 1828356 1838366 1894062 1864429 1797302 1732445 1676983 1654727 1567227 1509116 1523420
6692 1523420 1511720 1508677 1415520 1313748 1295624 1318328 1294045 1257981 1278396 1235888 1212569
6681 1212569 1171910 1143215 1115920 1135589 1131522 1033032 1034365 1044728 1114648 1103717 1016160 1005987
6669 1005987 1003712 1036196 962052 989158 960687 925749 928324 896508 926122 933418 903346 872937
6657 872937 851232 826252 801680 806959 870191 834051 784305 822953 840451 796238 835578 823770
6645 823770 742862 786561 790446 808052 807768 780602 839040 832745 775105 719773 733265 708675
6633 708675 635827 635948 635826 661072 586151 641075 627789 634909 584159 598477 632553 559678 578953
6620 578953 549540 556311 534038 520607 520848 479479 496132 509215 475186 484234 452932 440304
6608 440304 423726 434374 443407 443165 495319 492843 471192 416768 430056 424627 432927 434421 469597
6595 469597 490602 483867 451527 402971 441546 395935 397560 477049 499492 439074 443590 457404
6583 457404 419797 403068 420588 414170 358859 354771 375247 379620 426564 417425 380981 371287 423316
6570 423316 425733 430151 447963 531666 525045 556277 525927 521742 537549 612252 623865 636352
6558 636352 620226 641913 627976 541888 514103 528329 522725 504228 484062 411889 407521 427127
6546 427127 332023 320893 323644 321392 307005 259635 318274 323985 295716 264458 264306 237227 264224
6533 264224 331062 295322 241352 210985 249156 298486 284120 199517 186381 172482 230043 251171
6521 251171 245334 248795 195751 204168 222459 227394 231420 250985 267786 217019 183372 185200 215329
6508 215329 224109 206612 202680 146476 189308 217085 199704 175906 157129 56026 145733 191751
6496 191751 191777 223912 217764 182669 188681 162586 224183 196072 161137 132644 164114 210139 213123
6483 213123 150825 112541 151289 108302 94353 104451 88634 128953 130899 178968 169330 102349
6471 102349 81544 129680 141729 177155 125604 68420 89484 41701 92888 70573 45264 81190
6459 81190 106032 140004 171170 109431 111467 147762 117774 97652 106820 92303 102387 78351
6447 78351 66758 121190 156888 137731 72027 51861 89289 60667 64646 61045 78566 101924
6435 101924 67489 110998 87497 66464 60343 93227 135748 125182 44168 37502 26181 41175
6423 41175 94621 43914 66383 40888 47376 79376 38652 51214 83380 30513 -26944 37673
6411 37673 91863 100681 135882 73464 75669 73881 30628 -4189 26315 40701 58749 85538
6399 85538 106834 24753 33355 4254 -540 42642 51823 74204 34883 57305 36590 8431
6387 8431 39609 532 5828 87813 44695 16517 33023 54979 59922 88796 61246 62998 66089
6374 66089 106640 104672 51919 53515 29208 67047 55896 78725 127111 99720 115593 62621
6362 62621 -12483 68501 85248 107119 95977 69791 55158 74871 61421 71781 42345 106
6350 106 30263 65934 105361 146272 92958 80865 29053 1701 14968 33293 87645 72832
6338 72832 95832 106936 89546 94391 48187 42625 27721 12896 67871 19818 48109 56899
6326 56899 57411 53022 52188 60315 85293 24091 12208 -20183 -49774 -32867 33070 71953 83099
6313 83099 81396 72088 57665 113523 86668 59663 55842 68068 32207 -6215 16151 43437
6301 43437 120552 106205 40324 12014 -3142 3797 -24839 32651 120527 51312 -1937 37139
6289 37139 99066 53378 16700 68143 100126 56821 62364 79327 55663 15187 62764 66325
6277 66325 74933 126755 184022 138587 101324 164265 136006 142015 209067 236673 212197 140112
6265 140112 87806 59607 51072 83018 53660 57608 107289 129644 141679 97436 20921 21021
6253 21021 24649 22170 17908 -940 16547 6461 33103 47620 73632 44852 50514 51753 19190
6240 19190 -674 -56042 -70861 -15471 21413 -3537 -41656 -53241 -66756 6432 1844 -5018
6228 -5018 17259 18831 -14761 965 10928 23308 55118 42687 63252 -32692 -65403 -26399
6216 -26399 -49588 -46962 -20639 -31065 -9995 -24864 -4380 -6595 -68506 -85898 -242 -5143
6204 -5143 6058 35443 16647 24358 22528 -36515 -39802 -23813 8261 -38677 -52706 -11468 -74320
6191 -74320 -60015 -52656 -32149 -1589 8923 -9211 -32857 -90331 -45449 24593 -13209 -25249
6179 -25249 -62224 -58436 -55907 -44907 -55429 -79618 -22711 -35721 -65794 -51997 -88869 -66578
6167 -66578 -66432 -14519 -74490 -88996 -47814 -85062 -29712 -46781 -87585 -76523 -47689 -86401
6155 -86401 -89344 -76849 -53138 -33023 -23983 -58759 -2395 -43757 -65264 -28955 -4464 3733
6143 3733 -33776 -21164 -42422 -114048 -109855 433 -40928 -45002 -54618 -21203 -3834 -36896
6131 -36896 -52138 -62642 -26518 -28175 -10191 -9586 -18667 -75014 -55572 -76111 -119697 -51891 -59980
6118 -59980 -24718 -33699 -69180 -54823 -15320 25208 5996 -66279 -19750 4290 -45018 -65477
6106 -65477 -70983 -31773 -43873 -75009 -66592 -28569 -42280 -51360 -66924 -62617 -49940 -6756 -35596
6093 -35596 -46448 -37797 -97935 -64637 -59909 -57181 -17169 -10871 -46088 -68292 -36219 6023 -32750
6080 -32750 -93599 -84564 -64289 -76823 -50747 -58726 -93026 -145403 -87769 -29093 -116981 -82515
6068 -82515 -60946 -36038 -118659 -152969 -137941 -96367 -126688 -93724 -72993 -27054 20549 -72921
6056 -72921 -103728 -100166 -51406 -80039 -86201 -35087 -94515 -87876 -110428 -125142 -103502 -58080
6044 -58080 -30287 -33530 -45049 -146471 -89549 5031 53191 -9805 -95133 -81816 -72236 -39278
6032 -39278 -115475 -138135 -62489 -24415 -28990 39 -49414 -100378 -77668 -71250 -71496 -73907 -43670
6019 -43670 -73679 -69286 -74510 -62221 -108035 -124325 -81262 -10055 -61299 -89220 -72783 -14636
6007 -14636 -55714 -42453 -28737 -17159 -50274 -71216 -76858 -86215 -81050 -153591 -94647 -8218
5995 -8218 -59735 -73881 -74591 -87371 -128963 -122682 -91649 -101546 -85749 -47226 -103695 -108807 -129060
5982 -129060 -124615 -80119 -85033 -141517 -189706 -148372 -115971 -29608 -75882 -96161 -112518 -90008
5970 -90008 -76406 -47635 -5577 -83571 -97646 -103219 -100786 -53610 -49482 -73972 -66198 -88286 -41940
5957 -41940 -18404 -20318 23804 46 -50454 -49778 -66488 -37412 9607 -24267 -21694 -40116 -29983
5944 -29983 -63512 -36138 -74792 -60599 -76242 -71634 -53609 -76282 -46901 -36221 -45269 -54882
5932 -54882 -67983 -49116 -118318 -95606 -140426 -136551 -71183 -47407 -77236 -43805 -29915 -74256
5920 -74256 -102254 -73396 -86637 -120701 -86429 -100396 -58477 -44392 -13502 -36600 -22622 -1653
5908 -1653 -27496 -49188 -40170 -72454 -61233 -4277 -43747 -42768 -40494 -43209 -44220 -93114 -108047
5895 -108047 -70884 -69914 -34872 -36947 -79059 -43437 -105275 -120560 -85191 -65758 -6825 48310
5883 48310 -33717 -42754 -73907 -54525 -50710 -56898 -12235 -41682 -44011 5454 -60740 -83386 -43043
5870 -43043 -4903 15343 -24363 -9468 -44347 -3127 -36371 28410 40788 -766 -12232 -23841
5858 -23841 10331 -12150 3769 -55164 -38349 -26785 -58529 1059 2001 42020 43887 -41578
5846 -41578 22226 18098 -31158 -10569 20995 31719 17668 -4635 72964 48618 -61342 -64986
5834 -64986 -27028 -21622 16410 -7288 -27125 6314 27951 14942 21310 14436 -31300 -30834 24455
5821 24455 -62376 -79843 11398 7695 -791 8283 20501 -7005 -20738 -19903 20790 -17405 -26261
5808 -26261 11070 12220 -16955 12439 -13645 5872 -6672 10282 -34026 7230 70572 107763
5796 107763 118515 58560 33335 27836 68573 32561 729 8920 44130 -20617 -42077 -49014
5784 -49014 -25743 31882 -4708 -72372 -84867 -64248 -71691 -120364 -109386 -41606 653 -23529
5772 -23529 -40590 -19266 -31454 -115650 -35983 -28615 -77116 -25706 3673 15971 8590 -12158
5760 -12158 3197 4229 -2198 -66437 -47236 -94350 -63661 -33586 -50197 -62008 -48357 -13970
5748 -13970 -39674 -27695 -87111 -40106 -44221 -21009 -4635 -15805 -84954 -140098 -114923 -31122
5736 -31122 -34738 -36151 -17254 -34972 6067 -23579 -84562 -57015 -34587 3271 -23865 -56416
5724 -56416 -43752 -4302 -40467 -84711 -92964 -126427 -105387 -66198 -48303 -10044 -2938 3221
5712 3221 8350 10788 -68783 -38215 -20716 -15358 -19917 -27114 29659 74695 26516 -23772 14779
5699 14779 40274 5555 -25817 -887 43049 114539 128511 63169 45872 54729 -19794 21026
5687 21026 64496 43469 25025 -12611 -29072 28968 -21449 -30078 27526 -54123 -46914 -46457 -24406
5674 -24406 -60336 -42901 4857 18336 21821 -7126 -26704 -593 -14214 -60222 8966 -43373
5662 -43373 -31425 -46112 -60915 -15548 -31184 -13281 -1721 1271 39786 44261 29857 -57205
5650 -57205 -8314 -694 -23920 -16259 -42158 -11392 22909 -8815 38544 79145 -5850 -76486
5638 -76486 -49343 -33696 48657 -7359 -35500 -24436 -32452 27132 11403 37854 22545 6069
5626 6069 15816 -5423 -13587 -27254 -29472 2775 30665 4468 -3289 -10294 -44676 -27216 -1884
5613 -1884 9816 38164 2201 -61045 -52538 -79104 -24854 31617 -40124 -72092 -32266 -6394
5601 -6394 20830 59914 8011 -63484 -13568 9745 51663 60361 7173 53034 68550 31914
5589 31914 31148 16226 33285 39227 27001 82054 16320 28120 53996 52640 70678 47838 55801
5576 55801 54140 72789 89618 102467 165823 160181 110845 54372 58303 106584 90333 59134
5564 59134 100022 56380 67437 114892 64052 105705 68704 78196 100584 123211 124503 133419
5552 133419 192094 186577 141994 131334 119932 126369 163081 164085 153234 180259 274783 300879
5540 300879 235677 171280 145351 147233 183456 232891 194504 214509 186658 188462 152483 201336
5528 201336 208606 170229 135645 103735 69732 145525 185304 149849 86868 147382 218850 210631
5516 210631 221593 245065 259974 273727 276982 211292 173589 137941 124637 188122 236156 174790
5504 174790 129204 175708 149744 80922 117125 126846 140514 171038 163119 136075 102730 136630
5492 136630 126961 134227 81780 109543 152216 216501 221251 193329 208957 167149 214033 176697
5480 176697 217396 169529 148720 216589 199972 191949 188015 176883 175130 189589 191879 184991 231113
5467 231113 187824 210920 185473 207465 190421 232826 264421 308171 304590 328317 311707 305257
5455 305257 333297 324674 282716 305992 343481 349708 388513 368306 399867 414947 376937 368192
5443 368192 383370 362054 342349 352543 359335 365417 353682 442576 455490 469608 448904 437494
5431 437494 437395 496869 566005 537260 497490 482511 504139 526386 575891 573912 645027 627532
5419 627532 663615 648379 711685 699270 701229 746462 753901 802591 857544 906811 933749 1033024
5407 1033024 1112025 1113591 1218058 1262183 1286550 1414342 1630328 1726991 1762924 2038539 2216139
5396 2216139 2399027 2664942 2986516 3344285 3782235 4298678 4918452 5668287 6495298 7389862
5386 7389862 8254638 9213894 9746713 8972042 7301048 5681732 4487119 3677614 3129173
5377 3129173 2802218 2507229 2326606 2213048 2084524 2051661 2008129 1936157 1845257 1808784
5367 1808784 1772209 1711389 1779759 1857673 1904918 1981899 2029156 1911875 1769964 1575811 1367014
5356 1367014 1250339 1119119 1016027 865669 797303 815044 775526 751815 674316 664185 695495
5345 695495 671492 662594 639157 601508 562838 477932 497565 463370 449939 457673 412673 452695
5333 452695 431937 445560 474584 425388 459362 487450 471311 520937 481341 492098 464736 436908
5321 436908 367968 372221 420087 373325 395328 376003 395700 401042 382358 318017 306525 339333
5309 339333 396894 411060 360700 411344 398556 365375 398519 393538 385528 389118 336215 320516
5297 320516 338086 384939 422956 395173 368497 424351 518245 483161 532437 551934 434894
5286 434894 431361 453174 465918 422687 402642 388975 411489 409349 384246 355361 352959 394866
5274 394866 359655 377414 403312 367469 359420 391851 360625 322895 333577 358964 313885 366595
5262 366595 321159 435000 454507 421146 411059 377845 384567 384102 457778 454656 390521 433991
5250 433991 428499 383687 379620 366755 431282 407668 404753 439372 506599 477865 490049 448906
5238 448906 449637 446748 470295 471187 528363 573571 604676 701062 646084 565959 599377 586558 589722
5225 589722 505918 516842 516382 600588 631955 558545 579596 561294 589547 602094 622276 631277
5213 631277 695411 689798 723889 713523 768146 760832 791280 856857 888077 829102 882629 900026
5201 900026 888923 908440 897862 929591 921324 992517 913405 914298 987492 1061277 1083749 1084500 1144890
5188 1144890 1218366 1205445 1260530 1359336 1355410 1402315 1436374 1532432 1622770 1697597 1844008
5177 1844008 1861620 1994890 2120223 2265846 2376077 2549557 2759133 3037404 3294653 3607441
5167 3607441 3963260 4347698 4855243 5469098 6199561 7065255 8141920 9256838 10415200
5158 10415200 11560765 12809667 14431443 15404557 14136014 11277880 8685123 7004567
5150 7004567 5922155 5098474 4466622 4029077 3677207 3360514 3176399 3105090 3013496 2931695
5140 2931695 2905370 2968477 3007335 3088377 3206405 3375778 3485421 3603381 3753121 3885819
5130 3885819 3784227 3489086 3116072 2793676 2517203 2312710 2117691 1975272 1902703 1815718
5120 1815718 1742803 1684542 1607309 1601081 1614562 1653055 1636287 1610318 1608197 1564160 1530174 1509640
5108 1509640 1520054 1559228 1612336 1642602 1689739 1697172 1671494 1685018 1704284 1708066 1620087 1553934
5096 1553934 1498566 1385571 1313217 1280435 1238282 1241452 1248713 1289163 1255206 1220213 1236783 1325946
5084 1325946 1347596 1344538 1456549 1504733 1579200 1632672 1809303 1924985 2085602 2188186 2356330
5073 2356330 2499084 2623334 2756499 2716797 2553321 2347021 2075856 1827343 1720534 1632286
5063 1632286 1585419 1463423 1418380 1432540 1396247 1394944 1378263 1361247 1397413 1494784 1623740
5052 1623740 1702788 1827227 1928625 2052811 2210033 2366094 2424281 2451742 2536717 2689123
5042 2689123 2772899 2698887 2474324 2189179 1882629 1702801 1548049 1454357 1359992 1259038
5032 1259038 1158877 1122594 1151016 1188562 1161212 1115709 1097162 1025655 1070925 1117904 1176191
5021 1176191 1190522 1240626 1195387 1283309 1300624 1299180 1324981 1334101 1383122 1413960 1307556 1178797
5009 1178797 1111257 967065 893822 869575 843067 818780 812846 751271 732575 754149 747117 727554
4997 727554 677001 690025 737675 735456 723484 650714 625077 602079 604994 639799 615180 602499
4985 602499 586208 620272 639964 641320 603781 607528 601588 581280 601856 638002 608622 637545
4973 637545 600720 549538 564972 566662 573627 593136 560350 489425 482089 487571 435056 464393
4961 464393 461861 495511 468418 486329 439869 479991 495708 459552 463166 413092 493479 508779
4949 508779 450838 484623 548576 517201 446950 498241 522651 420986 478273 496822 511096
4938 511096 551192 532017 541509 532358 493567 415720 417198 470524 434379 511706 526035 533378
4926 533378 551896 540478 513838 486396 526115 528489 494195 518772 527293 539847 499631 522167
4914 522167 565742 603238 628776 550366 509291 522862 525036 539942 521946 495294 495597 567302
4902 567302 535775 547695 579603 563630 588837 641631 600912 564617 569550 635159 642142 608649
4890 608649 619924 655506 692812 743882 796904 814816 811676 847585 870381 915958 991351 1025529
4878 1025529 1057179 1176374 1279591 1372158 1510438 1688959 1903754 2070689 2225879 2441803
4868 2441803 2555862 2380299 1929020 1642419 1478306 1344900 1261188 1159500 1068164 1059318
4858 1059318 1094251 1128659 1111243 1153128 1235909 1310865 1364317 1467290 1562229 1620429 1750621
4847 1750621 1840300 1869533 1948784 2032008 2141087 2162337 2052010 1901554 1645190 1462607
4837 1462607 1270100 1163973 1055185 1041108 942022 885812 864317 809381 795784 790045 744089
4826 744089 776112 773299 763455 767820 772889 735225 719489 743875 767373 694220 677300 705408
4814 705408 747359 810025 888333 844812 750147 769247 849734 860444 904119 965718 1002597 1005444
4802 1005444 987827 958693 957441 871375 814644 811980 841897 802883 818914 880841 862187 857516
4790 857516 874113 880946 907941 906978 934943 1011694 981503 1018647 1075984 1147744 1124691 1205187
4778 1205187 1354714 1396584 1476907 1590430 1725265 1872524 1980603 2101689 2222396 2404951
4768 2404951 2475605 2528622 2647656 2714208 2735965 2769869 2759911 2556229 2339294 2261924 2217142
4757 2217142 2183908 2192722 2192952 2197529 2283011 2397518 2489423 2561148 2699476 2750904 2820118 2823276
4745 2823276 2707160 2577551 2539161 2423877 2310587 2250125 2224597 2211444 2200568 2280533 2349475
4734 2349475 2406278 2461911 2557649 2632927 2671032 2724533 2657265 2620377 2566457 2503088 2444418
4723 2444418 2350872 2320537 2231337 2157813 2160892 2174925 2278253 2314866 2345146 2343652 2308096 2357860
4711 2357860 2346719 2241872 2172527 2111712 1963147 1831749 1655573 1548087 1451363 1367290
4701 1367290 1252587 1136130 1032043 1000374 963000 919700 897671 848529 807373 777536 764363
4690 764363 748321 719356 720786 704994 642133 616866 617802 533503 596132 585917 561472 575634
4678 575634 576901 533774 509572 510301 514718 546365 548591 586311 548445 540540 499385 519412 497832
4665 497832 510185 518491 503899 458833 484841 480994 461466 420672 474107 484269 450188 424870
4653 424870 444010 459898 445428 449061 423406 411012 418767 423034 458717 456608 423443 421590 462451
4640 462451 469042 413361 415959 454440 471958 458615 458944 434447 365816 364497 386733 457692 444040
4627 444040 391281 454280 458650 427683 430590 380419 332883 405121 406943 413316 405894 368509 366070
4614 366070 367921 364918 420805 404314 398016 393756 379560 361473 376231 384575 460587 458467 501924
4601 501924 415641 407632 474153 420155 408815 384689 338695 352766 437635 400482 432380 418147
4589 418147 372963 443136 427431 414738 423926 434273 426383 434569 368164 392906 412297 408635
4577 408635 457223 475271 461579 486099 538006 482228 465562 391877 459555 530814 475745 469671
4565 469671 475246 500700 502329 482333 449548 469140 523387 500439 501341 524519 532781 526299 552959
4552 552959 523844 478585 457413 490035 487172 530025 535408 521974 521858 511956 533316 566053 579277
4539 579277 564224 589549 612228 589969 592824 626038 662394 696624 640748 658086 631951 658266
4527 658266 733322 723617 707333 721416 723533 700213 712462 715794 743332 760793 696718 726401
4515 726401 792830 762780 822121 794426 796555 820289 805657 846313 795851 775028 767824 774158
4503 774158 803616 849054 892546 858866 890741 958709 977824 1022209 1016227 1050294 1009616 998836
4491 998836 996762 1065914 1066902 1037260 1040722 1032903 1143660 1160394 1180845 1135184 1106678 1085972
4479 1085972 1212754 1183915 1129373 1204457 1161425 1133087 1183648 1214803 1203300 1308575 1355965
4468 1355965 1275254 1299528 1413537 1441223 1522872 1603482 1704621 1829960 1861477 1995626 2214550
4457 2214550 2405460 2648397 2979442 3291821 3622193 3911487 4213354 4589103 4958131 5045236
4447 5045236 4795867 4224667 3567741 3052917 2653520 2264747 2075068 1920041 1761647 1751807
4437 1751807 1702294 1609886 1495880 1465071 1490456 1421648 1366263 1413102 1376691 1374828 1397293
4426 1397293 1398656 1368564 1375227 1314935 1294433 1324658 1350172 1365890 1322758 1288687 1330058 1370762
4414 1370762 1327244 1317396 1274584 1286570 1342269 1320810 1358756 1361087 1351508 1401028 1438316 1491278
4402 1491278 1542584 1561033 1641895 1733374 1863082 2007021 2135475 2262450 2447111 2713674
4392 2713674 2953823 3205963 3516973 3800438 4131713 4476984 4851515 4941816 4723240 4381970
4382 4381970 3766389 3177384 2704975 2351224 2129696 1950509 1793172 1695738 1631991 1551491
4372 1551491 1570086 1542711 1444382 1394139 1353924 1350258 1289629 1296854 1274917 1286920 1255787 1273199
4360 1273199 1277155 1281499 1234069 1204645 1194997 1206979 1194331 1140599 1189244 1126679 1102591 1180756
4348 1180756 1198193 1164821 1151132 1122338 1135053 1189825 1217585 1166339 1168815 1163400 1208778 1249055
4336 1249055 1257682 1273757 1286076 1283128 1338834 1324447 1323345 1382718 1349340 1362448 1416691 1414044
4324 1414044 1402227 1363780 1308887 1312355 1354753 1303778 1282178 1264552 1248993 1293227 1294827 1315171
4312 1315171 1357641 1342918 1334988 1323146 1409432 1387950 1400386 1462275 1420618 1418217 1422943 1442606
4300 1442606 1391653 1438678 1483092 1522997 1575691 1550846 1583829 1605407 1632174 1663484 1617845
4289 1617845 1609040 1603673 1624216 1654051 1608249 1591733 1576650 1605836 1644673 1620630 1591761 1640186
4277 1640186 1635167 1623199 1602655 1642169 1603084 1599796 1690642 1692326 1694465 1652150 1756400 1733192
4265 1733192 1667305 1650260 1658552 1666340 1678616 1632855 1643649 1687222 1690121 1727038 1708571 1694143
4253 1694143 1726737 1752224 1768649 1734116 1719817 1755525 1806836 1768112 1828801 1855651 1859456 1882689
4241 1882689 1836606 1886280 1893861 1890302 1881655 1939892 1882210 1943024 2020145 1961190 1956941 2003938
4229 2003938 2119238 2097772 2097626 2146680 2127354 2109822 2120659 2169557 2228252 2300408 2303763 2344787
4217 2344787 2394676 2376079 2406366 2413092 2438344 2535412 2605809 2558719 2639834 2647191 2687882 2786390
4205 2786390 2795388 2847996 2902702 2985679 3022654 3010297 3135247 3181474 3248381 3264555 3311075
4194 3311075 3362963 3475391 3512368 3547600 3677449 3725227 3818151 3949062 4022133 4144668 4213639
4183 4213639 4296696 4446824 4560943 4693086 4745551 4850918 4946339 5111715 5234746 5432048
4173 5432048 5555905 5758016 5877116 6050290 6202094 6350589 6553599 6777773 6993175 7242720
4163 7242720 7540202 7730178 8009219 8379202 8683412 9036411 9390066 9856097 10325162 10817116
4153 10817116 11402007 11985878 12549269 13185605 13894503 14626049 15432266 16273500 17130911
4144 17130911 17985489 18715525 19353409 20114965 20803029 21480880 22059426 22578604 23116807
4135 23116807 23648289 24163981 24643120 25064361 25591574 26207928 26764401 27392469 28113685
4126 28113685 28788786 29459901 30109313 30691549 31133017 31522645 31826184 31999139 32101127
4117 32101127 32144135 32131456 32030014 32009844 32065623 32050583 32077237 32215945 32349745 32533663
4107 32533663 32796098 33115054 33470916 33848750 34158273 34464631 34702119 34946024 35122148
4098 35122148 35082858 35017088 34796253 34556969 34317739 34046104 33690760 33251224 32691478 31960559
4088 31960559 31163409 30176162 29214935 28074127 26877675 25670988 24475709 23368254 22212187
4079 22212187 21191538 20272305 19419303 18651844 17916832 17336077 16848034 16329852 15883237
4070 15883237 15369938 14977588 14664133 14408195 14151640 13884630 13647141 13474507 13306336
4061 13306336 13115978 12884383 12707529 12636930 12598494 12519600 12509942 12494356 12551982 12603566 12723978
4050 12723978 12884733 13006882 13247028 13392544 13638120 13871356 14114978 14364946 14591899
4041 14591899 14857695 15136932 15415455 15727435 16088730 16566848 17113549 17671611 18263201
4032 18263201 18984249 19732207 20482345 21323885 22155672 23011540 24017063 25135901 26239557
4023 26239557 27457098 28687793 29886834 31015271 32036680 32960153 33792818 34486429 34968931
4014 34968931 35312990 35505490 35548183 35484418 35341923 35219210 35018162 34792016 34574392 34338514
4004 34338514 34153312 33960456 33771847 33536786 33311161 33029590 32810794 32622863 32471790
3995 32471790 32327780 32271812 32193514 32194729 32306818 32448032 32506499 32539408 32538534 32476946 32371968
3984 32371968 32173016 31944104 31569400 31090309 30536634 29889685 29112856 28370191 27620559
3975 27620559 26835493 26122729 25500433 24829565 24305720 23777673 23273053 22797399 22336638
3966 22336638 21790216 21274499 20699882 20101883 19445264 18855404 18181981 17446727 16763678
3957 16763678 16161770 15567503 15014270 14597558 14095288 13689461 13250466 12871319 12500296
3948 12500296 12176602 11890192 11591286 11253214 10992963 10693976 10443625 10199051 9925243
3939 9925243 9683242 9541771 9399344 9218522 9166265 9074300 8915089 8867489 8884880 8812332
3929 8812332 8672352 8605435 8587998 8555670 8527923 8493832 8522029 8526229 8411532 8445675 8486739
3918 8486739 8557242 8543192 8597713 8694788 8689008 8698368 8672332 8705111 8762472 8769044 8813437 8924298
3906 8924298 8970797 9069319 9110279 9210618 9316367 9342181 9350188 9315419 9218273 9165322 9078695
3895 9078695 8938399 8843052 8749466 8665392 8620783 8608135 8585285 8577580 8583248 8640666 8704380 8695776
3883 8695776 8809563 8875798 8899944 9043901 9125482 9258949 9345239 9453841 9573303 9625998
3873 9625998 9617007 9603062 9603816 9593459 9541180 9558117 9635693 9602669 9602771 9666484 9749157 9853916
3861 9853916 10007318 10132345 10268229 10405223 10568141 10701247 10837374 11018953 11205160 11329674
3851 11329674 11476279 11708134 11879026 12028869 12245355 12450581 12684928 12957154 13176399
3842 13176399 13432251 13759203 14046035 14414929 14764417 15104023 15562182 16087731 16635998
3833 16635998 17167989 17754177 18352383 19024584 19687071 20407868 21246735 22131115 23139137
3824 23139137 24209567 25374181 26693677 28204634 29927584 31818534 33843690 36064122
3816 36064122 38326750 40710467 43113068 44938920 45648409 45356843 44263236 42345932
3808 42345932 40361309 38898442 38129648 37904460 38085974 38498014 39116401 39932537 40822926
3799 40822926 41819476 42953594 44148482 45471621 47044525 48816207 50766359 52947718
3791 52947718 55417864 58174637 61277455 64727763 68440744 72475301 77057505 82021302
3783 82021302 87416312 93357673 99570297 105920754 112123366 117988111 123358318 128006737
3775 128006737 131831676 134620976 135542921 134104074 129973063 123749825 116287170 108255648
3767 108255648 100362824 92929063 86286594 80279305 74897617 70125499 65918508 62208578
3759 62208578 58969619 56088260 53618768 51399683 49405751 47614931 45946862 44296999
3751 44296999 42668739 40985033 39333793 37751594 36151529 34610930 33285697 31960941
3743 31960941 30712885 29612102 28519797 27524499 26444349 25384282 24346384 23291086
3735 23291086 22254584 21273477 20357224 19557345 18687729 17900469 17280323 16700190 16083420
3726 16083420 15606865 15143589 14690983 14328472 13959014 13614643 13355764 13025420 12664644
3717 12664644 12269636 11906946 11664205 11344575 11015022 10738870 10511446 10246811 10070099
3708 10070099 9852918 9603137 9361223 9130534 8995321 8843436 8706373 8526078 8404348
3699 8404348 8307201 8157951 8074725 7932353 7866726 7681033 7606831 7472859 7345734 7296510
3689 7296510 7211989 7130725 7104135 7140885 7051896 7017605 7023429 7045166 7017563 7014730 6983908 7018066
3677 7018066 7034521 7039497 6981860 6956977 6932535 6868898 6864957 6838251 6819105 6749048 6669401 6578029
3665 6578029 6509463 6397220 6295724 6215702 6151158 6198800 6197228 6163568 6151974 6125613 6046716
3654 6046716 6017816 6080410 6029278 6024560 6017606 5966804 5949623 5989797 6067855 6045178 6024836 6008879
3642 6008879 6000225 6021006 6085283 6099748 6116604 6165615 6119523 6109323 6126526 6075496 6018002 6018110
3630 6018110 5953097 5846184 5839191 5847035 5806222 5785955 5814460 5775688 5801688 5871946 5944607 5984322
3618 5984322 6025047 6032544 6002689 5961312 5864257 5871227 5744158 5667757 5645150 5575341 5547393 5527586
3606 5527586 5535573 5568309 5576311 5657583 5742183 5692074 5658243 5691111 5754353 5781225 5749892 5752097
3594 5752097 5763380 5786208 5821235 5857123 5906959 5912488 6043756 6096824 6102267 6147627 6203192 6303027
3582 6303027 6419040 6468853 6527751 6645483 6714854 6747800 6829314 6841751 6881790 6928811 6968891
3571 6968891 6998508 7003244 7075024 7105841 7149508 7249156 7296010 7378532 7448674 7597178 7733893
3560 7733893 7757729 7857368 7989611 8121597 8243319 8411186 8575425 8769131 8968991 9138760
3550 9138760 9318365 9514693 9733688 9986542 10285010 10526918 10892513 11250047 11601301 12041966
3540 12041966 12515422 13051160 13600180 14156053 14821408 15530412 16182749 16914768 17560341
3531 17560341 18126752 18706882 19242424 19628093 19922219 20159464 20432684 20639420 20951974
3522 20951974 21236101 21421738 21770673 22117328 22441988 22784689 23122029 23445994 23662489
3513 23662489 23894668 24179272 24502930 24828333 25231325 25737248 26416937 27213993 28170244
3504 28170244 29348978 30684397 32196197 33936614 35812580 37864149 40051244 42355556
3496 42355556 44686864 47057740 49344701 51523389 53373326 54957457 56143361 57020161
3488 57020161 57481777 57589858 57492664 57079860 56627079 56029060 55413442 54722179 53975149 53106311
3478 53106311 52106561 50778487 49181743 47370102 45260514 42845099 40399348 37874060
3470 37874060 35398135 33071031 30780857 28671700 26841594 25147273 23597844 22249032
3462 22249032 21053010 20011583 19094763 18283696 17584696 16902864 16219533 15681025 15225625
3453 15225625 14763558 14359011 13922482 13594600 13298818 13000473 12724640 12509505 12288276
3444 12288276 12039789 11882324 11714469 11543481 11446706 11377486 11227633 11108771 11064699 11029219
3434 11029219 10958325 10890808 10836076 10793359 10820709 10861571 10932799 10939394 10957686 10962423 10966920 11015313
3422 11015313 11092298 11058824 11065161 11141595 11177774 11225114 11291288 11361150 11402789 11439490 11468654
3411 11468654 11527851 11621006 11726106 11788665 11857840 11932799 12079161 12173967 12352319 12515340
3401 12515340 12717312 13017313 13214265 13469755 13756808 14109512 14519898 14894789 15307661
3392 15307661 15744826 16338808 16909055 17536151 18231522 19056130 19900708 20796875 21798912
3383 21798912 22890153 24124570 25480114 26934519 28453999 30083066 31701833 33392223
3375 33392223 35128016 36876112 38427004 39952506 41295138 42469485 43377099 44006087
3367 44006087 44304071 44284813 43997152 43334657 42490895 41489604 40337821 39048620 37849254
3358 37849254 36757596 35680117 34647259 33861406 33229848 32755750 32509480 32491744 32557608
3349 32557608 32795652 33177876 33749933 34438659 35365950 36402111 37551669 38983783 40618832
3340 40618832 42413215 44411020 46632940 49142088 51899859 54982711 58332358 61886853
3332 61886853 65714454 69697877 73887141 78080941 82255673 86305534 89924291 93009457
3324 93009457 95629265 97583591 98895532 99582980 99674258 99253258 98439490 97338625 95957474
3315 95957474 94379231 92587462 90625479 88410246 86000981 83424596 80528135 77440352
3307 77440352 74053535 70523149 66844912 63136222 59476270 55862689 52300012 48881821
3299 48881821 45763457 42806157 40129725 37747566 35521276 33510067 31699218 30090997
3291 30090997 28618136 27286942 26087321 25048768 24053507 23213422 22432782 21734490 21084770
3282 21084770 20525600 20001348 19518754 19183119 18792941 18479490 18273008 18125505 17957538
3273 17957538 17894924 17853563 17898026 17955044 17923662 17986020 18006022 18069738 18096890 18049955 18008479
3262 18008479 17878463 17757102 17498462 17183483 16842005 16335113 15843206 15332177 14779388
3253 14779388 14279168 13783649 13337873 12939397 12502661 12058385 11811280 11501731 11198543
3244 11198543 11001549 10755715 10517704 10365686 10212093 10078867 9978989 9890323 9790235 9727838
3234 9727838 9642633 9591013 9570388 9608392 9588424 9611055 9645682 9600145 9522232 9542459 9605468
3223 9605468 9612040 9590542 9631930 9642520 9653217 9711506 9722336 9810805 9834223 9938967 9988807
3212 9988807 10047557 10111509 10146853 10320865 10469804 10605240 10720780 10877656 11057428 11151409
3202 11151409 11279934 11514294 11651486 11894152 12104581 12197788 12395643 12543547 12724748 12953122
3192 12953122 13162696 13414834 13690168 13955463 14228749 14549830 14881582 15220737 15574061
3183 15574061 15944665 16395732 16833426 17336400 17834864 18297549 18795261 19267396 19819719
3174 19819719 20437042 21040220 21510015 21840574 22223584 22527432 22802127 23068510 23333111
3165 23333111 23619189 23935496 24313486 24652089 25037538 25520714 25975867 26411945 26798945
3156 26798945 27187424 27545194 28002368 28472068 28933144 29365077 29844239 30417422 30921107
3147 30921107 31522320 32117704 32634802 33275875 33959039 34659180 35424627 36373912 37407470
3138 37407470 38533498 39717686 41094239 42571873 44192066 45943223 47828225 49847187
3130 49847187 52133363 54591579 57275262 60079754 63030446 66076181 69071884 72009248
3122 72009248 74705122 77161609 79357709 81336640 82916974 84288021 85494885 86627710
3114 86627710 87882232 89223910 90673591 92111996 93383078 94568300 95517632 96125456
3106 96125456 96340271 96088160 95383454 94299884 93028007 91425851 89684661 87998947 86236018
3097 86236018 84526443 82921113 81420142 79953346 78557182 77215573 75849065 74472713
3089 74472713 73001024 71341648 69539387 67630964 65499545 63140206 60642988 57906839
3081 57906839 55086002 52061737 49139341 46295659 43553317 41012156 38786615 36916456
3073 36916456 35377794 33990318 32857629 31854467 31010515 30206677 29591930 29141887 28769267
3064 28769267 28248750 27599440 26971054 26390897 26074163 25788890 25558258 25489755 25424705 25381864
3054 25381864 25366178 25319313 25302436 25203766 25151737 25026319 24904284 24768740 24603710 24444830
3044 24444830 24377091 24411767 24495697 24496684 24472295 24433685 24445745 24556410 24497185 23949261 22868517
3033 22868517 21730738 20762118 19976645 19227653 18662754 18213561 17786707 17422879 17129076
3024 17129076 16850387 16694271 16571773 16461869 16359413 16308861 16347182 16418787 16551741 16612168
3014 16612168 16794204 17008625 17204352 17332664 17526820 17718429 17955983 18099320 18035533 17889856
3004 17889856 17719744 17679746 17772629 17911625 18111847 18358340 18717619 19175678 19675953 20257951
2994 20257951 20948523 21706801 22536039 23490236 24491071 25516691 26571981 27683099 28864878
2985 28864878 30033695 31237054 32354064 33505135 34583541 35655091 36698632 37691498
2977 37691498 38707687 39768519 40922814 42197808 43624951 45363989 47371441 49633010
2969 49633010 52169115 55021588 58076767 61313453 64659113 67897748 70934943 73588204
2961 73588204 75682896 77036526 77553890 77086818 75628600 73281765 69987946 66109457
2953 66109457 61789400 57244597 52691549 48200233 44039558 40297003 36986512 33955622
2945 33955622 31338729 29068220 27061669 25322909 23836948 22474782 21300975 20282797
2937 20282797 19339068 18473542 17640663 16918660 16301585 15726986 15103831 14581716 14109068
2928 14109068 13650202 13225693 12777666 12279492 11839094 11462124 11108854 10815571 10499992
2919 10499992 10214685 9842898 9582770 9370299 9063281 8878277 8716555 8491788 8350801
2910 8350801 8237146 8113541 7984375 7926010 7851821 7720096 7581751 7527016 7432652 7254633
2900 7254633 7137540 7092961 7020374 6866464 6764890 6728014 6641114 6541960 6437631 6366469 6283627
2889 6283627 6251741 6212350 6179030 6110592 6055218 6098163 6105506 6032216 6054284 6018763 6005621 5953271
2877 5953271 5896731 5874540 5807929 5731785 5721295 5670678 5627452 5662492 5604786 5583049 5588748 5611478
2865 5611478 5608164 5639214 5511737 5523788 5574962 5581233 5546298 5608388 5658413 5663183 5689684 5690401
2853 5690401 5719766 5824648 5872623 5823719 5883445 5888266 5884077 5864105 5860251 5813390 5851181 5874554
2841 5874554 5859228 5848906 5858779 5845710 5862796 5969607 6041127 6112772 6198895 6251504 6349277
2830 6349277 6421577 6501964 6512714 6568066 6607722 6633383 6650953 6634709 6713652 6782504 6904270
2819 6904270 7007360 7062251 7192951 7409041 7548627 7731242 7809139 8007442 8238271 8460450
2809 8460450 8657101 8833947 9056893 9277026 9446712 9639616 9881025 10103925 10363324 10580599
2799 10580599 10799840 10996672 11192133 11344186 11653186 11960292 12192959 12496247 12830217
2790 12830217 13195441 13509433 13825831 14166267 14521055 14874913 15325051 15763254 16171606
2781 16171606 16588776 16999678 17429052 17873705 18328429 18798110 19212535 19580668 19955225
2772 19955225 20316717 20814850 21340658 21820153 22438373 23196991 23977531 24753374 25604377
2763 25604377 26515322 27404922 28218559 29105626 30013660 30967744 32017853 33117746 34355103
2754 34355103 35692181 37118356 38740656 40542394 42565337 44729141 47080941 49634042
2746 49634042 52464013 55623879 59082572 63004628 67373946 72195610 77421656 83257531
2738 83257531 89596011 96129523 102663828 108852550 113897162 116793390 117291687 116806727
2730 116806727 116910952 118497432 121922014 127001945 133834565 142277546 152369936 164226898
2722 164226898 177800686 192932382 209346691 226371901 242964559 258115888 270495044
2715 270495044 277677286 276018061 263293034 241382742 215298037 189657991 166801101
2708 166801101 147345599 130991334 117339590 105942007 96267523 88005045 80841191
2701 80841191 74636940 69311470 64681416 60694988 57204544 54043972 51259111 48700508
2693 48700508 46318813 44033232 41952002 39942637 38116440 36331039 34649893 33081609
2685 33081609 31640745 30302337 29090523 27923628 26811429 25784420 24708902 23773675
2677 23773675 22795714 21891022 21091900 20222267 19463444 18712223 17945933 17346171 16877495
2668 16877495 16468276 16027812 15756777 15442702 15219666 14970341 14793108 14642247 14384687
2659 14384687 14100462 13940306 13763112 13531792 13307926 13157124 13052360 12936244 12813316
2650 12813316 12744250 12675785 12593793 12535839 12502672 12364715 12215869 11999067 11600403 11214965
2640 11214965 10779615 10356441 9965799 9616512 9214409 8917197 8628515 8350438 8075895
2631 8075895 7728063 7471528 7291424 7138597 7023600 6900539 6765695 6712978 6614672 6485911
2621 6485911 6405266 6330558 6252890 6152500 6091714 5942217 5867942 5818447 5661568 5608512 5582190
2610 5582190 5462207 5304057 5151628 5059421 4953218 4849099 4752341 4628879 4524832 4442569
2600 4442569 4347356 4284164 4233081 4204249 4169902 4138479 4111843 4105514 4080579 4056947 4008105 3936446
2588 3936446 3835867 3794764 3782901 3728276 3606933 3568388 3504981 3466600 3440637 3396891 3342010
2577 3342010 3379783 3422262 3426110 3454825 3411015 3413438 3425926 3406600 3449565 3462054 3459499 3458382
2565 3458382 3381419 3341063 3217935 3191353 3134516 3044500 2952139 2936374 2902673 2810004 2793289
2554 2793289 2676705 2618429 2548496 2469713 2399944 2322892 2306974 2255568 2222250 2192281 2170023
2543 2170023 2158428 2112417 2117048 2170079 2121301 2095025 2083929 2049261 2055473 2078868 1946547 1934129
2531 1934129 1959447 1887395 1831167 1830511 1846668 1815354 1785161 1771772 1731821 1694361 1696808 1701913
2519 1701913 1694208 1699366 1687675 1674739 1648972 1679838 1674866 1631190 1616512 1577764 1581245 1618593
2507 1618593 1607521 1595257 1572325 1530090 1523483 1557696 1559509 1585330 1591569 1562267 1554318 1562412
2495 1562412 1616909 1618605 1570081 1606031 1656726 1629595 1658133 1650260 1605388 1596093 1614765 1562437
2483 1562437 1537334 1587350 1645671 1628358 1675824 1685681 1686280 1630617 1649188 1674812 1703209 1677650
2471 1677650 1622923 1642395 1695110 1763607 1823727 1885205 1912267 1962955 1997033 2081372 2186543
2460 2186543 2176658 2099662 2067281 1977592 2000637 1862889 1676692 1596595 1525677 1411215 1349567
2449 1349567 1292694 1259585 1166931 1148733 1085554 1017769 986807 981648 1000803 988984 952796 941916
2437 941916 952636 875030 859967 875517 810023 791674 803187 724050 648964 633188 613707 593201
2425 593201 623380 598558 592498 572217 599331 633200 627390 622280 583515 626381 635532 543952
2413 543952 529838 568805 609762 581829 594804 497631 549891 582664 573089 534005 522578 537301
2401 537301 554780 581848 561188 534913 551676 535599 543421 515440 497900 469536 409322 391741
2389 391741 462207 453928 430971 444302 476492 418187 473097 466440 427563 444694 446131 475174
2377 475174 414282 435305 394876 437706 478438 481348 419939 438806 422965 463975 477666 487567
2365 487567 419157 458158 385770 344321 342066 334253 293529 291699 361730 327213 341237 335787
2353 335787 369175 391318 339889 325284 335725 288151 291620 299887 359865 339960 320093 334459
2341 334459 307618 239941 277339 281492 263746 277955 286355 278171 268909 329968 329477 332923 302651
2328 302651 243982 221937 201197 208934 258250 271512 228390 295297 278796 259922 236438 280413
2316 280413 320214 313723 321388 277533 276908 262106 282324 241441 228274 261752 256552 263835 269412
2303 269412 269921 280004 319546 336262 310648 350467 383590 362093 378267 295456 222684 238040
2291 238040 284094 245751 213208 256722 248769 280091 214236 184114 149813 177369 175291 151058
2279 151058 139302 95996 130967 160620 153814 195373 146785 158897 172496 202397 215015 233531
2267 233531 222875 212899 174311 204451 225724 216247 201818 233111 222588 168675 151567 191137
2255 191137 221280 219467 224615 204557 180690 186814 170190 177869 218098 196035 247252 251009 267923
2242 267923 191637 161866 164966 203330 213690 221129 219657 204990 214692 255355 282636 303461
2230 303461 253056 224232 194978 216802 245899 215778 164751 236453 243015 208752 203691 213577
2218 213577 218719 169475 167469 174734 162292 162530 158374 185165 159121 147373 126567 130184 205147
2205 205147 183054 199213 156521 208741 191177 220760 206734 218582 240477 211378 265434 256272
2193 256272 279280 251596 272509 338834 296116 238428 258970 242776 269820 283068 254454 287889
2181 287889 259970 255480 238614 257367 271372 201934 227621 225802 288140 272676 285371 300329
2169 300329 286371 316822 305732 274641 316592 274583 240339 251024 304100 316619 322840 288270
2157 288270 258569 286611 290894 299039 316688 374109 393403 370885 342379 384211 372204 349526
2145 349526 366686 436558 421292 407079 446886 478971 513062 482369 480569 503626 504203 509078
2133 509078 503145 580422 628052 527553 498917 498094 545866 562302 559371 583583 625628 655366
2121 655366 750817 738091 754809 777339 780509 842704 883087 881841 911311 882915 861264 943013
2109 943013 958650 1050620 1134563 1192719 1241445 1258993 1202016 1215896 1262853 1307097 1332280 1360234
2097 1360234 1308662 1315456 1367476 1470703 1434633 1500930 1629777 1781890 1833114 1888512 1949240
2086 1949240 2095531 2208169 2344492 2441143 2579767 2723852 2952233 3156990 3402478 3698323
2076 3698323 4012916 4297537 4653029 5131396 5549182 6042518 6692384 7192463 7827629 8576747
2066 8576747 9647904 10868951 12465944 14268046 16701348 19689365 23063829 26036692
2058 26036692 29630507 30979816 26337645 20345665 15278213 12216939 9997621 8450723
2050 8450723 7202525 6301074 5687087 5217155 4772938 4421996 4234215 3995511 3651578
2041 3651578 3359963 3091842 2921890 2765706 2638826 2522415 2442898 2326124 2124451 2061683
2031 2061683 1923887 1804180 1726413 1624502 1522254 1491720 1449961 1418409 1332644 1254951 1194619
2020 1194619 1204788 1158172 1053862 1036121 971620 869954 812388 761034 803020 715156 728452
2009 728452 708159 733792 777825 756432 719964 737249 760571 727008 643530 621027 573956 565208
1997 565208 563894 493913 522149 544421 544730 527670 523166 546598 474913 464893 474299 404817 379251
1984 379251 386603 374942 388372 371316 429222 382492 346811 339697 339548 372300 293692 230908
1972 230908 191297 189944 237886 248672 247201 259587 270488 298828 268814 249682 228118 222645
1960 222645 186218 203642 217260 248627 235987 221217 246511 249970 296568 274679 271033 288927
1948 288927 202271 180530 149809 191330 223891 199523 139441 177183 165304 143211 178502 159404
1936 159404 159810 165732 162281 183253 213338 180231 106064 98188 103349 97184 153303 143819 114856
1923 114856 141670 70823 128758 182432 92121 122117 145462 136107 167200 147249 129829 191044
1911 191044 135250 186628 202620 130658 132725 135428 140959 226308 188766 99470 116847 172086
1899 172086 136939 99653 115162 146833 104502 189495 130813 108825 57067 6195 87134 126982
1887 126982 123031 80557 46968 29205 63655 42064 49522 82365 77661 72172 86669 83879 150427
1874 150427 87392 32204 52201 80392 117424 101549 88896 138508 158386 72432 112605 137192
1862 137192 74779 106820 120426 106900 76310 74180 74690 31453 4068 24330 90326 129479
1850 129479 119037 95374 107703 103862 99399 92388 47397 58826 28988 81627 71721 103885
1838 103885 79475 34827 20979 80233 110629 69875 107129 83467 74629 70111 88138 59521
1826 59521 39931 107297 113489 95324 136000 94641 61434 74085 99346 129528 143937 115322
1814 115322 162864 221932 196076 143001 114471 108578 79262 63139 95019 62280 24490 67629
1802 67629 43241 28395 51871 58188 52990 81528 55971 -16042 26785 55038 36877 75601
1790 75601 54506 39138 57357 53247 53890 78096 20447 57505 97184 93444 30967 13594 25924
1777 25924 -21286 12368 26029 19378 78205 53926 52560 74820 64346 42531 10600 40810
1765 40810 7590 -32930 -88492 -98671 -12592 15227 -11324 11853 18726 56578 29800 31451
1753 31451 40552 34016 58874 61693 18466 53420 58299 36781 32058 78783 81535 59083 5974
1740 5974 7796 42091 72805 38075 10064 1815 17483 62935 33004 59140 11410 27725
1728 27725 24691 2288 -18448 27601 18128 3432 19951 41536 77524 51314 68649 43544
1716 43544 14945 30529 78306 56349 12778 -14577 20625 65953 74266 12264 -11253 31990
1704 31990 23886 79806 84316 26468 -6970 63679 9252 11253 48837 7155 -15001 -53763
1692 -53763 -31613 7384 25884 -36108 -30968 -14275 -53874 -68720 -46664 12328 46127 53451
1680 53451 17731 -72522 -59322 11809 37666 24766 -10009 981 -20734 -23237 -9196 9709
1668 9709 42269 57783 4386 12117 -5981 29198 58496 3991 7270 41120 29166 -21429
1656 -21429 -31347 -70206 -15875 28544 28633 34679 47923 45327 -4424 45516 13640 -17109 1986
1643 1986 -24893 62967 7202 -18233 -31148 -53179 -25012 18887 23842 69774 21921 -10269
1631 -10269 14837 27560 3083 13394 16853 -23186 -40755 -67955 -25147 -24249 14309 45933
1619 45933 52819 935 -3887 9631 13249 -1676 35132 20350 39765 54213 39250 18658
1607 18658 -1343 31926 51557 88154 48113 -13845 52360 34679 -12741 10395 -25497 2255
1595 2255 16657 50625 32501 10725 9459 -2341 20613 38907 42142 40541 40146 54992 -14718
1582 -14718 -27915 -27103 28537 6819 -57282 -21863 -67902 -30385 39434 -5367 -54400 -104
1570 -104 3970 -2384 -16640 41795 36539 40886 2020 -47571 13620 27164 -15757 -35681 -38019
1557 -38019 -19972 -6533 19332 5917 7378 -10594 -2946 4369 -47530 46754 37955 45202 211
1544 211 -22383 -32320 -40705 -5995 -5035 33627 35429 9281 -15933 -12029 -1374 62673 14632
1531 14632 -8521 -6200 -34849 -80830 -56447 -60458 -12267 24106 -30210 -42610 -66728 -44824
1519 -44824 -61750 -2040 60381 79269 23066 -25817 -58921 -83180 -58963 -29152 -70238 -57783
1507 -57783 -61439 -56117 20038 66961 11173 4822 3777 11363 57578 -18205 -26816 -56204 -43750
1494 -43750 -42387 -57325 -50370 -41296 -31625 -36272 -65700 -50008 -20265 -59834 -71109 -23034 -12503
1481 -12503 -25969 -38482 14020 32905 32504 -4124 5958 29990 32924 44430 -5839 -1529 -11852
1468 -11852 31389 58434 62958 49471 14717 40995 60173 76205 19029 -45949 -33951 -49773
1456 -49773 -65358 -58557 -55305 6026 38776 -23946 -2084 -3623 30385 23305 7464 -14632 1614
1443 1614 32420 26674 53976 67831 -5316 -41612 21611 -2652 -40423 -33326 75515 43857
1431 43857 -19930 11298 -24759 -23631 -27402 -43836 -37106 -1180 1263 7278 -41227 14978 36454
1418 36454 26797 17677 -18310 -72992 -85566 -32704 -23179 -44115 -67982 -43883 -12954 -59210
1406 -59210 -57899 -1984 40898 77339 25770 -29423 -73241 -7778 -24127 -57409 36138 41117
1394 41117 28907 75561 8826 -24874 -56594 -33470 -18966 -23895 -31765 -18815 -1575 38058
1382 38058 32040 -10866 -6077 13778 27047 -3866 -39395 -18579 32091 10435 18325 1530
1370 1530 12596 -11217 2940 15834 -48339 -34726 -43536 -45426 27232 7226 -53734 8748
1358 8748 -15453 -16089 20625 15496 25906 35026 -21052 -8657 -13894 -5060 -37938 -9510 11405
1345 11405 -12661 -24012 -15651 29940 -8123 -67386 -39825 -7488 -51080 -3612 -25472 -10576
1333 -10576 18525 954 23491 -6583 -24738 20395 58800 61106 -12850 -15887 -13661 -17075 -16207
1320 -16207 521 -47273 -34247 162 9842 -28199 -89094 -53970 -24809 -32385 -120425 -88984
1308 -88984 -3639 -81675 -48595 -276 -36876 -32400 -19017 -29480 -20846 -15558 -48380 -32761
1296 -32761 22374 -15536 -55094 -44785 -59794 -55026 -16531 -72386 -15723 1111 -22363 -2297
1284 -2297 -65964 -59681 -73249 -41488 -53202 -50399 -10636 21818 -40755 -7236 -31218 5850
1272 5850 -3529 -31897 -32427 -51643 65116 43420 37302 -9870 -27560 -8233 -4972 18374 8566
1259 8566 -4245 -45466 -84218 -92149 -71366 -111766 -75234 -9891 41435 -19192 -76218 -34410
1247 -34410 -31768 -24972 -18283 -27028 -53305 16211 -11345 -37402 20383 2457 -4522 7706 -5387
1234 -5387 39688 7043 -37255 6211 19027 7565 -26581 -26044 -43011 -86069 -36463 -29734 -31466
1221 -31466 -18206 47738 60691 47376 39330 50330 10331 -38448 -69210 -45440 -19877 -26206
1209 -26206 -37459 -36491 10432 20803 -35206 -67114 -59371 -45398 -17874 11313 -40966 -6250
1197 -6250 181 -2336 -28048 -46854 -23862 -36496 -61334 -39775 -67716 -47101 -40457 -83454 11706
1184 11706 -14220 -5816 -51444 27968 86978 40759 -35396 -47410 -34661 -22181 9096 -31539
1172 -31539 -1749 17646 28374 30174 -15036 1868 -10515 -23782 -40762 -25813 4721 -7773
1160 -7773 -52394 678 13518 20648 -45813 -29228 -1472 -9833 37134 48907 19411 -13228
1148 -13228 -11128 -56937 -62310 -18073 -15392 -21631 40443 25430 15889 58414 27912 33416 14545
1135 14545 -4100 -32209 -25181 -67340 -104638 -77716 5051 15537 12503 -23978 4073 27268
1123 27268 30699 6054 -28561 -37438 -36635 -35709 -19402 10884 -30616 -81936 -62625 -88664 -84945
1110 -84945 -85131 -70688 -1517 -28499 -78961 -392 1642 -47250 21009 -17970 -3192 39142
1098 39142 36195 -45411 -20781 -47156 -46046 -62142 -5075 -34472 17601 -34788 -6490 -4286
1086 -4286 7692 3368 -39299 -31713 -4962 35058 880 -33239 -32053 -59213 -15988 6955 -23554
1073 -23554 -13885 -19060 -45189 -41424 -25945 -26188 -83324 -67851 4851 -21531 -35172 -59136 -42046
1060 -42046 8158 -31276 -59213 -14675 -36535 8388 26821 -29094 34293 5992 -4515 -691
1048 -691 -21357 1644 16506 22390 -28566 -40677 30543 18466 -69264 -30601 -18643 16209
1036 16209 1976 -36808 -29661 -79082 -96114 -113522 -101540 -65418 -27261 -29107 -19486 9480
1024 9480 -37761 45857 18242 -20483 -11622 -36009 -52417 -4427 21795 15539 24350 -15773 -17332
1011 -17332 6739 11449 17561 12905 4337 -45510 -104591 -77831 -2427 -6126 29922 23554 12713
998 12713 43399 92085 26724 -7853 -12351 69752 -37813 -23338 -5874 32320 -3460 -45382
986 -45382 -8916 -18331 -36055 -29737 -24632 -53682 -17816 -7871 -850 -44892 -34091 -31584 -9912
973 -9912 -4197 -30910 -22750 1014 -12143 -13861 -16866 3958 -52058 -41287 -41131 6483 42378
960 42378 14975 -13869 -56719 5853 11295 82416 43750 -59109 -30613 -20223 7946 70402
948 70402 27558 -22608 -27402 -55402 -26548 -14241 -8931 -16057 -4048 -36476 -54068 -62433 30601
935 30601 25789 47207 34548 10754 33168 59874 44343 -12695 -49920 24316 43367 -17576
923 -17576 -32990 -52809 -64786 9495 -7422 -34318 2841 10175 412 -38853 -41991 20509 -16352
910 -16352 22144 23529 -36260 -13487 -19881 -34471 -2916 14548 -33320 -25561 -18729 -19547 15131
897 15131 2649 -14725 38249 47532 29808 -41642 -37780 1990 641 -47182 16828 43408 58484
884 58484 39586 -30637 -38235 10251 -34979 -50049 244 -5949 -22331 -65 22333 -62595
872 -62595 16314 11678 9031 37973 -16013 -38791 56523 65644 -28222 -28610 -10898 10968 31773
859 31773 12958 10239 14371 -19382 -8484 7233 50592 51923 61897 30533 -6557 -38988 -85006
846 -85006 -57047 -10656 -76898 -92569 -53468 -17478 -8036 -47410 2428 41220 7549 1608
834 1608 -28148 1591 -78315 -45507 -7698 -25809 -33960 -10488 61187 54740 36989 -7064 24132
821 24132 24030 45954 59644 22563 -35091 -10723 34533 11879 -25298 -77075 -61827 -40920
809 -40920 46074 83862 22917 34311 9536 -19188 -69497 -56340 -119520 -57119 -57508 -87813
797 -87813 -36998 13990 -13590 -39918 -11219 35871 60767 374 -34215 10035 19973 -25248
785 -25248 -33157 -10828 -8718 -40381 -28981 26849 70788 3327 -19309 3621 41949 -18214
773 -18214 -9848 16566 44983 8684 -52760 11056 -33467 -51034 -31605 -53693 -2905 -33887
761 -33887 -26178 -26489 1508 -2758 7797 46356 50244 39567 39891 25676 -7941 8505 15623 -10530
747 -10530 31400 17137 50787 29838 19761 62533 14965 25618 54735 1868 -37463 -34183
735 -34183 8683 3879 33218 32323 -2092 -19447 -33248 -23306 -36751 -49000 -3398 -23004 20785
722 20785 21251 39935 47555 -106 31777 23472 91507 25399 -8904 24862 36809 9312 28704
709 28704 10866 21438 -3088 -16812 -18137 -643 -34976 -86904 -40382 1284 -97774 -42327
697 -42327 -24920 -18253 -77654 -2790 -16585 1149 68647 12607 11437 66238 38441 -23456
685 -23456 19196 96594 35459 -36970 -2946 -46045 -58527 -52683 -9040 22763 46433 5422
673 5422 30098 42750 27764 -35363 -14239 -31960 -75 16644 2862 33192 -15775 -41239
661 -41239 -37166 -22936 -40512 -34452 52359 7281 -17759 21027 10329 -10973 51025 19737
649 19737 23118 33768 7606 25110 -10740 -7611 37484 18584 15680 -7954 -24654 12981 -4793
636 -4793 -3890 12328 44346 33854 36147 23081 26731 20049 20784 8062 27566 38363 -4233 19078
622 19078 40071 54313 59388 32535 66368 28724 -25987 9771 38096 8676 33625 -39107
610 -39107 -49887 -36222 -25232 -21612 -11665 32650 26802 -15429 -18967 -58231 -54334 18291 -46632
597 -46632 -87587 23566 128224 34235 -15941 -2393 -10539 -3373 22114 26449 24361 -22026
585 -22026 27384 41223 33430 23651 -24334 -27162 -39593 -82038 -56662 -17108 9440 -13975 -15532
572 -15532 -9184 25824 9666 -5299 29934 29495 -19237 32359 101289 73257 -24572 18727 47456
559 47456 -41140 -31226 -11623 -10599 -4976 -44051 -68481 -86254 -98048 -20494 32428 42160 -7953
546 -7953 302 -38668 -5120 2212 -51740 -7987 -6490 7174 34866 111495 40347 -50753 34374
533 34374 63449 42406 50914 36026 -9292 12292 20782 -34957 -62688 29556 57065 51938 56135
520 56135 29534 35185 50987 21106 668 -11008 -37617 -82911 -13 50944 -49577 -19847
508 -19847 -8451 18144 29741 19460 17666 -5844 -28648 -25268 29383 25432 12646 35114 4817
495 4817 15871 13365 8008 50789 59135 -1435 -11975 9291 -47645 -100362 -56674 -142 -9206
482 -9206 -25266 -25748 33575 -7695 -36127 -23606 -9161 35580 -5827 -38430 -34301 6457 -3307
469 -3307 36509 38726 16220 3593 -28003 50358 44826 31361 7864 96825 80868 86224 15471
456 15471 -16740 41412 55796 52098 -27011 -34850 -53126 -36656 -35917 -33127 -27391 48414 57226
443 57226 -3826 4925 39773 8971 -30479 -64565 -30521 5950 -23766 -9157 -10282 12613
431 12613 -25848 6579 -57989 -39435 57424 40159 -6559 8160 6687 18956 3920 40731
419 40731 34574 19902 64081 66686 15377 5436 35211 -35421 -34329 3047 60276 46750 30982
406 30982 50119 39488 20480 42277 15070 47701 16180 19491 29942 -28254 -6457 32613
394 32613 14405 -11208 -32926 -12096 -45531 -6877 2289 -19718 30676 -4723 14360 46211
382 46211 28757 -12491 14417 86407 63266 30253 23803 11482 4847 39131 31290 29 25700
369 25700 -2130 -22514 11808 -4097 -9058 -11829 31254 68890 60014 23874 2574 24571 42533
356 42533 24768 28889 2844 25238 86772 44094 86956 94851 17518 19554 3870 30160 51932
343 51932 3142 -21455 -18657 37989 8002 -6141 -4080 19765 75394 62150 22296 10869
331 10869 -2047 26351 1225 -35205 -41034 -61645 -68750 -27681 3915 -3476 21755 45096 34271
318 34271 37252 56812 -7492 30071 7151 7129 -4402 2083 63331 69012 63510 72564 33563 16248
304 16248 23125 36911 24307 11949 35571 30505 316 2313 7033 -9451 -28390 11042 36547
291 36547 14309 80248 68614 44479 78838 92982 54813 -12064 49601 59640 74000 66973
279 66973 26405 28779 3870 -17885 -14891 31212 21233 11395 39348 20108 -11254 35577 -1536
266 -1536 -63007 17025 17962 15692 43127 24844 37230 99368 105583 56110 43830 57395 28682
253 28682 -20460 20908 -7251 -20959 25219 44168 8598 -7626 -24769 27961 87206 62829
241 62829 -665 20807 8760 32137 12047 833 39528 31207 -4257 34518 24453 37789
229 37789 26156 35205 82990 25941 -2920 50896 26914 86856 87823 88491 25383 -40817 -45684
216 -45684 -19797 -13332 19428 20583 -7612 5254 2034 -11274 -36926 -24184 -25119 32923 12129
203 12129 14661 30965 -16590 -53223 -16937 45125 72069 47254 4002 29820 36320 25752
191 25752 17753 13721 14327 13786 -18769 -21338 20426 48043 63698 19406 -19899 -61847 -3917
178 -3917 13406 14030 55780 50915 47444 52785 46183 31864 27517 15527 -18 68006 19393 5958
164 5958 46884 68821 82891 75503 8430 -25550 -17353 32394 41969 50961 21569 49729 53342
151 53342 37455 54944 30736 10463 39408 36387 14259 34588 53880 36305 -2490 -71004
139 -71004 -13406 -12766 -12397 -12209 -14791 -33787 23454 13191 20345 52067 51400 58816 16265 -4787
125 -4787 14284 4694 11907 -1419 29490 61870 63917 74002 31809 71928 18305 2470 48568
112 48568 6258 5784 26620 21004 23703 7532 229 26392 64909 22870 41702 29170 45658
99 45658 68108 70830 51884 22424 68674 96348 102354 34119 27428 72649 54408 86381 60817
86 60817 69600 9298 432 14774 -3079 57636 65374 20897 19018 55164 70571 72523 65912
73 65912 76933 68737 31105 7008 -6756 25567 -52935 -21739 -26764 -22333 10277 17786 6989
60 6989 28257 18712 -8326 14344 38940 31940 41819 14440 -7495 16513 17184 57066 46647
47 46647 31758 44810 44379 19444 -7996 -1384 27342 22736 18340 24734 18710 26301 -10082 -1889
33 -1889 -21698 22845 4891 -16029 -27248 -16139 5499 12492 10248 7295 -6264 24775 31730
20 31730 32143 38700 47964 15264 35107 95358 76556 56844 52128 16398 -2082 46409 55954
7 55954 29887 58979 98590 62336 18293 9366 34339
0 34339
$$ Imaginary data points
##PAGE= N=2
##DATA TABLE= (X++(I..I)), XYDATA
16383 -1627430 -1604386 -1571263 -1558541 -1536972 -1548323 -1515851 -1460230 -1459664 -1423399 -1406081 -1391732 -1359418
16371 -1359418 -1345924 -1313632 -1285237 -1221716 -1204226 -1178605 -1138839 -1167243 -1192308 -1128709 -1081239
16360 -1081239 -1065514 -1023089 -1038616 -1010097 -995094 -991821 -972639 -941328 -944788 -938028 -943568 -884257
16348 -884257 -808645 -797202 -823192 -778512 -762090 -732292 -721803 -691060 -662275 -665128 -671251 -603438
16336 -603438 -542495 -545239 -505379 -488914 -468655 -430951 -448240 -467042 -433749 -438681 -446789 -338120
16324 -338120 -304427 -306545 -280438 -270542 -215755 -227577 -274102 -239969 -216101 -169463 -154656 -91344
16312 -91344 -118830 -74324 -47811 -51527 -38268 14356 28270 58919 95084 22718 42718 91472
16300 91472 110981 155938 139422 166534 160892 236363 233287 196642 224985 199907 241716 323941
16288 323941 305972 343250 381472 318157 375256 395172 400556 392505 380153 373816 391209 429564
16276 429564 505725 525338 526316 521991 549932 572929 595750 597473 625885 613572 596957 595550
16264 595550 645102 660203 681739 723822 737882 792647 784050 848623 872163 808598 810648 803604
16252 803604 828458 838015 834560 874071 900986 897713 913941 953775 978506 1028905 1015891 996760
16240 996760 993745 970711 948701 1009530 991697 1041312 1030738 1045918 1139098 1121465 1082576 1105302
16228 1105302 1099431 1089551 1112082 1100827 1118426 1139783 1209622 1205005 1190794 1196001 1245847 1225828
16216 1225828 1203076 1260920 1298639 1279059 1300091 1300168 1356949 1310170 1299908 1275061 1303252 1306566
16204 1306566 1279765 1278161 1281963 1304094 1353642 1424931 1389829 1395822 1360923 1365832 1367069 1394521
16192 1394521 1410404 1427757 1424578 1431857 1495621 1544547 1586791 1546421 1531156 1477978 1447187 1502619
16180 1502619 1573602 1541503 1492885 1484609 1519348 1514567 1493535 1478521 1520653 1548209 1553292 1568943
16168 1568943 1553971 1571691 1604918 1593084 1588007 1609472 1605100 1628816 1587124 1593182 1584796 1643200
16156 1643200 1624087 1604512 1626394 1657369 1661964 1615072 1659502 1675392 1674725 1682900 1620236 1650890
16144 1650890 1654773 1645648 1691006 1730069 1720068 1711588 1718521 1766110 1773762 1731945 1748876 1744609
16132 1744609 1774858 1777524 1756522 1809519 1799415 1766571 1774835 1812686 1778493 1771262 1768608 1755824
16120 1755824 1762888 1794444 1837526 1779507 1775855 1780727 1796264 1756795 1757646 1761994 1772282 1778375 1773704
16107 1773704 1787556 1753330 1763624 1764692 1774363 1776370 1784924 1762054 1709604 1751573 1774294 1833707
16095 1833707 1840406 1776833 1769439 1763108 1814156 1848432 1848617 1823122 1821764 1792072 1819518 1834697
16083 1834697 1838666 1849656 1842833 1836056 1821560 1783522 1814631 1817221 1791492 1829145 1835009 1800467
16071 1800467 1811688 1840121 1800378 1782860 1831069 1816113 1797949 1855213 1852763 1848686 1812955 1828911
16059 1828911 1808421 1815425 1800969 1817327 1834432 1797286 1745500 1860709 1875649 1828171 1801903
16048 1801903 1792267 1794250 1812206 1838461 1848585 1875666 1892211 1875841 1830493 1883919 1877244 1892052
16036 1892052 1854489 1837653 1906783 1925051 1868539 1909744 1874660 1798910 1849711 1835226 1837383
16025 1837383 1843554 1850848 1820746 1815637 1852556 1848155 1808331 1833241 1901571 1901784 1886036 1865000
16013 1865000 1818972 1829504 1897347 1889181 1825176 1848620 1849721 1797915 1860831 1876534 1834149 1869425
16001 1869425 1879056 1865792 1850151 1849937 1855009 1851781 1842695 1843712 1903732 1872464 1799982 1796168 1884386
15988 1884386 1908535 1869444 1850006 1877841 1881537 1814525 1847004 1886892 1880237 1909984 1945121 1937032
15976 1937032 1876290 1895811 1930866 1903044 1860312 1870960 1859325 1918564 1895124 1920316 1918769
15965 1918769 1866539 1846302 1856143 1869841 1877997 1905098 1907641 1870978 1884877 1927729 1903191 1901923
15953 1901923 1901855 1882822 1873901 1871907 1857308 1873557 1888607 1907126 1911657 1889299 1859933 1896478
15941 1896478 1893717 1923952 1919408 1870826 1865206 1899831 1892151 1905170 1907571 1865942 1829355 1888098
15929 1888098 1920849 1879991 1844771 1914019 1931341 1888546 1896117 1885413 1873300 1875878 1904571 1888701
15917 1888701 1871319 1854747 1863937 1888390 1893264 1885009 1871381 1941437 1898037 1878393 1895917 1940599
15905 1940599 1950495 1910722 1895771 1880283 1844576 1827774 1872680 1879890 1895230 1894838 1898622 1929666
15893 1929666 1936972 1891301 1919153 1895149 1896876 1927382 1904097 1975623 1993466 1898274 1894774 1956251
15881 1956251 1960366 1933555 1953066 1949039 1964423 1968831 1957846 1923498 1934379 1951145 1894542 1869009
15869 1869009 1938073 1922358 1878579 1888577 1839613 1850041 1886473 1878782 1926881 1929794 1893344 1925685
15857 1925685 1924069 1913412 1880337 1840939 1863967 1889471 1912328 1867043 1886452 1876775 1926233 1907682
15845 1907682 1874590 1913142 1935060 1950754 1934831 1919144 1890831 1854926 1856061 1895967 1901682 1868697
15833 1868697 1856446 1931618 1905086 1918325 1885793 1861487 1862042 1877542 1946060 1940934 1905734 1880812
15821 1880812 1875195 1923048 1919779 1942782 1925278 1923756 1935011 1914593 1883304 1873029 1928011 1908572
15809 1908572 1903991 1873028 1885123 1890833 1838597 1891864 1852250 1860721 1878022 1863642 1848509 1883897
15797 1883897 1934213 1921075 1930756 1891450 1907304 1944430 1888266 1922120 1966207 1908777 1926360
15786 1926360 1962752 1938152 1917929 1907007 1841597 1869470 1897310 1894980 1900558 1920625 1963003 1958369
15774 1958369 1956283 1970527 1923529 1960215 2018471 1994376 1966348 1932312 1917458 1919702 1876821 1872205
15762 1872205 1899470 1852659 1851183 1845342 1858036 1867386 1899113 1920521 1910752 1869336 1868545 1897222
15750 1897222 1926025 1927906 1903088 1931136 1993016 1958915 1951061 1921143 1953846 1982059 1921278 1963114
15738 1963114 1960815 1904171 1892608 1943923 1924201 1982869 1962979 1944309 1922382 1885685 1882472 1900060
15726 1900060 1930587 1941965 1979464 1970849 1915038 1927493 1922630 1916327 1934093 1909568 1925680 1971955
15714 1971955 1948588 1928882 1870522 1877033 1935185 1892933 1890101 1912169 1934200 1966170 1889701 1870494
15702 1870494 1925008 1905112 1937310 1932503 1907493 1907395 1934915 1931529 1867162 1895257 1885580 1940738
15690 1940738 1951044 1931002 1909445 1893644 1938284 1897357 1913508 1902731 1924356 1944942 1973442
15679 1973442 1950467 1903183 1901805 1905187 1953025 1943247 1921157 1869971 1923623 1932949 1956345 1976069
15667 1976069 1907459 1949097 2000950 1917048 1909678 1934024 1930020 1965579 1938596 1925127 1911750 1916837
15655 1916837 1856927 1887342 1956378 1935086 1956137 1949852 1938665 1940901 1979166 1981133 1936230 1981320
15643 1981320 1956242 1924959 1907684 1948565 1962334 1989372 1984145 1956490 1896217 1953364 2014315
15632 2014315 1992596 1994446 1945735 1946549 1926935 1865169 1958348 1949090 1947673 1931869 1938755 1952794
15620 1952794 1942377 1949071 2010214 2027339 1960427 1965633 1993035 1977133 1967950 1964745 1957445 2040594
15608 2040594 1933373 1952155 2032184 2004049 1974599 2020255 1982986 1962302 1952120 1927100 1904740
15597 1904740 1951380 1916644 1918062 1960521 2018329 2004569 1959643 1918703 1899220 1914964 1968599
15586 1968599 1993944 1992927 2038445 1953182 1959423 1988051 1921221 1875496 1926794 1962297 1888897 1905384
15574 1905384 1962400 1940402 1981000 1965824 1988806 1958807 1948828 1997514 2054276 2011679 1970621
15563 1970621 1981851 1988105 1964740 1983063 1999708 2013403 2025532 2028701 1976559 1945489 1923552 1863668
15551 1863668 1842476 1878291 1908335 1956954 1880013 1912023 1977253 1991310 1992209 1996212 1972564 1893539
15539 1893539 1899994 1880012 1905906 1919409 1976612 2009892 1973850 2010635 2000808 1937031 1951483 1910364
15527 1910364 1922986 1902386 1934624 1913191 1977136 1984275 1950547 1983566 1980053 1968935 1963300 1948631
15515 1948631 1915657 1934997 1998753 1957407 1953107 1919048 1910271 1957553 1938202 1897321 1922890 1939802
15503 1939802 1987384 1987360 1991661 1949444 1916984 1908683 1945754 1956846 1994220 1958434 1906136 2005257
15491 2005257 1989444 1978442 1982484 2005255 1981174 2050317 1988846 2016367 2047282 2009475 1981919
15480 1981919 1962714 1930942 1941622 1973622 1929611 1961302 2014883 2062723 2016381 1977499 1954581
15469 1954581 1995938 2087760 2059066 1989473 1979218 2027847 1967917 1982462 1942244 1958393 1943775
15458 1943775 1939337 1967704 2015159 2012715 2038167 2017873 2011860 2009600 1896786 2002417 2012128 1993252
15446 1993252 1959411 1970381 1985689 2035606 2013865 2002314 1961509 1928292 1973532 1981665 2038130
15435 2038130 1984174 1926788 2019401 2023424 2001711 2007439 1963777 1948389 1983020 2004043 1926846 1948182
15423 1948182 1972187 1938997 2008274 1996305 1989466 1967838 1984598 1957232 1986881 1985652 1988755 1969585
15411 1969585 1975316 2014188 2028735 2026870 2029624 1995941 1980098 2017201 2057338 2060449 1987078 1971171
15399 1971171 1962731 1975576 1950109 2005657 2025290 1988209 2009059 2066055 2019345 2028091 2060239 2051561
15387 2051561 2034478 2062311 2010307 2078705 2006842 1986745 2007552 1978362 1957087 2007005 1998418
15376 1998418 2043825 2038007 1990363 1962176 2003161 2022390 1998121 2002465 1945813 1951766 1980937 2043223
15364 2043223 2043570 2036173 2064001 2064811 2010722 1988796 2017625 2007456 1981829 2038779 2011637 2005365
15352 2005365 1962198 1963597 1976438 1994916 1997308 2053273 2033412 2001684 2007582 1966792 1979279 1997220
15340 1997220 2013901 1980044 1964203 1964841 1927188 1966458 1981395 1978965 2039112 2045374 1997522 1993083
15328 1993083 1924636 1948196 1919712 1933019 1964971 1927643 2002548 2010709 1951777 1938994 1980822
15317 1980822 1970876 1984148 1997930 1998099 1974867 2000381 1952400 1994456 2047533 2037842 1967473 1935203
15305 1935203 1970025 1951108 2010151 2034232 2038837 2053952 2044862 2022810 2027318 2052413 2038571 1978008
15293 1978008 1964303 1977530 2046566 2032492 2003109 1974939 2000350 2022942 2022838 2016848 1991788 1987331
15281 1987331 2045768 2102821 2050520 2047257 2059574 1989026 1988742 2017834 2061404 1999029 2012314 2034372
15269 2034372 2012670 2031913 2064549 2004451 1979044 2022205 2021828 2041085 2058437 2043646 2068348 2060564
15257 2060564 2031302 2007541 1988480 2042840 2025116 2048459 2014019 1956560 1983585 1981703 2009330
15246 2009330 2010678 1989537 2018568 2063131 2105722 2060679 2003660 2025706 1996586 2005078 2037454 2041647
15234 2041647 1982612 2010160 2064920 2021459 2016208 1980648 2029434 2011347 2013742 2069037 2011819 2010598
15222 2010598 2037858 1993120 2035986 2022340 2011346 2030367 2046361 2042768 2023177 1942255 1939260 1988064
15210 1988064 2038203 2058103 2030644 1977165 1991456 2020237 1988770 2037712 2069368 2069122 2041528 2021812
15198 2021812 2079811 2099981 2067413 2028718 2059670 2080561 2045432 2081510 2116079 2080333 2081107 2056764
15186 2056764 2024258 2036631 2050868 2051930 2003757 2025739 2027966 2047732 2069348 2076504 2119600 2058824
15174 2058824 2101926 2168273 2106659 2055277 2019871 2002572 2073400 2035122 2040927 2066002 2051807
15163 2051807 2037680 2053762 2078365 2076770 2101421 2083635 2019160 2083844 2054420 2008588 2033324
15152 2033324 2032833 2060719 2063623 2033379 2083494 2122961 2084312 2107028 2003155 2025420 2047984 2024334
15140 2024334 2041959 2026319 1990872 2058695 2073872 2007451 1972326 1994783 2038401 2048687 2040222
15129 2040222 2026917 2071534 2043044 2040350 2092379 2045497 2031466 2025828 1993761 2031041 1992641 2041040
15117 2041040 2109153 2079244 2070735 2092659 2088685 2070948 2030279 1971639 2024099 2031052 2048381 2059384
15105 2059384 2106309 2126525 2084257 2100695 2084092 2061548 2033000 2039081 2061635 2066514 2054283 2001948
15093 2001948 2037985 2097048 2025046 2048845 2057523 2108671 2144082 2107899 2161090 2086157 2064889
15082 2064889 2011460 2031926 2059666 2052562 2061501 2055981 2043286 2095291 2090446 2067494 2067212 2089859
15070 2089859 2128732 2072069 2046371 2046684 2020313 2019636 2031991 2088526 2067853 2089472 2068608 2079580
15058 2079580 2049753 2012836 2052034 2040993 2046356 2058192 2040666 2062844 2091660 2079773 2074176 2069750
15046 2069750 2043117 2080737 2098265 2073734 2056799 2049343 2120877 2135173 2105487 2108868 2206478 2168477
15034 2168477 2144928 2111799 2100855 2066347 2091941 2098595 2121695 2170481 2083014 2041311 2037273 2044285
15022 2044285 2078480 2110104 2076626 2067976 2082792 2104245 2090522 2097475 2107437 2052457 2067752 2091789
15010 2091789 2130436 2152357 2128378 2154950 2176489 2171550 2141394 2104952 2157778 2115549 2101062
14999 2101062 2089480 2114549 2095552 2059068 2075988 2064845 2053394 2109694 2138710 2093781 2079228
14988 2079228 2110661 2116247 2064778 2052834 2024072 2023778 2133737 2151402 2136443 2121001 2090161 2153773
14976 2153773 2101531 2053810 2065708 2122489 2089157 2093456 2108910 2057961 2032133 2081065 2104452
14965 2104452 2066775 2049714 2040680 2075289 2091534 2109877 2167859 2140970 2117471 2115274 2095571 2103157
14953 2103157 2079122 2057602 2045497 2064991 2095099 2157677 2050718 2069663 2125500 2127318 2149270
14942 2149270 2134615 2100594 2101449 2088726 2090566 2116762 2122814 2095070 2057700 2068248 2103314 2125558
14930 2125558 2115368 2099630 2110816 2114678 2072516 2083451 2133113 2143748 2044763 2037722 2088429 2114350
14918 2114350 2102374 2095302 2054966 2093810 2078409 2053744 2057733 2023336 2061917 2084892 2111980 2103892
14906 2103892 2081974 2121752 2171850 2168799 2145698 2141610 2160359 2187256 2195695 2108749 2062407 2094415
14894 2094415 2116606 2136659 2093625 2065734 2117770 2117058 2156250 2111841 2129186 2061144 2063731 2086793
14882 2086793 2089308 2143201 2138432 2184910 2167185 2163956 2109913 2098809 2071188 2074290 2138938 2125297
14870 2125297 2093598 2063836 2139011 2134197 2131540 2150283 2114756 2106568 2057787 2140493 2140267 2173477
14858 2173477 2220177 2118143 2093625 2074830 2097024 2131668 2076039 2129751 2097492 2146577 2190035
14847 2190035 2218262 2154577 2142076 2105959 2043147 2105713 2120143 2116138 2129563 2152853 2145543 2170201
14835 2170201 2201623 2169146 2135348 2163306 2143589 2124827 2140529 2161171 2157166 2190197 2184680 2090244
14823 2090244 2128237 2124775 2130777 2091325 2120638 2130751 2091755 2063574 2107131 2120288 2133935 2149317
14811 2149317 2103050 2022974 2056670 2099131 2111325 2153736 2100877 2122627 2187829 2146082 2097582
14800 2097582 2148966 2178108 2161063 2158954 2139063 2143546 2130682 2095735 2111251 2067069 2107136 2131338
14788 2131338 2177607 2147442 2111278 2165582 2145782 2156192 2180133 2112428 2122820 2159346 2179239
14777 2179239 2134162 2128974 2143812 2139485 2182292 2183268 2207244 2225550 2139602 2188285 2205141 2160603
14765 2160603 2168967 2133704 2145200 2153000 2127562 2189838 2169480 2151529 2179245 2167675 2132333 2131131
14753 2131131 2187300 2181955 2161234 2148213 2145060 2088353 2064879 2103604 2092914 2118260 2110539 2133265
14741 2133265 2143710 2148227 2124404 2124198 2084214 2101225 2139046 2148964 2166186 2149161 2087782 2066489
14729 2066489 2080740 2181223 2187892 2147844 2110724 2150925 2110328 2077487 2142997 2142072 2155158 2131863
14717 2131863 2104874 2152541 2158505 2164226 2107352 2169737 2149682 2130892 2145697 2173070 2146796 2135252
14705 2135252 2144002 2148808 2180005 2128680 2139634 2123057 2088361 2105271 2131179 2079642 2119074 2104307
14693 2104307 2149919 2155299 2130664 2098538 2082851 2088553 2149638 2177603 2169454 2109624 2145275 2147153
14681 2147153 2180477 2166599 2149273 2151368 2130711 2088609 2150835 2146541 2135036 2152022 2176366 2171821
14669 2171821 2136819 2157157 2161668 2119202 2147132 2252703 2248157 2177261 2138897 2134290 2208360 2183178
14657 2183178 2128999 2181601 2180754 2199794 2247969 2237467 2193265 2189853 2161791 2170929 2165414 2133156
14645 2133156 2104588 2095751 2127629 2142231 2169700 2214151 2235791 2201580 2209738 2109055 2085195
14634 2085195 2145870 2176713 2151458 2164677 2188733 2162979 2175526 2161538 2197281 2224866 2185106
14623 2185106 2176196 2202443 2251437 2219330 2149945 2198523 2187263 2177360 2182730 2236758 2263724 2182838
14611 2182838 2202140 2183221 2203419 2256483 2220186 2148660 2164017 2185521 2181890 2206811 2207625 2145560
14599 2145560 2190376 2235687 2168784 2156605 2158825 2172432 2255226 2277008 2257565 2248466 2241981 2182992
14587 2182992 2118323 2136417 2112535 2151382 2196310 2181670 2185475 2214629 2225737 2211240 2221460
14576 2221460 2251385 2210167 2258941 2263372 2247510 2209354 2233324 2201516 2171146 2201162 2195767 2166229
14564 2166229 2187000 2153055 2147840 2174293 2188866 2219612 2203460 2195937 2201288 2215973 2261508 2228714
14552 2228714 2253510 2260588 2239954 2250026 2251973 2257573 2262768 2268059 2286582 2273860 2269234 2216843
14540 2216843 2157047 2181233 2164923 2168621 2216319 2194495 2198776 2161274 2138410 2189929 2206477 2235880
14528 2235880 2218359 2200276 2171012 2230040 2245985 2251820 2218109 2219997 2205697 2157333 2153602 2119075
14516 2119075 2168770 2233781 2264651 2240133 2212745 2206891 2260251 2270949 2273910 2211420 2217532 2234087
14504 2234087 2169414 2164296 2159734 2156978 2172284 2180421 2233213 2246723 2215818 2204210 2240088 2256333
14492 2256333 2243102 2257885 2228558 2236218 2236630 2212339 2239315 2276145 2243675 2184345 2193756 2224980
14480 2224980 2248297 2247553 2234513 2264641 2236011 2185100 2191431 2176361 2211237 2250488 2244115 2233918
14468 2233918 2264812 2258084 2223443 2204098 2197608 2214996 2253197 2273095 2238247 2232303 2173118 2204059
14456 2204059 2207893 2221588 2199057 2181471 2259032 2231666 2192166 2200838 2183125 2217252 2209341 2201937
14444 2201937 2178068 2202250 2253671 2259671 2207503 2215377 2242908 2229135 2244415 2185446 2222287 2233138
14432 2233138 2211733 2263431 2233542 2200205 2175501 2176211 2188243 2230398 2277936 2271247 2301786 2321733
14420 2321733 2286805 2233630 2208659 2271813 2237370 2173494 2150922 2162501 2197901 2193515 2178002
14409 2178002 2232134 2272400 2258662 2235891 2246601 2212044 2240678 2163978 2157717 2217243 2276168
14398 2276168 2262595 2305538 2284354 2250877 2297215 2267863 2247244 2246275 2257928 2274196 2293492 2230867
14386 2230867 2202295 2192313 2244432 2291840 2270329 2255275 2224815 2227980 2247486 2252285 2277921 2216498
14374 2216498 2250765 2243687 2230933 2269320 2264211 2236750 2248687 2282628 2250496 2247186 2272649 2302485
14362 2302485 2301269 2270677 2265214 2277781 2233986 2185849 2234949 2239825 2220738 2244595 2205430 2222157
14350 2222157 2209548 2177843 2198553 2213342 2251950 2262708 2270271 2257364 2295296 2253094 2220483
14339 2220483 2211726 2277955 2250123 2243507 2271198 2275870 2254993 2254652 2235480 2258289 2242806 2237076
14327 2237076 2299824 2290541 2319820 2290379 2256047 2235602 2252397 2261341 2253053 2267529 2279026 2295333
14315 2295333 2310624 2285397 2245159 2310841 2317127 2332771 2279699 2290653 2304763 2329244 2294228
14304 2294228 2293114 2314639 2289674 2254612 2290714 2235999 2222666 2211488 2207427 2217825 2218527 2255422
14292 2255422 2215056 2208311 2213191 2262257 2280990 2300883 2274302 2282712 2276250 2239393 2316572 2288608
14280 2288608 2272961 2281552 2316321 2293107 2235835 2297521 2285948 2301501 2262051 2229230 2204894
14269 2204894 2240257 2283092 2253135 2277499 2298520 2239613 2202995 2304053 2337036 2322450 2325529
14258 2325529 2272651 2282906 2262836 2237426 2219030 2287095 2250496 2272258 2252738 2298556 2350728
14247 2350728 2308840 2303878 2327637 2279307 2239357 2217820 2234573 2231964 2258911 2249819 2281405 2287297
14235 2287297 2254947 2268525 2278828 2291387 2235577 2240620 2277520 2218163 2237125 2241195 2207497 2253014
14223 2253014 2191331 2227314 2261107 2248007 2274225 2273300 2310769 2267921 2232124 2253639 2281380 2306378
14211 2306378 2259184 2266144 2296239 2315202 2326105 2300115 2345236 2317767 2281766 2332797 2325750 2311232
14199 2311232 2295309 2279497 2324725 2353561 2354058 2331517 2314742 2241210 2257176 2236093 2265545 2357790
14187 2357790 2325232 2307559 2326312 2340963 2359268 2323624 2320278 2343110 2323705 2306173 2296313 2283976
14175 2283976 2305792 2287359 2274999 2310043 2320533 2321912 2279911 2313211 2341917 2327834 2294621
14164 2294621 2294748 2322727 2253848 2266669 2302766 2286650 2306465 2323333 2305016 2255777 2312304 2301777
14152 2301777 2314973 2337554 2297928 2305596 2321800 2322458 2317097 2326262 2297195 2297315 2298853 2291673 2303664
14139 2303664 2290411 2271372 2273833 2289958 2270011 2283708 2299672 2332415 2321315 2363826 2348138
14128 2348138 2300061 2276295 2351197 2314903 2271630 2362476 2323776 2288723 2288734 2268599 2345148 2357834
14116 2357834 2372511 2325895 2348461 2360483 2367152 2331303 2327466 2283113 2270206 2293717 2330753 2352088
14104 2352088 2309004 2261191 2329735 2348775 2309948 2303398 2351459 2340246 2314527 2303460 2311274 2344505
14092 2344505 2358522 2353793 2300547 2313670 2256103 2278437 2314395 2321961 2338604 2309692 2309887 2368130
14080 2368130 2360210 2349940 2325131 2300372 2377175 2340980 2310673 2347606 2305030 2354970 2416736
14069 2416736 2351678 2283906 2346564 2372776 2383598 2370211 2414843 2424657 2372059 2372392 2382317 2341635
14057 2341635 2375380 2386351 2395726 2344761 2350212 2323188 2346087 2324216 2309719 2309212 2309419 2345475
14045 2345475 2374712 2322650 2374829 2353785 2309848 2338631 2331433 2387945 2396043 2382818 2348052 2317644
14033 2317644 2291103 2327955 2319499 2316694 2328225 2283941 2301223 2309658 2299300 2356030 2400446 2385706
14021 2385706 2350142 2331431 2360031 2370571 2333779 2324014 2371433 2393082 2357497 2366009 2332187 2324386
14009 2324386 2400351 2410344 2385745 2405984 2364582 2362427 2294802 2302864 2362582 2325170 2328344 2327214
13997 2327214 2374131 2394958 2350292 2318102 2374190 2374511 2337864 2302263 2331092 2381666 2426943 2427626
13985 2427626 2354480 2374830 2361565 2367506 2361593 2326755 2405307 2354967 2388285 2473524 2450892 2418199
13973 2418199 2399768 2387771 2344312 2363400 2390126 2329738 2341559 2362165 2355644 2346605 2283282 2337248
13961 2337248 2343383 2354587 2390911 2381254 2364085 2329903 2358785 2374779 2361839 2366522 2341312 2355951
13949 2355951 2383975 2385819 2384919 2356662 2327358 2403925 2359048 2339218 2341908 2423565 2369401 2376633
13937 2376633 2450350 2391813 2350350 2384234 2388215 2313025 2326794 2350883 2382429 2399563 2344816
13926 2344816 2389611 2367692 2375147 2436491 2379492 2386641 2396103 2363018 2377774 2386562 2404296 2430496
13914 2430496 2402850 2397285 2367627 2340084 2304378 2335778 2321575 2346344 2355260 2309550 2331663 2368407
13902 2368407 2334549 2310071 2340266 2385703 2431985 2404684 2385889 2411209 2395083 2377739 2435184
13891 2435184 2443525 2425221 2459592 2452405 2489370 2449750 2359517 2361101 2431160 2412630 2424726 2344586
13879 2344586 2374544 2424361 2401419 2390919 2419606 2443317 2417201 2391877 2321481 2344955 2410660
13868 2410660 2429883 2429475 2434707 2387747 2402434 2408406 2378220 2358131 2429450 2375806 2371310 2362045
13856 2362045 2300751 2351762 2408303 2419056 2444592 2440484 2479119 2494567 2461007 2435539 2387973
13845 2387973 2344715 2357009 2350923 2404157 2436079 2445555 2426870 2408669 2410174 2380002 2360318 2366798
13833 2366798 2382471 2377094 2382795 2406350 2410022 2393769 2424481 2433008 2439197 2442596 2392660 2354721
13821 2354721 2360988 2376090 2450632 2452187 2423382 2425603 2447631 2480770 2440498 2420757 2416813 2432669
13809 2432669 2423793 2417982 2437439 2420874 2459307 2429228 2400749 2402913 2414351 2413863 2419413 2391864
13797 2391864 2425396 2411396 2405811 2392431 2419508 2422118 2453719 2434442 2467353 2424483 2421504 2450890
13785 2450890 2430873 2465092 2452179 2438728 2378034 2413618 2421801 2445406 2481966 2451972 2378002
13774 2378002 2366327 2381884 2409398 2401057 2449034 2476537 2431049 2378625 2420492 2421368 2426280 2479284
13762 2479284 2429547 2390458 2355698 2392138 2455192 2483037 2496642 2417439 2459678 2429521 2424844
13751 2424844 2425046 2392012 2417017 2420047 2469011 2460949 2452781 2437732 2356060 2378823 2416159 2465355
13739 2465355 2442388 2417905 2486551 2434028 2440133 2445685 2499579 2451797 2426126 2470500 2481532 2500722
13727 2500722 2473653 2462208 2442496 2470164 2480651 2470663 2473383 2442832 2478686 2456039 2452380 2433921
13715 2433921 2436332 2501794 2526046 2478426 2499067 2542525 2495010 2514802 2570030 2522746 2472979
13704 2472979 2486355 2494525 2488015 2546488 2515643 2464530 2425253 2414128 2452953 2396036 2422391 2392194
13692 2392194 2398465 2430651 2431750 2474646 2441922 2321501 2395306 2458614 2471459 2504569 2470516
13681 2470516 2456950 2476547 2472793 2511726 2481732 2489401 2554382 2505283 2506399 2483424 2497653 2459394
13669 2459394 2503104 2502294 2499655 2604015 2529570 2486351 2457089 2443754 2483820 2473261 2489348 2487551
13657 2487551 2462534 2488112 2471069 2432598 2463292 2478658 2462305 2456431 2459722 2412651 2419307 2413114
13645 2413114 2420999 2480488 2485804 2535805 2479268 2489962 2487257 2419957 2449788 2506226 2515902 2519207
13633 2519207 2522608 2524481 2472122 2485727 2487524 2474567 2511184 2494182 2476160 2510659 2556081 2509310
13621 2509310 2443666 2451254 2457541 2445285 2473857 2516393 2452984 2443880 2415980 2512895 2539721 2443844
13609 2443844 2434902 2473123 2535945 2525607 2522964 2536683 2541248 2502654 2479911 2507420 2528958 2471934
13597 2471934 2498820 2498763 2502925 2459182 2408331 2476646 2515983 2487121 2504399 2477546 2470500 2480506
13585 2480506 2504912 2498537 2489050 2535216 2555741 2485634 2485644 2565578 2538470 2545372 2506219 2511925 2535317
13572 2535317 2542093 2512601 2502593 2486751 2487024 2486528 2469111 2460284 2508096 2530484 2503412 2515238
13560 2515238 2525442 2492518 2461317 2468156 2501160 2501418 2488458 2491297 2459482 2514269 2479831 2531196
13548 2531196 2515413 2503671 2553148 2590135 2507205 2490979 2500561 2511401 2489789 2489771 2473170 2480647
13536 2480647 2531352 2504199 2467909 2497669 2528054 2478194 2485283 2436457 2496113 2528783 2495820
13525 2495820 2509194 2534210 2562811 2553491 2576472 2522257 2531234 2550987 2598237 2578574 2573886 2578662
13513 2578662 2570556 2539230 2524021 2555527 2507975 2501870 2512297 2537666 2527352 2526006 2529313 2476669
13501 2476669 2495471 2534293 2539425 2494932 2515796 2576923 2563051 2585899 2523692 2534267 2555574
13490 2555574 2556767 2519854 2464497 2505562 2508741 2505196 2551946 2536908 2510087 2501176 2552283 2567807
13478 2567807 2532845 2553944 2622968 2614588 2540703 2528355 2549796 2581466 2572909 2564028 2561534 2528707
13466 2528707 2557609 2554615 2554765 2589061 2622127 2541622 2544212 2554884 2549712 2514230 2599040 2621816
13454 2621816 2608886 2623596 2574483 2564966 2576262 2510949 2526576 2518040 2522710 2511563 2524931 2546282
13442 2546282 2554938 2531060 2534100 2516253 2515698 2503730 2530733 2537095 2525833 2560520 2541411 2591902
13430 2591902 2622401 2583299 2551386 2525093 2522543 2560628 2580375 2580671 2568805 2573776 2593922 2619691
13418 2619691 2568168 2564757 2543208 2571348 2605521 2590198 2562320 2599198 2605208 2599623 2622370 2637019
$$ [...]
##END NTUPLES=NMR SPECTRUM
##END=
