##TITLE=1H_CG-1150-C1
 CDCl3, 8 sc, 
 27.08.2021
##JCAMPDX= 6.0         $$ Bruker NMR JCAMP-DX V2.0
##DATA TYPE= NMR SPECTRUM
##DATA CLASS= NTUPLES
##ORIGIN= UXNMR, Bruker Analytische Messtechnik GmbH
##OWNER= root
$$ XWIN-NMR		Version 3.5
$$ Fri Aug 27 08:58:59 2021 Russian Standard Time (UT+4h)  she@DPX200
##.OBSERVE FREQUENCY= 200.131506
##.OBSERVE NUCLEUS= ^1H
##.ACQUISITION MODE= SIMULTANEOUS
##.ACQUISITION SCHEME= undefined
##.AVERAGES= 8
##.DIGITISER RES= 18
##SPECTROMETER/DATA SYSTEM= spect
##.PULSE SEQUENCE= zg30
##.SOLVENT NAME= D2O
##.SHIFT REFERENCE= (INTERNAL, D2O, 0, 17.5215)
##AUDIT TRAIL= $$ (NUMBER, WHEN, WHO, WHERE, WHAT)
$$ ##TITLE= Audit trail, XWIN-NMR		Version 3.5
$$ ##JCAMPDX= 5.01
$$ ##ORIGIN= Bruker BioSpin GmbH
$$ ##OWNER= she
$$ F:/spectra/data/she/nmr/H-F/1/pdata/1/auditp.txt
$$ ##AUDIT TRAIL=  $$ (NUMBER, WHEN, WHO, WHERE, WHAT)
(   1,<2021-08-27 08:57:42.29 +0400>,<she>,<DPX200>,
      <created by zg, POWCHK disabled, PULCHK disabled
       configuration hash MD5:
       00 E9 B6 7A A2 85 ED C7 34 08 36 98 17 FE 4E 26
       data hash MD5: 16K
       16 10 C2 02 69 42 CE 11 E0 80 F7 21 8C 69 E4 93>)
(   2,<2021-08-27 08:57:44.79 +0400>,<she>,<DPX200>,
      <Start of raw data processing
       efp BC_mod = 2 LB = 0.24 FT_mod = 6 PKNL = 1 PHC0 = -13360.38 PHC1 = 16.20099 SI = 16K 
       data hash MD5: 16K
       2E EB D6 D3 00 05 8F 86 0E 37 2F 6A 01 21 A2 B4>)
(   3,<2021-08-27 08:58:01.70 +0400>,<she>,<DPX200>,
      <pk PHC0 = 2.059351 PHC1 = -3.2 
       data hash MD5: 16K
       12 5E EF A7 30 7F 0B 20 72 26 02 8F AE 96 A1 98>)
(   4,<2021-08-27 08:58:05.04 +0400>,<she>,<DPX200>,
      <abs ABSG = 5 
       data hash MD5: 16K
       0C DB 46 97 88 77 BF 14 A9 A0 DE 73 19 84 DD D9>)
$$ ##END=
$$ 
$$ hash MD5
$$ E9 4D F2 85 5F DB 3F 71 75 E5 1A 04 E4 EC 50 12
##$RELAX= 
##$RELAX= 
##$RELAX= 
##$RELAX= 
##$RELAX= 
##$RELAX= 
$$ Bruker specific parameters
$$ --------------------------
##$DU= <F:/spectra>
##$EXPNO= 1
##$NAME= <H-F>
##$PROCNO= 1
##$TYPE= <nmr>
##$USER= <she>
##$AMP= (0..31)
100 100 100 100 100 100 100 100 100 100 100 100 100 100 100 100 100 100 
100 100 100 100 100 100 100 100 100 100 100 100 100 100 
##$AQSEQ= 0
##$AQ_mod= 1
##$AUNM= <au_zg>
##$AUTOPOS= <>
##$BF1= 200.13
##$BF2= 200.13
##$BF3= 200.13
##$BF4= 200.13
##$BF5= 200.13
##$BF6= 200.13
##$BF7= 200.13
##$BF8= 200.13
##$BYTORDA= 1
##$CFDGTYP= 0
##$CFRGTYP= 5
##$CHEMSTR= <none>
##$CNST= (0..31)
1 1 145 1 1 1 1 1 1 1 1 1 1 1 1 1 1 1 1 1 1 1 1 1 1 1 1 1 1 1 1 1 
##$CPDPRG= <>
##$CPDPRG1= <>
##$CPDPRG2= <>
##$CPDPRG3= <>
##$CPDPRG4= <mlev>
##$CPDPRG5= <mlev>
##$CPDPRG6= <mlev>
##$CPDPRG7= <mlev>
##$CPDPRG8= <mlev>
##$CPDPRGB= <>
##$CPDPRGT= <>
##$D= (0..31)
0 1.2 0 0 0 0 0 0 0 0.06 0 0.03 0 0 0 0 0.0002 0 0 0 0 0 0 0 0 0 0 0 0 
0 0 0 
##$DATE= 1630040261
##$DBL= (0..7)
120 120 120 120 120 120 120 120 
##$DBP= (0..7)
150 150 150 150 150 150 150 150 
##$DBP07= 0
##$DBPNAM0= <>
##$DBPNAM1= <>
##$DBPNAM2= <>
##$DBPNAM3= <>
##$DBPNAM4= <>
$$ [...]
##$SUBNAM3= <"">
##$SUBNAM4= <"">
##$SUBNAM5= <"">
##$SUBNAM6= <"">
##$SUBNAM7= <"">
##$SUBNAM8= <"">
##$SUBNAM9= <"">
##$SW= 20.0188882624521
##$SWIBOX= (0..15)
0 0 2 0 0 0 0 0 0 0 0 0 0 0 0 0 
##$SW_h= 4006.41025641026
##$TD= 16384
##$TD0= 1
##$TE= 0
##$TE2= 300
##$TE3= 300
##$TEG= 300
##$TL= (0..7)
0 120 120 120 120 120 120 120 
##$TP= (0..7)
150 150 150 150 150 150 150 150 
##$TP07= 0
##$TPNAME0= <>
##$TPNAME1= <>
##$TPNAME2= <>
##$TPNAME3= <>
##$TPNAME4= <>
##$TPNAME5= <>
##$TPNAME6= <>
##$TPNAME7= <>
##$TPOAL= (0..7)
0.5 0.5 0.5 0.5 0.5 0.5 0.5 0.5 
##$TPOFFS= (0..7)
0 0 0 0 0 0 0 0 
##$TUNHIN= 0
##$TUNHOUT= 0
##$TUNXOUT= 0
##$USERA1= <user>
##$USERA2= <user>
##$USERA3= <user>
##$USERA4= <user>
##$USERA5= <user>
##$V9= 5
##$VALIST= <valist>
##$VCLIST= <CCCCCCCCCCCCCCC>
##$VD= 0
##$VDLIST= <DDDDDDDDDDDDDDD>
##$VPLIST= <PPPPPPPPPPPPPPP>
##$VTLIST= <TTTTTTTTTTTTTTT>
##$WBST= 1024
##$WBSW= 4
##$XGAIN= (0..3)
0 0 0 0 
##$XL= 0
##$YL= 0
##$YMAX_a= 751192
##$YMIN_a= -728762
##$ZGOPTNS= <>
##$ZL1= 120
##$ZL2= 120
##$ZL3= 120
##$ZL4= 120
##$ABSF1= 17.49466
##$ABSF2= -2.524378
##$ABSG= 5
##$ABSL= 3
##$ALPHA= 0
##$AQORDER= 0
##$ASSFAC= 0
##$ASSFACI= 0
##$ASSFACX= 0
##$ASSWID= 0
##$AUNMP= <proc_1d>
##$AZFE= 0.1
##$AZFW= 0.1
##$BCFW= 0
##$BC_mod= 2
##$BYTORDP= 0
##$COROFFS= 0
##$CY= -3
##$DATMOD= 1
##$DC= 0
##$DFILT= <>
##$DTYPP= 0
##$F1P= 0
##$F2P= 0
##$FCOR= 1
##$FTSIZE= 16384
##$FT_mod= 6
##$GAMMA= 0
##$GB= 0
##$INTBC= 1
##$INTSCL= 1.334414e-10
##$ISEN= 128
##$LB= 0.24
##$LEV0= 0
##$LPBIN= 0
##$MAXI= 10000
##$MC2= 0
##$MEAN= 0
##$ME_mod= 0
##$MI= 1.114404
##$NCOEF= 0
##$NC_proc= -5
##$NLEV= 6
##$NOISF1= 3.799351
##$NOISF2= 2.8
##$NSP= 0
##$NTH_PI= 0
##$NZP= 0
##$OFFSET= 17.52155
##$PC= 1
##$PHC0= -13358.32
##$PHC1= 13.00099
##$PH_mod= 1
##$PKNL= yes
##$PPARMOD= 0
##$PSCAL= 0
##$PSIGN= 0
##$REVERSE= no
##$SF= 200.130002617195
##$SI= 16384
##$SIGF1= 3
##$SIGF2= 2
##$SINO= 5.538805
##$SIOLD= 16384
##$SREGLST= <1H.CDCl3>
##$SSB= 0
##$STSI= 16384
##$STSR= 0
##$SW_p= 4006.41025641026
##$SYMM= 0
##$S_DEV= 0
##$TDeff= 16384
##$TDoff= 0
##$TI= <>
##$TILT= no
##$TM1= 0
##$TM2= 0
##$TOPLEV= 0
##$USERP1= <user>
##$USERP2= <user>
##$USERP3= <user>
##$USERP4= <user>
##$USERP5= <user>
##$WDW= 1
##$XDIM= 16384
##$YMAX_p= 272887108
##$YMIN_p= -184147
$$ End of Bruker specific parameters
$$ ---------------------------------
##NTUPLES= NMR SPECTRUM
##VAR_NAME=  FREQUENCY,     SPECTRUM/REAL,   SPECTRUM/IMAG
##SYMBOL=    X,             R,               I
##VAR_TYPE=  INDEPENDENT,   DEPENDENT,       DEPENDENT
##VAR_FORM=  AFFN,          ASDF,            ASDF
##VAR_DIM=   16384,         16384,           16384
##UNITS=     HZ,            ARBITRARY UNITS, ARBITRARY UNITS
##FACTOR=    0.24454680195387, 1,            1
##FIRST=     3506.58769222725, 0,            0
##LAST=      -499.822564183015, 0,           0
##MIN=       -499.822564183015, -184147,     0
##MAX=       3506.58769222725, 272887108,    0
$$ Real data points
##PAGE= N=1
##DATA TABLE= (X++(R..R)), XYDATA
$$ [...]
5670g6890N4824m486L1921m9941j3344n5525M237l587M7621M4270n5165j0057
$$ -76890 -22066 -26552 5369 -44572 -57916 -113441 -109204 -112791 -65170 -20900 -76065 -86122
5658h6122L3008J4812r4991N6539l0973r457L6529O7914o5423J1008o8570L0670
$$ -86122 -53114 -38302 -133293 -76754 -107727 -117184 -80655 -12741 -78164 -67156 -135726 -105056
5646a05056M1783K5379L997o9989M2705K2057L7705N1178o0656k1018J4798o160
$$ -105056 -63273 -37894 -33897 -103886 -61181 -39124 -1419 49759 -10897 -31915 -17117 -23277
5634b3277J102j3300J8193K5774l5311k5876o689l5985J5767J8684L5064k0319
$$ -23277 -22175 -35475 -17282 8492 -26819 -52695 -59384 -95369 -79602 -60918 -25854 -46173
5622d6173k7823O1431j5329m582j029l4845M2003l1788j7579M224J2710N857J2034
$$ -46173 -73996 -12565 -27894 -32476 -33505 -68350 -26347 -58135 -75714 -71490 -58780 -52923 -40889
5609d0889k978J6463K1369l4279j9996M693M4837J2682l0104k9055K9627j9613
$$ -40889 -43867 -27404 -6035 -40314 -60310 -55617 -10780 1902 -28202 -57257 -27630 -47243
5597d7243m6994O385O127k6123O0274L3310j6561k0078K6769k9940L0752J6018
$$ -47243 -94237 -87852 -81725 -107848 -47574 -14264 -30825 -50903 -24134 -54074 -23322 -7304
5585g304l2776J5629l869k01k9644J8543J451M3938j2676o0125j0138N0325R313
$$ -7304 -40080 -24451 -28320 -28521 -58165 -39622 -38171 5767 -6909 -67034 -77172 -26847 -17534
5572a7534p31J0086l772k0836R621K0625j4543m1211M7950K1795K1966l9491J7996
$$ -17534 -18265 -8179 -11951 -32787 -23166 -2541 -17084 -58295 -10345 11450 33416 -6075 11921
5559A1921O4823m536k7984k3870J6722k4891L8499L0556K07k7120j0308J5518
$$ 11921 76744 72208 44224 20354 37076 12185 50684 81240 81447 54327 44019 59537
5547E9537J3813q038m9571j3976K0724J6667K6081p1765m4733L3002M1050j7149
$$ 59537 73350 65312 15741 1765 22489 39156 65237 -6528 -51261 -18259 22791 5642
5535E642K0206j6042J1682j4654k3142k067j1933N118J4161M2237l7308j7868
$$ 5642 25848 9806 21488 6834 -16308 -18375 -30308 -25190 -11029 31208 -6100 -23968
5523b3968M2881l657j1451o752r934L563R163J0521l6977N0356j2542N576P228
$$ -23968 18913 15256 3805 -2947 -12881 -9318 -155 10366 -26611 23745 11203 16779 24007
5510B4007j1544l327K1310n6599J2037k8382r909J3665J0249L1973M8924k2497
$$ 24007 12463 9136 30446 -26153 -14116 -42498 -52407 -38742 -28493 3480 52404 29907
5498B9907l0131M1809n5980Q775K8914o463K9802l7915k9381P0374J0116q0n2296
$$ 29907 -224 41585 -14395 -5620 23294 16831 46633 8718 -20663 49711 59827 59747 7451
5485G451q547J0247r024J5277l2139k0109J2399p536P3215L7526j1243n1445L6996
$$ 7451 -1096 9151 127 15404 -16735 -36844 -24445 -31981 41234 78760 67517 16072 53068
5472E3068l4552k9513k3100K5867K5518k7285K4478l459K5424J2257o122J8958
$$ 53068 18516 -10997 -34097 -8230 17288 -9997 14481 11022 36446 48703 42581 61539
5460F1539J5592o1615l3095L2537K4830k6799M5914p4296K3815J1661J5985j4221
$$ 61539 77131 15516 -17579 14958 39788 12989 58903 -15393 8422 20083 36068 21847
5448B1847l747K3767J6873J2888l1758j6472M9684l9419l0166j5360k1588j7921
$$ 21847 18100 41867 58740 71628 39870 23398 73082 33663 3497 -11863 -33451 -51372
5436e1372J1740M2432J0435M3788k6740L5311r27k7533k117k5399K5994k6359
$$ -51372 -39632 2800 13235 57023 30283 65594 64667 37134 35017 9618 35612 9253
5424I253M5082k6015n1012P0220k3011q367m7164K7000M2660J8089k3399K7331
$$ 9253 54335 28320 -22692 47528 24517 16150 -31014 -4014 38646 56735 33336 60667
5412F0667j4884M7075j738n791J0719n9276K0447l9325L79M232K585J7453j4569
$$ 60667 45783 92858 91120 85329 96048 36772 57219 17894 18273 22505 25090 42543 27974
5399B7974J2292m078M7485j9904p0866K1264p564m6360O9794J710J6123r940K2150
$$ 27974 40266 36188 83673 63769 -7097 14167 6603 -39757 30037 31747 47870 37930 60080
5386F0080L1683J934m0078k6479r509L6682r2521K8433Q0015o3421K9011r532
$$ 60080 91763 93697 53619 27140 17631 54313 -38208 -9775 70240 6819 35830 26298
5374B6298K2234J5539j8168l0132M735J7219J5308M2445j8968o3371L6861N2407
$$ 26298 48532 64071 45903 15771 20506 37725 53033 95478 76510 13139 50000 102407
5362A02407q803k268J1113j5346j0715M5571k6452n6109N8038J6109m2000N405
$$ 102407 93604 91336 102449 87103 76388 121959 95507 39398 97436 113545 71545 76950
5350G6950M6636m5568K164J5099l0407L722K2510q719R1835r826k2861l2154n6468
$$ 76950 123586 78018 80182 95281 64874 68596 91106 82387 174222 164396 141535 109381 52913
5337E2913L9844L127l202J3395l109K478J139k4828L1182M3756n7074L8666K7135
$$ 52913 92757 95884 92682 106077 102968 105446 106585 81757 112939 156695 99621 138287 165422
5324A65422K4615j8628p4582j1225K2012M1338j7216J718M7446L1131P466p3766
$$ 165422 190037 171409 96827 85602 107614 148952 131736 133454 180900 212031 219497 145731
5312A45731J6789L0626O657j5367j9291R5703l6775j7871N5906L1098r5973L1316
$$ 145731 162520 193146 199803 184436 165145 260848 224073 206202 262108 293206 197233 228549
5300B28549k648j9355N605k5230R845n4467l2756N2064L0423l3157l0307n5870
$$ 228549 225901 206546 212151 186921 196766 142299 109543 161607 192030 158873 128566 72696
5288G2696o5186J03680K0316l192M1927K4106m2041k2228N2334j5816j9634j5104
$$ 72696 7510 111190 131506 128314 170241 194347 152306 130078 182412 166596 146962 131858
5276A31858J5659L7112j9869l3814j9902j1863L0794p586O8514j6611n51l66o00
$$ 131858 147517 184629 164760 130946 111044 99181 129975 122389 190903 174292 173741 173375 172775
5263A72775k3607J001j0376K8919n1956J486J2717j9511n8088j9852O1066l4859
$$ 172775 149168 150169 139793 168712 116756 118242 130959 111448 53360 33508 94574 59715
5251E9715L6351j361j891k3574k4347L2625N13L1533J1401R410k2214J0387L869
$$ 59715 96066 94705 92814 69240 44893 77518 78031 109564 120965 130375 108161 118548 122417
5238A22417j7561K3427j35N5846k2899m4317k273J0286q455M7180R490j2001p5948
$$ 122417 104856 128283 128148 183994 161095 116778 114505 124791 116336 163516 173006 161005 85057
5225H5057l3178j6161M8416J6586J8527N3524o8944l2316K5483O3656m1708M4594
$$ 85057 51879 35718 84134 100720 119247 172771 103827 71511 96994 160650 118942 163536
5213A63536q178l9233j2943J884J149N3699J1754n4020K0029l6071O8474P0614
$$ 163536 155358 116125 103182 105066 106215 159914 171668 117648 137677 101606 170080 240694
5201B40694j3764k7823J1480K7666J1523L9862K1630K8555o7081M0675L5940l4906
$$ 240694 226930 199107 210587 238253 249776 289638 311268 339823 272742 313417 349357 314451
5189C14451n0985R848m8850m4231N7806M6349l1840M1258l2947j0545P9769m9871
$$ 314451 263466 273314 224464 180233 238039 284388 252548 293806 260859 250314 330083 280212
5177B80212l7554n857q348L7680j7261p5234N8865M9041P630K1175P5984p6909
$$ 280212 242658 236801 228453 266133 248872 173638 232503 281544 289174 310349 386333 309424
5165C09424k6387J966N7063O944k0792j7253J5703N7060Q304q552K5322l181m338
$$ 309424 283037 285003 342066 349010 328218 310965 326668 383728 392032 383480 408802 405621 401283
5152D01283o476J04986P4532J0700l7457j9888L2188O1356o0638L1390j8894j9168
$$ 401283 394807 499793 574325 585025 547568 527680 559868 621224 560586 591976 573082 553914
5140E53914O8040N8845j02962k8455M3564j0110R267l6882M2756O3975N2075J421
$$ 553914 621954 680799 577837 549382 592946 582836 592103 555221 597977 661952 714027 715448
5128G15448M6507m592j667K5780j0356k0793j2800k4154q874M8602o226m3177
$$ 715448 761955 757363 755696 781476 771120 750327 737527 713373 704499 753101 746875 703698
5116G03698l2887j0433k020q2414K7142O8473M174l3905L8562L4890k7016L7396
$$ 703698 670811 660378 658358 575944 603086 671559 675733 641828 680390 715280 688264 725660
5104G25660L2484L0453N871k5730M3513r08L030J7647m280R99P1698K5379J15396
$$ 725660 758144 788597 794468 768738 812251 811343 814373 832020 827740 828739 900437 925816 1041212
5091A041212M2197P9945L448L8914L0871L0202j1221q5593j50204n7967j4420
$$ 1041212 1083409 1163354 1166802 1205716 1236587 1266789 1255568 1169975 1019771 961804 947384
5080I47384r7477j2096j5853L9108J2598L299N1279M0515P9125J9071M2999R3699
$$ 947384 849907 837811 821958 861066 873664 876963 928242 968757 1047882 1066953 1109952 1203651
5068A203651O8748J32660J82045J24533J50089J57619J81029J74614J55584K06588
$$ 1203651 1272399 1405059 1587104 1711637 1861726 2019345 2200374 2374988 2530572 2737160
5058B737160J42787l4806k77262l59759k73520k16110j70287j16639r0771q7546
$$ 2737160 2879947 2845141 2567879 2208120 1934600 1718490 1548203 1431564 1340793 1253247
5048A253247m7577M7039l0138O9337J3849j1554K9880o414Q3503J10261Q7300
$$ 1253247 1205670 1252709 1222571 1291908 1305757 1294203 1324083 1317669 1401172 1511433 1598733
5037A598733Q3387J78587J64144J29410J75918K07338J66918K20932J37987j43255
$$ 1598733 1682120 1860707 2024851 2154261 2330179 2537517 2704435 2925367 3063354 2920099
5027B920099l83638l73045k80450k21629j45954j55966j00247j19410q5343r7039
$$ 2920099 2536461 2163416 1882966 1661337 1515383 1359417 1259170 1139760 1054417 957378
5017I57378j5313N809J8514m2651m2829J1857L7808M7335O0329L4260K342O5267
$$ 957378 942065 947874 966388 923737 880908 892765 930573 977908 1038237 1072497 1074839 1140106
5005A140106J18569L9687M7642K9602J12019J0656j91660j35841j59622q4818
$$ 1140106 1258675 1298362 1346004 1375606 1487625 1498281 1306621 1170780 1011158 926340
4995I26340o0638n1266q3573j1328k3656j22080K1634K0526j3172R749q4403o201
$$ 926340 865702 814436 730863 719535 695879 573799 595433 615959 602787 612536 528133 521932
4983E21932K7137p5808K3025P506j5928M866K5560j1545n9493m0836l1926L0427
$$ 521932 549069 473261 496286 503792 487864 492730 518290 506745 447252 406416 374490 404917
4971D04917o094L2285M7788K329p4185Q882J0090K5727j2391q773k0382o7706
$$ 404917 398823 431108 478896 481225 407040 415922 426012 451739 439348 430575 410193 342487
4959C42487L9379J1323k4641m1673M0504j9577M3357j721l2344k9172k6000K9144
$$ 342487 381866 393189 368548 326875 367379 347802 391159 389438 357094 327922 301922 331066
4947C31066n455m974M0639l5182J2988k3680K1177N7221l8236O191M8069n7588
$$ 331066 325611 320637 361276 326094 339082 315402 336579 393800 355564 361755 409824 352236
4935C52236M307m102k9124L4412p1053P456N260K3724O3j8268O3397M1744p8646
$$ 352236 356543 352441 323317 357729 286676 294132 299392 323116 323179 304911 368308 410052 331406
4922C31406N51L2500L779J3549p934n130l2891l4642N907L7720O3652j8824j04006
$$ 331406 331957 364457 368236 381785 373851 368721 335830 301188 307095 344815 408467 389643 285637
4909B85637k917N5592O6200q383K1220K9406m4014j9028k1048L6406k9202J898
$$ 285637 282720 338312 404512 396129 417349 446755 402741 383713 362665 399071 369869 371767
4897C71767L4849Q069j9041j0909j2999l3127o391J6930J2629K8884M6159M301
$$ 371767 406616 414685 395644 384735 371736 338609 332218 349148 361777 390661 436820 441121
4885D41121l4611K2566j3177J5464J0963M5609n6280r7202L0005K5072l649o017
$$ 441121 406510 429076 415899 431363 442326 487935 431655 334453 364458 389530 385881 379864
4873C79864l8117j626M5896M5138r33k8377J8668l7124l1824r666K5740j4337
$$ 379864 341747 340121 386017 431155 430222 401845 420513 383389 351565 341899 367639 353302
4861C53302K0976J6642l5049K7398q5014L7072L1357m8820j7806M0359K7563n8987
$$ 353302 374278 390920 355871 383269 298255 335327 366684 317864 300058 340417 367980 308993
4849C08993J0636K5112K6675K4499L0378N2270O4606M2855j8625k7698M9053O642
$$ 308993 319629 344741 371416 395915 426293 478563 543169 586024 567399 539701 588754 595396
4837E95396O7061R3949M087O8647K3004N3885L2882p1833j12106p3066j3178j0383
$$ 595396 662457 756406 760493 829140 852144 906029 938911 867078 754972 681906 668728 658345
4825F58345l8127o7476L4014R084o1514n1272L6451m0585n3171P411k2699L2101
$$ 658345 620218 552742 586756 595840 534326 483054 519505 478920 425749 433160 410461 442562
4813D42562o216K3405j7076k7054L8012L1293K8684j7549j5355l670K0055j539
$$ 442562 436346 459751 442675 415621 453633 484926 513610 496061 480706 477036 497091 495552
4801D95552P708K2772K793J8843K8574o4067k188k9404j7300M0596M5784N2951
$$ 495552 503260 526032 528825 547668 576242 512175 509987 480583 463283 503879 549663 602614
4789F02614K3208P045K8864l8215J4173L8999N0898J5876K4800L1203O6436j1761
$$ 602614 625822 632867 661731 623516 637689 676688 727586 743462 768262 799465 865901 854140
4777H54140o0410O1904O3151o498N2712P0245M9557J02378Q4091J00341J00874
$$ 854140 793730 855634 918785 912287 964999 1035244 1084801 1187179 1271270 1371611 1472485
4766A472485J27080O6139J48325R1410J25696J19222p901K8325l9222N1162m5870
$$ 1472485 1599565 1665704 1814029 1905439 2031135 2150357 2142456 2170781 2131559 2182721 2136851
4755B136851j36342m7178l2309k8640k5671M8586O7488L3817L9647J09224P9502
$$ 2136851 2000509 1953331 1921022 1892382 1866711 1915297 1982785 2016602 2056249 2165473 2244975
4744B244975N1925Q8490O5779L1821Q5805r8247o3205R97q3161o9359n5219n760
$$ 2244975 2296900 2385390 2451169 2482990 2568795 2470548 2407343 2408340 2325179 2255820 2200601 2194841
4732B194841q5030M012R0506J13839J00525K6318R3678J46956O4251Q4091N7601
$$ 2194841 2109811 2113823 2204329 2318168 2418693 2445011 2538689 2685645 2749896 2833987 2891588
4721B891588L9820Q4211J7750L0182N1389q6199n8359j86507j44289r7650j05244
$$ 2891588 2931408 3015619 3033369 3063551 3114940 3028741 2970382 2783875 2639586 2541936 2436692
4710B436692j4225l2247n863m9579l896l7520m7012j52622r6974r8111j57404
$$ 2436692 2422467 2390220 2384357 2334778 2330882 2293362 2246350 2093728 1996754 1898643 1741239
4699A741239j13082r9471j28425q4195j45651j06093M7377o6358j00085K053m8454
$$ 1741239 1628157 1528686 1400261 1316066 1170415 1064322 1111699 1045341 945256 947309 898855
4688H98855n1536l4613L8268K0865k6773k1223l0114m2633Q935j9126j8210L6303
$$ 898855 847319 812706 850974 871839 845066 823843 793729 751096 760031 740905 722695 758998
4676G58998o865k6845l1010L8264J0763k2927K760J1914m820N6215N560P6675
$$ 758998 752133 725288 694278 732542 743305 720378 723138 735052 730232 786447 792007 868682
4664H68682K1130q218K0828O0773M8925K0260R2818P3163m736l3510L7031j29261
$$ 868682 889812 881594 902422 963195 1012120 1032380 1125198 1198361 1193625 1160115 1197146 1067885
4652A067885j07528j41556j05957m9370k742j1567N5328P3217k2779r9276o1038
$$ 1067885 960357 818801 712844 663474 660732 649165 704493 777710 754931 655655 594617
4641E94617J184j7398l3139J8773l403k139O9703j5288j5808P587j2778k6761
$$ 594617 595801 578403 545264 564037 560634 558495 628198 612910 597102 604689 591911 565150
4629E65150j175L9264Q371m3073J6404k270k0777J9969N4285p68n9160j4683K1856
$$ 565150 563975 603239 611610 568537 584941 582671 561894 581863 636148 635380 576220 561537 583393
4616E83393P182N420M392M3472m0019M0127O3499k5595n079m827k0472O3603p024
$$ 583393 590575 595995 600387 643859 603840 643967 707466 681871 676792 671965 651493 715096 708072
4603G08072k48k7137l2690k0787K8330J8525n6345J577M8131J6438q270k611j5605
$$ 708072 707824 680687 647997 627210 655540 674065 617720 619297 667428 683866 675596 672985 657380
4590F57380M5001N6332l0433n7135l7999m093m265P19l5455K7411L2286o832J3847
$$ 657380 702381 758713 728280 671145 633146 629053 624788 625507 590052 617463 649749 642917 656764
4577F56764J2736r161K0634J458K4904O7980J1005O5934J2542j7465K4661P3808
$$ 656764 669500 660339 680973 682431 707335 775315 786320 852254 864796 847331 871992 945800
4565I45800O4188k7371m0589N3471J8041L6653K1382K6200k5493J6546N4032P0641
$$ 945800 1009988 982617 942028 995499 1013540 1050193 1071575 1097775 1072282 1088828 1142860 1213501
4553A213501k3358M6787O5323J6621K5461L5062M4633K4708O8518j2397M4557
$$ 1213501 1190143 1236930 1302253 1318874 1344335 1379397 1424030 1448738 1517256 1504859 1549416
4542A549416L1943N1561J0378J2548K9646J1642l4993K4387j2918j0655M5559
$$ 1549416 1581359 1632920 1643298 1655846 1685492 1697134 1662141 1686528 1673610 1662955 1708514
4531A708514l7031L3833Q3145J21315J69119L3635o206J05324N5126o652O6838
$$ 1708514 1671483 1705316 1788461 1909776 2078895 2112530 2106324 2211648 2266774 2260122 2326960
4520B326960J12293P7879O6203N947J7188j7292M1271K0511J08899J01451R4137
$$ 2326960 2439253 2517132 2583335 2589282 2606470 2589178 2630449 2650960 2759859 2861310 2955447
4509B955447J07202Q4052J71389J16308J50624J20069P2005P5033Q3831J02122
$$ 2955447 3062649 3146701 3318090 3434398 3585022 3705091 3777096 3852129 3935960 4038082
4499D038082K2663Q0060J41195N4405J46872J60909J53061J97064K37528K58351
$$ 4038082 4060745 4140805 4282000 4336405 4483277 4644186 4797247 4994311 5231839 5490190
4489E490190J79630K40564L21706K26624K96602K16486K28292K58157L08535K57964
$$ 5490190 5669820 5910384 6232090 6458714 6755316 6971802 7200094 7458251 7766786 8024750
4479H024750K63137L55422K98938L68777L19022L31798L74457L73035L49574L45454
$$ 8024750 8287887 8643309 8942247 9311024 9630046 9961844 10336301 10709336 11058910 11404364
4469A1404364M06443M27956M66598M62299M26887M71934N10916O03959P02899
$$ 11404364 11810807 12238763 12705361 13167660 13594547 14066481 14577397 15181356 15884255
4460A5884255Q40223R56245J046939J249317J315285J636566J940123K155400
$$ 15884255 16724478 17680723 18727662 19976979 21292264 22928830 24868953 27024353
4452B7024353K476666K923403L348855L782087M347433N152762N994606P347047
$$ 27024353 29501019 32424422 35773277 39555364 43902797 49055559 55050165 62397212
4444F2397212Q847724R796944J0500861J0641291J1305136J3102144J1803051
$$ 62397212 71244936 81041880 91542741 102184032 113489168 126591312 138394363
4437A38394363M204886o801166j7155808k0617447j8011299j3734328j0243257
$$ 138394363 142599249 135798083 118642275 98024828 80013529 66279201 56035944
4430E6035944p848357o041272m760479l768439l011127k291701j774093j392460
$$ 56035944 48187587 42146315 37385836 33617397 30606270 28314569 26540476 25148016
4422B5148016j169055j025343q05410n41259n82790n58900m38888n34860m27341
$$ 25148016 23978961 22953618 22148208 21606949 21024159 20465259 20026371 19491511 19064170
4413A9064170l17214k52341k40515k84733j89213j26342l1608M1103O1145J39462
$$ 19064170 18746956 18494615 18254100 17969367 17780154 17653812 17622204 17663307 17724452 17863914
4403A7863914J05163J41762K04062K55288L68580M65232O13957O66217P49405
$$ 17863914 17969077 18110839 18314901 18570189 18938769 19404001 20017958 20684175 21433580
4394B1433580Q89622J167404J402837J654706J970844K263055K709365L150651
$$ 21433580 22323202 23490606 24893443 26548149 28518993 30782048 33491413 36642064
4386C6642064L511897M067321M865098N847655P187015Q527110R361212J0120376
$$ 36642064 40153961 44221282 49086380 54934035 62121050 70648160 80009372 90129748
4378I0129748J0535851J1430086J3252940R873104J362360m744150j2614498j8904092
$$ 90129748 100665599 112095685 125348625 135221729 136584089 131839939 119225441 100321349
4370A00321349j8757131j4954406j1137531q466579o591635n320158m210512l321602
$$ 100321349 81564218 66609812 55472281 47005702 40414067 35093909 30883397 27561795
4362B7561795k545914k040478j657236j455561j189950j076223r06759q27029
$$ 27561795 25015881 22975403 21318167 19862606 18672656 17596433 16689674 15862645
4354A5862645p75903p48652o88011o59833n77422o21873n39022n42698m64592
$$ 15862645 15086742 14338090 13650079 12990246 12412824 11790951 11251929 10709231 10244639
4345A0244639m72499m66322l67374k58183k92950k24777k63956k65739k01624
$$ 10244639 9772140 9305818 8938444 8680261 8387311 8162534 7898578 7632839 7431215
4336G431215k40715j66216j37613j97350j78267j44489j24084j50056j48677j38738
$$ 7431215 7190500 7024284 6886671 6689321 6511054 6366565 6242481 6092425 5943748 5805010
4326E805010j26633j03468r1158n7539p5313j16758j04034q7449q9449q7927n4547
$$ 5805010 5678377 5574909 5483751 5426212 5350899 5234141 5130107 5042658 4953209 4865282 4810735
4315D810735o2995j18322j42793j77197p6287m8749j48324j32646q1760j1376
$$ 4810735 4747740 4629418 4486625 4309428 4233141 4184392 4036068 3903422 3821662 3810286
4305C810286n0793q8606j09939r633j0337j08162m8611n1834j14327j1505j11551
$$ 3810286 3759493 3670887 3560948 3551315 3540978 3432816 3384205 3332371 3218044 3206539 3094988
4294C094988K1702n2527j15665l2534n9818N471P751k7259K764M139m1295o606
$$ 3094988 3116690 3064163 2948498 2915964 2856146 2861617 2869368 2842109 2844873 2849012 2807717 2801111
4282B801111j9171M4988n0412k1826k9461n0581j15198m5897r111j18866l9192
$$ 2801111 2781940 2826928 2776516 2754690 2725229 2674648 2559450 2513553 2504442 2385576 2346384
4271B346384l5683K2324J966m4702j1096l4133L1223j754k9231L3330p1931j3521
$$ 2346384 2310701 2333025 2334991 2290289 2279193 2245060 2276283 2274529 2245298 2278628 2206697 2193176
4259B193176J5087m957J8736m9932M909O5564N5816j9750k2963N312K8125l9354
$$ 2193176 2208263 2203306 2222042 2172110 2177019 2242583 2298399 2278649 2255686 2260998 2289123 2249769
4247B249769m5038R737M0622k719J9113J1868p039j6019k3766M6257l0205k501
$$ 2249769 2204731 2214468 2255090 2252371 2271484 2283352 2276313 2260294 2236528 2282785 2252580 2250079
4235B250079K3946J5069j5188J7989l1177p5719l9488M8466N388J5119K2218o2677
$$ 2250079 2274025 2289094 2273906 2291895 2260718 2184999 2145511 2193977 2199365 2214484 2236702 2174025
4223B174025k5593J5295M7919k5969R510K704K0090M6240k704p1660o183K6030
$$ 2174025 2148432 2163727 2211646 2185677 2195187 2197891 2217981 2264221 2261517 2189857 2183674 2209704
4211B209704N9290L7929K6455m568P1715K8405n945N4310M1977N8433R955n450
$$ 2209704 2268994 2306923 2333378 2328810 2400525 2428930 2422985 2477295 2519272 2577705 2587660 2582210
4199B582210M7172R6991L9357O1774O4755N562Q2646P7847N8637L248J8779O5900
$$ 2582210 2629382 2726373 2765730 2827504 2892259 2897821 2980467 3058314 3116951 3120199 3138978 3204878
4187C204878J15388Q8418J06937Q6077P0235O0452J01319P6803L1003R6079R266
$$ 3204878 3320266 3408684 3515621 3601698 3671933 3732385 3833704 3910507 3941510 4037589 4046855
4176D046855J09788J38903Q3173J08390J18316J03848J68713J38032J12526J55061
$$ 4046855 4156643 4295546 4378719 4487109 4605425 4709273 4877986 5016018 5128544 5283605
4166E283605J39065J72550K06139J99686J77783K38044K59775K26868K87626K49156
$$ 5283605 5422670 5595220 5801359 6001045 6178828 6416872 6676647 6903515 7191141 7440297
4156G440297L34991L34615L15287K75276K04340K58220K65687L48892M20480M26672
$$ 7440297 7775288 8109903 8425190 8700466 8904806 9163026 9428713 9777605 10198085 10624757
4146A0624757N91870N25750O24168P57517P43002P03268Q20513Q88289Q84300
$$ 10624757 11216627 11742377 12366545 13124062 13867064 14570332 15390845 16279134 17163434
4137A7163434P65676P27946P20131O14269P19533O43815N37659M83343M98877
$$ 17163434 17929110 18657056 19377187 19991456 20710989 21354804 21892463 22375806 22874683
4128B2874683M40209M49142N13302N10859M92105N27466O13500P45207P18368
$$ 22874683 23314892 23764034 24277336 24788195 25280300 25807766 26421266 27166473 27884841
4119B7884841P20980P03857P15279O27843N04885L36990K63417J57375J47716
$$ 27884841 28605821 29309678 30024957 30652800 31157685 31494675 31758092 31915467 32063183
4110C2063183L8254k3292O519M9038J783j6732J03300J62031K43115J89972L26029
$$ 32063183 32101437 32078145 32084664 32133702 32135485 32118753 32222053 32384084 32627199 32817171 33143200
4099C3143200M20484M38909M00290M48047L35104J93219Q5472K7270J1269j18160
$$ 33143200 33563684 34002593 34402883 34850930 35186034 35379253 35464725 35491995 35503264 35385104
4089C5385104j06830j17386j48413k29713l43765m31260o05202p26303r40335
$$ 35385104 35278274 35160888 35012475 34782762 34438997 34007737 33402535 32676232 31735897
4080C1735897j011048j173199j245385j341404j353135j388571j333924j161490
$$ 31735897 30724849 29551650 28306265 26964861 25611726 24223155 22889231 21727741
4072B1727741j092487r66391r23077p77139p30676o15902n23353m72286l69832
$$ 21727741 20635254 19668863 18745786 17968647 17237971 16622069 16098716 15626430 15256598
4063A5256598l67117k86522l06451j88823j35084j75401j24803n5176j14081j47883
$$ 15256598 14889481 14602959 14296508 14107685 13972601 13797200 13672397 13617221 13503140 13355257
4053A3355257O739n3304l2518K1110L5799M7519O9045O6726N0643Q1595R9072
$$ 13355257 13361996 13308692 13276174 13297284 13333083 13380602 13449647 13516373 13567016 13648611 13747683
4042A3747683R6458J87178L09297K91585K59565L60025L51997M69621N52755N18418
$$ 13747683 13844141 14031319 14340616 14632201 14891766 15251791 15603788 16073409 16626164 17144582
4032A7144582N79512N96161O27366O93428O87405O84085P51883Q12354Q57498
$$ 17144582 17724094 18320255 18947621 19641049 20328454 21012539 21764422 22576776 23434274
4023B3434274R08669R27103R62911R92943J108546R97116R22573R60293Q83902
$$ 23434274 24342943 25270046 26232957 27225900 28334446 29331562 30254135 31214428 32098330
4014C2098330P24889N90556M80416M00383J87306J17038J01530j9560j02750j60367
$$ 32098330 32823219 33413775 33894191 34294574 34481880 34598918 34700448 34680888 34578138 34417771
4004C4417771r4236j56350j78278k20957j77754j89359k87015k58478j81678k85554
$$ 34417771 34323535 34167185 33988907 33767950 33590196 33400837 33113822 32855344 32673666 32388112
3994C2388112k22866j18781r2060p3727Q710k3372k0487n6422p1899j63156j05984
$$ 32388112 32165246 32046465 31954405 31880678 31889388 31866016 31845529 31789107 31717208 31554052 31448068
3983C1448068k07970l79890l33702l85644n32220o47884o59793p78844p39215
$$ 31448068 31240098 30860208 30526506 30140862 29608642 28960758 28300965 27522121 26782906
3974B6782906o86350o75325o68507n43605m77629m18679m54599m12918m99138
$$ 26782906 26096556 25421231 24752724 24209119 23731490 23312811 22858212 22445294 21946156
3965B1946156m99254n25895n83282n11756n56826o52913o85513o13957o72089
$$ 21946156 21446902 20921007 20337725 19825969 19269143 18616230 17930717 17316760 16644671
3956A6644671p50556o15623n80129n88621n51161m29491l98044m30232l42435
$$ 16644671 15894115 15278492 14698363 14109742 13558581 13129090 12731046 12300814 11958379
3947A1958379l04691k53471k65608k51794j76712j52018j68031j39265j69151
$$ 11958379 11653688 11400217 11134609 10882815 10706103 10554085 10386054 10246789 10077638
3938A0077638j44978r4959j48821q4757j14280j24139k51153j81388j84741k66627
$$ 10077638 9932660 9837701 9688880 9604123 9489843 9365704 9114551 8933163 8748422 8481795
3928H481795j12027k05302j65721j29697j11586n3731o6354n6167M5351N6306
$$ 8481795 8369768 8164466 7998745 7869048 7757462 7703731 7637377 7581210 7626561 7682867
3918G682867n7685k5268L6263P0848K0259P3468p991n0397J2261L617k0327K7833
$$ 7682867 7625182 7599914 7636177 7707025 7727284 7800752 7792761 7742364 7754625 7758242 7737915 7765748
3906G765748N8261O2114J30580K9851Q8152L3687L549l9839m1474o518o481q2880
$$ 7765748 7824009 7886123 8016703 8046554 8134706 8168393 8171942 8132103 8090629 8084111 8077630 7994750
3894G994750O821j453j0250l423K521k0563Q6488K3275k884K5521k7912J3981
$$ 7994750 8001571 8000118 7989868 7986445 7988966 7968403 8054891 8078166 8075282 8100803 8072891 8086872
3882H086872l2183J2310p200J2467R0870J8418O9951J42098J00482J70574J51300
$$ 8086872 8054689 8066999 8059799 8072266 8163136 8181554 8251505 8393603 8494085 8664659 8815959
3871H815959K19880J56284R8530J45022R7578M0671j0125K0145n5466k7228r7683
$$ 8815959 9035839 9192123 9290653 9435675 9533253 9573924 9563799 9583944 9528478 9501250 9403567
3860I403567j17978K3353M819n6758J7469J06464R8914J07028O9106J33938K12708
$$ 9403567 9285589 9308942 9313761 9257003 9274472 9380936 9479850 9586878 9655984 9789922 10002630
3849A0002630Q3712P3912K16887J88785J97204K47889J91686K03706L21413K41562
$$ 10002630 10086342 10160254 10377141 10565926 10763130 11011019 11202705 11406411 11727824 11969386
3839A1969386L16113K47600K83066K88263K91989K70699K95028L17213L29955
$$ 11969386 12285499 12533099 12816165 13104428 13396417 13667116 13962144 14279357 14609312
3830A4609312L64045M52984M41560M57977N85917O09784M96943O21887N96146
$$ 14609312 14973357 15426341 15867901 16325878 16911795 17521579 18018522 18640409 19236555
3821A9236555N87703N63639N47857O05984O06883O98576Q36808R36719R30014
$$ 19236555 19824258 20387897 20935754 21541738 22148621 22847197 23684005 24620724 25550738
3812B5550738J147608J295424J442042J583283J896978K105772K248877K368411
$$ 25550738 26698346 27993770 29435812 31019095 32916073 35021845 37270722 39639133
3804C9639133K460321K333784J874035R78123J24967p35448j272735j217420p80789
$$ 39639133 42099454 44433238 46307273 47285396 47410363 46674915 45402180 44184760 43403971
3795D3403971j98409K40947P19006J145094J431152J898498K227435K625611L047781
$$ 43403971 43205562 43446509 44165515 45310609 46741761 48640259 50867694 53493305 56541086
3786E6541086L498713L851849M311227M842691N299137N936251O590692P106452
$$ 56541086 60039799 63891648 68202875 73045566 78344703 84280954 90871646 97978098
3778I7978098P328329P403939P208586O872891O159616M798170K618828q18728
$$ 97978098 105306427 112710366 119918952 126791843 132951459 137749629 140368457 139549729
3770A39549729m548319p351707q729137q846861q100496p157469o477995o027400
$$ 139549729 135001410 127649703 118920566 110073705 101973209 94815740 88337745 82310345
3762H2310345n455678m826725m136990l428003k968086k533024k217406j820021
$$ 82310345 76854667 72027942 67890952 64462949 61494863 58961839 56744433 54924412
3754E4924412j596512j361981j266915j250221j286099j391744j425904j386006
$$ 54924412 53327900 51965919 50699004 49448783 48162684 46770940 45345036 43959030
3746D3959030j365240j372906j344464j160362j091614j016257r50064r18876
$$ 43959030 42593790 41220884 39876420 38716058 37624444 36608187 35658123 34739247
3738C4739247r20115r08352j001837j091016j093546j022161j049460r66287r23179
$$ 34739247 33819132 32910780 31908943 30817927 29724381 28702220 27652760 26686473 25763294
3729B5763294q54079q76654q58863p70520p74742p10752p47361o92513p80729
$$ 25763294 24909215 24032561 23173698 22403178 21628436 20917684 20170323 19477810 18697081
3720A8697081p10016o35927o11618n71621n46324m35706m54834m53437m65766
$$ 18697081 17987065 17351138 16739520 16167899 15621575 15185869 14731035 14277598 13811832
3711A3811832m52832l58274l77675m21631l40045l44587m28975l37959l13624
$$ 13811832 13359000 13000726 12623051 12201420 11861375 11516788 11087813 10749854 10436230
3702A0436230l30939k94720k77335k08485j65033k41953k25785j85984j44179
$$ 10436230 10105291 9810571 9533236 9324751 9159718 8917765 8691980 8505996 8361817
3693H361817j09299j57286j84919j74694j09904o8999j30878n3000q3324o8270
$$ 8361817 8252518 8095232 7910313 7735619 7625715 7556716 7425838 7372838 7289514 7221244
3683G221244j0359p1213K0469m7544q1454M42o0783l9616N87P3837p3666o6158
$$ 7221244 7210885 7139672 7160141 7112597 7031143 7031585 6970802 6931186 6931773 7005610 6931944 6865786
3671F865786r5715l9274o4156r3489n4203n1866j24025j26904o9083q2919q3999
$$ 6865786 6770071 6730797 6666641 6573152 6518949 6467083 6343058 6216154 6147071 6064152 5980153
3660E980153O747O396o4631K314k1757l4267k0975K1338J4961n3012L116J8668
$$ 5980153 5986900 5993296 5928665 5930979 5909222 5874955 5853980 5875318 5890279 5837267 5840383 5859051
3648E859051l1002l4858J9355M4289L436l6241l1865K2438k5209j102P0513J2798
$$ 5859051 5828049 5793191 5812546 5856835 5860271 5824030 5792165 5814603 5789394 5788292 5858805 5871603
3636E871603J3387L5386k1139l0287O172l5758j85994j05779j07528q9025m6353
$$ 5871603 5884990 5920376 5899237 5868950 5875122 5839364 5653370 5547591 5440063 5351038 5304685
3625E304685o9998l6899j0046N0931J0444K2128J3353l4149L3084L3791N0630
$$ 5304685 5234687 5197788 5187742 5238673 5249117 5271245 5284598 5250449 5283533 5317324 5367954
3614E367954J0088l5408o5342j25526p4532j01664j32680K4759n1649j6832J9032
$$ 5367954 5378042 5342634 5277292 5151766 5077234 4975570 4842890 4867649 4816000 4799168 4818200
3603D818200L7219N781N2357o06N4213M3088n3514k4698j811K730J1822p580K1221
$$ 4818200 4855419 4861200 4913557 4912951 4967164 5010252 4956738 4932040 4930229 4932959 4944781 4937201 4958422
3590D958422K0041P2193O3109k6408P2766O0009O2282O5981M6426K6896P6850
$$ 4958422 4978463 5050656 5113765 5087357 5160123 5220132 5282414 5348395 5394821 5421717 5498567
3579E498567P6260M2650K6462O2241O8557P496P147N6861M9120O6531n3453R1264
$$ 5498567 5574827 5617477 5643939 5706180 5774737 5782233 5789380 5846241 5895361 5961892 5908439 5999703
3567E999703L8380J18889J37998K2901J10904L7127O9555L6968Q2339O7312P6752
$$ 5999703 6038083 6156972 6294970 6317871 6428775 6465902 6535457 6572425 6654764 6722076 6798828
3556F798828R0860P5535J82180J03174K2779O0380N1196L1993O5299J09648J19183
$$ 6798828 6889688 6965223 7147403 7250577 7273356 7333736 7384932 7416925 7482224 7591872 7711055
3545G711055P5766J14675J46919J41627J75052J29403J70419K39117J96582K09479
$$ 7711055 7786821 7901496 8048415 8190042 8365094 8494497 8664916 8904033 9100615 9310094
3535I310094K45093K84745L68306L56732L33886M03794L85334M62997N25249N51373
$$ 9310094 9555187 9839932 10208238 10564970 10898856 11302650 11687984 12150981 12676230 13227603
3525A3227603O33234N72219P03107P42726P77539O74169Q17032P15824O10138
$$ 13227603 13860837 14433056 15136163 15878889 16656428 17330597 18147629 18863453 19473591
3516A9473591O21797M29154M01245L14981L15428L09429K81784K70079L17303
$$ 19473591 20095388 20524542 20925787 21240768 21556196 21865625 22147409 22417488 22734791
3507B2734791L06963L50413L40381L48029K70692K24457L37444L17514K96042
$$ 22734791 23041754 23392167 23732548 24080577 24351269 24575726 24913170 25230684 25526726
3498B5526726L98699M58814M67098O85124Q60912R48685J097485J348118J516137
$$ 25526726 25925425 26384239 26851337 27536461 28397373 29346058 30443543 31791661 33307798
3489C3307798J703790J875512J984093K090284K192826K215921K091218K025384
$$ 33307798 35011588 36887100 38871193 40961477 43154303 45370224 47461442 49486826
3481D9486826J793087J518539J200572Q92822M83116K02562r515k35968l76122
$$ 49486826 51279913 52798452 53999024 54891846 55374962 55577524 55568009 55332041 54955919
3472E4955919m14791m89772o06974o91637q15602j045548j217559j460538j733244
$$ 54955919 54541128 54051356 53444382 52752745 51937143 50891595 49674036 48213498 46480254
3463D6480254j993818k122198k329088k373960k296478k252271k135645j994246
$$ 46480254 44486436 42364238 40035150 37661190 35364712 33112441 30976796 28982550
3455B8982550j862960j657178j516061j399270j273732j051953r32887r08843
$$ 28982550 27119590 25462412 23946351 22547081 21273349 20221396 19288509 18379666
3447A8379666p97279p33744n76491n95593o32567n07523m40432m62440l58128
$$ 18379666 17582387 16848643 16272152 15676559 15043992 14536469 14096037 13633597 13275469
3438A3275469l12190l18115l50458k66311k26974j71889j68870j11154j92037
$$ 13275469 12963279 12645164 12294706 12028395 11801421 11629532 11460662 11349508 11157471
3429A1157471j37321n5755j54013q5991j22025p9075L2852o4951p8211K1476n459
$$ 11157471 11020150 10964395 10810382 10724391 10602366 10523291 10556143 10491192 10412981 10434457 10428998
3418A0428998l7621P2590J3533k7737P0395N4418J36031M4335M3824J4664M480
$$ 10428998 10391377 10463967 10477500 10449763 10520158 10574576 10710607 10754942 10798766 10813430 10817910
3407A0817910L8455K1613O651Q0165L7147Q9232O0353P129Q2167K28O3331J17351
$$ 10817910 10856365 10877978 10884629 10964794 11001941 11091173 11151526 11158655 11240822 11241050 11304381 11421732
3395A1421732J41551Q4734J82748J35408J80831K10555J77564K23226K90181K27349
$$ 11421732 11563283 11648017 11830765 11966173 12147004 12357559 12535123 12758349 13048530 13275879
3385A3275879K62557L18338M12112L86406L93462N16885M91031N69971O79541
$$ 13275879 13538436 13856774 14268886 14655292 15048754 15565639 16056670 16626641 17306182
3376A7306182O77923P67547Q78474Q88049J020070J124845J290636J325949J423909
$$ 17306182 17984105 18751652 19630126 20518175 21538245 22663090 23953726 25279675 26703584
3367B6703584J583980J625637J696953J775589J825205J721805J636397J482830
$$ 26703584 28287564 29913201 31610154 33385743 35210948 36932753 38569150 40051980
3359D0051980J413860J171723R21191O10209L54700J02183l11824o05422p97826
$$ 40051980 41465840 42637563 43558754 44168963 44523663 44625846 44314022 43708600 42910774
3350D2910774r37212j147790j147029j088183j019767r45876q48580p26624n10408
$$ 42910774 41973562 40825772 39678743 38590560 37570793 36624917 35776337 35049713 34539305
3341C4539305l93110k48093N3229K19399L19279N09305O71200P70050R29958J157727
$$ 34539305 34146195 33898102 33951331 34170730 34490009 34999314 35670514 36440564 37370522 38528249
3331C8528249J371077J564233J736791K013127K184611K479738K759297K997417
$$ 38528249 39899326 41463559 43200350 45213477 47398088 49877826 52637123 55634540
3323E5634540L252177L543322L855980L992034M111252M138278M104521L852961
$$ 55634540 58886717 62430039 66286019 70278053 74389305 78527583 82632104 86485065
3315H6485065L573074L188273K661890K081822J386792P47999J70213l87157q39519
$$ 86485065 90058139 93246412 95908302 97990124 99376916 100124915 100295128 99907971 99068452
3306I9068452j249851j575166j909889k200988k448850k678317k946895l147916
$$ 99068452 97818601 96243435 94333546 92132558 89683708 87005391 84058496 80910580
3298H0910580l311891l475897l592580l690413l734330l743272l548232l479503
$$ 80910580 77598689 74122792 70530212 66839799 63105469 59362197 55813965 52334462
3290E2334462l289967l088432k853444k661652k483164k225920j973232j830216
$$ 52334462 49044495 45956063 43102619 40440967 37957803 35731883 33758651 31928435
3282C1928435j680634j453968j364134j163660j082850r97054q87043q01269p28376
$$ 31928435 30247801 28793833 27429699 26266039 25183189 24186135 23299092 22497823 21769447
3273B1769447o43004n93276n26269m77246m10462l75667l49872k67927j65632
$$ 21769447 21126443 20533167 20006898 19529652 19119190 18743523 18393651 18125724 17960092
3264A7960092j69601p9651n9430r7028o4339k0171J5945o4914R662m1908j22554
$$ 17960092 17790491 17710840 17651410 17554382 17490043 17469872 17485817 17420903 17430565 17388657 17266103
3253A7266103j22852j52949k91043k77130l08286l67150m96677m65443n60494
$$ 17266103 17143251 16990302 16699259 16422129 16113843 15746693 15250016 14784573 14224079
3244A4224079n05147m79121m59389m36074m75684l50885l07144l81175l07282
$$ 14224079 13718932 13239811 12780422 12344348 11868664 11517779 11210635 10829460 10522178
3235A0522178l09164k16231j77587k69268j80659j62069j07676j17641k7314j10908
$$ 10522178 10213014 9996783 9819196 9549928 9369269 9207200 9099524 8981883 8954569 8843661
3225H843661p8961o2677n4192p8244q6816n3881o8939J3000n5648J7194o7034
$$ 8843661 8764700 8702023 8647831 8569587 8482771 8428890 8359951 8372951 8317303 8334497 8267463
3214H267463n8309L5093j8285K173O5744O5847j1612l465Q0057L8730P9027N6860
$$ 8267463 8209154 8244247 8225962 8228135 8293879 8359726 8348114 8344649 8424706 8463436 8542463 8599323
3202H599323Q0695R7697J8916O8376O3686K33044J10187O9790J75664J63118J20478
$$ 8599323 8680018 8777715 8796631 8865007 8928693 9161737 9271924 9341714 9517378 9680496 9800974
3191I800974J90039J48558K49549K05840J42538J86837K15112J26905K01621K31928
$$ 9800974 9991013 10139571 10389120 10594960 10737498 10924335 11139447 11266352 11467973 11699901
3181A1699901K13772J54784K22806K33756K49290K57792K44911L29678L27765
$$ 11699901 11913673 12068457 12291263 12525019 12774309 13032101 13277012 13606690 13934455
3172A3934455L10558L01077L43585L34363L80888M36396M62049M60430M36731
$$ 13934455 14245013 14546090 14889675 15224038 15604926 16041322 16503371 16963801 17400532
3163A7400532N05765N67670M98703N85862N04348N05532L65076L35185L83200
$$ 17400532 17906297 18473967 18972670 19558532 20062880 20568412 20933488 21268673 21651873
3154B1651873K74850K97539L96317L80513L29534L90060M23307N31391M53921
$$ 21651873 21926723 22224262 22620579 23001092 23330626 23720686 24143993 24675384 25129305
3145B5129305N00177M97894M29706L80473M23851N26223M48689M40574M62171
$$ 25129305 25629482 26127376 26557082 26937555 27361406 27887629 28336318 28776892 29239063
3136B9239063M75686N24110O64550N30289N89808O52832O82421O87208P31057
$$ 29239063 29714749 30238859 30903409 31433698 32023506 32676338 33358759 34045967 34777024
3127C4777024Q92843R92403J061291J143484J243234J381919J532086J574544
$$ 34777024 35669867 36662270 37723561 38867045 40110279 41492198 43024284 44598828
3119D4598828J765247J917911K094963K304858K473320K649774K725204K864710
$$ 44598828 46364075 48281986 50376949 52681807 55155127 57804901 60530105 63394815
3111F3394815K927186K841571K677840K493929K263628J954760J623444J455862
$$ 63394815 66322001 69163572 71841412 74335341 76598969 78553729 80177173 81633035
3103H1633035J232345J149882J105191J074129J205146J150413J160565J039066
$$ 81633035 82865380 84015262 85120453 86194582 87399728 88550141 89710706 90749772
3095I0749772R10283O88451L43418J27933k25915n04234p10308r54091j172906
$$ 90749772 91660055 92348506 92691924 92819857 92593942 92089708 91379400 90425309 89252403
3086H9252403j277761j297836j281237j273859j183851j120179j082374r63594
$$ 89252403 87974642 86676806 85395569 84121710 82937859 81817680 80735306 79771712
3078G9771712r18458q90555r05634j016341j118315j338859j530441j836918k212671
$$ 79771712 78853254 77962699 77057065 76040724 74922409 73583550 72053109 70216191 68003520
3069F8003520k527826k934014l210368l312395l401306l352000l061775k670859
$$ 68003520 65475694 62541680 59331312 56018917 52617611 49265611 46203836 43532977
3061D3532977k412383k096830j786031j520810j191981j019531q40124p07430
$$ 43532977 41120594 39023764 37237733 35716923 34524942 33505411 32665287 31957857
3053C1957857o16165q35361r64734r08888q07175p82364n04217l25169l48733
$$ 31957857 31341692 30506331 29541597 28632709 27825534 27043170 26538953 26213784 25865051
3044B5865051k51502m0508l1619p2470n2466m170K0666m535l4657q8418P37p9172
$$ 25865051 25613549 25573041 25541422 25468952 25416486 25412316 25432982 25428447 25393790 25305372 25306109 25226937
3032B5226937n213M0002N9274J45965J20369M8862J01905K63005O042p32313j105834
$$ 25226937 25221724 25261726 25321000 25466965 25587334 25636196 25738101 26001106 26007148 25274835 24169001
3021B4169001j120414j025582q82356q43945p19377o05917o01675m94807m70066
$$ 24169001 23048587 22023005 21140649 20296704 19577327 18971410 18369735 17874928 17404862
3012A7404862l80348k97208l26998k25030j65866j17413m7928m6697P174Q7148
$$ 17404862 17024514 16727306 16400308 16175278 16009412 15891999 15844071 15797374 15804548 15891696
3002A5891696J23798J81742J48369K09940J93472K51660L34265J76592j64608
$$ 15891696 16015494 16197236 16345605 16555545 16749017 17000677 17334942 17511534 17346926
2993A7346926j66171j47811r1817K6151J33208K15264K03208L47038M09098N01274
$$ 17346926 17180755 17032944 16941127 16967278 17100486 17315750 17518958 17865996 18275094 18776368
2983A8776368M83790N77943O73549P67242Q04808Q80711R59743R59527R82816
$$ 18776368 19260158 19838101 20511650 21278892 22083700 22964411 23924154 24883681 25866497
2974B5866497J061040J021805J043818J049086J047557J059659R88546R50088
$$ 25866497 26927537 27949342 28993160 30042246 31089803 32149462 33138008 34088096
2966C4088096R08795Q81278Q48004Q84838R17141J008716J131384J250879J549658
$$ 34088096 34996891 35878169 36726173 37611011 38528152 39536868 40668252 41919131 43468789
2957D3468789J784192K073869K395278K622602K934585L040114L244994L217031
$$ 43468789 45252981 47326850 49722128 52344730 55279315 58319429 61564423 64781454
2949F4781454K991697K839413K407212J791529J024385J50270q09345j666833
$$ 64781454 67773151 70612564 73019776 74811305 75835690 75985960 75176615 73509782
2941G3509782k576091l331378l803175m141727m353415m365587m171382l788787
$$ 73509782 70933691 67602313 63799138 59657411 55303996 50938409 46767027 42978240
2933D2978240l518465l177416k785953k566696k169183j876623j722045j443580
$$ 42978240 39459775 36282359 33496406 30929710 28760527 26883904 25161859 23718279
2925B3718279j368599j222075j060292j001718q66210q79157p30703o44780o85160
$$ 23718279 22349680 21127605 20067313 19065595 18199385 17320228 16589525 15944745 15259585
2916A5259585o05767m87659n27876n55787m85871l85078l89217l35338l30960
$$ 15259585 14653818 14166159 13638283 13082496 12596625 12211547 11822330 11486992 11156032
2907A1156032l37525k75636k74287j59588k74815k69640j97265j54531j76419
$$ 11156032 10818507 10542871 10268584 10108996 9834181 9564541 9367276 9212745 9036326
2898I036326k25626j89985j73065j38565j08823j63967j88053j48643j15176j30889
$$ 9036326 8810700 8620715 8447650 8309085 8200262 8036295 7848242 7699599 7584423 7453534
2888G453534j24144j00327j42290j65971j66878j18591r8642m4145j33507q2833
$$ 7453534 7329390 7229063 7086773 6920802 6753924 6635333 6536691 6492546 6359039 6276206
2878F276206p5255p2484r6992j14520l6707p8324n5873L3251j37721q7220l5013
$$ 6276206 6200951 6128467 6031475 5916955 5880248 5801924 5746051 5779302 5641581 5554361 5519348
2867E519348j7575q1394o2201j9164o1966k3635n1190n5226j33454o6161K8498
$$ 5519348 5501773 5420379 5358178 5339014 5277048 5253413 5202223 5146997 5013543 4947382 4975880
2856D975880p2507m469q905r8339q363m4176n6483k6197k2182m6895p3115j7430
$$ 4975880 4903373 4898904 4889999 4791660 4783297 4739121 4682638 4656441 4634259 4587364 4514249 4496819
2844D496819l6444L4038M915o9092P620J7407M57O1748J9573k3564J14493L5063
$$ 4496819 4460375 4494413 4499328 4430236 4437856 4455263 4455720 4517468 4537041 4513477 4627970 4663033
2832D663033K8890Q4198o843L0027O1147M1670k4278L6449P6278k7835N6035O5812
$$ 4663033 4691923 4776121 4769278 4799305 4860452 4902122 4877844 4914293 4990571 4962736 5018771 5084583
2820E084583Q2778K3850M1158R2520J8914P6529M5694K9951J30991P1698Q8695
$$ 5084583 5167361 5191211 5232369 5324889 5343803 5420332 5466026 5495977 5626968 5698666 5787361
2809E787361J10807K7623J04275J24069P4641P1824M1399N3780J60490R7960O2275
$$ 5787361 5898168 5925791 6030066 6154135 6228776 6300600 6341999 6395779 6556269 6654229 6716504
2798F716504Q6727J41929J14490J16242J85784J26591K05405J84485K53428J91771
$$ 6716504 6803231 6945160 7059650 7175892 7361676 7488267 7693672 7878157 8131585 8323356
2788H323356K35998K49622J96240K37870J78619K06251K19113K46093K91638J65873
$$ 8323356 8559354 8808976 9005216 9243086 9421705 9627956 9847069 10093162 10384800 10550673
2778A0550673K59869K49585K86281K54496K62744L53044L52532M00775L98287
$$ 10550673 10810542 11060127 11346408 11600904 11863648 12216692 12569224 12969999 13368286
2769A3368286M08468M23275M35139M90952M85847M51663M68047M41897M54352
$$ 13368286 13776754 14200029 14635168 15126120 15611967 16063630 16531677 16973574 17427926
2760A7427926M46100L80841L55424L71496N61281O14756O55635P47851P68561
$$ 17427926 17874026 18254867 18610291 18981787 19543068 20157824 20813459 21561310 22329871
2751B2329871P29634Q75071R86403R22031J029345J040603J147167J203765J318892
$$ 22329871 23059505 23934576 24920979 25843010 26872355 27912958 29060125 30263890 31582782
2742C1582782J458912J490439J625287J767958J945106K064331K258638K374212
$$ 31582782 33041694 34532133 36157420 37925378 39870484 41934815 44193453 46567665
2734D6567665K496460K746048K955453L300077L524378L798177M125928M560356
$$ 46567665 49064125 51810173 54765626 58065703 61590081 65388258 69514186 74074542
2726G4074542M939454N295365N516033N449039N310967M896674L981053K461792
$$ 74074542 79013996 84309361 89825394 95274433 100585400 105482074 109463127 111924919
2718A11924919P18241r5261K25042J308875K824183M311563N959350P462164Q968084
$$ 111924919 112643160 112547899 112772941 114081816 116905999 121217562 127176912 134639076 143607160
2709A43607160J0613080J2226379J3946478J5448140J6479378J6681467J6010774
$$ 143607160 154220240 166446619 180393097 195841237 212320615 229002082 245012856
2702B45012856J4213328J0320922L340002o345402j5919395k2052450k4003041
$$ 245012856 259226184 269547106 272887108 266541706 250622311 228569861 204566820
2695B04566820k2955678k0626572j7743117j5192182j2888486j1039600r395244
$$ 204566820 181611142 160984570 143241453 128049271 115160785 104121185 94725941
2688I4725941p982975o959644n931648n153708m550552l963336l523724l237758
$$ 94725941 86742966 79783322 73851674 68697966 64147414 60184078 56660354 53422596
2680E3422596k949525k767960k547313k345091k218335k056137j856473j863686
$$ 53422596 50473071 47705111 45157798 42812707 40594372 38538235 36681762 34818076
2672C4818076j625682j449261j413870j251229j157659j068058r63164q61842
$$ 34818076 33192394 31743133 30329263 29078034 27920375 26852317 25889153 25027311
2664B5027311q02275q08503p44063o42411o47721o19560n88711n57548n66288
$$ 25027311 24225036 23416533 22672470 22030059 21382338 20762778 20174067 19616519 19050231
2655A9050231n28312m83255m19737m09972l56586l08827l62231k33975l16575
$$ 19050231 18521919 18038664 17618927 17208955 16852369 16543542 16181311 15947336 15630761
2646A5630761l06515k74156l16669k91488j88904k21090k52314j92537k53993
$$ 15630761 15324246 15050090 14733421 14441933 14253029 14031939 13779625 13587088 13333095
2637A3333095j88731j88113k26433j90292k02925l01183l39780l38043m17392
$$ 13333095 13144364 12956251 12729818 12539526 12336601 12035418 11695638 11357595 10940203
2628A0940203m54067l61780l85959k54057l25368l62470l00283k93284k38056
$$ 10940203 10486136 10124356 9738397 9484340 9158972 8796502 8496219 8202935 7964879
2619G964879k17500j70773r3030j39717j80928p6442k6756r8259o6390j8093j40518
$$ 7964879 7747379 7576606 7483576 7343859 7162931 7086489 7059733 6961474 6895084 6876991 6736473
2608F736473o6062p1826j37785q1549j09343j16924j14942j19200j03402r8892
$$ 6736473 6670411 6598585 6460800 6379251 6269908 6152984 6038042 5918842 5815440 5716548
2598E716548j19528j51642j03754n3535o3523p4119l3449o4810k1423j4994q2629
$$ 5716548 5597020 5445378 5341624 5288089 5224566 5150447 5116998 5052188 5030765 5015771 4933142
2587D933142j12803J0051j07711p5577p771k7236n9124k9557m8909L256l7979
$$ 4933142 4820339 4830390 4722679 4647102 4639331 4612095 4552971 4523414 4474505 4477761 4439782
2576D439782p8785k1629p1504k5763k8298m4751o5522K48N9731k7815N3050n2728
$$ 4439782 4360997 4339368 4267864 4242101 4213803 4169052 4103530 4103778 4163509 4135694 4188744 4136016
2564D136016j8086j5361l9926L740o8387r516m5701M380n939q0102p1920o8878
$$ 4136016 4117930 4102569 4062643 4066383 3997996 3988480 3942779 3947159 3941220 3861118 3789198 3720320
2552C720320o5139o3820o5778q1158o1784o9012j27224q3452q1301o3315l2128
$$ 3720320 3655181 3591361 3525583 3444425 3382641 3313629 3186405 3102953 3021652 2958337 2926209
2541B926209j02498m8042m2204o3760o3090k0181j3173p9826p2818m2223q4524
$$ 2926209 2823711 2775669 2733465 2669705 2606615 2586434 2573261 2493435 2420617 2378394 2293870
2530B293870j1965P95k0017n0199o5704l0340K250k1833m4207L4218q6103j4919
$$ 2293870 2281905 2282700 2262683 2212484 2146780 2116440 2118690 2096857 2052650 2086868 2000765 1985846
2518A985846q5702j6597K0266N225N4949j7766o0515J3079p0505o2387l5409o8394
$$ 1985846 1900144 1883547 1903813 1909038 1963987 1946221 1885706 1898785 1828280 1765893 1730484 1662090
2506A662090l0445O6270m9813j8907L1871j6393n8886J8380o797O499l8804q01
$$ 1662090 1631645 1697915 1648102 1629195 1661066 1644673 1585787 1604167 1597370 1603869 1565065 1564264
2494A564264K8833k043L0858m8279p194J466l5058k2680J03394k0537j4792k0956
$$ 1564264 1593097 1591054 1621912 1573633 1566439 1567905 1532847 1510167 1613561 1593024 1578232 1557276
2482A557276l4267q354n19p3858K3107J0378l289k0729n088M5207P4245L5475
$$ 1557276 1523009 1514655 1514136 1440278 1463385 1473763 1470474 1449745 1444657 1489864 1564109 1599584
2470A599584n474K6569M0772Q062J1594j1338k6228J3182M6983l6811j3418M3306
$$ 1599584 1594110 1620679 1661451 1669513 1681107 1669769 1643541 1656723 1703706 1666895 1653477 1696783
2458A696783J2960L7634J1280P9028K5205j2873P5806Q3373P7367R6407m116N3098
$$ 1696783 1709743 1747377 1758657 1837685 1862890 1850017 1925823 2009196 2086563 2182970 2178854 2231952
2446B231952Q7649M4413k5095N467l0982j50668j34234l8458j27353j86843o3945
$$ 2231952 2319601 2364014 2338919 2344386 2313404 2162736 2028502 1990044 1862691 1675848 1611903
2435A611903l4915r6293q9689l6226o0203m5401n8590l3610j4566N2699O534o4938
$$ 1611903 1576988 1480695 1391006 1354780 1294577 1249176 1190586 1156976 1142410 1195109 1201643 1136705
2423A136705m9548J7336K8669m9009l9096o6834J6902L1241n1826p7419L7623
$$ 1136705 1087157 1104493 1133162 1084153 1045057 978223 995125 1026366 974540 897121 934744
2412I34744r731j1248r580m2766m842J5590K4677Q83K6086l4649n6290m6435j841
$$ 934744 925013 913765 904185 861419 856577 872167 896844 897727 923813 889164 832874 786439 784598
2399G84598P1993k276m4849n8464J3520L2027L7366p2457m7176k5465j7544N7608
$$ 784598 856591 854315 809466 751002 764522 796549 833915 761458 714282 688817 671273 728881
2387G28881m7743n2887L9779L9003l7039J8161j0201M0464l390n0610L3625K575
$$ 728881 681138 628251 668030 707033 669994 688155 677954 718418 715028 664418 698043 700618
2375G00618j1105m6768j9998K5151p1392k4444m269m7200o897L6871j6577K515
$$ 700618 689513 642745 622747 647898 576506 552062 547793 500593 493696 530567 513990 516505
2363E16505Q4011l1230l7345P385J669J230J4045j9007M1002n8404m1896k8089
$$ 516505 600516 569286 531941 539326 540995 542225 556270 537263 578265 519861 477965 449876
2351D49876M5063J8478q8662K9720k088M2376N244l6585K7057J3869k0200N6878
$$ 449876 494939 513417 424755 454475 452387 494763 500007 463422 490479 504348 484148 541026
2339E41026m4797k4172J5138K0902Q059n1928k7119P590M0060N5490J3185j08347
$$ 541026 496229 472057 487195 508097 516156 464228 437109 444699 484759 540249 553434 445087
2327D45087j2010N4932k4354J9380K3788J2538j5574L3287q5639K1624k0587l0638
$$ 445087 433077 488009 463655 483035 506823 519361 503787 537074 451435 473059 452472 421834
2315D21834L2333O80l5916K2082k2223J9890k1325m0900L5823k9759l254J0602
$$ 421834 454167 454847 418931 441013 418790 438680 417355 376455 412278 382519 379265 389867
2303C89867j20l945L4690k5706P8M2685j1140P1390k9447q3751j3696L7872L7975
$$ 389867 389747 385802 420492 394786 394864 437549 426409 497799 468352 384601 370905 408777 446752
2290D46752j7967k7737j1023P3284J5227J4468O0111k4096j6397o2835n2222j8639
$$ 446752 428785 401048 390025 463309 478536 493004 553115 529019 512622 449787 397565 378926
2278C78926n0609j183N6761L1476l6961n5356K7551k1917j0216K0105j885j4229
$$ 378926 328317 327134 383895 415371 378410 323054 350605 328688 318472 338577 336692 322463
2266C22463j900J2806r263R088l4523l5180N376L8516n7546k3576M9148M1030
$$ 322463 320563 333369 324106 333194 298671 263491 268867 307383 249837 226261 275409 316439
2254C16439o4845L0234j0523R752j4915O76M7425n741K0296P074j8334K637l873
$$ 316439 251594 281828 271305 281057 266142 266818 314243 308502 328798 335872 317538 320175 316302
2241C16302P9549n6393p8639Q671O5429P320K0301l2691j7461J1764k2615M1129
$$ 316302 395851 339458 260819 269490 334919 342239 362540 329849 312388 324152 301537 342666
2229C42666j4350L1462j6318j2745L5698O336q657M6562M5599r3919J0953l6367
$$ 342666 328316 359778 343460 330715 366413 372749 364092 410654 456253 362334 373287 336920
2217C36920J8794K3751j375m4905K4639R676n7133N8408j1433o0967l265P6961
$$ 336920 355714 379465 378090 333185 357824 367500 310367 368775 357342 296375 293110 370071
2205C70071p2748n7215P9909O574k1658n3090P068O1417j7962N332m3264j2367
$$ 370071 297323 240108 320017 326591 304933 251843 258911 320328 302366 307698 264434 252067
2193B52067J457l5647j0119K8920j8551R361M1746L16J594k7042K2903J2487m9193
$$ 252067 253524 217877 207758 236678 218127 227488 269234 269550 271144 244102 267005 279492 230299
2180B30299k597O157J6800M0831n340k0963l001K9227j3376j4747O1167J3806
$$ 230299 227702 233859 250659 291490 286150 265187 262186 291413 278037 263290 324457 338263
2168C38263k348k1086j7326p028O8194J6049n304l8968K3621J2359k2959p584
$$ 338263 335915 314829 297503 290475 358669 374718 369414 330446 354067 366426 343467 335883
2156C35883o223J7297l9515L4458p791N6260R503J9986k5570q937j7288m3589
$$ 335883 329660 346957 307442 341900 334109 390369 399872 419858 394288 385351 368063 324474
2144C24474j0101M3549O07j3874J6325j0333R817N1664M802o673j5664n619J5514
$$ 324474 314373 357922 358529 344655 360980 350647 360464 412128 416930 410257 394593 388974 404488
2131D04488L4332M4067j0215M2067K2498k4335k253M6750L432j6558J4418j368
$$ 404488 438820 482887 472672 514739 537237 512902 510649 557399 560831 544273 558691 557323
2119E57323K403L6242k099L8364L7169l9148K5921L8197J0330J4318n3385L0520
$$ 557323 559726 595968 593869 632233 669402 630254 656175 694372 704702 719020 665635 696155
2107F96155L1715l4975q357L1238N1956N9171l7715O2455L1740j5486L9024J08902
$$ 696155 727870 692895 684538 715776 767732 826903 789188 851643 883383 867897 906921 1015823
2095A015823K3255J5601K5447Q7187M3133L3845m0739M7056O6886R0724K795P9625
$$ 1015823 1039078 1054679 1080126 1167313 1210446 1244291 1203552 1250608 1317494 1408218 1411013 1490638
2083A490638K1380J2368N8817O8561J07714J43701K0780P6641N0501J14676M8362
$$ 1490638 1512018 1524386 1583203 1651764 1759478 1903179 1923959 2000600 2051101 2165777 2214139
2072B214139Q2880N1058J20573J21683J56039J08294J73742J38007K62899K25766
$$ 2214139 2297019 2348077 2468650 2590333 2746372 2854666 3028408 3166415 3429314 3655080
2062C655080K94355L34099L64162M75914M62246N39904O53790O00762O43519O91955
$$ 3655080 3949435 4283534 4647696 5123610 5585856 6125760 6779550 7380312 8023831 8715786
2052H715786R74670J078261J469406J822414K577122K858566L156735K995729
$$ 8715786 9690456 10768717 12238123 14060537 16637659 19496225 22652960 25648689
2044B5648689L859923L053523l476915n124114m912597l798089k658339j961844
$$ 25648689 29508612 32562135 29085220 23961106 19048509 15250420 12592081 10630237
2036A0630237j606581j282474q73773o86659n74672l38845k40909l69008l36783
$$ 10630237 9023656 7741182 6867409 6180750 5606078 5267233 5026324 4657316 4320533
2027D320533k67220l47135k57017j69311k57189j92569j09479j95702j81589j14997
$$ 4320533 4053313 3706178 3449161 3279850 3022661 2830092 2720613 2524911 2343322 2228325
2017B228325n7420r9544j36336j01446j03649p9562o3282j3727k7502p2084j07399
$$ 2228325 2170905 2071361 1935025 1833579 1729930 1650368 1587086 1573359 1545857 1473773 1366374
2006A366374j3320p3737q571j8005P583l8026o7806j1403q6268l2160J7921m0659
$$ 1366374 1353054 1279317 1270746 1252741 1260324 1222298 1154492 1143089 1056821 1024661 1042582 1001923
1994A001923Q85p5429K6207l8240K1615j1043j8015q612n2180O714k3056n3001
$$ 1001923 1002808 927379 953586 915346 936961 925918 907903 899291 847111 853825 830769 777768
1982G77768J7215j5581m6427k8362K8359O299n9509q4452l7311j2533N0204m8575
$$ 777768 794983 779402 732975 704613 732972 739271 679762 595310 557999 545466 595670 547095
1970E47095m4269P295o303l6365J7986K5522p5354p7119L5315j2227j3692J6029
$$ 547095 502826 510121 503818 467453 485439 510961 435607 358488 393803 381576 367884 383913
1958C83913k2812K2091K7683k3824K6157L2388k9670N121L2813J3491j1616n638
$$ 383913 361101 383192 410875 387051 413208 445596 415926 421047 453860 467351 455735 450097
1946D50097n4547j7222o0519K52O8170K0007n6957k7085J1775M268L3300l1225
$$ 450097 395550 378328 317809 318061 386231 406238 349281 322196 333971 338239 371539 340314
1934C40314K3512j09l9295k4116K6503j5622l2933N0993m625l8716K0603J3014
$$ 340314 363826 363717 324422 300306 326809 311187 278254 329247 324622 285906 306509 319523
1922C19523P6510p1988O1641o9333K302j5772m5441L8415k509N087k3371j1720
$$ 319523 396033 324045 385686 316353 318655 302883 257442 295857 293348 298435 275064 263344
1910B63344j5102n5739O1296J7693q367K9056p6j8623k5700K3632L1904N8984
$$ 263344 248242 192503 253799 271492 263125 292181 292105 273482 247782 271414 303318 362302
1898C62302n0819o6285L0785R517k4549m3773L7786R860j0020k0624j5048l4884
$$ 362302 311483 245198 275983 285500 260951 217178 254964 264824 254804 234180 219132 184248
1886A84248K8315L68P2913q0326l2481K9241m0416k3547j6488Q2323j4787Q578
$$ 184248 212563 212931 285844 205518 173037 202278 161862 138315 121827 204150 189363 197941
1874A97941l934j744J234n5202Q174J5415J9812J3784M838q115O357M8385k8661
$$ 197941 194007 192263 193497 138295 146469 161884 181696 195480 200318 192203 198560 246945 218284
1861B18284o1085k804M819N7963O2368n7768o8221L6345M160r9746M1618P7572
$$ 218284 157199 154395 159214 217177 279545 221777 153556 189901 194061 94315 135933 213505
1849B13505m5445k8798j7454p963K2713L3557L7088p775l9478J5156L0888o9020
$$ 213505 168060 139262 121808 113845 136558 170115 207203 199428 159950 175106 205994 136974
1837A36974O43k4964O3636j1534P37O361N0271j6023Q504j6049J215m2860L6233
$$ 136974 137617 112653 176289 164755 165492 171853 222124 206101 214605 198556 199771 156911 193144
1824A93144n0204M2630M3943M368m0333j2753K0002l143n5875K3762K4520N9570
$$ 193144 142940 185570 229513 233881 193548 180795 200797 197654 141779 165541 190061 249631
1812B49631L209j4500M307o07Q905j2562J3961l647P27P261N787l458o972K7077
$$ 249631 252840 238340 242647 242040 250945 238383 252344 248697 249424 256685 262472 259014 252042 279119
1798B79119p7585n2222M5623J6012k4997J7008m732J3635n4875L1671J6566J1425
$$ 279119 201534 149312 194935 210947 185950 202958 198226 211861 156986 188657 205223 216648
1786B16648m6750j5410l3831j2214L0791j7522J673k8971J0059j097L1902p913
$$ 216648 169898 154488 120657 108443 139234 121712 123385 94414 104473 103376 135278 127365
1774A27365p136J0990R033q971N146k4455O402n8538P5379k210n0493K2657N7469
$$ 127365 120229 131219 140252 131281 136427 111972 118374 59836 135215 133005 82512 105169 162638
1761A62638k8295n823R015J7301J1154L113k275k8045j6974K384M1678O044o1828
$$ 162638 134343 128520 137535 154836 165990 169103 166828 138783 121809 124193 165871 171915 110087
1748A10087P513j6366J9923n6k1826J0065K51j3588L1569j1738K5937p185K9394
$$ 110087 117600 101234 121157 121101 99275 109340 109591 96003 127572 115834 141771 134586 163980
1735A63980j651o9850l1789O3558j4524K687k8146O131N9417L3198o4342r685
$$ 163980 162329 92479 60690 124248 109724 112411 84265 90396 149813 183011 118669 108984
1723A08984J2949J5522n915P646J2350J1247n5274j7882K0974J3089l1453K0575
$$ 108984 121933 137455 131540 139186 151536 162783 107509 89627 110601 123690 92237 112812
1711A12812m5545j3387L2259m5338N0843L696J9872k865m9380K3502P0550k8559
$$ 112812 67267 53880 86139 40801 91644 95340 115212 112347 62967 86469 157019 128460
1699A28460o5089n8860N4971P8922l4283K0565j8426N71k5464l9240k0269K6329
$$ 128460 63371 4511 59482 138404 104121 124686 106260 106831 81367 42127 21858 48187
1687D8187L2933k3000J5429o370k2417k6256J3843J283j1359k3680J235j3186
$$ 48187 81120 58120 73549 67179 44762 18506 32349 33632 22273 -1407 -172 -13358
1675a3358J5054K8693K0621N9130K4721m3899L5544k7108R199N443k0320l6108
$$ -13358 1696 30389 51010 110140 134861 90962 126506 99398 108597 114040 93720 57612
1663E7612L6843P2502k4433m8072j3778J0393j2975Q626k3527j5153j8590M4550
$$ 57612 94455 166957 142524 94452 80674 91067 78092 86718 63191 48038 29448 73998
1651G3998J1046N392K4803J9134j8725l6664J458O3478n634p6037K8060j1400
$$ 73998 85044 90436 115239 134373 115648 78984 80442 143920 138286 62249 90309 78909
1639G8909J0216l2323j2065M3369k3068J3366J4628K9295j5159r4349O3827k7064
$$ 78909 89125 56802 44737 88106 65038 78404 93032 122327 107168 12819 76646 49582
1627D9582K4831l2934j2285K2612O7j0916L615L8457M7079r758k1855r941m3604
$$ 49582 74413 41479 29194 51806 51873 40957 44572 83029 130108 120350 98495 88554 44950
1614D4950l1816N0768L7903l8493k5589j3960j0363O3170j2420p832l7646l9350
$$ 44950 13134 63902 101805 63312 37723 23763 13400 76570 64150 56318 18672 -20678
1602b0678N2104K7122J42J4700J1445J6582K9768p2322k6718K9652r3342o4513
$$ -20678 31426 58548 58690 73390 84835 101417 131185 58863 32145 61797 -31545 -96058
1590i6058O7110K7046M0747K4231j7700k1732K6568n9795l4436J01146k0693J9372
$$ -96058 -28948 -1902 38845 63076 45376 23644 50212 -9583 -44019 57127 36434 55806
1578E5806j1108K6863J8685Q126j5365l3800K0676J1414o1020n0516P1466l6420
$$ 55806 44698 71561 90246 98372 83007 49207 69883 81297 20277 -30239 41227 4807
1566D807L9527k1565J1325L3803o0131M1929j0770J6545M0313o8978J4956K275
$$ 4807 44334 22769 34094 67897 7766 49695 38925 55470 95783 26805 41761 44036
1554D4036K0220j4377j0775L706l4738j769R8317J4646o4041K9285m6821k6847
$$ 44036 64256 49879 39104 42810 8072 6303 104620 119266 55225 84510 37689 10842
1542A0842l7267k403R107k5816j685O4058k4564L8426J5341K0323J1L4763N0386
$$ 10842 -26425 -28828 -19721 -45537 -47222 16836 -7728 30698 46039 66362 66373 101136 151522
1529A51522k7142k3094k8232O809j1185K7537l8514j5840M613n1897N4151K5581
$$ 151522 124380 101286 73054 79863 68678 96215 57701 41861 46474 -5423 48728 74309
1517G4309J4117R790m918Q987p4260J3740m2734M3404N830m165J0495l8297N6682
$$ 74309 88426 98216 93298 102285 28025 41765 -969 42435 48265 44100 54595 16298 72980
1504G2980J01912q8018o33J6110K143j7493j3204N121K6693l6425r671k2297q828
$$ 72980 174892 86874 86241 102351 104494 87001 73797 78918 105611 69186 59515 37218 28390
1491B8390N2260k7758l5620j676M9906k9016K3873J1689J9938n2700J4506l7429
$$ 28390 80650 52892 17272 15596 65502 36486 60359 72048 91986 39286 53792 16363
1479A6363K522M1651l5774J2910p0422O9810k7694k4234N0319K9355j9229L3418
$$ 16363 18885 60536 24762 37672 -32750 37060 9366 -14868 35451 64806 45577 78995
1467G8995k7035J5484k8922m9154L413M3977K0415k7832k5862j1050O7235J359
$$ 78995 51960 67444 38522 -10632 -7219 36758 57173 29341 3479 -7571 59664 61023
1455F1023J5660J8497l7924j9229J6196K468N8522l1584K1488m5798k7692K7509
$$ 61023 76683 95180 57256 38027 54223 56691 115213 83629 105117 59319 31627 59136
1443E9136m1697N914n506N989j5052P144J451j2179k0761j5967J8720j4614K4148
$$ 59136 17439 23353 17847 23836 8784 15928 17379 5200 -15561 -31528 -12808 -27422 -3274
1430c274J5687J9921N0842l0712m8539p428N1106N263K5662M7759j20672K5900
$$ -3274 12413 32334 83176 52464 3925 -3503 47603 52866 78528 126287 5615 31515
1418C1515n572j3867P3915K4888o1346o5810k430j8334j6783O0468j729l7216
$$ 31515 25943 12076 85991 110879 49533 -16277 -18707 -37041 -53824 6644 4915 -32301
1406c2301j4640J0684M6148J2649l2311M7424O654n2734L453J4403P5275j5560
$$ -32301 -46941 -36257 9891 22540 -9771 37653 44307 -8427 -4974 9429 84704 69144
1394F9144m1852j9736j9870j1607J3664j9412K8693P5283l5685j4537R513Q049
$$ 69144 27292 7556 -12314 -23921 -10257 -29669 -976 74307 38622 24085 33598 41647
1382D1647L717k7056m3248J03468l7179j2605J7735j4753O1307m1449j4800K4156
$$ 41647 45364 18308 -24940 78528 41349 28744 46479 31726 93033 51584 36784 60940
1370F0940M4625m2558r9173J1965N4883K1508K422p731r44j2381J8636o0277K2769
$$ 60940 105565 63007 -36166 -24201 30682 52190 54612 46881 45937 33556 52192 -8085 14684
1357A4684L5738M837m3675J9284J2918k3078K7020J6739j1606J3553m9570k6298
$$ 14684 50422 55259 11584 30868 43786 20708 47728 64467 52861 66414 16844 -9454
1345i454Q869j6135J5168K7001L3045m5307j0535l948O8625j476r404n5143K342
$$ -9454 -585 -16720 -1552 25449 58494 13187 2652 -1296 67329 65853 56449 1306 3648
1332C648K6251N0673l3559j9565K6094k4207l9572J8611k8457j5044O185Q4011
$$ 3648 29899 80572 47013 27448 53542 29335 -10237 8374 -20083 -35127 -28942 55069
1320E5069j4324L382k3362m5826K9532j5644p75Q7957k2994q0283J1338J5448
$$ 55069 40745 44127 20765 -25061 4471 -11173 -11948 76009 53015 -27268 -15930 -482
1308d82l8584P3351K682K8926J4266k1045j5264J7401K9550n0193Q551l8908L3
$$ -482 -39066 34285 36967 65893 80159 59114 43850 61251 90801 40608 49159 10251 10284
1295A0284k347J1475j8785J5132k1190M8949k0791k1419Q318l2359J4497j1094
$$ 10284 7937 19412 627 15759 -5431 43518 22727 1308 9626 -22733 -8236 -19330
1283a9330o180J24009l265j6261j3111j3223l3276M4507k9150M2451p212m4090
$$ -19330 -25510 98499 95234 78973 65862 52639 19363 63870 34720 77171 69959 25869
1271B5869M7025l4953o1721M2494N732M17N078N2438l6202K004m8305K5702L3790
$$ 25869 72894 37941 -23780 18714 24446 24863 29941 82379 46177 48181 -124 25578 59368
1258E9368M339j1461k3911O572o705o8440K7673Q2993m693J4920j991o4269J1664
$$ 59368 63707 52246 28335 34907 28202 -40238 -12565 70428 65735 80655 78664 14395 26059
1245B6059k3562J1154L7454k9585k9962J1687M4705j9104k9093M1143m5312M0554
$$ 26059 2497 13651 51105 21520 -8442 3245 47950 28846 -247 40896 -4416 36138
1233C6138R3340p4354k5748n8785J6548K6394J3104K7488l412n9687J1832l4546
$$ 36138 129478 55124 29376 -29409 -12861 13533 26637 54125 50713 -8974 2858 -31688
1221c1688k7413N6333k5425M091O5269n6198r41J8946O519L2127J0627n9091J1171
$$ -31688 -59101 -2768 -28193 -24102 41167 -15031 -15972 2974 9493 41620 52247 -6844 4327
1208D327j3148R982R780M2003o223l0244k9874M2864K6176k0963O43n9607K2611
$$ 4327 -8821 1161 10941 52944 46721 16477 -13397 29467 55643 34680 35323 -24284 -1673
1195a673J9753j8765l1487j668M6833j6002N340L458L1176M2644l8872q1268P1332
$$ -1673 18080 -685 -32172 -33840 12993 -3009 2331 5789 36965 79609 40737 -40531 30801
1182C0801j3206l0442K2916J7794l5465K5585K7113j58l8140m2328M2078J7309
$$ 30801 17595 -12847 10069 27863 -7602 17983 45096 44938 6798 -35530 6548 23857
1170B3857L2628j2897j4890L5943J4040n4394j8886m7958J9793q713J5688K2240
$$ 23857 56485 43588 28698 64641 78681 24287 5401 -42557 -22764 -31477 -15789 6451
1158F451J3077o91K4157K716n0285L6448K3871k5184o3803r286o399j3897L2547
$$ 6451 19528 18837 42994 45710 -4575 31873 55744 30560 -33243 -42529 -48928 -62825 -30278
1145c0278M9958J2287k2725k0545J4872k695j3757J9346K8966J7238m6483k8270
$$ -30278 19680 31967 9242 -11303 3569 874 -12883 6463 35429 52667 6184 -22086
1133b2086K3371m4453K4744j7081M7031K4921m6402J7540Q183j4123l5381J9054
$$ -22086 1285 -43168 -18424 -35505 11526 36447 -9955 7585 15768 1645 -33736 -14682
1121a4682L5930j3387N1730l5984j634M5194j1345k4327K3564m6589j9999P2071
$$ -14682 21248 7861 59591 23607 21973 67167 55822 31495 55059 8470 -11529 60542
1109F0542o7020J6557M682k5353j1714L6890K3249M2527p085q0319L299K5479
$$ 60542 -6478 10079 14761 -10592 -22306 14584 37833 80360 73275 -7044 -3745 21734
1097B1734K5319q772k5264o007k8765K3438R602J0591k9273K6068J4901N096p8224
$$ 21734 47053 38281 13017 7010 -21755 1683 11285 21876 -7397 18671 33572 38668 -39556
1084c9556o6734M6638K6996L1805m2007N4710R667o0245j1208O5616K4397n4558
$$ -39556 -106290 -59652 -32656 -851 -42858 11852 21519 -38726 -49934 15682 40079 -14479
1072a4479j4055K2178P2157n9327L4648M06m9119n5459M1179J6289K291m264N8505
$$ -14479 -28534 -6356 65801 6474 41122 41528 -7591 -63050 -21871 -5582 -3291 -7555 50950
1059E0950k6943l1023J8101l1827K0264L9307o0867K1271M0001j7151k5518n331
$$ 50950 24007 -7016 11085 -20742 -478 38829 -22038 -767 39234 22083 -3435 -8766
1047h766J0445n5157m296O951L2095J1969L0147k8943j7761J4666M8245o1968
$$ -8766 1679 -53478 -57774 -50823 -18728 -6759 23388 -5555 -23316 -8650 39595 -22373
1035b2373J92M6832K721p1563J2752K1647Q160M6267l1024k244l8177N687O238
$$ -22373 -22181 24651 27372 -44191 -31439 -9792 -1632 44635 13611 11367 -26810 -21123 -14885
1022a4885j878L690l1617L2436N981k9404K2310K4492m9520k3237N1050J865k9682
$$ -14885 -16763 -13073 -44690 -12254 -6273 -35677 -13367 11125 -38395 -61632 -10582 -8717 -38399
1009c8399L2118j2926J064l5827P6321k6177J7793k1673k7333R988j5843N0341
$$ -38399 -6281 -19207 -18143 -53970 22351 -3826 13967 -7706 -35039 -25051 -40894 9447
997I447k6826r839j3380N0536m9710K4505J8786J6689k589q251O4795m8754l5713
$$ 9447 -17379 -27218 -40598 9938 -39772 -15267 3519 20208 17619 9368 74163 25409 -10304
984a0304K5151j0318l9820K4573J094P0082j8639p0479P1456r177r152j828p1752
$$ -10304 14847 4529 -35291 -10718 -9624 60458 41819 -28660 42796 33619 24467 22639 -49113
971d9113j5508J7912K8847K6189o9557k6376K3980M5983m6194l0978J03841M7096
$$ -49113 -64621 -46709 -17862 8327 -61230 -87606 -63626 -17643 -63837 -94815 9026 56122
959E6122l1465J9583j4618k376k5623j558k3254M740n0663L3582J8015j3059o201
$$ 56122 24657 44240 29622 27246 1623 65 -23189 -18449 -69112 -35530 -17515 -30574 -36775
946c6775J6763L6311L750K7683o5901k0087K8717O0580m4849q2476K9136Q4762
$$ -36775 -20012 16299 20049 47732 -18169 -38256 -9539 51041 6192 -76284 -47148 37614
934C7614J588n5549k8551Q397M2630J3446Q611j4688n0866L7239L7250k816L735
$$ 37614 39202 -16347 -44898 -36501 6129 19575 28186 13498 -37368 -129 37121 34305 38040
921C8040m2850k3851N1072J9578J9757j7787j2034m9579l3681L9504L3587k4225
$$ 38040 -4810 -28661 22411 41989 61746 43959 31925 -17654 -51335 -11831 21756 -2469
909b469N450K572l9473J7487k8838J2311j3625k6258K8278O696M9775k8203M0808
$$ -2469 2981 5553 -33920 -16433 -45271 -32960 -46585 -72843 -44565 -37869 11906 -16297 24511
896B4511k1349l689l6548J5488k9809L0784M9846n4569j1294m6508N1307J5797
$$ 24511 3162 -527 -37075 -21587 -51396 -20612 29234 -25335 -36629 -83137 -31830 -16033
884a6033j2364l3452O7374j1132M235L5732K3134K0324q8103k4228L5506J5764
$$ -16033 -28397 -61849 5525 -5607 -1372 34360 57494 77818 -10285 -34513 993 16757
872A6757j3673J5100R79M521k3098j2906L7797J5206l5172j0531O357j391k1892
$$ 16757 3084 18184 19163 23684 586 -12320 25477 40683 5511 -5020 1337 -54 -21946
859b1946J4385J8235J2351l0856k283J9660m1030K1790L5552l3164k8174M5404
$$ -21946 -7561 10674 23025 -7831 -10114 9546 -31484 -9694 25858 -7306 -35480 9924
847I924J0476k9006j9268k6674K3900K9399k745m2589k5206J1628K9731J1809
$$ 9924 20400 -8606 -27874 -54548 -30648 -1249 -3994 -46583 -71789 -60161 -30430 -18621
835a8621L2471K4164j9641j6587P925j0539m0604J7903J2104J0626O720M819k1174
$$ -18621 13850 38014 18373 1786 9711 -828 -41432 -23529 -11425 -799 5921 10740 -10434
822a0434k6312l3566M1841l0504L3557K9779m3433l2892L2968K2029M2508m012
$$ -10434 -36746 -70312 -28471 -58975 -25418 4361 -39072 -71964 -38996 -16967 25541 21529
810B1529p4402K7808m5781l7317L3863Q0217l7479K7451K3951n1585J3734K461
$$ 21529 -52873 -25065 -70846 -108163 -74300 5917 -31562 -4111 19840 -31745 -18011 -15550
798a5550K5328N789J6105j4500j9964l609n2829Q419J4362J4605l592L4246K1434
$$ -15550 9778 15567 31672 17172 -2792 -6401 -59230 -50811 -36449 -21844 -25436 8810 30244
785C0244o9468N8119O9914m9149q3175j9756M5732q39k9081M7926J1002n8788
$$ 30244 -39224 18895 88809 39660 -43515 -63271 -17539 -18378 -47459 467 11469 -47319
773d7319l628O212j9695Q7848m7994J0692N289J5685k0809M859k2918l2569M4924
$$ -47319 -50947 -44735 -64430 23418 -24576 -13884 -8595 7090 -13719 -8860 -31778 -64347 -19423
760a9423j5203k0403P0365q149j6507q658r306M5796J2537k5766o932l5298k8592
$$ -19423 -34626 -55029 15336 7187 -9320 -17978 -27284 18512 31049 5283 -1649 -36947 -65539
747f5539N010m594J7664l4550L5677M497r361O4896k0532o085l0615m3531n588
$$ -65539 -60529 -65123 -47459 -82009 -46332 -41835 -51196 13700 -6832 -12917 -43532 -87063 -92651
734i2651R612K717K0427K6237n6304K4547J8705N961N5374L2550k0167K3018m3544
$$ -92651 -83039 -80322 -59895 -33658 -89962 -65415 -46710 -40749 14625 47175 27008 50026 6482
721F482k9769K0516J1265K3777n3513q8069K0708N7079L3603r733M4006Q72l9851
$$ 6482 -23287 -2771 8494 32271 -21242 -109311 -88603 -31524 2079 -7654 36352 37224 -2627
708b627j2674L8830n0718R858O3801K8664p8984j7898Q295K5924l234m4023J830
$$ -2627 -15301 23529 -27189 -17331 46470 75134 -3850 -21748 -13453 12471 9237 -34786 -32956
695c2956l0411k6233L1663j7812L2554k092L565J856n1930j1610L2085J4422N678
$$ -32956 -63367 -89600 -57937 -75749 -43195 -45287 -41722 -39866 -91796 -103406 -71321 -56899 -51221
682e1221O300Q069P218l0795m176Q159j5644L6817L8268m8426k883J965N4136
$$ -51221 -44921 -36852 -29634 -60429 -64605 -56446 -72090 -35273 2995 -45431 -48314 -46349 7787
669G787j4545k1666J6102L572m4771J4382K2835j0255P117J2030q451m0233M4326
$$ 7787 -6758 -28424 -12322 -8750 -53521 -39139 -16304 -26559 -19442 -7412 -15863 -56096 -11770
656a1770L2238K4658j881j3116m3081j0586k1467k8417K2576O2344J0601o1800
$$ -11770 20468 45126 43245 30129 -12952 -23538 -45005 -73422 -50846 11498 22099 -39701
644c9701n304J1873p301M5119L348K6568l141n6974l7889N1206K1368J1567J0601
$$ -39701 -45005 -33132 -40433 4686 8034 34602 31461 -25513 -63402 -12196 9172 20739 31340
631C1340k6306k1596n426L0339Q288k2347Q91N2418m7472l7684m1530M3657n4021
$$ 31340 5034 -16562 -21988 8351 16639 -5708 -4817 47601 129 -37555 -79085 -35428 -89449
618h9449M1287Q963K7750j6470q364K7783o6186K029L2290J5450j6035k7155j155
$$ -89449 -48162 -39199 -11449 -27919 -36283 -8500 -74686 -72657 -40367 -24917 -40952 -68107 -69262
605f9262K1016l6366N152P9921j8715k0116m8014P5440n2545j7943L1376K7993
$$ -69262 -48246 -84612 -79460 461 -18254 -38370 -86384 -10944 -63489 -81432 -50056 -22063
593b2063K5226l6660k7870n3326M3374K6660K4046J5529j2525J2350l1420R630
$$ -22063 3163 -33497 -61367 -114693 -71319 -44659 -20613 -5084 -17609 -5259 -36679 -27049
581b7049L5361l7726j8745j1682j0511m5746K6111J8973M6744j4569j0194j7556
$$ -27049 8312 -29414 -48159 -59841 -70352 -116098 -89987 -71014 -24270 -38839 -49033 -66589
569f6589r898M7260j1112l2452N910J5528L9705l9070Q523N7791m8705m0907P067
$$ -66589 -76487 -29227 -40339 -72791 -66881 -51353 -11648 -50718 -42195 15596 -33109 -74016 -66949
556f6949J6345K6723R287l0122l049j6603L2511l7276j2746K8316k6630K7118
$$ -66949 -50604 -23881 -14594 -44716 -47765 -64368 -31857 -69133 -81879 -53563 -80193 -53075
544e3075K1792j2642Q81J7957r718p009j6334k6769j080M2281K0714K2862j8024
$$ -53075 -31283 -43925 -43044 -25087 -34805 -41814 -58148 -84917 -85997 -43716 -23002 -140 -18164
531a8164l0517P515M4273K1073m0437j0549R855j9425K3321j328j03644N013K9429
$$ -18164 -48681 -41166 3107 24180 -16257 -26806 -16951 -36376 -13055 -14383 -118027 -113014 -83585
518h3585N3720J7878l7252k1674L0581Q432j3876p138o917M2454j1670k3323K3622
$$ -83585 -29865 -11987 -49239 -70913 -40332 -31900 -45776 -52914 -59831 -17377 -29047 -52370 -28748
505b8748P3659p2879o514j4200L6718m0781Q719j9973L4725N8728k2570r939j4476
$$ -28748 44911 -27968 -34482 -48682 -11964 -52745 -44026 -63999 -29274 29454 6884 -3055 -17531
492a7531L8675q707l6409L0572l3636l9712J9870j6389J06740J5752K8136m4867
$$ -17531 21144 12437 -23972 6600 -27036 -66748 -46878 -63267 43473 59225 87361 42494
480D2494p6330N3465j2966k2782M5165j004o5065l0016M7967k9051R199J1605
$$ 42494 -33836 19629 6663 -16119 29046 28042 -37023 -67039 -19072 -48123 -38924 -27319
468b7319l9141M1138R760m0927K7370k3712M405M0603j4992M765k5202O39N9184
$$ -27319 -66460 -25322 -15562 -56489 -29119 -52831 -48426 -7823 -22815 -18050 -43252 -42613 16571
455A6571n0688J9676j7614K5873k57k5328K508n8686k7896P2322J7630k8020K376
$$ 16571 -34117 -14441 -32055 -6182 -6439 -31767 -29259 -87945 -115841 -43519 -25889 -53909 -51533
442e1533J2547K3957J19l3370k2972K6216L4602L6978o0595j7666Q379m1678M47
$$ -51533 -38986 -15029 -14910 -48280 -71252 -45036 -10434 26544 -34051 -51717 -43338 -85016 -84569
429h4569N5707N191j8545l6035O1000K576l9188J0796j4242J6066L1709l1869
$$ -84569 -28862 -23671 -42216 -78251 -17251 -14675 -53863 -43067 -57309 -41243 -9534 -41403
417d1403j8037j6677K6653J2528N64O506k6742k7746m2525L4438O4322K9238O4029
$$ -41403 -59440 -76117 -49464 -36936 -36372 -29866 -56608 -84354 -126879 -92441 -28119 1119 65148
404F5148n5025o7309L5884J3403P340n0608L1098n162k8202L0052m5586k4975
$$ 65148 10123 -57186 -21302 -7899 -559 -51167 -20069 -25231 -53433 -23381 -68967 -93942
392i3942K3526Q0342l6666m3374K3834l2342M0803n966l3750L0197L6317j28769
$$ -93942 -70416 9926 -26740 -70114 -46280 -78622 -37819 -43785 -77535 -47338 -11021 -139790
380a39790K0935K4593J8134M1420r826J6784l0638L0342J6527J5481p4948K5504
$$ -139790 -118855 -94262 -76128 -34708 -44534 -27750 -58388 -28046 -11519 3962 -70986 -45482
368d5482K7471O1118l8731r1202n1614k935O0709O7548j6365l7579M3293l0500
$$ -45482 -18011 43107 4376 -86826 -138440 -141375 -80666 -13118 -29483 -67062 -23769 -54269
356e4269R102L5444j8135j6394L7256J500k6522j6414L3830L0376j6591m3987
$$ -54269 -45167 -9723 -27858 -44252 -6996 -5496 -32018 -48432 -14602 15774 -817 -44804
344d4804o7050J7451N490O1566j4971j8278j6647j1898K4692K8898J4209k0458
$$ -44804 -111854 -94403 -88913 -27347 -42318 -60596 -77243 -89141 -64449 -35551 -21342 -41800
332d1800m7211J7318M6257J07K4141k6729Q625l2013J9892L8551o446J2483m437
$$ -41800 -89011 -71693 -25436 -25329 -1188 -27917 -19292 -51305 -31413 7138 692 13175 8738
319H738n84j0408m0312k7973J4124Q7257k6273j2385q807L4922m3664n0852j5841
$$ 8738 8154 -2254 -42566 -70539 -56415 30842 4569 -7816 -16623 18299 -25365 -76217 -92058
306i2058k5999k5067L1002M7420N3565k1051L1057L4150j9818J0261m3773k3972
$$ -92058 -118057 -143124 -112122 -64702 -11137 -32188 -1131 33019 13201 23462 -20311 -44283
294d4283j1722k6919M9260K2860q29l7438l7009K0228j212j8280l641N1161J284
$$ -44283 -56005 -82924 -33664 -10804 -11633 -49071 -86080 -65852 -67064 -85344 -88985 -37824 -36540
281c6540o7271K413J0104L4238Q4828q4953r272M5139K9524j414M921n0703L467
$$ -36540 -103811 -101398 -91294 -57056 27772 -57181 -66453 -21314 8210 6796 11717 -38986 -35519
268c5519m6764k8953O1006j7122J364k5535J7114k4402K8277K7354l3751l7398
$$ -35519 -82283 -111236 -50230 -67352 -65988 -91523 -74409 -98811 -70534 -43180 -76931 -114329
256a14329J5732K2585K2892O279K2455J4011l9788j1682L1258L956j0217J2940
$$ -114329 -98597 -76012 -53120 -46841 -24386 -10375 -50163 -61845 -30587 -26631 -36848 -23908
244b3908k5214K0345p969q053l9511q89J2407M1178l0223k1605o006L6147j610
$$ -23908 -49122 -28777 -36746 -44799 -84310 -85199 -72792 -31614 -61837 -83442 -89448 -53301 -54911
231e4911q443N5976p5344J1528L3501k660k5161Q096K5337o697o4774j2607K7595
$$ -54911 -63354 -7378 -82722 -71194 -37693 -40353 -65514 -57418 -32081 -38778 -103552 -116159 -88564
218h8564L5993L4529O478k6278j7849J0476J3568j0627l7222k0701J9642j4544
$$ -88564 -52571 -18042 -11564 -37842 -55691 -45215 -31647 -42274 -79496 -100197 -80555 -95099
206i5099J5849J6626O1167M7653m2013L990j8930M913l6638j9920L5779M2063
$$ -95099 -79250 -62624 -1457 46196 4183 8173 -10757 -5844 -42482 -62402 -26623 15440
194A5440p6132k9096M1072L0218n7381J9445k2676j6991J3383M2762j4590M1317
$$ 15440 -60692 -89788 -48716 -18498 -75879 -56434 -79110 -96101 -82718 -39956 -54546 -13229
182a3229J6390o1155r550l4712j1739r024L4590O0228k3922k0677l3163N3215
$$ -13229 3161 -57994 -67544 -102256 -113995 -123019 -88429 -28201 -52123 -72800 -105963 -52748
170e2748N062k6966k3973J7571O6056O775K9529l7731k90k1987j8348J8629M8084
$$ -52748 -47686 -74652 -98625 -81054 -14998 -8223 21306 -16425 -16715 -38702 -57050 -38421 9663
157I663l9127k310M2197J1265j0214l820l0635j3920k3097l4796J4198K5185O6210
$$ 9663 -29464 -31774 10423 21688 11474 7654 -22981 -36901 -59998 -94794 -80596 -55411 10799
144A0799l6220M315O2227o6696l6993N841l1981O036J7642J387o9549K4211L9600
$$ 10799 -25421 -21106 41121 -25575 -62568 -56727 -88708 -82672 -65030 -63643 -133192 -108981 -69381
131f9381L3397j5288o9971M5909j1403j7509L6206L1760r5K0907m4045j8689J6260
$$ -69381 -35984 -51272 -121243 -75334 -86737 -104246 -68040 -36280 -36375 -15468 -59513 -78202 -61942
118f1942J8907J6150k4151p042L3181j1771o2334k8440L9485O3907j6986j5309
$$ -61942 -43035 -26885 -51036 -58078 -24897 -36668 -99002 -127442 -87957 -24050 -41036 -56345
106e6345L5368k50O986l3889J4765k211j1781K3196L4461j0605P977m6796Q877
$$ -56345 -20977 -21227 -14241 -48130 -33365 -35576 -47357 -24161 10300 -305 7672 -39124 -30247
93c0247K313j601m3001K8282k9171N566K1145k3098N590j7110K1673J3387J7537
$$ -30247 -27934 -29535 -72536 -44254 -73425 -67859 -46714 -69812 -64222 -81332 -59659 -46272 -28735
80b8735j8462k9416K987n409m3494l511N2624M6711L011j1438q23K4441m1696
$$ -28735 -47197 -76613 -73626 -79035 -122529 -126040 -73416 -26705 -23694 -35132 -35955 -11514 -53210
67e3210n2766K6878O8875l0888j0612j0414L466l0271k7857L1104J5610L631K2787
$$ -53210 -105976 -79098 -10223 -41111 -51723 -62137 -58671 -88942 -116799 -85695 -70085 -66454 -43667
54d3667j9601q01j0141k3867j1639N1874n327j4616J9497L3380K6354m7773n739
$$ -43667 -63268 -64069 -74210 -98077 -109716 -57842 -63169 -77785 -58288 -24908 1446 -46327 -52066
41e2066j5171k7681j3647O5236j063M906K2982l8022k3080r197J6518n0l5895
$$ -52066 -67237 -94918 -108565 -43329 -44392 -39486 -16504 -54526 -77606 -86803 -70285 -70335 -106230
28a06230M5427j9248m0102K4321K7686K5103q867R644K423j013j4773j2754J3894
$$ -106230 -60803 -80051 -120153 -95832 -68146 -43043 -51910 -42266 -39843 -40856 -55629 -68383 -54489
15e4489Q975Q311j919M05n819K751n0556O529K0631J1978M1880o377k1347n243
$$ -54489 -45514 -37203 -39122 -38717 -44536 -41785 -92341 -85812 -65181 -53203 -11323 -17700 -39047 -44290
1d4290r002
$$ -44290 -53292
0e3292
$$ -53292
$$ Imaginary data points
##PAGE= N=2
##DATA TABLE= (X++(I..I)), XYDATA
16383a671670j3015K4981L0488O701K5415J6541O4048L8124n719L6594J9742O0253
$$ -1671670 -1684685 -1659704 -1629216 -1622515 -1597100 -1580559 -1516511 -1478387 -1484106 -1447512 -1427770 -1367517
16371a367517p34J9543O5652L3292j1933q532O2834K4481j2959O185M1932L7374
$$ -1367517 -1368251 -1348708 -1283056 -1249764 -1261697 -1270229 -1207395 -1182914 -1195873 -1189688 -1147756 -1110382
16359a110382P946N2568J2165k5615J7708J9834M4830j9421N0750M2141J091M8848
$$ -1110382 -1102436 -1049868 -1037703 -1063318 -1045610 -1025776 -980946 -1000367 -949617 -907476 -906385 -857537
16347h57537P0044N3376m6235N287J5779K8230K7687J109K6054L4915L7739J9440
$$ -857537 -787493 -734117 -780352 -775065 -759286 -731056 -703369 -702260 -676206 -641291 -603552 -584112
16335e84112L3637L4989j500j5386K7640J8292K0154P3851N0558j8085M6065k198
$$ -584112 -550475 -515486 -516986 -532372 -504732 -486440 -466286 -392435 -341877 -359962 -313897 -316095
16323c16095j9355N0150L6158m30L522M4163R6482l9877N559M689j5892L7873
$$ -316095 -335450 -285300 -249142 -249572 -246050 -201887 -105405 -145282 -139723 -135034 -150926 -113053
16311a13053O3860k2790K7405L2208M0547l7858N0138N0723m653k3074K128O5071
$$ -113053 -49193 -71983 -44578 -12370 28177 -9681 40457 91180 86527 63453 65581 130652
16299A30652J0792J850N1568K3624M5542o377J776M9166L4108L8277j5804r384
$$ 130652 141444 143294 194862 218486 264028 257651 259427 308593 342701 380978 365174 355790
16287C55790K8921J0434l4108K1810L6952J5088L2021J7104L7130J5486l2590
$$ 355790 384711 395145 361037 382847 419799 434887 466908 484012 521142 536628 504038
16276E04038J208k0456K9275P8544J3189P148L7569J246L855J8132O3786p802
$$ 504038 505246 484790 514065 592609 605798 612946 650515 651761 655616 673748 737534 729732
16264G29732K7918K379N6797K1528l2243M5069l204j7274L3067K3703K1322L0070
$$ 729732 757650 760029 816826 838354 806111 851180 847976 830702 863769 887472 908794 938864
16252I38864O713J0235l522L6388m244m7124M3831L8410L5693J7751N5019k9245
$$ 938864 945577 955812 952290 988678 984434 937310 981141 1019551 1055244 1072995 1128014 1098769
16240A098769O096M8573M620j7758l309n491K2368K3002j5306L5491J5139Q732
$$ 1098769 1104865 1153438 1158058 1140300 1136991 1131500 1153868 1176870 1161564 1197055 1212194 1220926
16228A220926j562P144K1687L2844J3087J620K7719j4496M9290j9944l3289l708
$$ 1220926 1219364 1226508 1248195 1281039 1294126 1295746 1323465 1308969 1358259 1338315 1305026 1301318
16216A301318j1113J6019M5876N4754Q352K0613k6068N474L2865l0894n922Q75
$$ 1301318 1290205 1306224 1352100 1406854 1415206 1435819 1409751 1415225 1448090 1417196 1411274 1412149
16204A412149J597K4054l701O5710m5088M497l947J2960J3459L9754j0340k9712
$$ 1412149 1413746 1437800 1434099 1499809 1454721 1459218 1455271 1468231 1481690 1521444 1511104 1481392
16192A481392N0786J6442K0027k6646J0451J0156j668P125J4894J8674J410M3743
$$ 1481392 1532178 1548620 1568647 1542001 1552452 1562608 1560940 1568065 1582959 1601633 1603043 1646786
16180A646786R389p278L9321l4623N511n563K581m0701P4543M421m0849L399N3507
$$ 1646786 1656175 1648897 1688218 1653595 1659106 1653543 1656124 1615423 1689966 1694387 1653538 1656937 1710444
16167A710444L1781k5123j5461J5906M6861n604k7083l8569J7394L820P952k4962
$$ 1710444 1742225 1717102 1701641 1717547 1764408 1758804 1731721 1693152 1710546 1714366 1722318 1697356
16155A697356Q5830O3813n2692M3812l052l7543L3896P980r625r067j7624J6446
$$ 1697356 1783186 1846999 1794307 1838119 1835067 1797524 1831420 1839400 1829775 1820708 1803084 1819530
16143A819530J7616L0342K3163j7233j4056L8488k5025j0477L336L592N122k503
$$ 1819530 1837146 1867488 1890651 1873418 1859362 1897850 1872825 1862348 1865684 1869276 1874398 1871895
16131A871895J1024j2096k1874M3408m8608L480j0246k3827K7613Q2264J3324
$$ 1871895 1882919 1870823 1848949 1892357 1843749 1847229 1836983 1813156 1840769 1923033 1936357
16120A936357k1615j7602J9214n585j5294N0814k8590j67k9917L7403K49k0276
$$ 1936357 1914742 1897140 1916354 1910769 1895475 1946289 1917699 1917532 1887615 1925018 1925267 1904991
16108A904991J8029L0636k9680l9331L8234L1774p468K7974L3303m7358j2990
$$ 1904991 1923020 1953656 1923976 1884645 1922879 1954653 1947185 1975159 2008462 1961104 1948114
16097A948114K6302Q056p161k1629j4696M128M9254l1426L9917o9284q306J7270
$$ 1948114 1974416 1982472 1975311 1953682 1938986 1943114 1992368 1960942 2000859 1931575 1923269 1940539
16085A940539l2559j9809M1452N539O5874o466K2557L1271l0317k7950m7953K9092
$$ 1940539 1907980 1888171 1929623 1935162 2001036 1994570 2017127 2048398 2018081 1990131 1942178 1971270
16073A971270L4306q233k2381k1455J5506K3518j6278J3765j4005r880K0233L743
$$ 1971270 2005576 1997343 1974962 1953507 1969013 1992531 1976253 1990018 1976013 1966133 1986366 1990109
16061A990109n8482j1621l2313Q999O2440M9264O5849q2807k6130K3651K3706
$$ 1990109 1931627 1920006 1887693 1896692 1959132 2008396 2074245 1991438 1965308 1988959 2012665
16050B012665k8372l8578L0868L0428j0792K325k8957k1642O1729K138n5868M6040
$$ 2012665 1984293 1945715 1976583 2007011 1996219 1998544 1969587 1947945 2009674 2011812 1955944 2001984
16038B001984M1421j3358p274k0859o7023J03605R5072n0830K3875n9054J517
$$ 2001984 2043405 2030047 2022773 2001914 1934891 2038496 2133568 2082738 2106613 2047559 2049076
16027B049076o4414K6622N7785p0361o1889j7380N6211M5688J3135K6105K4334
$$ 2049076 1984662 2011284 2069069 1998708 1936819 1919439 1975650 2021338 2034473 2060578 2084912
16016B084912k6624j9150l6242k1438O197l566L3307l696q316j2962j0063N3407
$$ 2084912 2058288 2039138 2002896 1981458 1987655 1984089 2017396 2013700 2005384 1992422 1982359 2035766
16004B035766m5585J070O438j1747N4787n0133J9420J6248k7591j7783K0664J8637
$$ 2035766 1990181 1991251 1997689 1985942 2040729 1990596 2010016 2026264 1998673 1980890 2001554 2020191
15992B020191L9147p3683m2918k1698P2891M1227k8683M689J1729l4806k2799
$$ 2020191 2059338 1985655 1942737 1921039 1993930 2035157 2006474 2011163 2022892 1988086 1965287
15981A965287n493O8112k9725J236N4035p4509J9191K6349j3982K327M690J2060
$$ 1965287 1959794 2027906 1998181 1999417 2053452 1978943 1998134 2024483 2010501 2012828 2017518 2029578
15969B029578n1237J1201k3216K9515M4354l968l2282p7996N6622M2273J2596
$$ 2029578 1978341 1989542 1966326 1995841 2040195 2036227 2003945 1925949 1982571 2024844 2037440
15958B037440N5874j6922J440O633m9484p0463k6044N0771k2425l0947K5627L8073
$$ 2037440 2093314 2076392 2077832 2084465 2034981 1964518 1938474 1989245 1966820 1935873 1961500 1999573
15946A999573M5863j9902m4964M1271l25O2673m8062J2998N2812k7537m5167r541
$$ 1999573 2045436 2025534 1980570 2021841 2021516 2084189 2036127 2049125 2101937 2074400 2029233 2019692
15934B019692j0184M4767k297q897j2872k8741L7479N062P899k4975n0458P3650
$$ 2019692 2009508 2054275 2051978 2043081 2030209 2001468 2038947 2044009 2051908 2026933 1976475 2050125
15922B050125j1683m6951P522k5956J96l8368P3190P858n4279L3965Q4472j0902
$$ 2050125 2038442 1991491 1999013 1973057 1973253 1934885 2008075 2015933 1961654 1995619 2080091 2069189
15910B069189n9563Q967R875m7929Q696j8476J915N3592j2009J2844N5876p2197
$$ 2069189 2009626 2018593 2028468 1980539 1989235 1970759 1972674 2026266 2014257 2027101 2082977 2010780
15898B010780l0665O0384L9380J0599L1340m5982j3734N020o6422j1430j9606
$$ 2010780 1980115 2040499 2079879 2090478 2121818 2075836 2062102 2067122 2000700 1989270 1969664
15887A969664p053K0768K3092k6178N0214j4165P958j5112J9664J5108L5193J1582
$$ 1969664 1962611 1983379 2006471 1980293 2030507 2016342 2024300 2009188 2028852 2043960 2079153 2090735
15875B090735m3623q0277R636J0013j9628K4608l5100L6472M6217o2179N3530
$$ 2090735 2047112 1966835 1976471 1986484 1966856 1991464 1956364 1992836 2039053 1976874 2030404
15864B030404m1653M0471L4607L410O8288o6837j6563J2584l8186J6122J2826
$$ 2030404 1988751 2029222 2063829 2067239 2135527 2068690 2052127 2064711 2026525 2042647 2055473
15853B055473J404J102p106k6028k4817O3592P717M0936l3076l6178k3067K3760
$$ 2055473 2056877 2057979 2050873 2024845 2000028 2063620 2071337 2112273 2079197 2043019 2019952 2043712
15841B043712m900K493Q68M710k0536L6248k4326k5530J4912l68k9299J1175L0219
$$ 2043712 2038812 2041305 2042173 2046883 2026347 2062595 2038269 2012739 2027651 2027283 1997984 2009159 2039378
15828B039378l5783j8346J827j0688J7377K3754J0970L1103k2029n8820k4420
$$ 2039378 2003595 1985249 1987076 1976388 1993765 2017519 2028489 2059592 2037563 1978743 1954323
15817A954323K7896L4003L3033N4293n034P579k5706p3493O2151R879l0637K7494
$$ 1954323 1982219 2016222 2049255 2103548 2098514 2106093 2080387 2006894 2069045 2078924 2048287 2075781
15805B075781r401p86p331K7274k2928k5920M7772k7957M0837m3139P371p945
$$ 2075781 2066380 2065594 2058263 2085537 2062609 2036689 2084461 2056504 2097341 2054202 2061573 2053628
15793B053628l7058J0341P960j9166j5085r331L8293J752L938o127m5862J9348
$$ 2053628 2016570 2026911 2034871 2015705 2000620 1991289 2029582 2031334 2035272 2029145 1983283 2002631
15781B002631L530P2376O309l1414j9922m072N110M5591L6235k8700n4831j7751
$$ 2002631 2006161 2078537 2084846 2053432 2033510 2029438 2034548 2080139 2116374 2087674 2032843 2015092
15769B015092M2817j463j8247p280j3354N1313L0146m4134j4042K9695l1803J9815
$$ 2015092 2057909 2056446 2038199 2030919 2017565 2068878 2099024 2054890 2040848 2070543 2038740 2058555
15757B058555M7972r2515K2627J8685P4153k6134J6290q879j5185n2924j8594
$$ 2058555 2106527 2014012 2036639 2055324 2129477 2103343 2119633 2110754 2095569 2042645 2024051
15746B024051J8184J476J4929N5246M272j20586K1273Q3707J1070k7773J0636
$$ 2024051 2042235 2043711 2058640 2113886 2118158 1997572 2018845 2102552 2113622 2085849 2096485
15735B096485k0386L2302k2067J3472J0403P611k3168j955L1217j6330m999k394
$$ 2096485 2076099 2108401 2086334 2099806 2110209 2117820 2094652 2092697 2123914 2107584 2102585 2100191
15723B100191k5492L2078k4942J7951K3869j1005q727m9734j4344j6505k6797
$$ 2100191 2074699 2106777 2081835 2099786 2123655 2112650 2103923 2054189 2039845 2023340 1996543
15712A996543J4130J6905l613n816J0653L7530j9334m2093J1562J0445R7529n6191
$$ 1996543 2010673 2027578 2023965 2018149 2028802 2066332 2046998 2004905 2016467 2026912 2124441 2068250
$$ [...]
##END NTUPLES=NMR SPECTRUM
##END=
