##TITLE=1H_CG-1150-C
 CDCl3, 8 sc, 
 27.08.2021
##JCAMPDX= 6.0         $$ Bruker NMR JCAMP-DX V2.0
##DATA TYPE= NMR SPECTRUM
##DATA CLASS= NTUPLES
##ORIGIN= UXNMR, Bruker Analytische Messtechnik GmbH
##OWNER= root
$$ XWIN-NMR		Version 3.5
$$ Fri Aug 27 08:48:55 2021 Russian Standard Time (UT+4h)  she@DPX200
##.OBSERVE FREQUENCY= 200.131506
##.OBSERVE NUCLEUS= ^1H
##.ACQUISITION MODE= SIMULTANEOUS
##.ACQUISITION SCHEME= undefined
##.AVERAGES= 8
##.DIGITISER RES= 18
##SPECTROMETER/DATA SYSTEM= spect
##.PULSE SEQUENCE= zg30
##.SOLVENT NAME= D2O
##.SHIFT REFERENCE= (INTERNAL, D2O, 0, 17.4947)
##AUDIT TRAIL= $$ (NUMBER, WHEN, WHO, WHERE, WHAT)
$$ ##TITLE= Audit trail, XWIN-NMR		Version 3.5
$$ ##JCAMPDX= 5.01
$$ ##ORIGIN= Bruker BioSpin GmbH
$$ ##OWNER= she
$$ F:/spectra/data/she/nmr/H-F/1/pdata/1/auditp.txt
$$ ##AUDIT TRAIL=  $$ (NUMBER, WHEN, WHO, WHERE, WHAT)
(   1,<2021-08-27 08:47:39.73 +0400>,<she>,<DPX200>,
      <created by zg, POWCHK disabled, PULCHK disabled
       configuration hash MD5:
       00 E9 B6 7A A2 85 ED C7 34 08 36 98 17 FE 4E 26
       data hash MD5: 16K
       99 84 1A A2 04 85 D3 FD B1 EF 77 C5 D0 30 DD F5>)
(   2,<2021-08-27 08:47:42.20 +0400>,<she>,<DPX200>,
      <Start of raw data processing
       efp BC_mod = 2 LB = 0.24 FT_mod = 6 PKNL = 1 PHC0 = -13367.12 PHC1 = 26.00099 SI = 16K 
       data hash MD5: 16K
       CF 19 99 F2 8F C0 F5 44 89 FC C3 FC 84 0C A2 6B>)
(   3,<2021-08-27 08:48:00.17 +0400>,<she>,<DPX200>,
      <pk PHC0 = 6.741759 PHC1 = -9.8 
       data hash MD5: 16K
       40 44 01 EE 1F 05 01 1D A6 11 E8 3B AC AB 83 07>)
(   4,<2021-08-27 08:48:03.20 +0400>,<she>,<DPX200>,
      <abs ABSG = 5 
       data hash MD5: 16K
       36 81 76 31 F3 11 5F 17 60 9D 17 01 89 D8 28 C9>)
$$ ##END=
$$ 
$$ hash MD5
$$ 37 16 13 C1 04 27 77 C0 9F 50 73 F9 E5 1F 7C 7D
##$RELAX= 
##$RELAX= 
##$RELAX= 
##$RELAX= 
##$RELAX= 
##$RELAX= 
$$ Bruker specific parameters
$$ --------------------------
##$DU= <F:/spectra>
##$EXPNO= 1
##$NAME= <H-F>
##$PROCNO= 1
##$TYPE= <nmr>
##$USER= <she>
##$AMP= (0..31)
100 100 100 100 100 100 100 100 100 100 100 100 100 100 100 100 100 100 
100 100 100 100 100 100 100 100 100 100 100 100 100 100 
##$AQSEQ= 0
##$AQ_mod= 1
##$AUNM= <au_zg>
##$AUTOPOS= <>
##$BF1= 200.13
##$BF2= 200.13
##$BF3= 200.13
##$BF4= 200.13
##$BF5= 200.13
##$BF6= 200.13
##$BF7= 200.13
##$BF8= 200.13
##$BYTORDA= 1
##$CFDGTYP= 0
##$CFRGTYP= 5
##$CHEMSTR= <none>
##$CNST= (0..31)
1 1 145 1 1 1 1 1 1 1 1 1 1 1 1 1 1 1 1 1 1 1 1 1 1 1 1 1 1 1 1 1 
##$CPDPRG= <>
##$CPDPRG1= <>
##$CPDPRG2= <>
##$CPDPRG3= <>
##$CPDPRG4= <mlev>
##$CPDPRG5= <mlev>
##$CPDPRG6= <mlev>
##$CPDPRG7= <mlev>
##$CPDPRG8= <mlev>
##$CPDPRGB= <>
##$CPDPRGT= <>
##$D= (0..31)
0 1.2 0 0 0 0 0 0 0 0.06 0 0.03 0 0 0 0 0.0002 0 0 0 0 0 0 0 0 0 0 0 0 
0 0 0 
##$DATE= 1630039659
##$DBL= (0..7)
120 120 120 120 120 120 120 120 
##$DBP= (0..7)
150 150 150 150 150 150 150 150 
##$DBP07= 0
##$DBPNAM0= <>
##$DBPNAM1= <>
##$DBPNAM2= <>
##$DBPNAM3= <>
##$DBPNAM4= <>
$$ [...]
##$SUBNAM3= <"">
##$SUBNAM4= <"">
##$SUBNAM5= <"">
##$SUBNAM6= <"">
##$SUBNAM7= <"">
##$SUBNAM8= <"">
##$SUBNAM9= <"">
##$SW= 20.0188882624521
##$SWIBOX= (0..15)
0 0 2 0 0 0 0 0 0 0 0 0 0 0 0 0 
##$SW_h= 4006.41025641026
##$TD= 16384
##$TD0= 1
##$TE= 0
##$TE2= 300
##$TE3= 300
##$TEG= 300
##$TL= (0..7)
0 120 120 120 120 120 120 120 
##$TP= (0..7)
150 150 150 150 150 150 150 150 
##$TP07= 0
##$TPNAME0= <>
##$TPNAME1= <>
##$TPNAME2= <>
##$TPNAME3= <>
##$TPNAME4= <>
##$TPNAME5= <>
##$TPNAME6= <>
##$TPNAME7= <>
##$TPOAL= (0..7)
0.5 0.5 0.5 0.5 0.5 0.5 0.5 0.5 
##$TPOFFS= (0..7)
0 0 0 0 0 0 0 0 
##$TUNHIN= 0
##$TUNHOUT= 0
##$TUNXOUT= 0
##$USERA1= <user>
##$USERA2= <user>
##$USERA3= <user>
##$USERA4= <user>
##$USERA5= <user>
##$V9= 5
##$VALIST= <valist>
##$VCLIST= <CCCCCCCCCCCCCCC>
##$VD= 0
##$VDLIST= <DDDDDDDDDDDDDDD>
##$VPLIST= <PPPPPPPPPPPPPPP>
##$VTLIST= <TTTTTTTTTTTTTTT>
##$WBST= 1024
##$WBSW= 4
##$XGAIN= (0..3)
0 0 0 0 
##$XL= 0
##$YL= 0
##$YMAX_a= 360909
##$YMIN_a= -323698
##$ZGOPTNS= <>
##$ZL1= 120
##$ZL2= 120
##$ZL3= 120
##$ZL4= 120
##$ABSF1= 17.50933
##$ABSF2= -2.509708
##$ABSG= 5
##$ABSL= 3
##$ALPHA= 0
##$AQORDER= 0
##$ASSFAC= 0
##$ASSFACI= 0
##$ASSFACX= 0
##$ASSWID= 0
##$AUNMP= <proc_1d>
##$AZFE= 0.1
##$AZFW= 0.1
##$BCFW= 0
##$BC_mod= 2
##$BYTORDP= 0
##$COROFFS= 0
##$CY= -3
##$DATMOD= 1
##$DC= 0
##$DFILT= <>
##$DTYPP= 0
##$F1P= 0
##$F2P= 0
##$FCOR= 1
##$FTSIZE= 16384
##$FT_mod= 6
##$GAMMA= 0
##$GB= 0
##$INTBC= 1
##$INTSCL= 1.334414e-10
##$ISEN= 128
##$LB= 0.24
##$LEV0= 0
##$LPBIN= 0
##$MAXI= 10000
##$MC2= 0
##$MEAN= 0
##$ME_mod= 0
##$MI= 1.114404
##$NCOEF= 0
##$NC_proc= -7
##$NLEV= 6
##$NOISF1= 3.799351
##$NOISF2= 2.8
##$NSP= 0
##$NTH_PI= 0
##$NZP= 0
##$OFFSET= 17.49467
##$PC= 1
##$PHC0= -13360.38
##$PHC1= 16.20099
##$PH_mod= 1
##$PKNL= yes
##$PPARMOD= 0
##$PSCAL= 0
##$PSIGN= 0
##$REVERSE= no
##$SF= 200.130007997966
##$SI= 16384
##$SIGF1= 3
##$SIGF2= 2
##$SINO= 5.538805
##$SIOLD= 16384
##$SREGLST= <1H.CDCl3>
##$SSB= 0
##$STSI= 16384
##$STSR= 0
##$SW_p= 4006.41025641026
##$SYMM= 0
##$S_DEV= 0
##$TDeff= 16384
##$TDoff= 0
##$TI= <>
##$TILT= no
##$TM1= 0
##$TM2= 0
##$TOPLEV= 0
##$USERP1= <user>
##$USERP2= <user>
##$USERP3= <user>
##$USERP4= <user>
##$USERP5= <user>
##$WDW= 1
##$XDIM= 16384
##$YMAX_p= 469855689
##$YMIN_p= -616808
$$ End of Bruker specific parameters
$$ ---------------------------------
##NTUPLES= NMR SPECTRUM
##VAR_NAME=  FREQUENCY,     SPECTRUM/REAL,   SPECTRUM/IMAG
##SYMBOL=    X,             R,               I
##VAR_TYPE=  INDEPENDENT,   DEPENDENT,       DEPENDENT
##VAR_FORM=  AFFN,          ASDF,            ASDF
##VAR_DIM=   16384,         16384,           16384
##UNITS=     HZ,            ARBITRARY UNITS, ARBITRARY UNITS
##FACTOR=    0.24454680195387, 1,            1
##FIRST=     3501.2086207186, 0,             0
##LAST=      -505.201635691663, 0,           0
##MIN=       -505.201635691663, -616808,     0
##MAX=       3501.2086207186, 469855689,     0
$$ Real data points
##PAGE= N=1
##DATA TABLE= (X++(R..R)), XYDATA
$$ [...]
7855 5664353 5580253 5564102 5738394 5781772 5606759 5620002 5539049 5352323 5383354 5346815 5368154
7844 5368154 5375273 5333276 5197059 5481676 5194317 5086682 5101304 5091138 5247302 5223285 5244012
7833 5244012 4972878 4836827 4940532 4770135 4742601 4793955 4920955 5182180 5009337 5161787
7823 5161787 4982872 4801603 5013343 4981214 5156747 5204815 5233254 5104494 4913357 4957590
7813 4957590 5036130 5038656 4992220 5369618 5528082 5363112 5281750 5102235 5293582 5322325 5128271
7802 5128271 5308195 5404050 5491481 5295710 5533059 5575489 5500131 5828731 5762027 5872418
7792 5872418 6159187 6139365 6023289 5991732 6067283 6245653 6213851 6325918 6353138 6277096 6223599
7781 6223599 6123038 5920322 5697847 5687094 5647252 5701923 5460894 5226060 5168830 5299969
7771 5299969 4934113 5027662 5184888 5369168 5364745 5182339 5274394 5090583 5192739 5355077
7761 5355077 5561480 5465722 5421106 5337810 5242819 5175034 5310649 5241939 5144228 5305930 5376305
7750 5376305 5347239 5012785 4867014 4892199 4639559 4648763 4506281 4319102 4238221 4162502 4108364
7739 4108364 4098496 4204255 3953637 3981921 3935940 3947355 4032717 3932516 3827925 3659685 3606610
7728 3606610 3835539 3890591 3680267 3839789 3725440 3571700 3620594 3634756 3713679 3598104
7718 3598104 3566597 3528047 3613529 3574717 3626898 3486157 3334236 3246963 3412056 3400701 3431768
7707 3431768 3578759 3219684 3019904 3187791 3287862 3449074 3482236 3302816 3184816 3139459
7697 3139459 3050470 2942178 2892917 2831136 2999330 2950586 3082555 2838660 2790978 2739928 2850057
7686 2850057 2761634 2847909 2814300 2829316 2938911 2772060 2796917 2733489 2686850 2799867 2888109
7675 2888109 2824185 2720668 2854155 2997440 3088070 2975216 2780519 3111176 3294943 3162898
7665 3162898 3170978 3073068 2969442 3029655 3202840 3088629 2966185 3139758 3218884 3189125 3022229
7654 3022229 2825728 2947519 3035240 2571312 2540722 2555700 2613396 2674776 2902619 2988840 2720481
7643 2720481 2727370 2674529 2802953 2883038 2605264 2702246 2929186 2948388 2914115 3092766 3021289
7632 3021289 3014351 2800766 2650428 2629673 2551039 2679126 2649222 2603835 2386195 2232469 2151622
7621 2151622 2078035 1919634 1687094 1676459 1781432 1895068 1824015 1553545 1585210 1546831
7611 1546831 1385382 1377361 1300818 1361091 1521761 1600763 1317465 1349820 1472727 1485873 1233722
7600 1233722 1349232 1356143 1371744 1463056 1341916 1305033 1208123 1169002 1067001 1287892 1340543
7589 1340543 1316563 1250410 1387276 1419759 1521446 1315932 1289002 1357709 1262650 1137822 1152812
7578 1152812 1010136 1017705 1151272 916002 968816 1056315 936848 862807 786289 896880 1092179
7567 1092179 724257 553318 562791 739844 797598 595492 487072 602600 602254 721454 914441
7556 914441 939691 986732 1054410 1015641 725026 968733 926205 581490 501831 350286 499251
7545 499251 546820 481924 579488 553453 477165 423314 572274 434109 516365 778317 591329
7534 591329 515782 744799 842833 673424 609772 490904 365163 420945 475228 558594 274231
7523 274231 310076 262181 28588 438759 380535 562513 357769 283204 602825 347031
7513 347031 475326 524399 565540 314833 86727 246523 541271 536864 460420 331344 138050
7502 138050 329253 529139 444342 277368 369517 165076 163639 146600 199965 293882 106241
7491 106241 522 -73214 -22793 8426 -155346 -19893 67545 -137377 -66131 -31085 236114
7480 236114 283100 -59624 -134645 -207318 -129185 -140640 -150314 -63639 104646 166660 -24655
7469 -24655 270401 152095 58330 57671 -26653 -71689 -11487 207639 -43636 -171107 -171551 4463
7457 4463 -35223 40187 26832 -20781 217099 205377 39657 28211 104042 204350 141784
7446 141784 53177 -49832 -269787 -237659 -97811 57539 86370 -28034 243619 257484
7436 257484 42428 -31682 -38723 63956 141632 -49612 -141471 -41389 177980 157998 22028
7425 22028 -134422 -109771 -187203 -374639 -332635 -247617 -143190 -175966 -54344 -185160 -316183
7414 -316183 -149787 -49817 -144439 -215144 23148 215419 159600 -27676 -197975 9990
7404 9990 32044 -123803 -231938 66044 -5963 -131877 -7190 -109182 -395035 -236011
7394 -236011 -33419 -156503 -139566 156881 117835 141233 -59941 -161663 -68943 -137790 127687
7383 127687 245909 30162 -66065 -195704 -257428 102952 -70503 -76197 174353 147463 -95908
7372 -95908 105104 46380 -23955 132175 151659 254117 276376 93408 -139162 100713 162121
7361 162121 45817 80335 77965 30973 162834 238856 131405 -62755 -110267 54772 76008
7350 76008 237639 277543 31340 -189993 12694 96426 -148818 -208206 -46375 23932 -19102
7339 -19102 -44986 -327330 -180523 -66470 198196 192009 154715 168349 -44034 -290660 -254407
7328 -254407 -149312 75381 182783 223448 144226 65215 -35611 -132522 44952 204144
7318 204144 59483 -225306 -10061 61641 106868 274018 3684 -120675 236009 -31822
7308 -31822 -148556 -97853 -20751 192993 58516 8596 -136890 -135718 -70966 2224 45388
7297 45388 49570 14315 35642 -61486 -244640 -263252 -51089 -55401 -470287 -136479 20501
7286 20501 -93925 -21439 -910 -19004 1902 -91311 31837 68302 -100013 -122111 146680
7275 146680 27280 100333 150943 121977 -149520 -87894 55306 35171 -95419 67600 87255
7264 87255 79509 24470 230124 151172 106330 240021 318954 156668 34416 80570 216691
7253 216691 50185 26542 73647 78306 236676 144384 276005 279058 53038 -66288 145754
7242 145754 202427 201113 357972 433493 503187 312448 115799 181815 158340 276852 116511
7231 116511 333297 505200 312891 325240 468683 432876 616162 692874 767164 721186 731539
7220 731539 970117 1011642 612309 652847 767904 925180 695111 824932 953476 835659
7210 835659 725534 1003678 1122713 1298385 1446757 1490001 1709759 2023406 2316398 2475043
7200 2475043 3136594 3870053 4202375 5099197 6078704 7109196 7714219 8143773 8351798
7191 8351798 8658408 8697386 8624308 9164247 9615719 9433177 9175539 8451699 7788083 7041602
7181 7041602 6267706 5722106 5066931 4532508 3976554 3709073 3300695 3006945 2579324 2530135
7171 2530135 2447942 2375565 2485523 2220463 2097940 1861963 1758229 1887982 1793894 1925440
7161 1925440 1761646 1535878 1548137 1672755 1703033 1700054 1877888 1938672 1782888 1948712
7151 1948712 1865209 1854978 2052447 2245753 2219587 2340015 2191011 2242555 2253934 2301896 2649629
7140 2649629 2818358 2916979 3201915 3569058 3769298 4160373 4938404 5940869 6568856 7491557
7130 7491557 8710620 10493016 12474370 15069203 17784542 19149403 19778515 20311304 20415138
7121 20415138 20332938 20427153 21266092 22016455 21347124 20286937 18977235 17298852 15070133
7112 15070133 13388744 11651619 10364618 9222525 8293051 7284544 6323978 5968985 5529806
7103 5529806 4993791 4764782 4288106 4126881 3859340 3600915 3504252 3438787 3387737 3096130
7093 3096130 2827840 2751729 2543780 2520460 2523528 2507160 2617302 2539470 2203172 2086295 2107840
7082 2107840 2056001 2083172 2081318 2161164 2236704 2121167 1892348 1805778 1808861 1764770 1857775
7071 1857775 2048670 1808935 1886904 1852453 1956261 1960520 1707622 1732138 1887700 2087368
7061 2087368 2173765 2171814 2106084 2083931 2144714 2419133 2349152 2175385 1978589 2217986 2263510
7050 2263510 2541556 2970955 2985743 3292671 3771914 4325396 4842049 5613125 6429979 7583322
7040 7583322 8625235 10191705 12340075 13607335 13653862 13479465 12936835 12234090 11031314
7031 11031314 9847580 8638924 7837344 6817171 6167937 5415457 5034264 4787625 4445841
7022 4445841 4141403 3748222 3636669 3739502 3562114 3172818 3201105 3256879 3030193 3021521
7012 3021521 3103321 3341256 3293275 3485371 3756317 4138847 4405377 4755736 5554881 6058543
7002 6058543 7206350 8447700 9500128 11323910 13348027 15108409 15813820 15673583 15364537
6993 15364537 14755970 13538928 11942458 10439508 9264661 8276853 7258780 6604812 5817378
6984 5817378 5581096 5219024 4670910 4257950 4253933 4019372 3920270 4054211 3895626 4234827
6974 4234827 4219394 4328639 4722340 4993117 5533519 6370318 6837564 6848590 6545913 6274866
6964 6274866 5922879 5210159 4724965 4355153 4070773 3688075 3451266 3458718 3296833 3094553
6954 3094553 2921565 2611079 2645254 2535565 2479458 2574415 2626678 2412458 2540306 2369177
6944 2369177 2278980 2416061 2698423 2514104 2749774 3184802 3367214 3493931 3493452 3870814
6934 3870814 4248415 4740642 5388620 6140296 7120485 7695090 8627070 9071807 8927551 8608726
6924 8608726 8247723 7745537 7044454 6273088 5815676 5333017 4940977 4587697 4299255 4137605
6914 4137605 3629357 3181245 2852100 2728258 2624401 2604575 2676342 2600872 2259044 2109188
6904 2109188 1887649 1782670 1486442 1596896 1666745 1614593 1820750 1477259 1581528 1523340
6894 1523340 1242991 1210544 1399213 1374571 1289647 1265244 960028 1166130 878760 884805 958237
6883 958237 1025368 1006760 993611 878266 840034 869563 836328 659195 588680 623068 896547
6872 896547 906846 938872 808682 567824 684145 635766 561053 424396 390086 444261 181349
6861 181349 181683 290697 267697 225608 197775 109516 350155 327221 397662 368781 201188
6850 201188 392715 478849 434650 218068 188967 304301 191913 85128 159999 241244 496724
6839 496724 264615 290872 321713 334681 63246 232065 194282 439679 406035 117483 110583
6828 110583 178755 69032 -80179 -48668 -28986 100158 142492 223745 113193 161463 150828
6817 150828 235363 238610 162902 281489 -17439 100100 466896 517244 387742 96915 5979
6806 5979 -33078 -92930 -152719 202973 334061 308320 139953 59538 98426 261291 251145
6795 251145 -60033 71282 259190 289958 320067 19176 27074 405230 442991 474243 377434
6784 377434 396941 419584 373056 303860 162289 339504 226919 220534 214469 225029 325564
6773 325564 438348 327036 171206 337407 550548 614002 482759 131757 67962 355483
6763 355483 375468 179060 224634 346588 264203 319451 457556 386710 360546 447836 616722
6752 616722 643342 420320 546573 540560 179391 464342 543947 631690 769317 880358 677619
6741 677619 780083 785773 713644 797306 857063 1098542 1093486 1147042 1138227 944930 959681 1099192
6729 1099192 1377985 1037573 1303652 1330765 1228287 1813567 1801522 1553481 1540844 1846743
6719 1846743 2032433 2052333 2181062 2597011 2333351 2534674 2760696 2842620 2880605 3237487
6709 3237487 3273246 3529776 3723312 4067681 4165051 4263337 4360261 4378574 4488525 4383417
6699 4383417 4342186 4230773 4300890 4277686 4267106 4259194 4143190 4083369 3852225 3976837 3774060
6688 3774060 3513898 3504888 3533312 3585330 3237047 3029393 2885459 2873572 2733701 2627899
6678 2627899 2651900 2544846 2408219 2323650 2329558 2358481 2033821 1913030 2060428 2016584 1829072
6667 1829072 1819156 1896436 2006677 2023475 2106465 2073061 2013688 2213767 2282849 2117900 2089640
6656 2089640 2272134 2110178 2322890 2566754 2699229 2771979 2819815 2855101 2728772 2700641
6646 2700641 2882084 2971982 3265710 3424208 3648338 4038306 4735505 5317686 5865111 6598316
6636 6598316 7509123 8663265 10145865 12265917 14452601 15728687 16444553 16761517 17100791
6627 17100791 17145313 17311716 18051104 18593410 18589274 17893214 16769749 15532897 13964943
6618 13964943 12491983 11291333 10271552 9512758 8806564 8307796 7680005 6941021 6614561
6609 6614561 6560043 6071672 5893365 5699595 5607773 5362198 5218076 5313798 5572562 5604551
6599 5604551 6073272 6514254 6934747 7414063 8090627 9163787 10612124 12259988 13933905
6590 13933905 14685189 15131749 15244000 15359761 15045414 15246541 15921198 16133308 15425769
6581 15425769 14679194 13703467 12554606 11267556 9947279 9127269 8419273 7629866 6855717
6572 6855717 6216613 5938694 5733391 5353747 5086607 4803663 4458332 4374439 4236164 4030881
6562 4030881 3897123 4013147 4048802 3947884 3662813 3363070 3541450 3413118 3256585 3248700
6552 3248700 3277006 3131395 2939391 2807208 2819836 2882381 2915585 2866269 2975281 2892362 2801954
6541 2801954 2724553 2631167 2716630 2704554 2637717 2775351 2516179 2559317 2662906 2769983 2619635
6530 2619635 2380219 2384234 2519956 2539117 2830165 2551755 2757960 2825018 2844313 2768169 2864680
6519 2864680 2959249 2845644 2910259 2930934 2950134 3018107 3169039 3182720 3203439 3445601 3588613
6508 3588613 3534277 3529355 3490256 3689556 3896094 4134465 4319009 4213701 4035011 3905399
6498 3905399 3969052 4042156 4363490 4441702 4520353 4781837 5058694 5146590 5179573 5508359 5716092
6487 5716092 5786552 6139131 6402852 6464191 6883979 7270714 7259891 7520372 7751708 7995507
6477 7995507 8042605 8372385 8588617 8705929 8989036 9384081 9909984 9849915 10162801 10096389
6467 10096389 10253418 10396764 10449575 10577817 10684331 10267224 10252049 10574611 10465050 10091295
6457 10091295 9941275 10043639 9979769 9953234 9413816 9216106 9242125 8895917 8665254 8238558
6447 8238558 8181947 8011962 7860081 7611094 7333264 7272110 6850514 6435554 6400448 6146786
6437 6146786 5768348 5836146 5672298 5446140 5257953 5061211 4847929 4662666 4609705 4593327
6427 4593327 4570161 4481807 4430010 4232291 4101081 4034275 3798082 3664745 3636179 3631815 3426995
6416 3426995 3174299 3194971 3077203 3155557 3080752 3008559 2880712 2724705 2636958 2609687 2535593
6405 2535593 2498414 2604011 2605247 2446631 2175423 1947165 1981758 2164365 2111010 1954961
6395 1954961 2125504 1994587 1924702 1912920 1749131 1775294 1848093 1916967 1933264 1763491 1589415
6384 1589415 1574734 1470647 1490089 1602063 1525398 1407822 1226885 1313608 1410613 1159790
6374 1159790 1214420 1288245 1260986 1247558 974674 961383 1235220 1279873 1383441 1263013 1342634
6363 1342634 1299909 1235090 1142981 1404293 1489709 1360809 1368419 1473781 1308133 1037115 1181114
6352 1181114 1007389 1072551 1140391 1185566 882499 801714 907798 773264 727110 941559
6342 941559 1035208 927286 735879 596438 705249 658980 787569 638072 508256 696962
6332 696962 795044 814447 776498 758809 720823 674599 665790 719827 633719 416746 150559
6321 150559 398858 595546 639909 610929 276470 127180 53535 210159 416793 595518
6311 595518 235253 464769 694369 584553 521754 402419 334893 510913 484494 589642
6301 589642 652134 436847 423611 692326 480613 496947 456501 476905 758258 541353 425376
6290 425376 521908 530983 492848 580631 328971 354037 288553 527528 331584 479382 546340
6279 546340 316198 425235 436952 345354 304918 309887 353561 310626 322387 540758 422909
6268 422909 288091 426535 307415 211004 172920 174864 320698 130108 272130 321204 11492
6257 11492 -67446 168670 145766 112100 357396 384138 276155 330051 246862 28280 -167853
6246 -167853 -334197 -30519 52589 141853 199236 145015 139339 195818 294774 29485 87241
6235 87241 168421 498701 449489 214918 -4027 161875 257004 247548 194121 98360 194798
6224 194798 152954 -32872 23817 8159 -2331 259590 82025 1596 46085 -12152 109466
6213 109466 95904 200158 136651 159648 237903 208537 133987 -175162 -104039 -62499 289906
6202 289906 158861 123400 -25473 -55678 136593 182905 106681 56335 265281 228208 1221
6191 1221 160409 83091 220245 197760 31943 -95035 101564 222390 213211 299081 207378
6180 207378 53657 -104596 -34011 -40516 138447 177237 80827 -238275 -194471 -35520 -336060
6169 -336060 -194105 48671 132879 47114 -181537 -74733 31393 -32640 50189 211938
6159 211938 211183 111440 -80845 38526 -43054 -121730 -83154 32363 49366 105149 -69545
6148 -69545 -205518 -256383 -53431 -84810 -110658 75880 -63157 -54478 -166981 -150905 80448
6137 80448 48994 93722 195741 236946 113389 -105751 -426753 -305383 -186339 -245272 -185914
6126 -185914 -194566 33282 15861 18285 153604 241318 42331 -4388 567 -102570 -262127
6115 -262127 -96491 -24320 -82800 -139610 -243753 -25463 100935 -23803 -131150 -7123
6105 -7123 -1717 -177310 -156116 -173652 -122631 -98503 -37945 -149963 -230803 -325358 -274027 -325409
6093 -325409 -261245 -234126 -339376 -214292 -2526 69339 -186404 -184246 55930 8914 84850
6082 84850 -209835 -83457 34466 -100546 50291 145939 296004 170773 98830 -27066
6072 -27066 -42435 -251779 -55416 105954 114939 27552 -166365 -158405 -44416 27689 132649
6061 132649 74284 -134579 -2196 96311 -142627 -86421 32236 72642 -23216 -27698 -116229
6050 -116229 27690 -48642 -50697 -35037 104677 79054 -56912 -29308 -3843 -80375 -184206
6039 -184206 -222676 -68399 67109 169379 317695 1651 22137 -175950 -178088 -73286
6029 -73286 -208255 -102418 -179455 -250278 -216171 46441 -88509 -226580 -196041 -30324 -38689
6018 -38689 -197410 -122475 -33610 44375 -43759 43181 69588 87148 179544 -17082 -142905
6007 -142905 -93480 -137960 -41760 35056 -71282 -69580 128638 57562 -61868 -105063 -133632
5996 -133632 -144875 38247 36316 -49740 -124619 -16019 -256051 7156 -13852 -22804 -6110
5985 -6110 -366913 -393606 -313062 -333002 13763 187624 383174 133192 -166216 -138538 -72002
5974 -72002 -233782 -144405 -23546 -271552 -26252 -90624 20556 -27656 -153358 -99568 -173135
5963 -173135 -347287 -241432 -234454 127805 -34092 -94713 -365 -121175 -325530 -251384 -6785
5952 -6785 -50331 130270 34979 -173825 -205360 88651 85693 37603 33952 -240762 -278816 -246698
5940 -246698 -186275 -78168 -56672 -39016 13124 -140304 -2797 539 -27199 -1747 -116068
5929 -116068 -146372 -85583 27289 -4966 -152093 53324 -73736 61688 210901 103606
5919 103606 134196 -106220 1421 -173600 -276955 2591 16965 -153613 -50650 68873
5909 68873 25748 -5374 -184904 -22293 -43526 -214588 -29050 -10178 166521 92458 27004
5898 27004 -226748 -194988 -167821 -10328 106937 59818 64837 -37227 -133263 -170270 -162130
5887 -162130 -141668 -83935 59138 -115822 -175755 -271299 -105370 125012 76084 66693 101126
5876 101126 103362 -38637 -303131 -361326 -532384 -395457 62942 233564 -77802 -262011
5866 -262011 -57131 51690 -80411 -574322 -369689 -172441 39303 142952 -25400 -2793
5856 -2793 36749 -52008 -102222 -172181 43674 14524 -71853 -176492 -177595 32747 -202159
5845 -202159 -411146 -400280 -375115 -296241 -296694 -288859 -482408 -502558 -50383 169407 13903
5834 13903 -141914 -42771 83355 -153391 57221 -78517 -72701 -94371 -88405 -124630 -85916
5823 -85916 -212771 -244507 -241714 -270677 -271638 34267 120854 -28140 -58721 132789 81640 -211299
5811 -211299 -172730 -59221 -199830 -332375 -17652 -91338 -181380 -225203 -181926 -304698 40577
5800 40577 100919 -149686 -118457 -97445 -90530 -284159 -370545 -71901 -25037 -92990 -209057
5789 -209057 39845 100686 33517 -36141 -98647 -56370 -106120 39399 175558 69862 -71346
5778 -71346 70991 37889 41702 -158697 -195472 114998 1949 -142105 -227590 -21775 -107681
5767 -107681 58561 -62205 -127983 -149462 -235463 -566593 -558205 -7331 132459 89333 -77462
5756 -77462 -182926 -322581 -331907 -197589 -55347 53354 192666 103496 -183496 -88329 -180927
5745 -180927 -377704 -283021 -414656 -244457 -191428 -148736 -65891 -271794 -48075 -54184 -184617
5734 -184617 127804 110881 -80820 -23247 -189326 -418827 -515206 -212778 21912 -29141
5724 -29141 -125463 -247610 -185288 -150157 -134078 -55665 -32543 106439 39199 -354180 -264250
5713 -264250 -390313 -122412 -114819 -145898 154383 82011 46513 -110289 -244893 -217101 -173761
5702 -173761 -94238 97387 165273 7065 12936 -117250 -138515 -339275 -342624 -125991 108661
5691 108661 67228 63201 141350 -65673 96218 -21612 -80865 -250094 -431597 -428680 -187315
5680 -187315 -131562 -276010 -231360 -215647 63787 139180 -94055 -240245 -86648 129256
5670 129256 -70101 -3828 -77007 -231582 -154082 -184614 -124771 -119923 -154758 -239975 -279914
5659 -279914 -82577 -60134 -162241 17741 33249 24524 -113985 -148134 566 -245746 -106274
5648 -106274 -56370 -217181 -106686 -390738 -525434 -332410 -158827 -75020 -80213 51373
5638 51373 -32464 -300402 -170136 -318351 -210004 -222331 -203454 -83182 -172541 -52493 -174297
5627 -174297 -100556 -212174 -170667 24984 190392 -86967 -64713 150062 166244 -109263
5617 -109263 -64567 -109262 -146936 -192888 -218682 -73552 -207476 -114035 -137286 -148024 -204838
5606 -204838 -109098 -45625 -48587 -219679 -280980 -145428 76445 13415 67183 45192 -226748
5595 -226748 -403999 -300872 -179865 -71018 -143065 -199399 -76830 58045 -69149 -41776
5585 -41776 -214123 -120733 -150670 313 242773 -26306 -192362 -374780 -286317 -91039
5575 -91039 99690 -12857 144459 185333 275396 196175 -14144 -168670 -149940 74243 30612
5564 30612 -132205 -249359 60004 97095 -34548 -42819 -45258 -221961 -251038 -70991 106759
5553 106759 351149 42880 50141 73514 -54679 63003 24808 -178682 179727 253931 98094
5542 98094 32629 -126784 -104408 -106584 142121 311051 45521 -283380 -79287 -142817 18086
5531 18086 6253 -129277 -100307 -57152 121164 -92521 -216231 -57286 -100049 -43388 -13185
5520 -13185 95714 80775 33816 -74943 -75585 -54829 -146644 224676 94855 74267 -20704
5509 -20704 118032 -19002 27792 68742 101455 124490 27814 25617 -21821 49023 -43442 -145227
5497 -145227 120317 114011 57754 -23360 55311 151373 32486 22572 -22351 117959 64503
5486 64503 -61424 -124092 -1493 52358 23545 -61423 108831 -17777 -64452 249696 254256
5475 254256 -4788 30695 -7096 95210 219374 268292 210032 186296 153757 287593 469210
5464 469210 211914 296537 301923 378008 414304 401843 152021 245875 359214 458398 591449
5453 591449 503444 363013 293864 530118 491788 330170 285823 457982 406703 338400 376921
5442 376921 304830 218136 425712 403188 459175 426285 206929 1218 -51821 28708 137009
5431 137009 98862 82781 292901 180940 175464 220854 254632 358947 509788 199368 -70253
5420 -70253 69517 296418 321974 79581 120459 50784 -19037 179151 214418 316758 181120
5409 181120 -44418 39684 395690 336321 209753 336547 283643 397882 239213 -73991
5399 -73991 -165312 52052 86029 103911 28460 63590 288923 262941 108148 26075 -81359
5388 -81359 57717 87655 365193 332780 35267 -54712 88499 169219 258909 57564 158250
5377 158250 351291 104711 230548 422235 313207 239276 256421 62143 34621 -18030
5367 -18030 -113195 12960 90544 122356 296659 232812 617 -387474 -115527 131557 -7410
5356 -7410 -22203 -166582 18172 74556 -15801 69435 137188 344684 231561 -61050 -127469
5345 -127469 -120367 16004 84456 -62967 -78565 -184653 93587 40379 38015 103644 322302
5334 322302 374606 22812 -12993 15491 -171820 -234569 -310835 -86737 128728 94451 -22481
5323 -22481 25478 24967 -71109 -118389 -60548 269024 462909 296435 109083 148837 17622
5312 17622 -54741 -52316 -174508 -94939 196632 218426 175373 6200 84898 237710 90747
5301 90747 70327 78312 82942 -102945 -258291 -129749 -9513 35209 50742 85615 -304609
5290 -304609 -86294 215703 278143 80132 -119796 65725 305354 22211 -139339 61929
5280 61929 56140 132950 160055 182941 298548 264426 108841 8854 80551 214824 212016 184955
5268 184955 -1414 16796 111437 67918 211262 131579 32080 -42114 74110 211238 15722
5257 15722 36394 122965 -84014 89684 211064 127866 81022 47419 120970 136963 204465
5246 204465 -130542 -187942 -103395 40450 72083 73289 96893 97900 111637 13903 76417 50274
5234 50274 -180651 -66301 80027 232278 95016 -87852 64029 162491 271761 321082
5224 321082 115485 192986 155950 85121 358440 234245 150485 275381 331420 277501 255448
5213 255448 334803 538158 618823 645721 448463 471212 691246 487636 373980 285715 405797
5202 405797 371300 411843 265582 176111 24478 341400 339813 138886 163506 267648 695692
5191 695692 741168 939609 1118881 926739 889185 840197 884115 926003 543111 386835 547046
5180 547046 671398 329499 367826 260593 355486 341760 410363 598791 207434 320048
5170 320048 421689 188152 253889 110480 6513 304520 464442 160047 161054 129266
5160 129266 300294 256315 180747 210999 195805 212740 499740 383561 513148 565070 176996
5149 176996 278894 -114306 -65161 362027 415869 223393 213476 326746 332839 440387 300876
5138 300876 401070 409372 412165 298473 348510 444825 448602 295921 285387 388878 343805
5127 343805 335222 405285 129820 277990 561034 452880 390998 425777 716279 518467 326396
5116 326396 324506 438174 344335 347915 213678 148414 228976 403202 543715 264548 497096
5105 497096 616347 337202 353867 363442 353283 482070 435116 277158 87566 305782 619649
5094 619649 520965 581259 395529 463719 551242 639781 496214 530781 639742 608142 430599
5083 430599 636661 683019 673123 737143 995865 1052303 787200 833091 1151101 1136441 1021699
5072 1021699 922238 974685 873768 476641 493085 745161 774936 786624 784909 886703 867587
5061 867587 768056 818529 731325 677472 695155 833544 1111760 1122005 1227748 1030093 793055
5050 793055 605328 674607 655909 628707 665340 780701 984109 913403 729917 580013 556448
5039 556448 672509 721769 836197 1065273 801322 647590 751160 794256 775398 851501
5029 851501 718346 949591 872324 900608 716845 640518 901868 653010 410661 578664
5019 578664 812355 894861 567774 473946 699725 919592 842871 505048 610907 778652
5009 778652 810308 819167 803654 757954 1014276 905171 612791 721437 730818 522725 390566
4998 390566 518928 470500 608898 727110 662010 634646 409270 149543 420712 347453
4988 347453 478811 606071 667371 692430 595640 389945 400025 293264 381033 656383 568822
4977 568822 430603 639723 563401 643659 763325 681855 707483 666280 805833 947552 764847
4966 764847 633049 703087 654934 572892 510643 679617 545035 404490 625364 608873 674418
4955 674418 648648 660421 653727 732664 935622 956429 930891 869126 729650 779104 824529
4944 824529 834859 850022 758674 710193 634056 893751 962170 953547 1023944 1019836 734992 641237
4932 641237 707109 741693 848652 880379 1096604 890615 918097 1038629 989620 841238 903536
4921 903536 843959 922760 1235942 1120830 1020120 766566 726445 363842 419242 604299
4911 604299 791837 769113 837034 825801 653413 529695 499482 522931 465074 652734 706909
4900 706909 694647 834578 896228 869550 632931 742328 874596 1097277 1163678 1101350 1040185
4889 1040185 1098948 843306 927393 736785 752098 659378 490329 582218 635853 572799 411389
4878 411389 418141 612451 871088 1029969 980204 790197 601365 573894 721751 811792 1050650
4867 1050650 1193617 1083958 1161165 885019 930914 1125190 1255101 1237695 1231928 930787
4857 930787 840384 769319 690446 747547 601983 595002 733641 835735 779205 933452 675462
4846 675462 480512 442418 657065 678685 873480 772969 731103 624440 318734 609230
4836 609230 764709 692686 1067269 1037358 747864 473570 670549 583606 868021 977108
4826 977108 979877 948347 1270355 1151569 881523 938715 869366 887065 744827 837832 852531
4815 852531 808087 1044453 1123511 1045412 953768 1081278 714933 577097 661842 539794 501926
4804 501926 675769 703869 964964 999223 865593 789182 901493 861508 958865 1023653 977803
4793 977803 1105695 1293691 1541203 1368787 1392345 1560628 1544654 1501803 1759205 1905044
4783 1905044 1790533 1515566 1666696 1521869 1589555 1470684 1258756 1340232 1252464 1553132
4773 1553132 1446071 1470370 1371506 1206637 1363466 1374706 1369494 1441367 1436682 1543173 1968545
4762 1968545 2115588 2451925 2753931 2933858 3130205 3028282 2930645 3019995 3055029 2988337
4752 2988337 2851925 2793060 2697281 2561443 2246902 2202730 2108084 1863222 2005656 2088414
4742 2088414 1998135 1917284 1635247 1828349 1656558 1843409 1783348 1740510 1579107 1833458
4732 1833458 1919264 2112571 2189924 2060683 2297025 2015350 1768026 1924250 1887850 1764651
4722 1764651 1931550 1954199 1717226 1667347 1719049 1585205 1526263 1573597 1621005 1700430 1614992
4711 1614992 1612243 1854628 2006669 2155561 2175626 2337552 2365214 2310998 2384737 2461558 2659621
4700 2659621 2698626 2756674 3006006 3082551 3197078 3132474 3136227 2875784 2791918 2839846 2758113
4689 2758113 2600390 2363811 2288256 2328598 2233961 2463932 2570225 2532929 2966462 3073310
4679 3073310 2804313 2733390 2687289 2487679 2414229 2571181 2548465 2396657 2175064 2343211
4669 2343211 2481268 2545404 2592255 2492122 2348387 2586663 2554458 2761040 3026528 2970712
4659 2970712 2892274 3355950 3333378 3300253 3549008 3492054 3519108 3558224 3644674 3420884 3523026
4648 3523026 3531414 3568786 3696707 3832060 3910366 4027441 4232298 4438426 4474053 4525517 4270088
4637 4270088 3971797 3712971 3785880 3711701 3785101 4112876 4212175 4486451 4336932 4128271
4627 4128271 4315878 4243010 4065726 3838619 4039754 3993525 4012370 4153512 3958827 3873186
4617 3873186 3923811 3886874 4017025 4212417 4281648 4463040 4370110 4271263 4147622 4090571 3982562
4606 3982562 3860373 3577665 3460043 3528984 3464141 3467957 3519114 3544284 3511167 3320779 3299421
4595 3299421 3430345 3625020 3478226 3611560 3571358 3761556 3972328 3940641 3892439 3990211
4585 3990211 4282074 4409452 4555173 4478868 4382856 4358958 4602551 4674246 4676477 4729778 4696119
4574 4696119 4797023 4752658 4641310 4455355 4552203 4378845 4293878 4365522 3911626 3905547 4004552
4563 4004552 4035426 4010304 4080216 4121405 4024030 3787484 3903756 4072502 3866395 3900704 3958612
4552 3958612 3806858 3981585 3913477 3863400 3904630 3890587 3976758 3956767 3854313 3918520 4122870
4541 4122870 4193842 4148161 4277593 4338005 4306488 4480908 4715653 4806151 4915260 4908635 4629801
4530 4629801 4691422 4796155 5013794 5230657 5310952 5532815 5421990 5457632 5654336 5376444
4520 5376444 5411082 5372587 5359622 5669447 5711102 5903453 5978143 6332313 6727592 7191534
4510 7191534 7443979 7735176 8207147 8700630 9368888 9471395 9976402 10417926 10977086 11588506
4500 11588506 11909531 12338046 12762408 13158463 13713694 14024828 14793459 15484791 16329141
4491 16329141 17440970 18702577 20438971 22657204 25780944 30036046 35720405 42932358
4483 42932358 51409470 61494392 73316518 87947580 106167245 129174484 153025990
4476 153025990 170574888 179242497 177314147 167776323 153184289 135788745 118096368
4469 118096368 103211944 91665497 82208283 74069283 66628017 59657486 53891086 49131095
4461 49131095 44783167 41194446 37803514 35157260 32739056 30464299 28845006 27342697
4453 27342697 26312599 25126304 24456817 24123276 23938164 23860675 23750509 23744348 23574223 23541270
4443 23541270 23475706 23550159 23867927 24456276 24870217 24944059 24937845 25420147 25737117 26090905
4433 26090905 26656959 27425499 28705554 30400480 32863280 36873894 41988994 48558662
4425 48558662 56752662 66618427 78377412 92616122 110709328 132896757 153837175
4418 153837175 168696565 179421390 180514250 171592333 158364880 142974270 125917923
4411 125917923 109841451 97076871 86434336 77385526 69366322 62697950 56611387 51510390
4403 51510390 46972779 43404503 40616514 38238655 35739789 33880579 32290287 31090587
4395 31090587 30538114 30090097 29344451 28244804 27441340 26415768 24859910 23409590 22288287
4386 22288287 21237681 20465648 19710877 19169860 18693206 17909113 17255178 16852184 16586691
4377 16586691 16082160 15575681 15259046 14577697 14125488 13660978 13231442 12945245 12513761
4368 12513761 11974964 11537925 11394738 10899285 10637767 10681742 10425046 10200789 10067496 9814324
4358 9814324 9600135 9473210 9316799 9405064 8960789 8861076 8642536 8601041 8511708 8317010
4348 8317010 8134732 7996767 7836802 7856396 7869835 7754898 7546045 7597574 7586322 7425879
4338 7425879 7466738 7321442 7192490 7121444 7243771 7065039 6911259 7074169 7009866 7064123
4328 7064123 7184390 6965473 7103412 7135108 7178243 7026163 6800697 6778547 6772757 6696744 6801255
4317 6801255 6678681 6603754 6913500 7220009 7203486 7226179 7127516 7128033 7094026 6848088 6668398
4306 6668398 6666952 6419397 6473861 6407865 6236136 6229177 6214599 6071779 5952196 5967852 6102529
4295 6102529 6071929 6108019 5912782 5865874 5808504 5666121 5538389 5565151 5529250 5469166 5573830
4284 5573830 5774895 5784162 5449589 5397132 5231949 5344311 5477075 5468305 5208184 5430918
4274 5430918 5386016 5495331 5608455 5631850 5781083 5575589 5489915 5871747 5757778 5771334
4264 5771334 6005016 6239754 6403698 6508146 6406424 6495697 6460850 6553400 6681904 6611321
4254 6611321 6681265 6687405 6874180 6977478 6942082 6819852 6534650 6494393 6705169 6962517
4244 6962517 6884984 6601347 6854466 6829608 6796510 6877199 6910860 6918498 6923944 6988263 7226796
4233 7226796 7285270 7034592 7289927 7559661 7704141 7708384 7712497 7705115 7604410 7785231 7903758
4222 7903758 8042965 8174352 8126490 8163036 8261311 8374778 8457662 8652383 8531190 8476935
4212 8476935 8571974 8568512 8950711 8899289 8666879 8866053 9043681 8999464 8868425 9106608
4202 9106608 9468890 9887901 10143720 10521353 11116078 11158394 11329140 11469488 11376286 11277399
4192 11277399 11142067 10824785 10446616 9987343 9970506 9739037 9862419 9971686 9851227 9717611
4182 9717611 9678078 9415486 9759484 9830841 9977740 10111930 9947979 9773800 9556000 9907846
4172 9907846 9715470 9560570 9687971 9818524 9693372 9638367 9772335 9799123 9714945 9756651
4162 9756651 9585130 9837061 9965374 10185228 10070636 10280529 9967308 10128275 10275794 10332105
4152 10332105 10402853 10694725 10845810 11056267 11284571 11522324 11739732 11739834 12092474 12325498
4142 12325498 12084510 11572452 11593671 11483720 11395432 11309574 11367125 11223090 11261678 10843195
4132 10843195 11155355 11108913 11026755 10732518 10635564 10508740 10206210 10319629 10361669 9997485
4122 9997485 9804858 9825789 10062739 10184309 10207633 10354810 10334863 10500634 10567120 10633030
4112 10633030 10801117 11043419 11158934 11120653 11341140 11348986 11471425 11505768 11343876 11485785
4102 11485785 11782989 11909952 11897141 12136806 12082749 11964453 11840982 11878427 11843718 11842842 11621713
4091 11621713 11597293 11514862 11494772 11445430 11422551 11388523 11470047 11629839 11542780 11358483 11205368
4080 11205368 11483477 11181289 10780721 10863424 10822667 10893903 10950880 10898450 10625894 10737182
4070 10737182 10930342 10903857 10672872 10271900 10191116 10279902 10147629 9790560 9687682 9347462
4060 9347462 8980077 9277028 9206463 8947064 8690317 8677528 8670710 8559534 8642304 8637395 8771116
4049 8771116 8825806 8743430 8984857 9048431 8991438 9417815 9400336 9485477 9553052 9852378 10088113
4038 10088113 9746965 9387901 9214850 9170312 9293437 9326334 9152273 9219987 8907917 8894878
4028 8894878 9248201 9233660 9179679 8924052 8950105 9145033 9173050 9379236 9812166 10355340
4018 10355340 10708250 11924166 12893630 14121351 15574856 17112783 19154371 21398366
4010 21398366 24089747 26760962 27726255 27420560 26690291 24800520 22696507 20607263 19069829
4001 19069829 17916511 17055532 16172819 15305858 14782084 14209607 13944791 13978617 14195472
3992 14195472 14748667 15369712 15878189 16155648 16758171 17664650 18692919 19509965 20073133
3983 20073133 20624240 20517872 20009636 19272567 18562365 17689213 16851952 16761204 16523267 16255412
3973 16255412 16223508 16199614 16171836 16232626 16400162 16664461 17204454 17689665 18461153 19194390
3963 19194390 20113218 21553365 23431268 24713835 25105532 24784170 24344944 23531253 22110880
3954 22110880 21175831 20113898 19505601 18991277 19057212 18951297 18606316 18316522 18049222
3945 18049222 17748050 17915428 17915430 17914807 18153066 18061006 17954135 17776787 17907591 18205664 18715904
3934 18715904 19001000 19238207 19169131 19089812 18921046 18641601 18557472 18253787 18027935 17803154
3924 17803154 17573901 17481302 17253903 16973161 16958464 16959528 17063476 17158509 17432713 17555258
3914 17555258 17708893 17811646 17713673 17252309 17150573 17261948 16930709 16779964 16611877 16688812
3904 16688812 16436412 16402361 16322366 16475597 16507282 16839891 16958160 16907217 16841442 17004490
3894 17004490 17445010 17768180 18076812 18612177 19244912 20040353 21294037 22444914 23304583
3885 23304583 23547275 23431340 22927144 22454502 21733967 20918464 20141026 19661283 19657866 19542437
3875 19542437 18939286 18662663 18768839 18585083 18361420 18129866 17687805 17742892 17914128 17768724
3865 17768724 17908825 17988136 17801358 17884766 18140213 18348554 18244162 18506958 18772497 19145596
3855 19145596 19642425 19706994 20301830 21125271 21670134 22200299 22891564 23576555 24596383
3846 24596383 25627360 26513543 27974625 29849286 32170410 34827680 38188078 41890860
3838 41890860 46569679 51623770 57032929 60751120 61096289 60342585 58675225 55857724
3830 55857724 52663189 49953842 47562569 46153810 45257500 44255833 43125299 42081105
3822 42081105 41159046 39830729 38574442 37723978 36775581 36086531 35560777 35120241 35234347
3813 35234347 35321048 34967609 34667133 34190837 33360722 32228086 31184325 29983360 28802610
3804 28802610 27887790 27107282 26387377 25893982 25394098 24868691 24384758 23696335 23026017
3795 23026017 22398871 21937559 21045744 20284662 19695163 19049774 18638101 18252632 18085616
3786 18085616 17557172 17214188 16812720 16472687 15827572 15586358 15556106 15328908 14959872 14559443
3776 14559443 14134477 13620630 13385924 13042703 12864122 12666711 12305858 12524745 12392920
3767 12392920 12124888 12050605 12016119 11848438 11729872 11698592 11693984 11772798 11557332 11507527 11298222
3756 11298222 10990895 10742028 10633377 10465770 10239762 10231059 10248394 10069689 10330290 10270748
3746 10270748 10054273 10272130 10311857 10448071 10426877 10128633 9991996 9992216 10018248 9999436 9946267
3735 9946267 9853542 10037143 10035708 9953251 9958420 10118168 9983663 10057841 10157959 10039159 10159243
3724 10159243 9720747 9783937 10198289 10266465 10552990 10427122 10754617 11050257 10942274 11063682
3714 11063682 11159960 11170403 11313131 11081024 10873547 10940050 11170634 11012962 10994675 11178968
3704 11178968 11392597 11478244 11641469 11769625 12160169 12331370 12959780 13474784 13758084 14435990
3694 14435990 14894286 15290958 15421656 15450774 15493451 15381016 14864000 14291027 14112283 13879037
3684 13879037 13777081 13566867 13462452 13772828 13860110 13964252 14117657 14317335 14333184 14575545
3674 14575545 14830240 15197775 15431165 15651412 15576342 15543225 15859204 15754476 15730772 15728434
3664 15728434 15602960 15472080 15643802 15980371 16120880 16247571 16091303 15829101 15611149
3655 15611149 15596437 15607175 15452481 15168553 15262065 15296935 15298268 15407528 15312909 15213881 15192476
3644 15192476 15257567 15216413 15211370 15406621 15429095 15460186 15581269 15856479 15740821 15722655 15850819
3633 15850819 16002438 15975160 16510077 17017333 17269181 17220180 17368270 17514729 17606674 17855098
3623 17855098 18254223 18592293 19000595 19317808 19787421 20544246 21058287 21833000 22631858
3614 22631858 23491658 24878445 26330714 27417953 28644230 30326129 32290547 34515368
3606 34515368 36848709 39786069 42916797 45853361 48923470 51787711 54235086 56206364
3598 56206364 57748839 59022763 60021310 60256295 60346822 60718638 61048303 61353089 61920429
3589 61920429 62323906 62685012 62487798 62384420 62027317 61048231 59761213 57931300 55790816
3580 55790816 53554053 51314838 49007661 46731972 44699045 43152595 41931667 40638001
3572 40638001 39825119 39495193 39222306 38903549 38778181 38962384 38973500 39131267 39302755 39474770
3562 39474770 39567280 39499602 39687223 39614998 39258200 39374175 39488459 39307121 39237475 39332175
3552 39332175 39242864 38978236 38650600 38183683 37647385 37187162 36670903 35957469 35335670 34789976
3542 34789976 34023727 33473545 33008621 32146850 31529588 31000159 30895482 30440655 29923224
3533 29923224 29786164 29487513 29014045 28892152 28689632 28371646 28494066 28555597 28601904 29202415
3523 29202415 29455081 29735009 30309960 31153025 31864817 32481681 33205284 33736448 34445910
3514 34445910 34996953 35150971 35261937 34902897 34903608 35064020 34673766 34025314 33708141 33287760
3504 33287760 32746892 32425267 32215890 31928252 31642413 31355548 30988311 30885975 31119005
3495 31119005 31004084 31033112 31371300 31362049 31498440 31393753 31218868 31092979 31161174 31415844
3485 31415844 31548295 31655387 31836872 31776589 31847278 32075628 32116495 32212670 32528767 32707990
3475 32707990 33043881 33512752 33902630 33878702 34291373 34900362 35421649 35803980 36206371 36847214
3465 36847214 37700175 38275655 38970161 39821246 40966262 42375113 43852228 45704140 48178072
3456 48178072 51141761 54571382 59080548 64308450 70815550 78444093 86973239 96222088
3448 96222088 106068414 116150892 125864963 135212840 142739625 148270001 151564919 152282712
3440 152282712 150582580 146743500 141262767 134717047 127215725 119664652 112043210 104854069
3432 104854069 98065840 91939790 86455685 81397743 76769245 73123569 70063530 67337052
3424 67337052 64829460 62765258 61217759 59937121 59246379 58612342 58568603 59036342 59872868
3415 59872868 60682846 61839016 63432702 65328450 67170572 69340199 71365171 73349409
3407 73349409 75115553 76338472 77182845 77287995 77233129 76609449 75534216 73970268 72411082
3398 72411082 70831997 68478072 66206808 64030856 62080196 60164457 58232144 56143995
3390 56143995 54565258 53225044 51848675 50432731 48922683 47690994 46740040 45668610
3382 45668610 44616534 43656822 42712076 42050425 41403395 40666466 40276529 40072627 39473924
3373 39473924 38836489 38449826 38386348 38346537 38007115 37632102 37268436 37034637 36783814 36511236
3363 36511236 36276671 36340078 36518019 36187340 35931387 35904297 35643987 35456804 35172348 35147395
3353 35147395 35222252 35045738 34798192 34826338 34679955 34569352 34445795 34422462 34253819 34014738
3343 34014738 34325141 34399463 34380226 34277747 34318656 34214603 34329007 34134455 34040382 34145718
3333 34145718 34163054 34047393 34081801 33969989 33888897 33862573 33759902 33839549 33606940 33734416
3323 33734416 33838064 33755752 33691431 33802038 33650921 33578573 33568670 33577789 33478509 33129908 33000707
3312 33000707 32878103 32979328 33069770 32738896 32804515 32570761 32502129 32626021 32577002 32612728
3302 32612728 32604223 32584712 32501143 32556306 32704239 32840903 32748542 32899592 33203457 33334921
3292 33334921 33388616 33645582 33621288 33618659 33566155 33568925 33762607 34234278 34213837 34350859 34600335
3281 34600335 34506938 34359579 34247266 34404594 34601255 34841734 34758924 34554122 34279057 34371909
3271 34371909 34566688 34615034 34842172 35004915 35217764 35388899 35505150 35694083 35717368 35913955
3261 35913955 36032952 36124487 36331146 36472143 36611631 36805485 37003703 37505020 37961959 38339094
3251 38339094 38817740 39135126 39723685 40436854 40872133 41431695 42216273 43265112 44144577
3242 44144577 44970537 45714731 46661255 47226441 47875476 48883440 49524903 50335568 51129257
3233 51129257 51840603 52312501 52869300 53201045 53596944 54028117 54289650 54587439 54904788
3224 54904788 54891825 55043572 55242466 55012335 55022211 54929285 54788657 54882063 54556473 54520730
3214 54520730 54463991 54390868 54480761 54701938 54774551 55156601 55465461 55369247 55792214 56299127
3204 56299127 56835701 57678253 58484187 59415663 61058110 62561953 64517415 66443634 68744851
3195 68744851 70838159 73330661 76052672 78317774 80805209 83099995 85534132 87417345
3187 87417345 89409881 91754803 93891693 95869667 97432885 98919211 100272753 101510822
3179 101510822 102515803 103274252 104212793 105112658 105616006 105761306 105749307 105388166 105248348
3170 105248348 104699211 103749414 102644805 101788463 101056050 100440170 99888801 99727151 99881845
3161 99881845 100334726 101119200 101993304 103471544 104968565 106643840 108568002 110630915 112760947
3152 112760947 114543102 116707517 118895267 120922115 123020009 124860804 126490299 128022838
3144 128022838 129433299 130826054 132097984 133721547 134933096 135883956 136769641 137320057
3136 137320057 137548224 137581830 137620625 137053073 136566389 136270878 135362540 134403137 133698019 132896012
3126 132896012 132261519 131871579 131836658 131904076 132041493 132399167 132969242 133962787 135171119
3117 135171119 136381510 138073681 139812625 141916937 144336566 147233005 150663325 154804308
3109 154804308 159417386 164682559 170933991 178037404 185531688 193956281 203172155 213156565
3101 213156565 223394542 234063847 244441579 254630284 263841881 271519665 277520983
3094 277520983 281298267 282319186 280656743 276568383 270389589 263265958 254716601 245636790
3086 245636790 236479075 227805743 219494079 211929177 204528384 197199220 190886650 184861867
3078 184861867 179069002 173901855 169194230 164457379 160192546 156398967 152935341 149681539
3070 149681539 146525274 143680635 141014996 138396600 136100281 134154344 132008603 129784070
3062 129784070 127434607 125631518 123658000 121579927 119944728 118228318 116426541 114927472
3054 114927472 113160630 111400637 109778329 108275189 106752501 105233746 103834554 102655310
3046 102655310 101580972 100322326 99288581 98275994 97339774 96686223 96190006 95938888 95559578
3037 95559578 95346011 95290967 95494716 95987007 96787254 97949448 99179457 100124315 101550239
3028 101550239 102883335 104222343 105508710 107183272 109268924 111202741 113471738 115398007
3020 115398007 116930266 118532024 120456488 122187322 123782499 125181490 126509598 127440181
3012 127440181 127642404 127512113 127056867 125691031 123838833 121734472 119313657 116205374
3004 116205374 113073606 109703059 106151518 102540447 99370014 96148378 93265679 90407897
2996 90407897 87656150 85420092 83229130 81029334 78967488 77347692 75689948 74244457
2988 74244457 72824468 71571487 70190390 68747605 67575122 66415100 65369691 64372883
2980 64372883 63454312 62610877 61806804 61045472 60381869 59783690 59137800 58692825 58007085
2971 58007085 57377976 56852617 56148807 55632720 55173117 54825550 54454368 54307121 54351717 54162554
2961 54162554 53730858 53150489 52755888 52348353 52028333 51668442 51252931 50720370 50263605
2952 50263605 49869956 49308895 48809629 48396518 47983498 47486886 47069034 46572793 46588407 46643098
2942 46643098 46165730 45781194 45428427 45033228 44691464 44555627 44407538 44228840 43727856
2933 43727856 43622850 43435813 43076358 42823742 42696665 42376605 41939060 41658969 41871164
2924 41871164 41728908 41180641 40959394 40881260 40774951 40663640 40345445 40052606 39910471 39831452
2914 39831452 39552717 39218530 38984220 38672177 38498289 38264867 37828185 37466501 37424334 37576000
2904 37576000 37501656 37524707 37298397 37301141 37393115 37277681 37208313 37119067 37091615 36618876 36645907
2893 36645907 36788274 36628690 36477083 36542298 36899202 36778609 36539374 36807104 36997888 37254664
2883 37254664 37286717 37382771 37427518 37292754 37240815 37564686 37813110 38225764 38410772 38734596
2873 38734596 39007785 39075614 39446221 39904818 40314679 40714320 41255469 41314442 41384531 41668390
2863 41668390 41823713 42221965 42493713 43046163 43640455 44073898 44760950 45397877 45773848
2854 45773848 46308842 46740260 47233871 47607787 47821011 48243864 48758793 49015456 49355891
2845 49355891 49738115 50153359 50670680 51060198 51434496 51714776 52095668 52681234 53148499
2836 53148499 53961591 54650091 55399112 56072356 56983597 57925440 59033174 60280692 61396918
2827 61396918 62533775 63461243 64739338 66335469 67845212 69509887 71124761 72759493
2819 72759493 74715185 76573127 78847382 81098488 83114398 85378073 87954078 90423471
2811 90423471 92665770 95125317 97503946 99753631 102254113 104510998 107238104 109961702
2803 109961702 112440300 114243029 116155318 117727685 119169028 121020191 123351091 126226057
2795 126226057 130012354 134391007 139211337 144568383 150471982 156765482 162919005 168059597
2787 168059597 172261525 175076230 176685513 177307337 176524644 175197994 174070082 173148603
2779 173148603 172940131 173435633 175102166 178010113 182407344 188521959 196494919 207292116
2771 207292116 220850459 236591294 255049484 276409392 301119911 329950491 363559147
2764 363559147 401902123 439017483 463236201 469855689 464427128 449521765 426030699
2757 426030699 397252859 369069244 344356084 323201405 305020050 288200110 272524185
2750 272524185 259000998 246915773 236132550 226403317 217458339 209129630 201562388 193933121
2742 193933121 186266875 179190660 172483420 165962206 159740093 153944716 148402560 143492291
2734 143492291 138986337 134516707 129934802 125610897 121732138 117987079 114552139 111408684
2726 111408684 108500538 105653728 102833377 100299055 98154614 95920783 93804150 91948801
2718 91948801 89872731 87832342 85616720 83873990 82036228 79942574 77810500 76044337
2710 76044337 74723328 73001645 71411756 70053813 68407038 66938970 65358243 64243131
2702 64243131 63201937 62166187 60845108 59733494 58448091 57163889 56058437 55140488
2694 55140488 54161498 53204881 52105972 51252170 50628724 49907820 49212401 48702717 48159116
2685 48159116 47526599 46946262 46199808 45654172 44802343 44361745 43636073 42747064 41621146
2676 41621146 40832083 39949640 39222048 38293988 37493363 36580030 35550586 34734642 33988100
2667 33988100 33244497 32448402 31710888 31239547 30407655 29935213 29324806 28803644 28424013
2658 28424013 27806149 27145873 26376170 25920864 25524590 25017624 24551863 24054103 23669073
2649 23669073 23262875 22917338 22683801 22539665 21995563 21493027 21036440 20772444 20332519
2640 20332519 19985159 19792173 19200712 18960422 18511155 18371155 17969120 17521442 17314155
2631 17314155 17173126 16776889 16542772 16324022 15891924 15410269 15141134 14917435 14418834
2622 14418834 14296437 14140942 14086080 13714103 13291568 13139536 12955716 12886601 12695757 12563337
2612 12563337 12253394 12185064 12263624 12063253 11852885 11776300 11656059 11499261 11342662 11289258
2602 11289258 11147404 10804737 10788811 10582900 10279306 10488131 10343917 10144050 10162112 10028121
2592 10028121 9846739 9802955 9701757 9942475 9614189 9627837 9381793 9364052 9103990 9074574
2582 9074574 9029569 8800292 8722452 8508072 8345447 8150388 7910872 7863899 7962753 7941316
2572 7941316 7932914 7947174 7858007 7600119 7529959 7301779 7334510 7336080 7447613 7499381 7315709
2561 7315709 7440317 7275200 6983925 7044754 6926029 7014121 6936099 6640038 6693852 6884199
2551 6884199 6663622 6609283 6386172 6306011 6055027 6015391 6080578 5940969 5792298 5999844
2541 5999844 5956875 5602447 5797837 5823028 5835371 5640665 5608163 5634763 5721626 5697428 5404421
2530 5404421 5433044 5269580 5223981 5464516 5622618 5326990 5309939 5270920 5279287 5382943 5248571
2519 5248571 5024173 5324404 5432634 5279225 5086812 5088843 5241376 5252226 5451710 5865215
2509 5865215 6162761 6364193 6381779 6275624 6193294 6169915 6231294 6325224 6163343 5783782
2499 5783782 5755147 5645123 5594564 5446192 5211961 4962777 4645786 4754576 4909291 4531274
2489 4531274 4621854 4479547 4461186 4351239 4068703 4120065 4028997 3940298 3921398 3754257 3934566
2478 3934566 3971330 4066126 3843669 3676928 3496880 3515452 3859829 3827950 3483851 3399605
2468 3399605 3337222 3390161 3458429 3428853 3525497 3102205 2920046 2932953 3043524 3103866 3041981
2457 3041981 3180176 2977113 2995346 3053811 2878932 2887391 2887269 2806088 2595576 2808741 2753403
2446 2753403 2903112 2780119 2662761 2603614 2510429 2414723 2203611 2290810 2431543 2237077
2436 2237077 2196626 2255329 2268148 2031645 2027716 1773131 1987746 2073613 2034359 2202453 2163606
2425 2163606 2155016 2015579 2039687 1899403 1933046 2046406 1981819 1877252 1945799 1732672 1631448
2414 1631448 1806969 1889387 1681647 1724979 1747336 1756816 1676019 1768062 1527625 1561889 1991077
2403 1991077 1938039 1791923 1658587 1689815 1726574 1565204 1431230 1508682 1451770 1494619 1647764
2392 1647764 1839312 1729043 1884985 1795844 1445434 1373225 1530573 1633400 1505111 1545504
2382 1545504 1332265 1304840 1342565 1128491 1279031 1402943 1342638 1264651 1210761 1298277 1250637
2371 1250637 1209342 1278367 1146269 1035239 942993 628791 1035210 922199 845461 883436
2361 883436 1096885 1222764 1045529 914114 848315 949519 1272490 1323717 1276579 1189182
2351 1189182 1096921 1112617 976385 1026945 1059529 961147 1076265 1122307 1057707 1051396 1171717
2340 1171717 1226398 954118 871536 896843 872148 859892 932951 854908 1021685 935648 736591
2329 736591 839683 1077133 719581 758134 678434 816086 828511 711969 816912 931020
2319 931020 799986 902216 983600 910595 741218 887307 1175160 1024996 932165 1068883
2309 1068883 1119191 975815 969003 844743 1021126 1202952 1042247 1050395 1137059 928962 497833
2298 497833 564430 770447 863865 788589 755078 883864 694531 742783 670462 491728 530846
2287 530846 714173 740368 924664 777449 615970 735044 573565 244521 232126 435204
2277 435204 567107 541613 680394 676923 489751 513972 722131 691518 632386 441693 496154
2266 496154 476317 610806 635001 452426 319065 373536 446593 588906 581184 662461 411033
2255 411033 482378 470304 446634 540958 399928 246740 396230 415225 480782 574926 473921
2244 473921 518318 486695 332535 210759 144200 358666 430489 281947 530552 428999
2234 428999 462981 568890 567068 366256 399543 361530 182930 239951 423808 599491 419693
2223 419693 309730 417669 266637 555881 647437 382798 404393 598468 699786 495027
2213 495027 174371 556093 784529 752717 537778 565365 580899 515169 607095 747356 713360
2202 713360 643734 628531 459492 553349 675654 453428 522811 764879 480684 455870 488821
2191 488821 543837 762027 901816 673756 494209 659348 531297 493694 451269 366070
2181 366070 454391 601963 593705 773876 705068 750873 662540 456487 506481 566173 342530
2170 342530 355935 296367 532168 646999 439331 464432 443585 476283 544963 490857 527348
2159 527348 395307 570065 695459 716164 691819 706091 737652 678497 302137 311016 258223
2148 258223 192819 453829 692170 560504 395030 482057 522802 624884 565353 292555
2138 292555 356316 351647 380717 602796 523887 520881 583840 644253 543062 505694 639721
2127 639721 915764 928317 964452 892862 912242 954369 875113 770372 943407 1117050 1233094
2116 1233094 1273225 1373128 1273669 1092036 1192324 1149035 1050921 1322660 1295769 1422599 1248965
2105 1248965 1411419 1564589 1467238 1444608 1550012 1693898 1969019 1985857 2364550 2399295
2095 2399295 2628674 2784281 3014165 3533329 3702381 3660622 3969408 4211534 4512503 4645712
2085 4645712 4923428 5201103 5417946 5803917 6653597 7303128 8111561 9020594 10224174
2076 10224174 11528590 13889311 16558130 20106348 24008526 29166856 35130080 43067913
2068 43067913 53375727 68664030 75382945 72499599 71694977 68813913 62410922 52917793
2060 52917793 45713883 39478689 34837630 30931915 27296114 24196107 22228252 20362263
2052 20362263 18647729 17029513 15906146 14739321 13448445 11988706 11000586 10259676
2044 10259676 9596905 8858674 8426926 7666466 7450274 6859584 6574578 6352062 6237397
2035 6237397 6057484 5916909 5635425 5503160 5503955 5153965 4921605 4966731 4970675 4587931 4839084
2024 4839084 4660661 4529063 4182656 4002911 4091083 3950375 3876455 3632099 3475458 3307325
2014 3307325 3214758 3067168 3023535 2933243 3008844 2761798 2541049 2663656 2727670 2511516
2004 2511516 2277304 2173187 2426669 2428621 2214669 2205964 1917953 1818600 2006267 1757229
1994 1757229 1744239 1641533 1840325 1974828 2084686 1743199 1641194 1588224 1507017 1588371
1984 1588371 1535380 1811836 1653552 1636740 1498243 1398077 1331233 1203890 1222324 1241942
1974 1241942 1118407 1329404 1300367 1178049 1320704 1499149 1089565 1026434 984099 753121
1964 753121 729022 946033 816739 640074 694687 848502 812679 948821 903350 923671 900699
1953 900699 861647 625406 606271 682223 835465 702765 811035 1005258 731723 742881
1943 742881 692046 633852 824139 617579 531937 423683 397355 464062 407785 298805 393916
1932 393916 482247 528432 647081 480301 219002 341182 371284 399629 525943 583236 453463
1921 453463 428557 329694 297057 257627 387580 394172 444105 395111 231886 332175 432675
1910 432675 642268 561578 495281 470161 284746 355438 267941 18484 265453 374770 468818
1899 468818 444665 466686 335998 181690 210398 278670 493116 578079 485962 340884 351378
1888 351378 414634 374228 218089 205502 267919 232434 505256 605086 566801 489123 393668
1877 393668 80813 194904 100746 278943 286389 365636 263874 148796 354925 238044
1867 238044 176930 164758 398059 601634 469400 208815 302417 111036 373361 541699
1857 541699 413441 421798 399629 297458 217395 241884 234872 346222 331439 263724 109373
1846 109373 97696 161615 290206 256304 392658 222520 142145 128614 213648 429389 296497
1835 296497 80145 238877 86944 2966 258667 621154 484779 599211 519689 370214
1825 370214 716518 576266 703028 618889 724703 615803 520502 544237 596097 457138
1815 457138 279988 79692 171949 365261 448828 501809 451761 350345 238366 338939
1805 338939 401462 191324 450334 319585 180074 157225 62932 113979 232609 198285 -135700
1794 -135700 -59638 36839 6148 45306 -1581 -28600 362391 262997 23321 73528 195224
1783 195224 197440 50505 -12132 104224 -118551 9955 113945 74930 105877 -77911 -61266
1772 -61266 107955 332166 144365 79525 280011 240024 201643 112449 74362 47238 93075
1761 93075 164055 261807 301565 342070 175111 100434 125147 176812 302338 406174 67721
1750 67721 104004 275847 345929 72749 144029 307782 194008 -70709 -30147 165654 229991
1739 229991 153627 291050 141327 127638 98929 -13028 16927 -114426 -17950 117406 105731
1728 105731 -184477 86368 244937 148436 129299 152939 153977 91969 242225 420081 212630
1717 212630 139481 -86308 77445 153918 159292 -67256 137629 209550 131878 310881 266858
1706 266858 118969 284941 148074 -93985 102707 228107 209868 121413 -22399 269808
1696 269808 127811 253083 160163 363705 469273 168095 95510 -12107 13917 259582
1686 259582 156400 54081 89989 179428 63568 179152 201325 49752 221481 142900
1676 142900 274549 277940 201514 249930 244638 397595 318328 321845 222647 254551 249531 170210
1664 170210 293933 -210454 -395169 -53386 63668 86360 75948 -37156 -32525 -160479
1654 -160479 -149152 27188 99817 79425 40180 18472 -25404 -167521 -343636 -212224 -46014
1643 -46014 4064 -19472 -167456 -4531 -112869 -69070 -65314 165468 159087 63176 137051
1632 137051 17231 52970 -77461 -109322 -112308 -20595 55777 141243 181868 23544 113052
1621 113052 8323 140561 -16013 -190213 -43424 102143 -114966 -7068 26375 155733
1611 155733 63390 -167474 16087 178223 223317 130572 30602 5716 -49813 72923 -32007
1600 -32007 120695 154283 -69305 -243807 -29101 88842 -129343 118244 180737 27115
1590 27115 -17705 111617 148461 107987 213710 381169 185820 127734 144572 43483 48387
1579 48387 163325 214036 269794 287927 227361 347620 85149 258478 169453 100303 -6179
1568 -6179 -24729 119931 112596 91567 -13957 -74029 80257 201386 89705 202193 227884
1557 227884 131040 102673 49673 -105250 -153563 -77441 44060 119265 237864 140301 212413
1546 212413 154057 97774 -44888 -50891 65946 326658 295694 108687 27010 -4726 97119
1535 97119 -8858 39675 95508 51673 -75369 -79688 227158 200795 116091 290656 347495
1524 347495 218195 93268 161099 168862 199008 69098 41670 79706 117973 197227 17837
1513 17837 -164817 -300816 97462 263247 155487 -32080 211337 146330 163084 -83780
1503 -83780 -250224 -190576 38868 109189 132083 159998 86905 -101277 -265124 -72353 -7785
1492 -7785 -68634 251388 474530 416825 -6743 187678 51203 -244077 -244540 -172978 -33344
1481 -33344 4642 155860 228018 65362 84876 134576 -138604 155537 266593 401111 183664
1470 183664 -12099 -90377 -158819 33995 236126 265 -31036 50928 147436 255792 420210
1459 420210 311805 181326 53954 48921 272552 294398 -15320 81968 148177 -148343 -196660
1448 -196660 22591 181937 102438 27904 64632 256335 381673 403668 239286 195120 138651
1437 138651 11444 -73043 113746 406368 400819 205764 348472 87815 97256 166511 88129
1426 88129 100367 233155 381885 244214 243698 158715 195540 203296 92654 -188408 -249363
1415 -249363 -53107 120521 -11529 174934 -29436 -115484 -199438 -48544 95027 -53443
1405 -53443 -228846 -226535 -365468 -229923 -266971 -254888 35881 153794 -33533 5360 -218219
1394 -218219 -148710 19733 66121 169321 221724 179611 -1586 -13533 -174731 17930 120056
1383 120056 -13035 -119244 3053 -54562 194206 258273 50400 -72955 42741 169921
1373 169921 426177 477371 144628 -16444 17356 -36829 -117508 -111288 91840 126680 -32769
1362 -32769 70509 55214 -63604 36266 -83019 69373 134205 -111168 -58139 49101 -30342
1351 -30342 -107201 -132226 -198915 -213906 -54351 114755 -81923 190408 180761 74159 161895
1340 161895 201452 288647 -52416 267664 146871 34288 151407 151199 -24897 36842 39623
1329 39623 21294 -109314 89624 332742 122998 108895 -168981 -62749 78433 71282 -124192
1318 -124192 -42625 108397 24066 76815 -18671 53834 176691 -81585 -122068 91303 -18066
1307 -18066 -75848 305201 216030 57961 -13962 -107755 -95524 -85886 -59883 14399 32268 147395
1295 147395 74028 25327 48930 -132047 -195387 -283830 -134912 118845 13370 -182978 -180830
1284 -180830 41241 -131396 -92261 75930 -53135 -58621 -79312 16610 74065 35306 5343
1273 5343 -49512 -255708 -101505 -152896 -222421 -218719 -221002 -398904 -359299 -96579 114803
1262 114803 107487 4157 135366 128457 -62265 123357 61411 106191 338706 335471 221589
1251 221589 13785 74793 16035 128847 277511 179412 233843 144989 -125031 62106 142772
1240 142772 77598 148937 -23406 -34110 -14365 -60853 -268637 -105344 -7276 -58285 76190
1229 76190 157817 -20071 211566 197677 99296 419140 303761 90804 -12415 63873 108067
1218 108067 14726 -54451 -142988 -297249 -143167 -152436 -91267 216097 87581 174679 192032
1207 192032 58890 -26100 -15635 63404 67745 -15142 -48506 97244 114197 -44940 15332
1196 15332 95757 -49878 154917 69014 216890 293262 351535 134019 102840 -65529 75213
1185 75213 15351 17390 -82683 31006 51498 -67610 -13571 -19020 203976 29012 2722
1174 2722 -57606 -111813 51170 224660 -172253 -181506 -137827 -307403 -37059 -75150 -13847
1163 -13847 -102200 -93269 -9222 -147851 -200819 -214423 -124989 87922 -276070 -228012 49850
1152 49850 -88844 -123839 -165444 -246545 -136169 155845 66666 -76531 13846 292859 53164
1141 53164 -63546 126282 -110784 -141439 -376022 -341192 -195667 -119534 -159051 34842 -76811
1130 -76811 -95327 78139 99632 4245 -93092 97741 111236 199127 219841 131396 -42193
1119 -42193 -33670 -74026 106269 -40208 -45491 61647 99280 31337 143616 -4022 -114523
1108 -114523 -9490 26409 202381 300600 487297 273452 174937 254088 280360 214017 7687
1097 7687 274777 125494 123282 81142 36376 -66730 -82999 -194547 -89396 -315841 -348567
1086 -348567 -58165 53098 -67502 -45280 -214867 8955 121622 166438 14869 -119416
1076 -119416 5938 49939 257010 219100 43736 130445 210526 56194 -64010 -64019 56386
1065 56386 24071 -148544 16753 -30736 -10546 -23692 -250642 58430 127024 55583 32541
1054 32541 120623 93215 21074 -180583 -94147 -138641 -82261 -100523 52355 67872 -30850
1043 -30850 -30247 264110 80517 96923 137252 155420 157362 -123096 9692 53201 -113601
1032 -113601 43042 21903 -166522 17951 237236 -163646 -104341 -270042 -116409 -122368
1022 -122368 -188479 23874 -146641 -9780 -117482 -21224 -95386 -172200 -14456 14269 -2089
1011 -2089 22248 -79408 -56914 -133708 -95835 -209192 -303657 -198695 49393 13193 -131047
1000 -131047 -71712 -50072 -128654 -26816 -70240 41747 86784 -181743 -243311 57716 87674
989 87674 117638 153894 55654 -55157 -29613 178738 6746 -409321 -142589 275689 119911
978 119911 217185 256064 218045 -82993 -199130 -165320 66369 237114 79786 -18487 -13585
967 -13585 29664 15992 -131777 -151267 -175133 -244855 -122293 227691 286274 60980 8492
956 8492 -121694 -282508 -165801 -321022 -54403 54533 -29472 13809 102018 106768 188420
945 188420 296100 13800 -45930 -73056 149969 171318 57200 317297 142457 -89749
935 -89749 -226324 -154130 -111592 -207390 -214558 -112375 34923 83891 197211 299044 95550
924 95550 -80560 -70594 121401 25516 -194357 32431 73937 158883 176687 105035 150865
913 150865 -122864 -45361 196791 -33458 92617 142682 116982 78011 -111879 14931 105896
902 105896 60916 167614 192036 95559 76319 247571 48191 22619 -178618 -203208 -191021
891 -191021 -206179 -216078 -147861 -142633 30967 -150118 -227686 -192935 56449 332293 62827
880 62827 234779 235527 105517 -4126 -3322 42006 130543 146495 19342 42854 117828 64925
868 64925 -170431 -221656 -67824 -113125 -153320 -68847 36109 22983 268736 200038 -30628
857 -30628 4134 -142625 -83483 -43460 -21007 63049 70554 71881 92865 -21342 69983 -17084
845 -17084 -155596 -150718 31921 -88583 13282 -117116 -70862 -46737 -144328 -128191 -44305
834 -44305 49905 41157 265619 169889 70751 -57308 4900 54818 26810 38992 64630 35772
822 35772 -87716 -314222 -242331 -147035 -167427 -229698 -322080 -432644 -429858 -222882 -44373
811 -44373 145814 212594 206931 67150 68317 134201 50776 281038 115041 11149 -322481
800 -322481 -196588 -218880 -127945 -170642 -190285 -8903 -34264 84660 213256 260272 26877
789 26877 -27141 -153336 -346285 -285714 -162634 -71919 -92520 17007 -66720 -188878 -151454
778 -151454 -219729 -233529 -90366 -68103 -104257 -98583 -57161 121982 166277 -20487 -1802
767 -1802 74214 44891 109808 -38137 34242 30006 -152733 -117097 -157652 -166910 -147117 -114958
755 -114958 -132639 -140230 -75521 -231932 -86152 -333039 -616808 -282669 -220592 -189056 197584
744 197584 109894 -185980 -84619 -83796 -33747 118803 -90057 -247840 -166176 -230939 -184417
733 -184417 -327228 -301570 -244260 -191107 6631 -134352 63471 185911 170655 291243 85553
722 85553 44281 25436 -88333 52537 23814 -129998 -86903 -46030 -59601 73043 -12667
711 -12667 -54123 -12261 -100841 -315827 15748 149982 83752 57802 -38663 -23033 -93830
700 -93830 -191959 -197796 -53399 -105312 -158785 -98819 -232617 -277332 -42460 27351 64681 -146973
688 -146973 -39246 -26820 4518 -41418 -106872 -51497 -15355 -72583 270563 185631 -32546
677 -32546 -115446 50417 412215 149445 221593 -128447 -252223 -42984 -251897 -233618 32837
666 32837 -167154 -81889 3115 -190016 -296144 -91473 18752 -61519 48355 75658 2377
655 2377 85488 96042 118411 -246722 -159855 -395336 -233260 -155321 -163431 -86728 -168575 23991
643 23991 35022 124825 32040 -118740 -135179 -105004 -143489 -46321 -209872 -102759 -154120
632 -154120 -144568 -73396 -272952 -70191 -49928 21551 139984 23402 -114636 45814 188109
621 188109 -134376 -58893 -30661 -71658 4633 146509 -30905 -236945 -167403 -154158 -92455
610 -92455 -92272 -74590 -99938 233532 125282 89092 -8939 -83697 -230761 -209840 90722 38279
598 38279 12886 -64497 2456 -174601 -92824 -24529 -124116 -124278 80238 -27413 -127353 -154895
586 -154895 13534 71414 30182 -73953 70273 114634 198012 200515 136323 83845 134811
575 134811 -16227 -276181 -290824 -160256 -108896 54121 4516 -179874 -48864 126023
565 126023 69001 -212545 -226521 39163 117092 128946 66774 -196204 -32953 7640 -100516
554 -100516 -135721 156003 290796 164100 -39373 -138317 -3703 53584 125416 -28275 -78392
543 -78392 -149489 -41377 -103964 47870 60785 -46816 -190079 -149623 -65041 -70230 -101946
532 -101946 -193863 -7346 -82619 -100637 -116214 128397 -44276 -98727 -87114 -52213 50507
521 50507 -18512 -66003 -360780 -175182 66809 73687 40239 21732 -86708 -76288 7495
510 7495 -151805 -104740 -72173 -87557 25645 -41237 20594 85704 -19030 85804 81710 -216
498 -216 -67247 77272 -16270 -57037 -73891 -41213 170264 340412 112035 -18154 123198
487 123198 -66127 -332757 -249239 -226174 50006 -138042 -278151 -39294 -46425 -255210 -329563
476 -329563 -355011 -2875 23459 -70178 -31986 26062 150652 61940 79065 1143 -54849
465 -54849 -35652 -69727 -158813 -97382 26654 -153289 -31191 134951 65126 30313 -104414
454 -104414 -47030 -76212 -56697 109 79362 -94625 150729 272297 9712 -179586 -166447
443 -166447 -305697 -33922 -65691 -90939 27748 77854 338245 234294 80164 119579 41087
432 41087 -247178 -145107 65173 2681 -30407 -82521 -60982 120920 -155976 -252825 -310550
421 -310550 -398701 -379614 -32 125825 30382 -121084 -42089 -128982 -232523 -70556 -130808
410 -130808 -205850 -238576 -306220 -286245 -163899 -233582 -247368 -183435 -55519 39471 132142
399 132142 198854 -596 -306823 -34547 -15303 -100292 -122690 -195194 -474763 -393433 -90622
388 -90622 -70759 -156322 -205058 -290942 -103755 12446 -212843 -184594 -63843 -136267 -170190
377 -170190 -121630 -124463 -117002 -93323 -43566 -53653 -158356 -280588 -144168 -147093 -137065 -129677
365 -129677 -102937 -245481 -267364 -57706 75849 226782 -246921 -320959 -135568 -40623 -98044
354 -98044 -273858 -366022 -93921 66529 200229 170828 73207 199058 -88759 -171352 -41132
343 -41132 -13340 -212473 -256822 -54093 -81444 -379323 -135457 -271614 -103254 185278 -227575
332 -227575 -82111 -57094 17240 -9763 -324366 -163275 -187970 -92133 -60720 -86261 -124108
321 -124108 -60049 -83787 -291988 -253051 -204154 -226612 -160790 -167335 -255860 -391211 -454064 -253334
309 -253334 -289106 -160470 -61543 -119709 -14564 -176924 -441561 -305683 -316753 -417606 -438586
298 -438586 -166567 126402 151606 -3004 -117446 6900 -111483 -357360 -150103 -49594
288 -49594 -200274 2010 146375 174880 152948 44112 -14615 -182730 -240250 -236392 -166096
277 -166096 -45349 -17550 -45857 85894 -1253 -63921 17106 61801 -214157 -14283 -329394
266 -329394 -213074 18138 -114296 -17850 -149246 -193830 -218415 -110237 -279838 23319
256 23319 -114085 -147778 -196992 -78387 -282280 -508541 -411359 -166806 -216237 -19557 -29963
245 -29963 -80326 -121805 -258224 -284120 -214434 -89592 -9827 -127923 -261604 -275358 -229339
234 -229339 -12741 -28847 -111874 -56042 142526 -118194 -53733 -65027 -419254 -160142 -59410
223 -59410 -61826 -241290 -389857 -168604 -117395 -276982 -260655 23090 -102732 -91788 86021
212 86021 23938 -131278 -207824 -71081 -209407 -185894 -142109 -80318 65795 -142022 -165806
201 -165806 -236345 -344446 -231335 -232439 -145785 98412 -65187 -110522 -361509 -306782 -262050
190 -262050 -230645 -110842 -155217 3504 -156236 -31382 75634 -170311 -170509 57261 148345
179 148345 42819 176461 50598 -136789 -150376 -145639 -190309 -216117 -48879 47541 -190169
168 -190169 -373376 -226549 -112465 -12462 29196 26585 257491 34109 -71141 -122766 -251484
157 -251484 -237732 -136193 -164050 -275801 -74061 -33312 -101644 -133532 -73638 46614 131599
146 131599 -52510 -36327 27585 -253493 -194050 -259244 -445674 -282149 -58194 -52370 42297
135 42297 76172 -46736 -268484 -245834 -178298 -59226 65332 -117308 -27405 14777 49802
124 49802 49651 -178403 -100261 -131715 -75792 -152469 -121424 -172190 -260529 -231571 -270919 -126665
112 -126665 -95473 2132 86144 42198 -172328 -188577 -64401 52998 -27736 -46088 -70017
101 -70017 -152327 -173257 -175860 20832 -80277 -103945 50630 62232 23073 -25685 -142006
90 -142006 -332208 -406064 -391204 -213702 -154194 -94587 -173472 -72049 -213918 -246882 -187897
79 -187897 -91142 -102071 -95681 -288080 -402865 -306445 -397004 -370108 -301732 -252468 -149350 -87584
67 -87584 -35133 -87253 -100103 -271247 -91145 90051 -91998 -4350 143180 34836 -95655
56 -95655 -225648 -57944 175060 119809 36596 -28690 -64774 -320933 -105011 -15961 -19340
45 -19340 -15737 33830 -45401 -203401 -182544 -88245 -17803 -32965 -93301 -124024 -157731 -268898
33 -268898 -273816 -152391 -389804 -271692 13759 48523 33441 -75029 107501 -34437 -291630
22 -291630 -89539 -97135 -165400 -95520 -135532 -86412 -11598 -64470 -298660 -142260 -61835 -76800
10 -76800 -122682 -153284 5035 20007 -103126 -124022 -135209 -57294 -150566 -101797
0 -101797
$$ Imaginary data points
##PAGE= N=2
##DATA TABLE= (X++(I..I)), XYDATA
16383 -3593973 -3403174 -3432487 -3455806 -3373132 -3244060 -3295785 -3259602 -3141051 -3163468 -3224688 -3147436
16372 -3147436 -3162310 -3142026 -3084622 -3090061 -3069449 -2832154 -2767688 -2812018 -2606611 -2797244 -2862686
16361 -2862686 -2597845 -2634376 -2773322 -2686607 -2574444 -2537332 -2335618 -2336311 -2359796 -2132987 -2217060
16350 -2217060 -2239185 -2119975 -2082889 -1953297 -1952330 -1906170 -1897828 -1953654 -1842028 -1754419 -1579513
16339 -1579513 -1662603 -1775803 -1685132 -1613805 -1610835 -1495210 -1560703 -1537220 -1314423 -1372906 -1254826
16328 -1254826 -1298989 -1253445 -1250471 -1146674 -1192218 -1221217 -1068444 -928885 -825199 -751182 -877657
16317 -877657 -855828 -859480 -799913 -625715 -680846 -730577 -642731 -559588 -517123 -389376 -386540
16306 -386540 -365003 -324796 -321487 -510552 -473150 -337569 -188845 -57547 -50884 -184780 -2170
16295 -2170 121701 -35569 -208782 60091 97509 -1660 -12594 226350 336372 437923
16285 437923 437658 115771 52410 195879 234675 342890 568727 608275 801359 819502 569717
16274 569717 575998 628336 741577 708533 887425 915895 809152 788303 815286 851533 819924
16263 819924 1061767 987245 970599 916095 914134 1096487 1068391 1061998 1184065 1121867 1178525
16252 1178525 1268763 1347446 1447847 1356070 1237503 1329581 1258577 1161115 978136 1188288
16242 1188288 1339428 1338872 1631728 1531713 1484366 1613326 1675674 1598889 1547853 1386977 1501129
16231 1501129 1611296 1673083 1798284 1880977 1977565 1770642 1702583 1613619 1606436 1938485 2043704
16220 2043704 2019638 2054544 2141023 2103395 2152071 2084751 1961634 2110307 2071996 2051977 2060036
16209 2060036 2047470 2028475 2153393 2271062 2245248 2334696 2579504 2477196 2447067 2342045
16199 2342045 2239694 2249939 2573725 2522761 2379423 2578507 2357373 2441586 2462324 2612827
16189 2612827 2584071 2705307 2683412 2435754 2494999 2521355 2409817 2251438 2311052 2366070
16179 2366070 2415156 2338162 2433354 2620682 2678596 2766912 2974537 3005431 2658564 2643649 2589720
16168 2589720 2507526 2588960 2714837 2565153 2655744 2805678 2831874 2983338 2792041 2726398
16158 2726398 2564289 2732002 2806481 2578024 2601026 2689499 2579990 2897246 2817709 2782071
16148 2782071 2941311 2701349 2629383 2767226 2777692 2832514 2821653 2940365 2904067 2861417
16138 2861417 2846783 2809182 2997679 3127213 2953610 2992223 2972464 2898046 2950540 2883391 3103662
16127 3103662 2945286 3132626 3195075 3295751 3232687 3294460 3203961 3186271 3209682 3052847
16117 3052847 3024473 3087128 3260627 3148734 3246083 3285715 3228242 3245537 3094485 2837865
16107 2837865 2752349 2958672 2982942 3025086 3076757 3108195 2943634 3105765 3050908 2888989
16097 2888989 2936367 2806780 2999171 3380471 3563268 3351189 3265413 3087245 2902442 2797284
16087 2797284 2796285 2972496 3063313 2968772 3285233 3286854 3209437 3099484 3089104 3201298 3063589
16076 3063589 3133241 3163061 3179103 3218293 3142830 3548608 3562735 3296258 3111815 3146096 3039075
16065 3039075 3072215 3121355 3240791 3333691 3092139 3151678 3168945 3262128 3258007 3322473 3319316
16054 3319316 3477382 3568907 3336908 3137664 2967301 2936644 3029579 2871092 3091724 3334630
16044 3334630 3404497 3266692 3272883 3123062 3233895 3529181 3531761 3161975 3084071 3208258
16034 3208258 3302310 3144842 3120845 3182823 3116454 3134578 3184992 3101875 3178985 3343652 3258649
16023 3258649 3056944 3214760 3176771 2956181 2968207 2960459 2969717 3032513 3201768 3335252 3410900
16012 3410900 3256963 3453216 3127234 3049491 2969091 3036288 3177730 3476537 3525421 3453370
16002 3453370 3287320 3264104 3080650 3061916 2992757 3054494 3198675 3000862 3052337 3218701
15992 3218701 3232555 3138243 3074440 3045183 3264801 3396233 3109131 3159118 3286901 3301471
15982 3301471 3468947 3194819 3202305 3149961 3363250 3420343 3274037 3283155 3451137 3317830
15972 3317830 3332830 3277680 3078378 2949494 3010065 3152986 3179042 3428023 3407436 3157538
15962 3157538 3238487 3142849 3008804 3183410 3303831 3313047 3352812 3447693 3437616 3245301 3071445
15951 3071445 3001502 2916141 2927935 3073818 3379899 3443045 3407180 3442248 3293986 3295041 3124503
15940 3124503 2898864 3070987 3328013 3323030 3309856 3248916 3242289 3319621 3242093 3415616 3471962
15929 3471962 3504372 3290100 3055784 3174412 3109627 2996294 3014429 3098849 3194367 3273251
15919 3273251 3239463 3315381 3248475 3032377 3088404 2999075 3212293 3232457 3194792 3237703 3231632
15908 3231632 3335771 3372256 3149030 3115996 3170699 3093303 3074629 3080867 3143797 3108570 3155368
15897 3155368 3157185 3286428 3433305 3370851 3311020 3273865 3008397 3289507 3192354 3122700 3310002
15886 3310002 3332615 3293591 3217776 3240392 3197150 3019913 2866699 3216839 3297287 3235770 3330337
15875 3330337 3345812 3242900 3133719 3283490 3434651 3530389 3358265 3194215 2994579 2951279
15865 2951279 3045732 3041460 3176581 3286938 3289658 3365837 3376739 3147982 3327559 3177267 3098786
15854 3098786 3218602 3297135 3136806 2963944 3083013 3251288 3451826 3400811 3262298 3424353
15844 3424353 3491916 3348444 3387045 3523792 3376003 3546518 3355978 3414084 3270178 3191545
15834 3191545 3264247 3152599 3235990 3082586 3191405 3208331 3399045 3427173 3347829 3097122
15824 3097122 2970842 2864914 3009614 3382624 3391714 3151339 3159380 3361510 3167623 3199129
15814 3199129 3249164 3218568 3301602 3352043 3269440 3609600 3539051 3245907 3123138 3133724 3249970
15803 3249970 3082592 3237562 3297724 3378224 3317099 3288258 3180198 3325286 3340343 3452883
15793 3452883 3382161 3213800 3199643 3224117 3234765 3313509 3389192 3334839 3296000 3373675 3212988
15782 3212988 3126291 3043505 3199701 3400068 3325048 3282118 3379528 3335103 3340811 3111379 3092917
15771 3092917 3283105 3170311 3370705 3121917 3142262 3182773 3317794 3406144 3252915 3351823
15761 3351823 3464692 3560866 3480834 3627124 3422102 3354279 3408891 3340604 3519649 3206624
15751 3206624 2984665 3198572 3313043 3350113 3348001 3408842 3257418 3230229 3300117 3369624 3474140
15740 3474140 3388662 3340245 3174641 3000822 3104006 3425765 3209978 3244742 3084659 3328803
15730 3328803 3290695 3383693 3663950 3566636 3551636 3315269 3262135 3196195 3129387 3104471 2988673
15719 2988673 2961532 3288277 3383789 3396329 3331279 3245940 3313866 3250174 3394630 3440781 3252815
15708 3252815 3237831 3618899 3689045 3340621 3339029 3472778 3462676 3463133 3328440 3147967 3060179
15697 3060179 3112130 3027838 3176446 3654778 3623812 3627343 3397303 3147079 3343240 3304669
15687 3304669 3215508 3312472 3374878 3482090 3532645 3421289 3395068 3191717 3190822 3363498 3406545
15676 3406545 3487785 3385681 3132457 3217798 3140206 2998101 3003849 3239835 3491622 3414226
15666 3414226 3202110 3498875 3615336 3636539 3475815 3437362 3430015 3220388 3353855 3416311
15656 3416311 3400670 3389362 3342133 3418847 3439603 3408621 3452598 3268244 3562481 3401140 3462530
15645 3462530 3418018 3342446 3312704 3297475 3398944 3533843 3241359 3178852 3038628 2940917
15635 2940917 3280760 3194099 3353482 3661651 3527139 3371382 3310612 3444548 3574727 3704163
15625 3704163 3683624 3330970 3185031 3262906 3394592 3413932 3307865 3258419 3232675 3263243
15615 3263243 3340876 3558087 3449868 3324550 3306160 3309989 3379781 3382378 3365271 3260425 3213483
15604 3213483 3241202 3307705 3109531 2983673 3315235 3564785 3652101 3804845 3564163 3512483
15594 3512483 3477697 3404369 3168250 3242123 3324801 3338244 3354867 3211342 3088308 3128899 3257678
15583 3257678 3303069 3368056 3403262 3343975 3331707 3456749 3399723 3346541 3573082 3412472 3195641
15572 3195641 3247867 3270650 3302351 3258009 3242856 3256572 3408124 3300532 3221185 3352962 3381073
15561 3381073 3300496 3433058 3574630 3247852 3264973 3100805 3092437 3362607 3419543 3452657
15551 3452657 3424129 3381387 3359563 3376487 3204457 3087799 3220263 3296597 3431531 3580016
15541 3580016 3341218 3336705 3312685 3294033 3357423 3216339 3139524 3443049 3527400 3307049 3245067
15530 3245067 3353268 3321142 3377421 3432379 3370800 3195908 3295128 3268350 3196058 3432210 3249812
15519 3249812 3288997 3254315 3256928 3355379 3571216 3595013 3625284 3649435 3608832 3701386 3455248
15508 3455248 3266440 3500346 3465514 3375820 3363081 3462415 3440298 3497305 3268479 3464960
15498 3464960 3364671 3218334 3475166 3531627 3560330 3486777 3533514 3675268 3436149 3325087
15488 3325087 3256381 3165033 3277426 3199728 2978398 3279383 3456480 3327609 3382170 3513987
15478 3513987 3644081 3382641 3643944 3534455 3341724 3253042 3217551 3243597 3497433 3223600
15468 3223600 3199888 3157127 3216716 3460587 3588375 3349462 3557044 3533825 3402950 3483677
15458 3483677 3332125 3362400 3332061 3041157 3119724 3254255 3219190 3174996 3208382 3441015
15448 3441015 3597179 3366233 3291246 3454771 3575424 3470144 3229453 3355112 3400512 3477902
15438 3477902 3648561 3699560 3599243 3468702 3204661 3404119 3547456 3708886 3842848 3480786
15428 3480786 3490087 3536508 3565445 3671733 3420496 3466434 3373683 3261846 3161374 3210312 3234163
15417 3234163 3187954 3306183 3578594 3638240 3572516 3369726 3416568 3578428 3507858 3303990
15407 3303990 3337752 3461912 3552050 3574243 3480424 3527746 3466029 3385112 3307773 3303128 3499191
15396 3499191 3742059 3401297 3413227 3713013 3712917 3435652 3300453 3323765 3598145 3539371 3276614
15385 3276614 3289421 3482124 3617420 3518216 3586904 3394600 3076200 3090123 3490192 3492569
15375 3492569 3563265 3623732 3591441 3457212 3403327 3296968 3211293 3318712 3366151 3240031
15365 3240031 3557286 3477151 3663103 3577209 3423005 3509436 3421597 3150817 3274680 3471908
15355 3471908 3632753 3494540 3501287 3348236 3259811 3404015 3492111 3471839 3315978 3460846
15345 3460846 3468730 3705781 3655149 3387011 3250308 3578240 3491324 3476761 3428042 3403553 3488114
15334 3488114 3456280 3287689 3336217 3288098 3348474 3358098 3423096 3500506 3408533 3310627 3215631
15323 3215631 3306061 3462158 3145432 3112424 3260332 3415925 3605503 3614199 3320686 3272752
15313 3272752 3320006 3381800 3584170 3659613 3507247 3310606 3373859 3358804 3369026 3295197 3409004
15302 3409004 3597125 3370692 3437848 3601486 3673932 3556269 3658051 3865115 3620058 3427561
15292 3427561 3378034 3680699 3838674 3545829 3519137 3514756 3479756 3474954 3662716 3567576 3381824
15281 3381824 3332116 3314373 3238696 3461168 3755619 3393963 3299062 3424080 3293818 3354351
15271 3354351 3464207 3787659 3692923 3623917 3556122 3185653 3516627 3634647 3515923 3438922
15261 3438922 3411170 3448891 3263087 3524256 3624809 3481431 3642441 3613663 3539478 3463518
15251 3463518 3554186 3504238 3722257 3730212 3846065 3878975 3850386 3512852 3308071 3219904 3295845
15240 3295845 3339430 3384317 3470944 3327604 3442678 3271459 3224877 3319500 3357737 3281564 3490678
15229 3490678 3458147 3313018 3411927 3473026 3599724 3399791 3286368 3268923 3239789 3415287
15219 3415287 3324006 3349547 3678116 3455299 3513443 3460992 3367629 3560670 3577148 3662964 3758388
15208 3758388 3731768 3694434 3622490 3418143 3249524 3260382 3322975 3390174 3573282 3402210
15198 3402210 3412939 3457982 3281004 3264752 3237153 3283990 3142033 3288314 3436061 3615017
15188 3615017 3577690 3518113 3572326 3572450 3635062 3766255 3667451 3595985 3514160 3445226 3436418 3701568
15176 3701568 3890719 3741394 3681219 3562467 3535959 3638046 3662389 3620555 3693244 3865419
15166 3865419 3801325 3832544 3679251 3357611 3551226 3356952 3521835 3754124 3690248 3633830
15156 3633830 3592909 3505625 3459663 3537442 3342284 3410212 3619321 3498138 3853486 3680736
15146 3680736 3434504 3539905 3396014 3360390 3413566 3421314 3641587 3632674 3757532 3878625
15136 3878625 3659535 3395940 3350992 3203950 3445726 3591217 3504403 3565451 3564994 3400157
15126 3400157 3374400 3175131 3433928 3627574 3435852 3302644 3513844 3606697 3325856 3309735
15116 3309735 3324484 3498974 3426931 3299152 3264017 3275100 3421639 3409513 3408141 3506697 3485624
15105 3485624 3499219 3288317 3520134 3445172 3421009 3540952 3707651 3813930 3522629 3676623
15095 3676623 3613825 3233388 3504436 3405314 3578059 3658553 3478237 3585996 3626924 3498112
15085 3498112 3218659 3205140 3464946 3537205 3440011 3499073 3689406 3521829 3279748 3486217
15075 3486217 3559174 3642099 3561708 3505285 3396216 3366495 3555834 3516047 3356298 3476786
15065 3476786 3453768 3576879 3459213 3446812 3637442 3456331 3193220 3164503 3274136 3417492
15055 3417492 3531242 3510150 3639174 3567299 3409706 3540498 3718005 3721965 3624661 3499996
15045 3499996 3287454 2897795 3268376 3092723 3418011 3666354 3590790 3491307 3458796 3408839
15035 3408839 3528380 3606048 3562459 3458952 3513101 3713867 3498744 3488699 3574998 3535212
15025 3535212 3441592 3534481 3534851 3604954 3460889 3612955 3454012 3775244 3591401 3484475
15015 3484475 3619506 3615624 3473697 3311217 3456205 3267366 3384221 3508357 3605484 3554810
15005 3554810 3557694 3573290 3641584 3395765 3108318 2937198 3293746 3429964 3455063 3632124
14995 3632124 3464214 3587546 3663547 3663216 3540510 3562534 3637195 3604972 3637261 3672942 3816015
14984 3816015 3850137 3819241 3611174 3791815 4014378 3958746 3860438 3761664 3473798 3195085
14974 3195085 3576464 3557537 3547755 3707208 3737554 3513059 3495997 3510899 3652273 3564432 3616186
14963 3616186 3756979 3802955 3659224 3616948 3641185 3583631 3648690 3580192 3500303 3441587 3587371
14952 3587371 3764466 3449199 3264432 3497680 3639758 3708937 3770533 3735639 3719525 3525853
14942 3525853 3734089 3743473 3764493 3642581 3493381 3434319 3601881 3583093 3339476 3502598
14932 3502598 3445913 3616634 3500261 3655388 3508321 3360259 3501673 3027371 3064313 3232650
14922 3232650 3251752 3388480 3407531 3371806 3506595 3672470 3386051 3403457 3552652 3804181
14912 3804181 3757700 3719962 4006554 3791479 3633048 3732611 3535881 3405511 3537913 3618475
14902 3618475 3719735 3833964 3618738 3585011 3724687 3637860 3502647 3687158 3764269 3513567
14892 3513567 3704090 3810604 3543509 3779774 3807234 3826377 3533306 3591706 3725255 3641252
14882 3641252 3373001 3699447 3918849 3747082 3556899 3645079 3617540 3658593 3500497 3597061
14872 3597061 3545364 3484281 3690664 3625409 3644636 3597673 3644413 3807440 3896594 3772484 3637782
14861 3637782 3678401 3544241 3557264 3537176 3426960 3521719 3517452 3502644 3639969 3536016 3429206
14850 3429206 3691138 3342646 3247629 3602187 3561347 3543642 3655690 3674727 3657419 3372974
14840 3372974 3519004 3488230 3289406 3327034 3455893 3487235 3618643 3758429 3719828 3584226
14830 3584226 3723747 3773593 3632708 3726972 3846296 3676191 3555959 3179356 3540889 3696495
14820 3696495 3693917 3717625 3690975 3460053 3495674 3372821 3338720 3600874 3789755 3645183
14810 3645183 3549816 3594714 3589516 3456705 3388673 3591545 3541175 3598636 3740075 3613959 3882622
14799 3882622 3633406 3478202 3360731 3219914 3437107 3432976 3429032 3550788 3568381 3470526
14789 3470526 3220718 3403553 3503592 3364572 3618538 3761643 3684060 3596744 3550761 3523525
14779 3523525 3557003 3423822 3456308 3253877 3553504 3831577 3779276 3765641 3636845 3582933
14769 3582933 3600590 3706619 3767433 3816939 3528141 3435233 3472391 3411163 3632630 3550354 3574931
14758 3574931 3531247 3762992 3905290 3683663 3556303 3628940 3584040 3862800 3870517 3651459
14748 3651459 3505444 3578801 3587836 3499549 3533470 3610585 3563128 3296857 3271787 3457472 3572419
14737 3572419 3628088 3501136 3889019 3812534 3666999 3600556 3414252 3419550 3361409 3505085
14727 3505085 3561017 3805530 3886385 3545895 3633179 3614771 3523250 3425577 3583140 3608803 3657422
14716 3657422 3656335 3705426 3746928 3603641 3525753 3782870 3663411 3550665 3526583 3705465
14706 3705465 3431742 3456281 3558738 3673275 3710861 3589009 3700826 3633237 3679675 3702501
14696 3702501 3688607 3610256 3763881 3847136 3907977 3786056 3676002 3694706 3758209 3280468
14686 3280468 3432148 3519454 3496357 3747440 3700290 3624193 3451838 3440737 3679215 3741572
14676 3741572 3682978 3634818 3641527 3606638 3727721 3848989 3723735 3477326 3966391 3889363
14666 3889363 3606763 3492503 3575726 3506834 3517127 3271883 3360479 3428314 3514429 3767065
14656 3767065 3763305 3738149 3927100 3951137 3760964 3738502 3698363 3839480 3754203 3729944 3887779
14645 3887779 3868113 3807763 3760076 3523961 3580305 3834382 3945355 4070553 3950645 4132279
14635 4132279 3900063 3779765 3635394 3592416 3629998 3675422 3901665 4004960 3702704 3822738
14625 3822738 3887532 3657488 3843299 3645925 3725175 3910536 3783270 3972834 3890047 3739158
14615 3739158 3922167 3905856 3729337 3722004 3709380 3805660 3844826 3731935 3683442 3743788 3772148
14604 3772148 3601351 3847152 3461620 3468298 3447208 3505567 3428709 3698650 3773915 3669912
14594 3669912 3531470 3591047 3750309 3667929 3831380 3871162 3773252 3753434 3675735 3782585
14584 3782585 3701663 3792339 3587245 3531149 3619700 3579319 3424857 3448020 3579935 3782356
14574 3782356 3775646 3756402 3746229 3657664 3764018 3718945 3618271 3560636 3691600 3645206 3807860
14563 3807860 3855351 3702870 3481668 3247448 3381025 3475644 3490923 3761166 3721611 3912205
14553 3912205 3689088 3565613 3733340 3806844 3780592 3694061 3517908 3569673 3500400 3452966
14543 3452966 3727102 3692382 3515119 3666103 3745307 3682095 3597905 3483057 3545832 3695402
14533 3695402 3627121 3695022 3512988 3647083 3737379 3652118 3800062 3772171 3811856 3607627
14523 3607627 3841107 3804199 3450554 3681936 3871402 3700269 3530917 3554691 3632881 3640878
14513 3640878 3898727 3759954 3605585 3479340 3558264 3819015 3646350 3572666 3502757 3389206
14503 3389206 3639085 3732401 3745084 3648624 3623177 3584131 3571191 3758866 3723682 3830481 3882191
14492 3882191 3737445 3698605 3767604 3533121 3444301 3557749 3726645 3868944 3822833 3566685
14482 3566685 3655502 3789073 3686165 3870598 3814610 3670285 3645492 3746886 3748325 3793348
14472 3793348 3688242 3639533 3586119 3511526 3574998 3516656 3499347 3521151 3482354 3737155 3920028
14461 3920028 3725397 3892376 3770083 3684140 3628968 3833915 3821654 3672509 3840276 3722714
14451 3722714 3793800 3774794 3616282 3824795 3722801 3823539 3824296 3538187 3646585 3683013
14441 3683013 3628820 3680691 3614209 3650979 3694857 3840999 3835588 3987665 3944953 3775947 3758446
14430 3758446 3700122 4043238 3996785 3827302 3613330 3745794 3772550 3775406 3910179 3555044
14420 3555044 3601452 3516164 3595227 3750116 3621980 3656571 3557905 3696945 3684771 3595238 3726067
14409 3726067 3710222 3694467 3665970 3701345 3685543 3668519 3692184 3631839 3649011 3786317 3735370
14398 3735370 3546091 3609197 3555369 3760587 3902035 4072432 4150348 4126424 3929599 3705724
14388 3705724 3636483 3858429 3802641 3903150 3995062 3783557 3334976 3456882 3481483 3624148
14378 3624148 3871843 3743410 3979954 3893460 3761060 3676979 3793252 3577411 3539663 3574085
14368 3574085 3699300 3818496 3709034 3822458 3627684 3507886 3669525 3658869 3715249 3782344
14358 3782344 3566025 3585986 3675385 3581511 3830797 3697881 3692345 3695079 3766142 3845985 3668208
14347 3668208 3601843 3660941 3678996 3683938 3809307 3849226 3647492 3646271 3735643 3617531 3673565
14336 3673565 3808935 3741527 3803709 3736509 3828006 3809242 3741070 3961222 3696448 3673851 3876739
14325 3876739 4064276 4052091 4031702 4064430 3918628 3976512 3779600 3872030 3838389 3706063
14315 3706063 3663299 3839700 3936839 3950117 3773922 3876894 3972720 3905759 3906355 3663422 3588266
14304 3588266 3783193 4071859 3996704 3832083 3918260 4113396 3828175 3763902 3814910 3732945
14294 3732945 3925538 3881896 3863885 4047430 3987690 3902116 3655308 3597052 3496641 3839336
14284 3839336 3852478 3840710 3769628 3858544 3749044 3689082 3937734 3878439 3769206 3904608
14274 3904608 3949500 3638557 3564744 3363713 3550883 3754976 3847375 3796156 3756654 3991431
14264 3991431 3917770 3702269 4022061 4092538 3689233 3983043 4116031 3814903 3657695 3765648
14254 3765648 3819310 3830519 3763818 3763750 3708381 3773838 3790204 3681900 3424137 3494106 3668394
14243 3668394 3825384 3820505 3887456 3916086 3606956 3447076 3548682 3563909 3562511 3761690 3765294
14232 3765294 3801590 3877574 3917350 3755715 3850484 3703282 3741169 3724919 3969151 3911234 3795218
14221 3795218 3611012 3552586 3889263 3917637 3751083 3882817 3928557 3643356 3690121 3785458
14211 3785458 3785339 3837131 3738137 3676491 3661780 3644502 3778252 3822120 3911416 3956350 3943310
14200 3943310 4023874 3943482 3978449 3849609 3811320 3929875 3905355 4094204 4096192 4114235 4033697
14189 4033697 4069112 3890134 3830037 3523502 3350875 3674359 3766216 3788631 3729178 3653566
14179 3653566 3426669 3536729 3668069 3670645 3685180 3719699 3790309 3981047 3853032 3727311
14169 3727311 3686995 3623355 3618601 3890186 4108836 4004358 4019846 3924406 3693615 3667315 3802355
14158 3802355 3999937 3682107 3856334 3858512 3762192 3708239 3839902 3869584 3741258 3733487 3852731
14147 3852731 3895383 3693436 3848228 3967279 4025332 3879217 4036437 3983781 3929237 3895268
14137 3895268 3839951 4081940 4265298 4118448 4115152 3931779 3749368 3699276 3820745 3706744
14127 3706744 3717745 3872038 3909603 3742126 3846441 3900229 3767329 3675397 3855318 3729904
14117 3729904 3915513 3880615 3810598 3892956 3677087 3765848 3563411 3653837 3684174 3772335 3771405
14106 3771405 3677346 3598768 3723908 3872311 3715336 3856971 3870348 3933799 4076206 3874945
14096 3874945 3758297 3931855 4095233 4164884 3790852 3729071 3600663 3603846 3780901 4071306
14086 4071306 4276798 4049017 4088656 4266723 4287347 3940036 4011171 3898578 3914083 3995135
14076 3995135 3980071 3940220 4042999 4157935 4165677 4132321 3818053 3910606 3953102 3957884 4033953
14065 4033953 3910641 3830168 3883329 3988749 3714458 3617214 3907357 4034415 3905785 4127027
14055 4127027 4022148 3516957 3365913 3527474 3558097 3829093 4019838 3803001 3657774 3449961
14045 3449961 3602921 3747274 3875162 3996288 3894818 3885099 3973843 3912545 3775741 3983980
14035 3983980 4056588 3817941 3883178 3770739 3768478 3948368 3912808 3967670 4086898 4064414 3965673
14024 3965673 3923229 3985117 3909892 3842321 4043999 4050037 4052671 4009073 3946899 3876633 3890519
14013 3890519 3876330 3877828 3955455 3788559 3897074 4008985 3835625 4032230 4021740 3894612
14003 3894612 3943704 4082468 4058130 4102354 4062189 3722618 3617155 3779133 3924470 3923486 3774085
13992 3774085 3799423 3845947 3778023 3735708 3828267 3827665 3871430 3864450 4056646 3983909 4025619 4003467
13980 4003467 4020939 4085160 3796760 3792914 3996266 4158210 3819923 3750093 4006589 4158987
13970 4158987 4024536 3955235 4056200 3978515 3832972 3864397 3809351 3975083 3914442 4069006
13960 4069006 4034946 4126677 3884908 3568779 3906918 3685263 3569495 3978522 3954137 4036532
13950 4036532 4016428 3947838 3994105 3888167 3735582 3627694 4025714 4185335 4161100 4013065
13940 4013065 3868972 3783526 3711558 3656600 3798584 3903083 3981461 3924767 3823558 3639085
13930 3639085 3835706 3978511 3778592 3681191 3637944 3631491 3918273 3993124 3978729 4104382
13920 4104382 3967215 3917730 4018154 4083679 3831431 4052338 4106344 4250044 4253375 4107795
13910 4107795 4084940 4043081 3987930 3931576 3761406 4024434 3967055 3984821 4196410 4152485 4058343
13899 4058343 4071210 4101285 3850877 3566669 3788972 3860242 3942573 3955384 3805307 3935570
13889 3935570 4042133 3966174 3593794 3667923 4080293 4076808 4105631 4168493 4265104 4406218 4072693
13878 4072693 3802206 3781415 3982792 3903755 3953412 4138826 3938563 3950887 3807857 3756661
$$ [...]
##END NTUPLES=NMR SPECTRUM
##END=
