##TITLE=1H_CG-1150-A4
 CDCl3, 8 sc, 
 6.08.2021
##JCAMPDX= 6.0         $$ Bruker NMR JCAMP-DX V2.0
##DATA TYPE= NMR SPECTRUM
##DATA CLASS= NTUPLES
##ORIGIN= UXNMR, Bruker Analytische Messtechnik GmbH
##OWNER= root
$$ XWIN-NMR		Version 3.5
$$ Fri Aug  6 10:20:54 2021 Russian Standard Time (UT+4h)  she@DPX200
##.OBSERVE FREQUENCY= 200.131506
##.OBSERVE NUCLEUS= ^1H
##.ACQUISITION MODE= SIMULTANEOUS
##.ACQUISITION SCHEME= undefined
##.AVERAGES= 8
##.DIGITISER RES= 18
##SPECTROMETER/DATA SYSTEM= spect
##.PULSE SEQUENCE= zg30
##.SOLVENT NAME= CDCl3
##.SHIFT REFERENCE= (INTERNAL, CDCl3, 0, 17.4971)
##AUDIT TRAIL= $$ (NUMBER, WHEN, WHO, WHERE, WHAT)
$$ ##TITLE= Audit trail, XWIN-NMR		Version 3.5
$$ ##JCAMPDX= 5.01
$$ ##ORIGIN= Bruker BioSpin GmbH
$$ ##OWNER= she
$$ F:/spectra/data/she/nmr/H-F/1/pdata/1/auditp.txt
$$ ##AUDIT TRAIL=  $$ (NUMBER, WHEN, WHO, WHERE, WHAT)
(   1,<2021-08-06 10:19:36.67 +0400>,<she>,<DPX200>,
      <created by zg, POWCHK disabled, PULCHK disabled
       configuration hash MD5:
       00 E9 B6 7A A2 85 ED C7 34 08 36 98 17 FE 4E 26
       data hash MD5: 16K
       F9 1B D1 6F 0E 59 69 54 95 28 0D 4E 7B 6B BA 0A>)
(   2,<2021-08-06 10:19:38.85 +0400>,<she>,<DPX200>,
      <Start of raw data processing
       efp BC_mod = 2 LB = 0.24 FT_mod = 6 PKNL = 1 PHC0 = -13512.84 PHC1 = 10.20099 SI = 16K 
       data hash MD5: 16K
       D1 D3 FB 0E 8B 80 AF 1C 58 61 E9 04 0A B5 A3 4F>)
(   3,<2021-08-06 10:19:59.45 +0400>,<she>,<DPX200>,
      <pk PHC0 = 156.5031 PHC1 = 1.2 
       data hash MD5: 16K
       AF 5A AA AB 28 56 5F 5E AC 72 12 F0 F3 C0 3C 4C>)
(   4,<2021-08-06 10:20:02.85 +0400>,<she>,<DPX200>,
      <abs ABSG = 5 
       data hash MD5: 16K
       E8 6F 83 D9 A3 2F 8A 13 61 10 26 DB D9 65 D9 4A>)
$$ ##END=
$$ 
$$ hash MD5
$$ C8 C6 ED 5B 6F DC B7 8B 5E A6 46 EF DB F8 5E C1
##$RELAX= 
##$RELAX= 
##$RELAX= 
##$RELAX= 
##$RELAX= 
##$RELAX= 
$$ Bruker specific parameters
$$ --------------------------
##$DU= <F:/spectra>
##$EXPNO= 1
##$NAME= <H-F>
##$PROCNO= 1
##$TYPE= <nmr>
##$USER= <she>
##$AMP= (0..31)
100 100 100 100 100 100 100 100 100 100 100 100 100 100 100 100 100 100 
100 100 100 100 100 100 100 100 100 100 100 100 100 100 
##$AQSEQ= 0
##$AQ_mod= 1
##$AUNM= <au_zg>
##$AUTOPOS= <>
##$BF1= 200.13
##$BF2= 200.13
##$BF3= 200.13
##$BF4= 200.13
##$BF5= 200.13
##$BF6= 200.13
##$BF7= 200.13
##$BF8= 200.13
##$BYTORDA= 1
##$CFDGTYP= 0
##$CFRGTYP= 5
##$CHEMSTR= <none>
##$CNST= (0..31)
1 1 145 1 1 1 1 1 1 1 1 1 1 1 1 1 1 1 1 1 1 1 1 1 1 1 1 1 1 1 1 1 
##$CPDPRG= <>
##$CPDPRG1= <>
##$CPDPRG2= <>
##$CPDPRG3= <>
##$CPDPRG4= <mlev>
##$CPDPRG5= <mlev>
##$CPDPRG6= <mlev>
##$CPDPRG7= <mlev>
##$CPDPRG8= <mlev>
##$CPDPRGB= <>
##$CPDPRGT= <>
##$D= (0..31)
0 1.2 0 0 0 0 0 0 0 0.06 0 0.03 0 0 0 0 0.0002 0 0 0 0 0 0 0 0 0 0 0 0 
0 0 0 
##$DATE= 1628230776
##$DBL= (0..7)
120 120 120 120 120 120 120 120 
##$DBP= (0..7)
150 150 150 150 150 150 150 150 
##$DBP07= 0
##$DBPNAM0= <>
##$DBPNAM1= <>
##$DBPNAM2= <>
##$DBPNAM3= <>
##$DBPNAM4= <>
$$ [...]
##$SUBNAM3= <"">
##$SUBNAM4= <"">
##$SUBNAM5= <"">
##$SUBNAM6= <"">
##$SUBNAM7= <"">
##$SUBNAM8= <"">
##$SUBNAM9= <"">
##$SW= 20.0188882624521
##$SWIBOX= (0..15)
0 0 2 0 0 0 0 0 0 0 0 0 0 0 0 0 
##$SW_h= 4006.41025641026
##$TD= 16384
##$TD0= 1
##$TE= 0
##$TE2= 300
##$TE3= 300
##$TEG= 300
##$TL= (0..7)
0 120 120 120 120 120 120 120 
##$TP= (0..7)
150 150 150 150 150 150 150 150 
##$TP07= 0
##$TPNAME0= <>
##$TPNAME1= <>
##$TPNAME2= <>
##$TPNAME3= <>
##$TPNAME4= <>
##$TPNAME5= <>
##$TPNAME6= <>
##$TPNAME7= <>
##$TPOAL= (0..7)
0.5 0.5 0.5 0.5 0.5 0.5 0.5 0.5 
##$TPOFFS= (0..7)
0 0 0 0 0 0 0 0 
##$TUNHIN= 0
##$TUNHOUT= 0
##$TUNXOUT= 0
##$USERA1= <user>
##$USERA2= <user>
##$USERA3= <user>
##$USERA4= <user>
##$USERA5= <user>
##$V9= 5
##$VALIST= <valist>
##$VCLIST= <CCCCCCCCCCCCCCC>
##$VD= 0
##$VDLIST= <DDDDDDDDDDDDDDD>
##$VPLIST= <PPPPPPPPPPPPPPP>
##$VTLIST= <TTTTTTTTTTTTTTT>
##$WBST= 1024
##$WBSW= 4
##$XGAIN= (0..3)
0 0 0 0 
##$XL= 0
##$YL= 0
##$YMAX_a= 127689
##$YMIN_a= -120077
##$ZGOPTNS= <>
##$ZL1= 120
##$ZL2= 120
##$ZL3= 120
##$ZL4= 120
##$ABSF1= 17.49956
##$ABSF2= -2.51948
##$ABSG= 5
##$ABSL= 3
##$ALPHA= 0
##$AQORDER= 0
##$ASSFAC= 0
##$ASSFACI= 0
##$ASSFACX= 0
##$ASSWID= 0
##$AUNMP= <proc_1d>
##$AZFE= 0.1
##$AZFW= 0.1
##$BCFW= 0
##$BC_mod= 2
##$BYTORDP= 0
##$COROFFS= 0
##$CY= -3
##$DATMOD= 1
##$DC= 0
##$DFILT= <>
##$DTYPP= 0
##$F1P= 0
##$F2P= 0
##$FCOR= 1
##$FTSIZE= 16384
##$FT_mod= 6
##$GAMMA= 0
##$GB= 0
##$INTBC= 1
##$INTSCL= 1.334414e-10
##$ISEN= 128
##$LB= 0.24
##$LEV0= 0
##$LPBIN= 0
##$MAXI= 10000
##$MC2= 0
##$MEAN= 0
##$ME_mod= 0
##$MI= 1.114404
##$NCOEF= 0
##$NC_proc= -8
##$NLEV= 6
##$NOISF1= 3.799351
##$NOISF2= 2.8
##$NSP= 0
##$NTH_PI= 0
##$NZP= 0
##$OFFSET= 17.49711
##$PC= 1
##$PHC0= -13356.34
##$PHC1= 11.40099
##$PH_mod= 1
##$PKNL= yes
##$PPARMOD= 0
##$PSCAL= 0
##$PSIGN= 0
##$REVERSE= no
##$SF= 200.130007509552
##$SI= 16384
##$SIGF1= 3
##$SIGF2= 2
##$SINO= 5.538805
##$SIOLD= 16384
##$SREGLST= <1H.CDCl3>
##$SSB= 0
##$STSI= 16384
##$STSR= 0
##$SW_p= 4006.41025641026
##$SYMM= 0
##$S_DEV= 0
##$TDeff= 16384
##$TDoff= 0
##$TI= <>
##$TILT= no
##$TM1= 0
##$TM2= 0
##$TOPLEV= 0
##$USERP1= <user>
##$USERP2= <user>
##$USERP3= <user>
##$USERP4= <user>
##$USERP5= <user>
##$WDW= 1
##$XDIM= 16384
##$YMAX_p= 396764006
##$YMIN_p= -1030235
$$ End of Bruker specific parameters
$$ ---------------------------------
##NTUPLES= NMR SPECTRUM
##VAR_NAME=  FREQUENCY,     SPECTRUM/REAL,   SPECTRUM/IMAG
##SYMBOL=    X,             R,               I
##VAR_TYPE=  INDEPENDENT,   DEPENDENT,       DEPENDENT
##VAR_FORM=  AFFN,          ASDF,            ASDF
##VAR_DIM=   16384,         16384,           16384
##UNITS=     HZ,            ARBITRARY UNITS, ARBITRARY UNITS
##FACTOR=    0.24454680195387, 1,            1
##FIRST=     3501.6968291074, 0,             0
##LAST=      -504.713427302855, 0,           0
##MIN=       -504.713427302855, -1030235,    0
##MAX=       3501.6968291074, 396764006,     0
$$ Real data points
##PAGE= N=1
##DATA TABLE= (X++(R..R)), XYDATA
$$ [...]
$$ plain form
5591 -458692 -963655 -590168 -452187 -292096 -116544 14445 18587 -99075 -356414 -588673
5581 -588673 -391653 -274471 -319586 -114370 -85919 46010 -178130 -363894 -394325 -236929
5571 -236929 -224209 -253270 -406135 -247488 -262507 -378723 -305364 -281974 -314209 18871 -179074
5560 -179074 -537049 -284361 101375 70008 201845 308682 20026 -9022 93789 -68162
5550 -68162 -390860 -212241 -242929 -333300 -337743 65901 119210 -13110 -67369 -97083 -57177
5539 -57177 -23535 -327069 67961 81468 -352366 -331059 -271411 -318075 -24778 -225544 -113828
5528 -113828 -198398 -380666 -571317 -212395 -425802 -302810 69150 -85659 -217790 -315003
5518 -315003 -363330 -464877 -436233 -200272 -131818 -91713 -223266 -78279 316963 -63043
$$ packed form
5591d58692n04963L73487J37981J60091J75552J30989M142j17662k57339k32259
5581e88673J97020J17182m5115K05216K8451J31929k24140j85764l0431J57396
5571b36929J2720k9061j52865J58647j5019j16216P3359K3390l2235L33080j97945
5560a79074l57975K52688L85736l1367J31837J06837k88656k9048J02811j61951
5550f8162l22698J78619l0688r0371m443M03644N3309j32320n4259k9714L9906
5539e7177L3642l03534L95030J3507m33834K1307N9648m6664K93297k00766J11716
5528a13828q4570j82268j90651L58922k13407J22992L71960j54809j32131r7213
5518c15003m8327j01547K8644K35961O8454M0105j31553J44987L95242l80006
$$ plain form
5508 -63043 305238 166118 204878 -47639 -32627 47287 -181433 48409 59136 -189367 -111699
5497 -111699 -144095 -334869 -539294 -414707 -5258 -137999 -13782 411708 370067 373019
5487 373019 495041 194890 -51450 -61159 147548 122320 -306750 -302134 -322339 -515772 -485031
5476 -485031 -565941 -718338 20324 221773 -514304 -476882 -312135 -306740 3239 163355
5466 163355 155906 -60126 -246364 -342348 -220112 -8495 202554 -226469 -261230 142492
5456 142492 -114072 -285098 -591370 -131089 11659 -110224 51806 177510 481078 147904
5446 147904 124118 -106788 -377760 -448978 -385198 11397 -131007 -609670 -407499 182565
5436 182565 46336 -38351 149078 100296 310361 330165 273094 520848 -56618 -286238
$$ packed form
5508f3043L68281j39120L8760k52517J5012P9914k28720K29842J0727k48503P7668
5497a11699l2396j90774k04425J24587M09449j32741J24217M25490m1641K952
5487C73019J22022l00151k46340r709K08707k5228m29070M616k0205j93433L0741
5476d85031q0910j52397P38662K01449p36077L7422J64747N395L09979J60116
5466A63355p449k16032j86238r5984J22236K11617K11049m29023l4761M03722
5456A42492k56564j71026l06272M60281J42748j21883J62030J25704L03568l33174
5446A47904k3786k30906k70972p1218O3780L96595j42404m78663K02171N90064
5436A82565j36229q4687J87429m8782K10065J9804n7071K47754n77466k29620
$$ plain form
5426 -286238 305380 77851 56185 199252 510262 177834 121532 -78674 -498960 -408836
5416 -408836 -5886 351972 73811 64518 197097 143392 126022 182098 -258751 57916 -62694
5405 -62694 -36250 25578 222992 236953 -297399 -286596 -444310 -319585 261539 456886 279124
5394 279124 227943 76220 -423612 -408968 -514495 -178335 1756 -45105 -114462 -228146
5384 -228146 -411403 -443133 -287909 -54313 17426 11237 -297771 -689341 -40593 543426
5374 543426 321009 19080 -228527 -189329 239069 119446 -315644 -287027 367351 227336
5364 227336 406330 393005 558412 113095 137875 304274 -224021 -300213 -152285 103866
5354 103866 387899 133376 42268 570277 373506 104137 59710 193914 405163 611953
$$ packed form
5426b86238N91618k27529k1666J43067L11010l32428n6302k00206m20286R0124
5416d08836M02950L57858k78161r293J32579n3705j7370N6076m40849L16667j20610
5405f2694K6444O1828J97414J3961n34352J0803j57714J24725N81124J95347j77762
5394B79124n1181j51723m99832J4644j05527L36160J80091m6861o9357j13684
5384b28146j83257l1730J55224K33596P1739o189l09008l91570O48748N84019
5374E43426k22417l01929k47607L9198M28398j19623m35090K8617O54378j40015
5364B27336J78994j3325J65407m45317K4780J66399n28295p6192J47928K56151
5354A03866K84033k54523r1108N28009j96771k69369m4427J34204K11249K06790
$$ plain form
5344 611953 538419 533528 250550 -195581 -52039 82711 -70010 167785 61920 62927 750285
5333 750285 663259 797623 366647 105398 197438 -288143 -252757 198278 87530 64426
5323 64426 355502 191750 245987 486101 205195 132878 -23275 35327 -10954 267888 376221
5312 376221 206264 -122603 -88349 61230 117336 15696 -228782 -403079 -219150 339803
5302 339803 349348 159460 28242 605608 965115 829803 717291 836378 323691 97566
5292 97566 -138474 -145534 130068 616406 518414 273706 84492 834567 816149 211833 11503
5281 11503 87794 144120 688849 971693 712940 584943 302436 255975 451996 343035
5271 343035 148793 562921 992276 988642 1040370 128173 241447 339426 541498 861943
$$ packed form
5344F11953p3534m891k82978m46131J43542J34750j52721K37795j05865J007O87358
5333G50285q7026J34364m30976k61249R2040m85581L5386M51035j10748k3104
5323F4426K91076j63752N4237K40114k80906p2317j56153N8602m6281K78842J08333
5312C76221j69957l28867L4254J49579N6106j01640k44478j74297J83929N58953
5302C39803R545j89888j31218N77366L59507j35312j12512J19087n12687k26125
5292I7566k36040p060K75602M86338r7992k44708j89214P50075j8418o04316k00330
5281A1503P6291N6326N44729K82844k58753j27997k82507m6461J96021j08961
5271C43035j94242M14128M29355l634N1728r12197J13274R7979K02072L20445
$$ plain form
5261 861943 1004956 1306833 1013405 739154 402685 659564 899000 813282 810285 1046881
5251 1046881 1114707 801418 929282 1166757 1357209 1948050 1643256 1533674 1480371 2059138
5241 2059138 2274159 2060403 1684660 1735620 2106401 2375265 2199437 2321572 2896167 3001925
5231 3001925 3243031 3437746 3831180 3829271 3833476 3883495 3592675 3790300 4262212 4668484
5221 4668484 5074348 5609618 5594014 5941481 5838279 6161527 5722131 5643941 6078390 5505654
5211 5505654 5050010 5547264 5928958 5587955 5256706 5402753 5726396 5991902 7292436
5202 7292436 7576342 8235742 8830393 9055181 9235301 9514844 9817140 9875627 9454877 8641585
5192 8641585 7793195 7328050 6892394 6309977 5932988 5428957 5840551 5915156 5188189 4973434
$$ packed form
5261H61943J43013L01877k93428k74251l36469K56879K39436q5718k997K36596
5251A046881O7826l13289J27864K37475J90452N90841l04794j09582n3303N78767
5241B059138K15021k13756l75743N0960L70781K68864j75828J22135N74595J05758
5231C001925K41106J94715L93434j909M205N0019k90820J97625M71912M06272
5221D668484M05864N35270j5604L47467j03202L23248m39396p8190M34449n72736
5211E505654m55644M97254L81694l41003l31249J46047L23643K65506J300534
5202G292436K83906O59400N94651K24788J80120K79543L02296N8487m20750q13292
5192H641585q48390m65145m35656n82417l76989n04031M11594P4605p26967k14755
$$ plain form
5182 4973434 5445375 5396675 5590650 5821132 6268496 5594620 5734978 6282131 6150684 6103755
5172 6103755 6279208 5542147 4937235 4205920 3688932 3607868 3767823 3425791 2615848 2616683
5162 2616683 2225900 2095135 2104172 2134447 1758111 1803431 1458019 1405432 1447007 1703247 1709586
5151 1709586 1655461 1381742 1323833 1032829 971094 1097565 1088760 1474287 1254661 1014216
5141 1014216 1422782 1449869 1336822 1470378 927521 890755 902042 599403 615057 1047284
5131 1047284 1344557 1488310 1417416 1029877 865109 502979 873129 964885 972630 929016
5121 929016 973172 1340426 868912 521842 573380 607392 462825 482761 859520 906148 785322
5110 785322 1008283 984423 978810 875066 1122737 855445 431319 875162 1040885 630447
$$ packed form
5182D973434M71941m8700J93975K30482M47364o73876J40358N47153j31447m6929
5172F103755J75453p37061o04912p31315n16988q1064J59955l42032q09943Q35
5162B616683l90783j30765R037L0275l76336M5320l45412n2587M1575K56240O339
5151A709586n4125k73719n7909k91004o1735J26471q805L85527k19626k40445
5141A014216M08566K7087j13047J33556n42857l6766J1287l02639J5654M32227
5131A047284K97273J43753p0894l87539j64768l62130L70150R1756P745m3614
5121I29016M4156L67254m71514l47070N1538L4012j44567J9936L76759M6628j20826
5110G85322K22961k3860n613j03744K47671k67292m24126M43843J65723m10438
$$ plain form
5100 630447 201363 431488 530002 906918 942174 614060 736986 790852 593458 574212
5090 574212 959760 909097 940322 884734 250782 844005 777493 887586 931960 452007 420890
5079 420890 672776 790693 364387 535699 745145 344134 756529 390521 743394 769937
5069 769937 817520 792671 166296 467521 731607 894485 960837 667196 472488 690373
5059 690373 647578 322297 539203 785106 521451 415852 78599 557514 564980 989389
5049 989389 620911 279388 757065 895410 970957 623082 185661 718839 377949 195154
5039 195154 367626 409109 -3653 259803 247759 390461 358984 160850 403829 459280
5029 459280 521866 531940 361809 600029 662856 437083 503072 276553 659645 983399
$$ packed form
5100F30447m29084K30125R8514L76916L5256l28114J22926N3866j97394j9246
5090E74212L85548n0663L1225n5588o33952N93223o6512J10093M4374m79953l1117
5079D20890K51886J17917m26306J71312K09446m01011M12395l66008L52873K6543
5069G69937M7583k4849o26375L01225K64086J62878O6352k93641j94708K17885
5059F90373m2795l25281K16906K45903k63655j05599l37253M78915P466M24409
5049I89389l68478l41523M77677J38345P5547l47875m37421N33178l40890j82795
5039A95154J72472M1483m12762K63456j2044J42702l1477j98134K42979N5451
5029D59280O2586J0074j70131K38220O2827k25773O5989k26519L83092L23754
$$ plain form
5019 983399 812949 725407 388470 493810 1031835 883192 675756 789677 744500 629925
5009 629925 340850 204091 420274 737913 1189278 756378 794384 392045 508742 482374
4999 482374 669254 1026004 670097 688894 610701 428890 787425 695079 727940 884453
4989 884453 558927 659792 791837 1088595 771797 1228998 1155634 308748 542503 638722
4979 638722 606200 749041 612343 273423 555918 608987 139516 597192 572569 466292
4969 466292 700153 845805 1049499 640421 598722 648306 186590 631453 530069 565109
4959 565109 812795 407705 298725 589850 933780 891479 918692 943989 1071349 720465
4949 720465 904670 804583 860632 742594 852703 1247690 1086803 754357 522201 557511
$$ packed form
5019I83399j70450q7542l36937J05340N38025j48643k07436J13921m5177j14575
5009F29925k89075j36759K16183L17639M51365m32900L8006m02339J16697k6368
4999D82374J86880L56750l55907J8797p8193j81811L58535r2346L2861J56513
4989H84453l25526J00865J32045K96758l16798M57201p3364q46886K33755R6219
4979F38722l2522J42841j36698l38920K82495N3069m69471M57676k4623j06277
4969D66292K33861J45652K03694m09078m1699M9584m61716M44863j01384L5040
4959E65109K47686m05090j08980K91125L43930m2301K7213K5297J27360l50884
4949G20465J84205j00087N6049j18038J10109L94987j60887l32446k32156L5310
$$ plain form
4939 557511 962783 565268 628544 552252 630327 577781 909695 1300326 1131393 891770
4929 891770 1091586 1154475 443862 605455 978627 1040494 1505760 1343577 760950 1084462
4919 1084462 661025 464443 755542 585748 412008 653810 1063395 988597 886245 942357
4909 942357 925799 1239638 785567 433012 420074 473465 987891 746346 475345 320589
4899 320589 853488 1643984 965022 848729 720271 683337 828089 719114 939411 1283157
4889 1283157 966663 995574 1075916 949607 1539704 1478492 1011852 1047943 769097 813999
4879 813999 657753 1207920 1159745 679656 798811 1164091 937428 813402 462138 596312
4869 596312 649527 593668 844926 1353006 1029772 739258 806110 692935 1093974 1172946
$$ packed form
4939E57511M05272l97515O3276p6292P8075n2546L31914L90631j68933k39623
4929H91770J99816O2889p10613J61593L73172O1867M65266j62183n82627L23512
4919A084462m23437j96582K91099j69794j73740K41802M09585p4798j02352N6112
4909I42357j6558L13839m54071l52555j2938N3391N14426k41545k71001j54756
4899C20589N32899P90496o78962j16293j28458l6934J44752j08975K20297L43746
4889A283157l16494K8911Q0342j26309N90097o1212m66640L6091k78846M4902
4879H13999j56246N50167m8175m80089J19155L65280k26663j24026l51264J34174
4869E96312N3215n5859K51258N08080l23234k90514O6852j13175M01039P8972
$$ plain form
4859 1172946 969211 667185 637728 1224001 1616350 1514456 1449569 1421696 1317765 857407
4849 857407 1289310 1322823 1037469 464242 631555 656408 706574 1162954 1022510 1024824 1053059
4838 1053059 1003012 1076415 1498398 1686153 944196 1414227 1482041 1690833 1934988 1435820
4828 1435820 1464222 1828585 1562813 1233549 1598179 1854038 1418963 1262945 1340163 1269344
4818 1269344 1654783 1855170 1715770 1921630 1980580 1968636 1948856 2100308 2008698 2213780
4808 2213780 2559948 2694191 2663948 2863251 3341751 3026790 3152830 3528184 4010499 4188659
4798 4188659 3928411 4498613 5062653 5150665 5093081 4753764 4948485 4680454 4586884 4468069
4788 4468069 3806475 3990172 4868680 4582975 3893017 4598621 4404677 4269343 4739599 5109929
$$ packed form
4859A172946k03735l02026k9457N86273L92349j01894o4887k7873j03931m60358
4849H57407M31903L3513k85354n73227J67313K4853N0166M56380j40444K314K8235
4838A053059n0047P3403M21983J87755p41957M70031O7814K08792K44155m99168
4828A435820K8402L64363k65772l29264L64630K55859m35075j56018P7218p0819
4818A269344L85439K00387j39400K05860N8950j1944j9780J51452r1610K05082
4808B213780L46168J34243l0243J99303M78500l14961J26040L75354M82315J78160
4798D188659k60248N70202N64040Q8012n7584l39317J94721k68031r3570j18815
4788D468069o61594J83697Q78508k85705o89958P05604j93944j35334M70256L70330
$$ plain form
4778 5109929 5789307 5729126 6032185 6358245 5923772 5425435 5009323 5058159 4767616 4536389
4768 4536389 4521121 4064446 3386298 3901754 4381348 4374810 4765298 5075035 5430203 5390823
4758 5390823 5404079 5967595 6248227 5514333 5456562 5402756 5350620 4869831 4867626 4954742 5293828
4747 5293828 4865103 4678936 5255861 5294360 5231993 5592763 5686255 5209274 5593177 4964720
4737 4964720 4559368 4237060 4163865 4000194 3672809 3464496 3347350 2985905 2931649 3009792
4727 3009792 2979320 2321248 2210439 2633449 2051645 1471243 2010938 2460587 1853465 1524474
4717 1524474 1733525 2342423 2327591 1851216 1838374 1720196 1704819 1879126 1246982 1418561
4707 1418561 1803858 1218817 1009923 1570847 1712619 1723121 1389224 1116893 1553289 1067015
$$ packed form
4778E109929O79378o0181L03059L26060m34473m98337m16112M8836k90543k31227
4768D536389j5268m56675o78148N15456M79594o538L90488L09737L55168l9380
4758E390823J3256N63516K80632p33894n7771n3806n2136m80789k205Q7116L39086
4747E293828m28725j86167N76925L8499o2367L60770R3492m76981L83903o28457
4737D964720m05352l22308p3195j63671l27385k08313j17146l61445n4256P8143
4727C009792l0472o58072j10809M23010n81804n80402N39695M49649o07122l28991
4717A524474K09051O08898j4832m76375j2842j18178j5377J74307o32144J71579
4707A418561L85297n85041k08894N60924J41772J0502l33897k72331M36396m86274
$$ plain form
4697 1067015 914660 1357971 1197969 1098770 1175624 1417454 1383007 1462383 1203837 1344266
4687 1344266 1087802 991181 971761 1208524 1586115 1399037 1754847 1551855 1227781 1272550
4677 1272550 1283619 900153 1071613 1584345 1591519 1192924 964479 962769 644090 17124
4667 17124 156061 761908 1007340 931763 846501 1251832 613023 332423 678368 466791
4657 466791 600750 424396 577110 612369 525120 1086614 747871 811291 845873 530668
4647 530668 169570 326387 460496 181009 157236 -48771 475898 515993 291254 236315
4637 236315 89338 441515 -116341 286945 809017 846316 1043473 925993 1015466 879385
4627 879385 459063 413751 489999 896087 623722 207740 518466 737731 876889 707597
$$ packed form
4697A067015j52355M43311j60002r9199P6854K41830l4447P9376k58546J40429
4687A344266k56464r6621j9420K36763L77591j87078L55810k02992l24074M4769
4677A272550J1069l83466J71460N12732P174l98595k28445j710l18679o26966
4667A7124J38937O05847K45432p5577q5262M05331o38809k80600L45945k11577
4657D66791J33959j76354J52714L5259q7249N61494l38743O3420L4582l15205
4647E30668l61098J56817J34109k79487k3773k06007N24669M0095k24739n4939
4637B36315j46977L52177n57856M03286N22072L7299J97157j17480Q9473j36081
4627H79385m20322m5312P6248M06088k72365m15982L10726K19265J39158j69292
$$ plain form
4617 707597 729350 947277 932409 981311 853661 751685 527709 461701 385083 193822 680506
4606 680506 125567 232930 370808 309709 225704 264263 716925 479711 151220 228839
4596 228839 217808 645032 831514 1200339 1140891 799129 351481 385184 -46345 -207341
4586 -207341 186352 523438 269187 529149 509025 -112084 1044654 935896 868727 853573
4576 853573 706405 758512 768621 1189055 776659 764991 638012 471680 702503 682518
4566 682518 705315 565561 984319 669230 148449 628268 1004686 1192138 715972 1128487
4556 1128487 1138042 435463 80056 521226 733228 463976 440593 433862 331871 665860
4546 665860 1158550 1332753 822041 653056 649778 643935 1089159 1176810 1032095 544071 204533
$$ packed form
4617G07597K1753K17927j4868M8902j27650j01976k23976o6008p6618j91261M86684
4606F80506n54939J07363J37878o1099q4005L8559M52662k37214l28491P7619
4596B28839j1031M27224J86482L68825n9448l41762m47648L3703m31529j60996
4586b07341L93693L37086k54251K59962k0124o21109J156738j08758o7169j5154
4576H53573j47168N2107J0109M20434m12396j1668j26979j66332K30823j9985
4566F82518K2797j39754M18758l15089n20781M79819L76418J87452m76166M12515
4556A128487R555p02579l55407M41170K12002k69252k3383o731j01991L33989
4546F65860M92690J74203n10712j68985l278n843M45224Q7651j44715m88024l39538
$$ plain form
4535 204533 708910 902285 663187 840465 733135 820036 1002757 981953 953385 1358080
4525 1358080 944087 912243 830119 923451 971554 763186 617285 612944 551889 877983 1185903
4514 1185903 1211988 1216084 850073 874746 1012186 1007637 992038 969919 1027635 1241736 1312615
4503 1312615 946109 621753 703473 1054423 1422688 1536040 1430000 1844323 1749584 1344803
4493 1344803 1296292 1421635 1666044 1510340 1552833 2133485 2283434 2708676 3111991 3802425
4483 3802425 4338966 4888379 4758215 3919980 3995767 3464499 2630567 2278494 2083297 1716429
4473 1716429 1338685 1117417 914755 1078007 1154076 940555 1149708 1364322 1538378 1383208
4463 1383208 1186251 848907 1205332 861452 1413906 1460137 1483133 1926947 1608920 1099953
$$ packed form
4535B04533N04377J93375k39098J77278j07330Q6901J82721k0804k8568M04695
4525A358080m13993l1844q2124R3332M8103k08368j45901m341o1055L26094L07920
4514A185903K6085M096l66011K4673J37440m549j5599k2119N7716K14101P0879
4503A312615l66506l24356Q1720L50950L68265J13352j06040M14323r4739m04781
4493A344803m8511J25343K44409j55704M2493N80652J49949M25242M03315O90434
4483C802425N36541N49413j30164q38235P5787n31268q33932l52073j95197l66868
4473A716429l77744k21268k02662J63252P6069k13521K09153K14614J74056j55170
4463A383208j96957l37344L56425l43880N52454M6231K2996M43814l18027n08967
$$ plain form
4453 1099953 738112 1153703 1344444 1393253 843720 1476270 1233972 1237839 1440780 1628210
4443 1628210 1359404 1355646 1367660 788254 931127 1260832 1266585 1298277 1386199 1583397 1498059
4432 1498059 1575134 2019275 2362400 2211989 2334083 2262832 2470717 2585253 3465741 3855839
4422 3855839 4280961 4471237 4570817 4937781 4454542 3628982 3084832 2740037 2375592 2475346
4412 2475346 2368025 2169382 1946437 1812568 1481389 1914314 1920026 1821946 1579673 1662408
4402 1662408 1318109 1436442 1053100 1208819 1542663 1394294 1139640 1374487 1179539 1097679
4392 1097679 1645126 1617028 1230462 1100642 938639 791928 951166 1168443 1238142 1075452
4382 1075452 728862 748359 839681 632160 600842 1241108 914029 647221 861425 392321
$$ packed form
4453A099953l61841M15591J90741M8809n49533O32550k42298L867K02941J87430
4443A628210k68806l758J2014n79406J42873L29705N753L1692Q7922J97198q5338
4432A498059P7075M44141L43125j50411J22094p1251K07885J14536Q80488L90098
4422C855839M25122J90276R9580L66964m83239q25560n44150l44795l64445R9754
4412B475346j07321j98643k22945j33869l31179M32925N712r8080k42273Q2735
4402A662408l44299J18333l83342J55719L33844j48369k54654K34847j94948q1860
4392A097679N47447k8098l86566j29820j62003j46711J59238K17277O9699j62690
4382A075452l46590J9497R1322k07521l1318O40266l27079k66808K14204m69104
$$ plain form
4372 392321 261681 456793 782742 1165586 418685 890263 1014190 950632 1102122 891464
4362 891464 803839 1194259 767335 833177 1153797 780473 825082 957973 841846 512046
4352 512046 676189 1070426 858925 712389 920395 977180 1127215 1020516 1228827 1083258
4342 1083258 1542335 1301205 914523 1108251 1184892 1448991 1838508 1535872 1559086 1167718
4332 1167718 918386 1019212 1217428 1393523 1487490 1195745 1072410 906274 1478932 1892091
4322 1892091 1442032 1324855 748529 731393 1321782 1448351 1379527 1291342 989113 1309821
4312 1309821 1478178 1784708 1923571 1496418 1273108 1279563 1323574 1562592 1836364 1405270
4302 1405270 1541299 1768858 1785553 1734976 1843491 1834568 2145435 1884166 2088516 1921821
$$ packed form
4372C92321j30640J95112L25949L82844p46901M71578J23927o3558J51490k10658
4362H91464q7625L90420m26924O5842L20620l73324M4609J32891j16127l29800
4352E12046J64143L94237k11501j46536K08006N6785J50035j06699K08311j45569
4342A083258M59077k41130l86682J93728P6641K64099L89517l02636K3214l91368
4332A167718k49332J00826J98216J76095R3967k91745j23335j66136N72658M13159
4322A892091m50059j17177n76326j7136N90389J26569o8824q8185l02229L20708
4312A309821J68357L06530J38863m27153k23310O455M4011K39018K73772m31094
4302A405270J36029K27559J6695n0577J08515q923L10867k61269K04350j66695
$$ plain form
4292 1921821 2248186 2119102 2179355 1864048 1633423 1844784 2229992 2265935 1909944 2279434
4282 2279434 1891553 2221767 2099490 2110484 2134073 1647241 1765001 2147490 2061945 1996119
4272 1996119 2199217 1904148 1635543 1861873 2325356 2692410 2673542 2937150 2705448 2613548
4262 2613548 2267411 2374728 2380358 2440475 3135739 3224866 3022383 2949560 3185979 3228546 3486262
4251 3486262 3299663 3223110 3607196 4213441 4646234 4682023 4404318 4246955 4600866 4214298
4241 4214298 4251270 4390840 4490487 4781970 4729912 4889414 5148166 5041481 5286476 5649359
4231 5649359 5734950 5527872 6000379 6626670 6157983 6500075 6535456 6830137 7197830 7214949
4221 7214949 7708670 7873711 8194421 8619637 9295604 9944175 9977511 10892776 11284442 11908165
$$ packed form
4292A921821L26365j29084O0253l15307k30625K11361L85208L5943l55991L69490
4282B279434l87881L30214j22277J0994K3589m86832J17760L82489q5545o5826
4272A996119K03098k95069k68605K26330M63483L67054j8868K63608k31702r1900
4262B613548l46137J07317N630O0117O95264Q9127k02483p2823K36419M2567K57716
4251C486262j86599p6553L84086O06245M32793L5789k77705j57363L53911l86568
4241D214298L6972J39570R9647K91483n2058J59502K58752j06685K44995L62883
4231E649359Q5591k07078M72507O26291m68687L42092L5381K94681L67693J7119
4221G214949M93721J65041L20710M25216O75967O48571L3336R15265L91666O23723
$$ plain form
4211 11908165 12827975 13315767 14072865 15103311 16208183 17677878 19112532 20740579 22926426
4202 22926426 24922155 26927077 28909210 31287922 32932910 34339195 34840088 35144428
4194 35144428 34508070 33672462 32806803 32564297 32793754 33292673 34572880 34702636 35350325
4185 35350325 36168146 36464258 37333768 37906436 38226324 38426943 38574114 38748597 38963439
4176 38963439 39049007 38510712 38881529 38538338 37749539 37514049 36481057 35858412 35538817
4167 35538817 36373858 36670213 37545636 39008103 40844766 42165596 43363514 44247442 44448013
4158 44448013 45032888 45100826 45604190 45629717 45606071 45979275 46085038 45669217 44330281 43421761
4148 43421761 42024714 40823643 39988770 38321976 36178643 33727954 31254713 29090598
$$ packed form
4211A1908165R19810M87792P57098J030446J104872J469695J434654J628047K185847
4202B2926426J995729K004922J982133K378712J644988J406285N00893L04340
4194C5144428o36358q35608q65659k42506K29457M98919J280207J29756O47689
4185C5350325Q17821K96112Q69510N72668L19888K00619J47171J74483K14842
4176C8963439Q5568n38295L70817l43191p88799k35490j032992o22645l19595
4167C5538817Q35041K96355Q75423J462467J836663J320830J197918Q83928K00571
4158D4448013N84875O7938N03364K5527k3646L73204J05763m15821j338936r08520
4148D3421761j397047j201071q34873j666794k143333k450689k473241k164115
$$ plain form
4140 29090598 27156680 25431026 24284529 23257906 21906501 20842420 20221795 19528659
4132 19528659 19056776 18356068 17505308 17327682 16929887 16132257 15596139 15446873 14902217
4123 14902217 14495170 14252514 13770512 13648516 13051414 13067626 12963052 13002760 12982048 13011789
4113 13011789 13233040 13171210 13061274 13255413 13569650 14066215 14007500 14295444 14357381 14732616
4103 14732616 15370672 15492521 15177613 15162068 15744159 15829430 16089602 15898639 15376451 15591149
4093 15591149 16519201 16785405 17125921 17361634 18056242 18832591 19421552 20011691 21493261
4084 21493261 22953189 24345108 26253802 27893711 29631028 31332115 33812499 35998032
4076 35998032 38000857 39897217 41992730 43963151 45328829 46154359 47293611 48233188
$$ packed form
4140B9090598j933918j725654j146497j026623j351405j064081o20625o93136
4132A9528659m71883p00708q50760j77626l97795p97630n36118j49266n44656
4123A4902217m07047k42656m82002j21996n97102J6212j04574L9708k0712K9741
4113A3011789K21251o1830j09936J94139L14237M96565n8715K87944O1937L75235
4103A4732616O38056J21849l14908j5545N82091Q5271K60172j90963n22188K14698
4093A5591149R28052K66204L40516K35713O94608P76349N88961N90139J481570
4084B1493261J459928J391919J908694J639909J737317J701087K480384K185533
4076C5998032K002825J896360K095513J970421J365678Q25530J139252R39577
$$ plain form
4068 48233188 49026701 49858189 50057531 50115497 50192357 49734194 49232439 48160687 47294802 46262026
4058 46262026 45617727 44645788 44113608 43242714 42459133 42109465 41864431 41270530 41581507
4049 41581507 41757588 42140653 42566753 42798360 43258551 42873833 42962068 43000576 42602852 42227327
4039 42227327 41888111 41189436 40638218 40271916 40278302 39693018 39237102 38476421 38020466 37582416
4029 37582416 36948813 36082492 35293091 35050046 34691085 34145600 34043052 33093357 32161427
4020 32161427 30652805 29578700 28071379 26609259 25222820 23303299 21703011 20590905
4012 20590905 19702020 19159763 18291434 17791160 17281806 17081593 17009033 16890523 16892710 16742734
4002 16742734 16778302 16742944 16769267 17185100 17697255 17641966 18471697 18494718 18504936 18558665 18162448
$$ packed form
4068D8233188P93513Q31488J99342N7966P6860m58163n01755j071752q65885j032776
4058D6262026o44299r71939n32180q70894p83581l49668k45034n93901L10977
4049D1581507J76081L83065M26100K31607M60191l84718Q8235L8508l97724l75525
4039D2227327l39216o98675n51218l66302O386n85284m55916p60681m55955m38050
4029C7582416o33603q66321p89401k43045l58961n45485j02548r49695r31930
4020C2161427j508622j074105j507321j462120j386439j919521j600288j112106
4012B0590905q88885n42257q68329n00274n09354k00213p2560j18510K187j49976
4002A6742734L5568l5358K6323M15833N12155n5289Q29731K3021J0218N3729l96217
$$ plain form
3991 18162448 17178773 15943874 14795866 14151019 13633820 13510213 13013039 13487297 13811006
3982 13811006 14316331 14487105 14268992 15166840 15880151 17153188 18217807 19203701 19617682
3973 19617682 19571201 19686792 19395232 18707476 17963657 16960226 16010510 15242734 14639729
3964 14639729 13877423 13812693 13977227 13290334 12983199 12589503 12807669 13174106 12983068 13365264
3954 13365264 13544529 14242143 14465134 15174665 15012326 14916028 14484468 13627725 13115104 12702792
3944 12702792 12343118 12357802 12433896 12207350 11967903 11645069 10986232 11022232 11518992 11355334
3934 11355334 11777453 11717034 11874844 12096900 12103646 12338885 12090398 11887854 11613387 11874293
3924 11874293 11602755 11734214 11886715 11850831 12444063 12628170 13228321 13480085 13840536 14309092
$$ packed form
3991A8162448r83675j234899j148008o44847n17199j23607m97174M74258L23709
3982A3811006N05325J70774k18113Q97848P13311J273037J064619R85894M13981
3973A9617682m6481J15591k91560o87756p43819j003431r49716p67776o03005
3964A4639729p62306o4730J64534o86893l07135l93696K18166L66437j91038L82196
3954A3365264J79265O97614K22991P09531j62339r6298m31560q56743n12621m12312
3944A2702792l59674J4684P6094k26546k39447l22834o58837L6000M96760j63658
3934A1355334M22119o0419J57810K22056O746K35239k48487k02544k74467K60906
3924A1874293k71538J31459J52501l5884N93232J84107O00151K51764L60451M68556
$$ plain form
3914 14309092 15024751 15704164 16288234 16733989 16940181 17761937 17845859 18010853 18887146 18962772
3904 18962772 18414418 18239465 18053445 17778648 17400661 17150609 16938842 16944698 16608356 16377459
3894 16377459 16987570 17369167 17570291 18108488 18482083 18709298 19226734 19944249 20166691
3885 20166691 20320339 20727680 21010700 21386229 21412077 21830466 22725505 23508628 23595011 24014462
3875 24014462 24197345 24847079 25342084 26282079 27372869 29217913 30225569 31367747 32934934
3866 32934934 34423291 35765434 37166758 38570533 40316400 42347660 44893672 46824996
3858 46824996 49486150 52496976 56486980 60901134 65797458 71807820 78372135 86659564
3850 86659564 96173418 107865332 120457901 135357454 153351558 174257893 197323970
$$ packed form
3914A4309092P15659O79413N84070M45755K06192Q21756Q3922J64994Q76293P5626
3904A8962772n48354j74953j86020k74797l77987k50052k11767N856l36342k30897
3894A6377459O10111L81597K01124N38197L73595K27215N17436P17515K22442
3885B0166691J53648M07341K83020L75529K5848M18389Q95039P83123Q6383M19451
3875B4014462J82883O49734M95005R39995J090790J845044J007656J142178J567187
3866C2934934J488357J342143J401324J403775J745867K031260K546012J931324
3858D6824996K661154L010826L990004M414154M896324O010362O564315Q287429
3850H6659564R513854J1691914J2592569J4899553J7994104K0906335K3066077
$$ plain form
3843 197323970 220863929 241603728 255344425 258340941 246215641 220131544 189157410
3836 189157410 160647212 138197183 121795747 109835570 100215671 92385008 86119696
3829 86119696 80910095 77121929 73438347 70549974 67587548 65020477 63392947 61741103
3821 61741103 60397434 59505826 58935382 58660353 57781167 57470981 57216892 56289809 55663583
3812 55663583 55310177 54487241 53142839 52950186 52465979 52156675 52326912 52743200 52141457
3803 52141457 51712841 52256814 51785999 50863068 49953732 48903169 47564381 46210725 45138429
3794 45138429 44456402 44230211 43737435 43326651 42924683 42528663 41426408 40700598 39387555
3785 39387555 37916112 36142400 34701741 33597106 32537249 31726022 30881892 29952011 29155723
$$ packed form
3843A97323970K3539959K0739799J3740697K996516j2125300k6084097l0974134
3836A89157410k8510198k2450029j6401436j1960177r619899p830663o265312
3829H6119696n209601l788166l683582k888373k962426k567071j627530j651844
3821F1741103j343669q91608n70444k75029q79186l10186k54089r27083o26226
3812E5663583l53406q22936j344402j92653m84207l09304J70237M16288o01743
3803E2141457m28616N43973m70815r22931r09336j050563j338788j353656j072296
3794D5138429o82027k26191m92776m10784m01968l96020j102255p25810j313043
3785C9387555j471443j773712j440659j104635j059857q11227q44130r29881p96288
$$ plain form
3776 29155723 27921231 26998868 26185068 25066032 23910965 23152218 22466716 21665054 21263747
3767 21263747 20837090 19898684 19258151 18493971 18646366 17620971 17307525 16538439 15488836
3758 15488836 15674036 15078749 15168889 14375433 14239269 13943175 13360995 13225099 12704176 12557553
3748 12557553 12437942 12770755 11841916 11556505 11769588 11317539 11282363 11265821 11608010 11068056
3738 11068056 10707302 10446916 10437691 10329534 9588608 8901919 8941216 9263481 9061072 9031115
3728 9031115 8553826 8179989 8476544 8676781 8972017 8859922 8552161 8308489 8247646 8200647
3718 8200647 8292763 8196868 8062071 7706723 7894717 8358998 8744496 8794988 8732778 8499355
3708 8499355 8795944 9019447 8807119 8946094 9192397 9184856 9357952 9106604 9268509 9360330
$$ packed form
3776B9155723j234492r22363q13800j119036j155067p58747o85502q01662m01307
3767B1263747m26657r38406o40533p64180J52395j025395l13446p69086j049603
3758A5488836J85200n95287R0140p93456j36164k96094n82180j35896n20923j46623
3748A2557553j19611L32813r28839k85411K13083m52049l5176j6542L42189n39954
3738A1068056l60754k60386r225j08157p40926o86689L9297L22265k02409k9957
3728I031115m77289l73837K96555K00237K95236j12095l07761k43672o0843m6999
3718H200647R2116r5895j34797l55348J87994M64281L85498N0492o2210k33423
3708H499355K96589K23503k12328J38975K46303p541J73096k51348J61905R1821
$$ plain form
3698 9360330 9095879 8695204 8603652 8578759 8393834 8145347 8052468 7918816 7667051 7806032
3688 7806032 8023437 8009306 8689362 8398120 7945430 7838305 8207896 8000603 7849142 8288519
3678 8288519 8471060 8245549 8442307 8906379 8815840 9044307 9762314 9796262 9851376 9884015
3668 9884015 9861960 9847426 9656515 9990059 9606701 9371008 9611510 10348869 10429381 10152570
3658 10152570 9638698 9077963 9383091 9795303 9446731 9222842 9307142 9116127 9450826 9862919
3648 9862919 10025120 10137266 10076257 9957848 10023804 10064909 10049524 9897556 9515455 9792974
3638 9792974 9867376 9947111 9697192 10323690 9884358 9808560 10227593 10286784 11063721 10930317
3628 10930317 11188426 11300153 10885291 11219506 10980247 10902161 11277331 11032403 10895400 11033598
$$ packed form
3698I360330k64451m00675r1552k4893j84925k48487r2879j33652k51765J38981
3688G806032K17405j4131O80056k91242m52690j07125L69591k07293j51461M39377
3678H288519J82541k25511J96758M64072r0539K28467P18007L3948N5114L2639
3668I884015k2055j4534j90911L33544l83358k35693K40502P37359Q0512k76811
3658A0152570n13872n60735L05128M12212l48572k23889Q4300j91015L34699M12093
3648I862919J62201J12146o1009j18409O5956M1105j5385j51968l82101K77519
3638I792974P4402P9735k49919O26498m39332p5798M19033N9191P76937j33404
3628A0930317K58109J11727m14862L34215k39259p8086L75170k44928j37003J38198
$$ plain form
3618 11033598 11213530 11382663 11589610 11548281 11488856 11518990 11593604 12025408 12197300 12354717
3608 12354717 12489215 12396635 12816348 13416644 13635426 13261878 13249557 13370013 13450872 13172846
3598 13172846 13093157 13581026 13999011 14708353 14419570 14455639 14408746 14459766 14864194 15341702
3588 15341702 15818719 16271772 16356363 17122583 17722702 18049410 18353871 18915973 19394141 19347430
3578 19347430 19826724 20529426 21392284 21460101 21844262 22766177 23576458 23794488 24110360 25241540
3568 25241540 26687511 28019362 29377883 30543289 32052534 33386579 34947593 36096247
3560 36096247 37440550 38771241 39935410 41725530 42847791 44283961 46260561 47896117
3552 47896117 50117367 52386100 54771992 56809042 58250715 60415845 62162380 63765367
$$ packed form
3618A1033598J79932J69133K06947m1329n9425L0134P4614M31804J71892J57417
3608A2354717J34498r2580M19713O00296K18782l73548j2321J20456Q0859k78026
3598A3172846p9689M87869M17985P09342k88783L6069m6893N1020M04428M77508
3588A5341702M77017M53053Q4591P66220O00119L26708L04461N62102M78168m6711
3578A9347430M79294P02702Q62858O7817L84161R21915Q10281K18030L15872J131180
3568B5241540J445971J331851J358521J165406J509245J334045J561014J148654
3560C6096247J344303J330691J164169J790120J122261J436170J976600J635556
3552D7896117K221250K268733K385892K037050J441673K165130J746535J602987
$$ plain form
3544 63765367 65372118 66728715 68497094 70510820 72364196 74971154 77232186 79735586
3536 79735586 81621128 83664289 85009494 85871137 85577423 84768363 84207286 83208537 82445188
3527 82445188 81354239 80257174 79306727 77560538 76310404 75121252 73613539 72163968
3519 72163968 70264518 68547598 66259822 62874560 59541742 57313872 54230191 51252995
3511 51252995 48829309 46217678 43829187 41537908 39802599 38236828 36459272 35234362
3503 35234362 34050595 32715459 31558279 30514219 29279904 28643280 27881993 27700179 26905077
3494 26905077 26568842 25721238 25265309 24997649 24786977 24416247 24202022 23580325 23089925
3485 23089925 23050515 22707937 22506429 22176335 21550040 21463228 21470295 21106670 20697482 21064359
$$ packed form
3544F3765367J606751J356597J768379K013726J853376K606958K261032K503400
3536G9735586J885542K043161J345205Q61643k93714q09060n61077r98749p63349
3527H2445188j090949j097065r50447j746189j250134j189152j507713j449571
3519G2163968j899450j716920k287776l385262l332818k227870l083681k977196
3511E1252995k423686k611631k388491k291279j735309j565771j777556j224910
3503C5234362j183767j335136j157180j044060j234315o36624p61287j81814p95102
3494B6905077l36235q47604m55929k67660k10672l70730k14225o21697m90400
3485B3089925l9410l42578k01508l30094o26295q6812P067l63625m09188L66877
$$ plain form
3475 21064359 20494190 20166208 20442934 20551331 20523397 20458832 20526364 20323186 20486372 20168060
3465 20168060 19938487 19597787 20096411 20177656 20159327 20218049 19985497 20200425 20402554 20577884
3455 20577884 20970729 21021141 20607151 21129377 21648317 21322564 21678506 22241216 22747990 22896125
3445 22896125 23163518 23130335 23192860 23535525 23599961 23414990 23811099 24320735 24558340 25034693
3435 25034693 25606630 25764505 26499606 27139154 27216577 27688499 27922391 29034004 30107769
3426 30107769 30403444 31639993 32607036 33488700 35005326 36422433 37762933 39261498 40864677
3417 40864677 42791543 44324851 46264364 48382448 50792275 53307774 55921977 58713722
3409 58713722 61766684 64638330 66632769 68879076 70743514 71975426 72145615 71788864
$$ packed form
3475B1064359n70169l27982K76726J08397k7934o4565O7532k03178J63186l18312
3465B0168060k29573l40700M98624Q1245j8329N8722k32552K14928K02129J75330
3455B0577884L92845N0412m13990N22226N18940l25753L55942N62710N06774J48135
3445B2896125K67393l3183O2525L42665O4436j84971L96109N09636K37605M76353
3435B5034693N71937J57875P35101O39548P7423M71922K33892J111613J073765
3426C0107769K95675J236549R67043Q81664J516626J417107J340500J498565J603179
3417D0864677J926866J533308J939513K118084K409827K515499K614203K791745
3409E8713722L052962K871646J994439K246307J864438J231912J70189l56751
$$ plain form
3401 71788864 70910393 70543072 70230396 70283651 70468604 71228860 72407903 73805090 75430085
3392 75430085 77146872 79289263 82047743 85752394 88055886 90681193 92974396 95262917
3384 95262917 97191743 98898925 100520963 101587671 102883008 105091277 107408186 109462879
3376 109462879 111276503 113788266 116581466 119061870 122135698 124765176 126681149 128465880
3368 128465880 129521648 129749429 129085144 128299859 127155304 125813813 124035673 121677088
3360 121677088 118758457 115971579 113459709 110424177 106585057 102530611 99110756 95172008
3352 95172008 90359208 86025594 81624399 77785240 74052314 69486535 65661417 62077852
3344 62077852 58797429 56021125 53021166 50417829 48448391 45792026 44383520 42489827
$$ packed form
3401G1788864q78471l67321l12676N3255J84953P60256J179043J397187J624995
3392G5430085J716787K142391K758480L704651K303492K625307K293203K288521
3384I5262917J928826J707182J622038J066708J295337K208269K316909K054693
3376A09462879J813624K511763K793200K480404L073828K629478J915973J784731
3368A28465880J055768K27781o64285p85285j144555j341491j778140k358585
3360A21677088k918631k786878k511870l035532l839120m054446l419855l938748
3352I5172008m812800m333614m401195l839159l732926m565779l825118l583565
3344F2077852l280423k776304k999959k603337j969438k656365j408506j893693
$$ plain form
3336 42489827 40238481 38554454 37035973 36351257 35855767 34420966 33152991 32212586 31127222
3327 31127222 30216622 29596356 28784355 28625083 28424057 28482768 27759289 26919097 26555896 26455353
3317 26455353 26481101 26402775 26205113 25945565 26401780 26031159 25218852 25190607 25054794 24729323
3307 24729323 24500761 23785795 23723697 23077313 22728933 21796524 21228645 20735120 20382109 20222045
3297 20222045 19385706 19362661 18517479 17941950 17531594 17350441 16625335 16140863 15695039 15171532
3287 15171532 15218444 14876147 14945042 14859303 14389814 14109626 13525345 13336815 13256822 13130499
3277 13130499 12953554 12818743 12953664 12913556 12596332 12280616 12195660 12214909 11992333 12110146
3267 12110146 12065196 11262642 11810899 11940975 11549604 11969010 12072776 12406731 12387492 12335443
$$ packed form
3336D2489827k251346j684027j518481o84716m95490j434801j267975r40405j085364
3327C1127222r10600o20266q12001j59272k01026N8711p23479q40192l63201j00543
3317B6455353K5748p8326j97662k59548M56215l70621q12307k8245j35813l25471
3307B4729323k28562p14966o2098o46384l48380r32409n67879m93525l53011j60064
3297B0222045q36339k3045q45182n75529m10356j81153p25106m84472m45824n23507
3287A5171532M6912l42297O8895q5739m69489k80188n84281j88530p9993j26323
3277A3130499j76945j34811J34921m0108l17224l15716q4956J9249k22576J17813
3267A2110146m4950q02554N48257J30076l91371M19406J03766L33955j9239n2049
$$ plain form
3257 12335443 11909609 11865061 11838716 11573226 11872940 11924244 12052781 12189074 12494654 11939267
3247 11939267 12546624 12975891 12450686 12380603 12573123 13043597 13040959 13617098 13942889 13306164
3237 13306164 13406268 14053423 14296726 14402519 14777656 15460616 15930202 16140533 16142711 16910256
3227 16910256 17204419 17186666 17212591 17930778 18633271 18808487 18794904 19752268 20576305 21346553
3217 21346553 21989115 21910148 22586516 23188572 24032520 24912322 25735768 26284157 26978453 27376146
3207 27376146 27983747 28537115 28975736 29706044 29571388 29597057 30402621 30506511 30626287 30874089
3197 30874089 30863061 30658798 30865351 31399560 31693272 31753480 32222096 32387947 32857878 33208622
3187 33208622 33495292 34175133 34537550 35157480 35805340 37040359 38155741 38780265 40195810
$$ packed form
3257A2335443m25834m4548k6345k65490K99714N1304J28537J36293L05580n55387
3247A1939267O07357M29267n25205p0083J92520M70474k638N76139L25791o36725
3237A3306164J00104O47155K43303J05793L75137O82960M69586K10331K178P67545
3227A6910256K94163j7753K5925P18187P02493J75216j3583R57364Q24037P70248
3217B1346553O42562p8967O76368O02056Q43948Q79802Q23446N48389O94296L97693
3207B7376146O07601N53368M38621P30308j34656K5669Q05564J03890J19776K47802
3197C0874089j1028k04263K06553N34209K93712O0208M68616J65851M69931L50744
3187C3208622K86670O79841L62417O19930O47860J235019J115382O24524J415545
$$ plain form
3178 40195810 40991528 42386015 43679017 45216485 46836722 48518194 50509221 52819580
3170 52819580 54678924 56457045 58107085 60335600 62461864 65218959 68004291 70868800
3162 70868800 73860212 76356595 79515540 82411120 85663257 88611697 91508151 93599299
3154 93599299 95873125 97337524 98885778 100973969 102964248 103876884 104132138 105157332
3146 105157332 105955308 106599004 107318392 108522828 109944929 110842778 111333257 111747840 113029073
3137 113029073 113592195 113403634 113382765 113051408 112549765 112280585 111361132 110130205 109042510
3128 109042510 108137172 106764751 104667794 103487919 102077897 100317810 98415575 96563869
3120 96563869 94723739 92518886 90018810 87512159 84658914 81112057 77463355 73645934
$$ packed form
3178D0195810P95718J394487J293002J537468J620237J681472J991027K310359
3170E2819580J859344J778121J650040K228515K126264K757095K785332K864509
3162G0868800K991412K496383L158945K895580L252137K948440K896454K091148
3154I3599299K273826J464399J548254K088191J990279R12636K55254J025194
3146A05157332P97976O43696P19388J204436J422101Q97849M90479M14583J281233
3137A13029073N63122j88561k0869l31357n01643k69180r19453j230927j087695
3128A09042510r05338j372421k096957j179875j410022j760087j902235j851706
3120I6563869j840130k204853k500076k506651k853245l546857l648702l817421
$$ plain form
3112 73645934 70539201 66951036 63528334 60179535 57355902 54653214 51829884 49494357
3104 49494357 47756548 46195666 44738141 43357229 42193133 41001182 40502166 40192216
3096 40192216 39666864 39257047 38496358 38445977 38055025 37418345 37133210 37199259 37370961 36753961
3086 36753961 36715107 37294372 36623115 36788058 36881191 37054899 36591136 36157870 36205439 36018577
3076 36018577 36069724 35185410 34640954 34506625 33708918 33579424 33285790 32562199 32122381 31845618
3066 31845618 31489061 31115340 30100467 29054438 28793144 27670993 26846732 26131575 25883711
3057 25883711 25212684 24448622 24074170 24066182 23608421 23655012 22935016 22892610 22500891 22350568
3047 22350568 22322450 21891408 21784022 21820139 21742654 21280796 21826440 21467334 21250145 20917374
$$ packed form
3112G3645934l106733l588165l422702l348799k823633k702688k823330k335527
3104D9494357j737809j560882j457525j380912j164096j191951m99016l09950
3096D0192216n25352m09817p60689n0381l90952o36680k85135O6049J71702o17000
3086C6753961l8854N79265o71257J64943R3133J73708m63763m33266M7569j86862
3076C6018577N1147q84314n44456j34329p97707j29494k93634p23591m39818k76763
3066C1845618l56557l73721j014873j046029k61294j122151q24261p15157k47864
3057B5883711o71027p64062l74452p988m57761M6591p19996m2406l91719j50323
3047B2350568k8118m31042j07386L6117p7485m61858N45644l59106k17189l32771
$$ plain form
3037 20917374 21455792 21527062 21569326 21915545 22085552 22013953 22114889 22707292 23363176 23608269
3027 23608269 23844768 24983308 25928811 26700691 28033878 29717948 31273724 32225226 33525408
3018 33525408 35538665 37155559 38708316 41131872 42986300 44480086 46900110 49580342
3010 49580342 51916174 54705453 57018282 60144150 62945193 65826591 68969850 71684033
3002 71684033 75266384 79066049 83167758 87532830 91982186 96172940 100258787 103836824
2994 103836824 106619219 108590495 109883277 110126460 109269637 107090150 103689320 98947391
2986 98947391 93387638 87679832 81908189 76229099 70109052 64522571 59809872 54954250
2978 54954250 50760086 47205089 43896501 40956315 38293338 36045083 34534325 32578321
$$ packed form
3037B0917374N38418P1270M2264L46219J70007p1599J00936N92403O55884K45093
3027B3608269K36499J138540R45503P71880J333187J684070J555776R51502J300182
3018C3525408K013257J616894J552757K423556J854428J493786K420024K680232
3010D9580342K335832K789279K312829L125868K801043K881398L143259K714183
3002G1684033L582351L799665M101709M365072M449356M190754M085847L578037
2994A03836824K782395J971276J292782K43183q56823k179487l400830m741929
2986I8947391n559753n707806n771643n679090o120047n586481m712699m855622
2978E4954250m194164l554997l308588k940186k662977k248255j510758j956004
$$ plain form
2970 32578321 31061715 29234682 27690670 27239926 26189271 24971577 23974587 23589061 22376108
2961 22376108 21750964 21718973 21102634 20303729 19899218 19261763 17881602 17873992 17543018 16991795
2951 16991795 16490939 16443537 16070165 15334972 15243262 15043228 14816254 14369992 13964225 14010468
2941 14010468 13812046 13483319 12794456 12621826 12297397 12341921 12263037 11704133 11387593 10843321
2931 10843321 10570167 10367262 10662339 10538870 10710056 10058810 10077731 10005617 9833356 9874692
2921 9874692 9565097 9019587 9026819 9106633 8613788 8782368 8702511 8505319 8512701 8804042 8639349
2910 8639349 8536847 8831753 8593785 8510887 7959537 7913678 8209011 7420187 7198481 8295575
2900 8295575 8117314 7905383 7715882 7632465 7827402 7838089 8012408 7682616 7263500 7532960
$$ packed form
2970C2578321j516606j827033j544012m50744j050655j217694r96990l85526j212953
2961B2376108o25144l1991o16339p98905m04511o37455j380161p610l30974n51223
2951A6991795n00856m7402l73372p35193r1710k00034k26974m46262m05767M6243
2941A4010468j98422l28727o88863j72630l24429M4524p8884n58904l16540n44272
2931A0843321k73154k02905K95077j23469J71186o51246J8921p2114j72261M1336
2921I874692l09595n45510P232P9814m92845J68580p9857j97192P382K91341j64693
2910H639349j02502K94906k37968q2898n51350m5859K95333p88824k21706J097094
2900H295575j78261k11931j89501q3417J94937J0687J74319l29792m19116K69460
$$ plain form
2890 7532960 7668801 7347255 7361210 7534947 7384108 6927805 6661420 7181621 7003436 7112911
2880 7112911 7403900 7106468 7114904 6899686 6868343 6941187 7206149 6934745 6993658 6849444
2870 6849444 6885984 7516604 7765441 7250215 7628890 7636330 7114631 7495673 7392340 7236352
2860 7236352 7900701 7919812 7876850 7712965 7775581 7762008 7921287 7993083 8143883 8385816
2850 8385816 8536810 9038912 9117815 8869276 9036747 9131879 9134386 9175116 8962080 9258079
2840 9258079 9479461 9619530 9773962 10028343 10297317 10086579 10188101 10526874 10882764 10900372
2830 10900372 11032976 10873912 11289757 11378637 11498280 12261489 12454875 12657781 12874317 13196516
2820 13196516 13430985 13545408 13757507 14331948 14990859 15457669 15955051 16196523 16984133
$$ packed form
2890G532960J35841l21546J3955J73737j50839m56303k66385N20201j78185J09475
2880G112911K90989k97432Q436k15218l1343P2844K64962k71404N8913j44214
2870F849444L6540O30620K48837n15226L78675P440n21699L81042j03333j55988
2860G236352O64349J9111m2962j63885O2616j3573J59279P1796J50800K41933
2850H385816J50994N02102P8903k48539J67471R5132K507M0730k13036K95999
2840I258079K21382J40069J54432K54381K68974k10738J01522L38773L55890J7608
2830A0900372J32604j59064M15845Q8880J19643P63209J93386K02906K16536L22199
2820A3196516K34469J14423K12099N74441O58911M66810M97382K41472P87610
$$ plain form
2811 16984133 17558814 17842569 18808427 19060508 19408044 20230761 20997202 21119759 21272694
2802 21272694 22244447 23268814 23719992 24359154 24655890 25130012 26687285 27602787 28175848
2793 28175848 28880569 29629418 30027088 31085639 32425275 33414387 34253396 35119209 36338218
2784 36338218 37643086 38718935 40094320 41908474 43904671 45390533 47262762 49658367
2776 49658367 51904988 55363970 58650775 62335526 66515624 70822732 75633295 81277095
2768 81277095 87501776 94050250 101545108 110954218 120980269 132702456 145952847 159676399
2760 159676399 172027392 179701835 183035385 185083070 188510426 196187154 206743450 220392722
2752 220392722 237561117 257919603 281932192 308127140 335725535 359287118 377144757
$$ packed form
2811A6984133N74681K83755R65858K52081L47536Q22717P66441J22557J52935
2802B1272694R71753J024367M51178O39162K96736M74122J557273R15502N73061
2793B8175848P04721P48849L97670J058551J339636R89112Q39009Q65813J219009
2784C6338218J304868J075849J375385J814154J996197J485862J872229K395605
2776D9658367K246621L458982L286805L684751M180098M307108M810563N643800
2768H1277095O224681O548474P494858R409110J0026051J1722187J3250391J3723552
2760A59676399J2350993P674443L333550K047685L427356P676728J0556296J3649272
2752B20392722J7168395K0358486K4012589K6194948K7598395K3561583J7857639
$$ plain form
2745 377144757 389673011 396764006 396654972 385545999 363951520 334004854 300810770
2738 300810770 268278864 238573887 212870070 191576263 174349519 159677109 146536712
2731 146536712 135195384 125031110 116137780 108586061 101931840 95987368 90422319 85545614
2723 85545614 81292572 76830065 73074482 69657346 66391213 62995182 60110002 58176547
2715 58176547 55967084 53521585 51744489 49869456 47681630 45722311 44236163 42709029
2707 42709029 40873555 39724954 38194692 36638386 34851607 33663038 32657148 31629408
2699 31629408 30714644 29845488 28807881 27995389 27382476 26622199 25796447 24844643 24276344
2690 24276344 23954098 23723685 22930801 21946113 21573664 21408883 20910089 20631484 20289327
$$ packed form
2745C77144757J2528254P090995j09034j1108973k1594479k9946666l3194084
2738C00810770l2531906k9704977k5703817k1293807j7226744j4672410j3140397
2731A46536712j1341328j0164274q893330p551719o654221n944472n565049m876705
2723H5545614m253042m462507l755583l417136l266133l396031k885180j933455
2715E8176547k209463k445499j777096j875033k187826j959319j486148j527134
2707D2709029j835474j148601j530262j556306j786779j188569j005890j027740
2699C1629408r14764q69156j037607q12492o12913p60277q25752r51804n68299
2690B4276344l22246k30413p92884r84688l72449j64781m98794k78605l42157
$$ plain form
2681 20289327 19677437 19297403 18796354 18577751 18004473 17843920 17860123 17891024 17632294 17815704
2671 17815704 17031099 16850247 16668384 16179517 15544756 14837915 14723507 15113214 14392525
2662 14392525 13221728 13216242 12492117 11925314 11872330 11479719 11261442 10956674 10204626 9794940
2652 9794940 9596183 9860725 9695040 9289818 9161666 9186009 8758505 8316884 8011731 7779096
2642 7779096 8091909 8296201 7677223 7403497 7550797 7596377 7113969 7329206 7392266 7287762
2632 7287762 7036939 6686347 6788258 6700373 6752187 6438578 6218256 6423263 5873143 6008011
2622 6008011 5936914 6034708 5768754 6035099 6008790 5602600 5693265 5193197 4920561 5095689
2612 5095689 5311812 5216553 5029611 4656034 4530768 4727200 4800810 4378925 4645767 4426039
$$ packed form
2681B0289327o11890l80034n01049k18603n73278j60553J6203L0901k58730J83410
2671A7815704p84605j80852j81863m88867o34761p06841j14408L89707p20689
2662A4392525j170797n486p24125n66803n2984l92611k18277l04768p52048m09686
2652I794940j98757K64542j65685m05222j28152K4343m27504m41621l05153k32635
2642G779096L12813K04292o18978k73726J47300M5580m82408K15237O3060j04504
2632G287762k50823l50592J01911q7885N1814l13609k20322K05007n50120J34868
2622F008011p1097R7794k65954K66345k6309m06190R0665n00068k72636J75128
2612E095689K16123r5259j86942l73577j25266J96432P3610m21885K66842k19728
$$ plain form
2602 4426039 4533709 4928555 4646958 4130538 4257648 4402753 4074031 4200835 4462813 4217935
2592 4217935 4384082 4121054 3554044 3512737 3543206 3782418 3703264 3697562 3778025 3635025 3632313
2581 3632313 3631565 3570315 3475994 3125007 3336220 3390181 3090807 2859870 2311176 2671820 2752869
2570 2752869 2665835 2966552 2952549 2731414 2451468 2404946 2421331 2889144 2958879 2677985
2560 2677985 2679026 2778580 2814205 2529251 2585443 2556637 2431107 2264845 2529715 2464030 2058094
2549 2058094 2391824 2657176 2514273 2621012 2480964 2400691 2011285 1944987 2009351 1882015
2539 1882015 1964426 1957616 1780259 1690841 2279671 2227225 1892108 1823346 870979 1232161 1487857
2528 1487857 1751356 2045096 1776815 1798021 1786085 1939493 1540829 1654711 1882697 2346171
$$ packed form
2602D426039J07670L94846k81597n16420J27110J45105l28722J26804K61978k44878
2592D217935J66147k63028n67010m1307L0469K39212p9154n702Q0463j43000k712
2581C632313p48o1250r4321l50987K11213N3961k99374k30937n48694L60644Q1049
2570B752869q7034L00717j4003k21135k79946m6522J6385M67813O9735k80894
2560B677985J041R9554L5625k84954N6192k8806j25530j66262K64870o5685m05936
2549B058094L33730K65352j42903J06739j40048q0273l89406o6298O4364j27336
2539A882015Q2411o810j77357q9418N88830n2446l35117o8762r52367L61182K55696
2528A487857K63499K93740k68281K1206j1936J53408l98664J13882K27986M63474
$$ plain form
2518 2346171 2604222 1972800 1819890 2353934 2069853 1919293 2379320 2176360 2029163 1825978
2508 1825978 1972053 2412611 2463152 2277435 1896704 2180978 2411581 2201257 1862736 2042703
2498 2042703 1972122 1864201 2465169 3018849 3178020 2935695 2581349 2793079 2824898 3073288
2488 3073288 3238174 2716169 2680569 3102255 2596201 2573961 2300498 2287653 2329481 2504876
2478 2504876 2212154 2153625 2011503 1821124 1729247 1052040 1110799 1215729 1259598 1545592
2468 1545592 1290185 1086952 1273435 1368850 932251 824178 992937 1221328 1118694 1043433
2458 1043433 1168525 1249261 934104 841111 777229 662934 771139 771511 803016 578449 795863
2447 795863 523401 655667 474909 91584 242832 659836 1002097 812039 609756 530329
$$ packed form
2518B346171K58051o31422j52910N34044k84081j50560M60027k02960j47197k03185
2508A825978J46075M40558N0541j85717l80731K84274K30603k10324l38521J79967
2498B042703p0581j07921O00968N53680J59171k42325l54346K11730L1819K48390
2488C073288J64886n22005l5600M21686n06054k2240k73463j2845M1828J75395
2478B504876k92722n8529j42122j90379r1877o77207N8759J04930M3869K85994
2468A545592k55407k03233J86483R5415m36599j08073J68759K28391j02634p5261
2458A043433J25092Q0736l15157r2993o3882j14295J08205L72L1505k24567K17414
2447G95863k72462J32266j80758l83325J51248M17004L42261j90058k02283p9427
$$ plain form
2437 530329 995974 894283 692285 684318 752398 823593 916302 1127295 800580 132518 383679
2426 383679 271894 181087 734808 838779 1047020 846023 354204 328158 308897 435384
2416 435384 677650 434078 475647 440634 752654 748216 645178 -147096 -203351 431382 612113
2405 612113 110349 428715 264849 191912 453676 320997 269922 267222 -324885 -48527
2395 -48527 83036 236397 77897 -10957 638188 599325 -210691 -551375 116378 81446
2385 81446 536174 689927 337847 471785 271056 107072 -122123 393491 -160458 134691
2375 134691 285010 244002 469497 164451 712330 634499 398612 -337150 -357378 379660
2365 379660 554176 220946 372134 279572 72413 458575 367896 773758 377471 79173
$$ packed form
2437E30329M65645j01691k01998p967O8080P1195R2709K10993l26715o68062K51161
2426C83679j11785r0807N53721J03971K08241k00997m91819k6046j9261J26487
2416D35384K42266k43572M1569l5013L12020m438j03038p92274n6255O34733J80731
2405F12113n01764L18366j63866p2937K61764j32679n1075k700n92107K76358
2395d8527J31563J53361j58500q8854O49145l8863q10016l40684O67753l4932
2385H1446M54728J53753l52080J33938k00729j63984k29195N15614n53949K95149
2375A34691J50319m1008K25495l05046N47879p7831k35887p35762k0228P37038
2365C79660J74516l33230J51188r2562k07159L86162r0679M05862l96287k98298
$$ plain form
2355 79173 31976 136041 156385 -2424 243228 156722 466994 737199 100187 184210 538915
2344 538915 106321 307133 233898 920820 958841 399417 13418 449164 486987 526574
2334 526574 351097 173598 548321 925437 1103481 862166 631533 722634 504145 52246
2324 52246 253093 -36318 -97 436921 547242 1020510 708489 323697 261986 211782
2314 211782 627225 932941 720977 1257072 1234063 1184372 1515381 1656950 1856942 1852123
2304 1852123 2160474 1873819 1532269 1470179 1170533 1168058 890543 1008264 654215 411770
2294 411770 490077 647711 574842 587113 560447 278446 330757 378744 203282 498032 437790
2283 437790 715502 733848 631049 573573 772103 560041 893634 932507 529586 932013
$$ packed form
2355G9173m7197J04065K0344j58809K45652q6506L10272K70205o37012Q4023L54705
2344E38915m32594K00812p3235O86922L8021n59424l85999M35746L7823L9587
2334E26574j75477j77499L74723L77116J78044k41315k30633R1101k18489m51899
2324E2246K00847k89411L6221M37018J10321M73268l12021l84792o1711n0204
2314B11782M15443L05716k11964N36095k3009m9691L31009J41569J99992m819
2304A852123L08351k86655l41550o2090k99646k475k77515J17721l54049k42445
2294D11770P8307J57634p2869J2271k6666k82001N2311M7987j75462K94750o0242
2283D37790K77712J8346j02799n7476J98530k12062L33593L8873m02921M02427
$$ plain form
2273 932013 667153 275678 144929 563761 481693 368261 54218 744933 614755 493966
2263 493966 65372 -174093 -223413 -119144 123092 741568 1010722 1108003 1001643 319042
2253 319042 436649 372354 -4695 -79972 482394 678301 331184 65011 374411 475935
2243 475935 541458 355569 89003 -23347 -63203 40419 380882 226491 367604 591606
2233 591606 791707 728138 655167 609102 451335 405983 459846 633303 681292 247482 268117
2222 268117 207384 634553 842195 1009321 964344 883503 1051450 1179616 751903 541153
2212 541153 598734 323305 354772 336153 661676 316500 187680 904239 897735 1010253 858004
2201 858004 648955 1068862 980218 904662 906367 850311 657144 1224951 839763 623972 879948
$$ packed form
2273I32013k64860l91475j30749M18832q2068j13432l14043O90715j30178j20789
2263D93966m28594k39465m9320J04269K42236O18476K69154R7281j06360o82601
2253C19042J17607o4295l77049p5277N62366J95907l47117k66173L09400J01524
2243D75935O5523j85889k66566j12350l9856J03622L40463j54391J41113K24002
2233E91606K00101o3569p2971m6065j57767m5352N3863J73457M7989m33810K0635
2222B68117o0733M27169K07642J67126m4977q0841J67947J28166m27713k10750
2212E41153N7581k75429L1467j8619L25523l45176j28820P16559o504J12518j52249
2201H58004k09049M19907q8644p5556J705n6056j93167N67807l85188k15791K55976
$$ plain form
2190 879948 938519 1004926 1276832 1015510 1542939 1424985 1387708 1091438 1263745 1440164
2180 1440164 1331515 1041477 1418558 1603451 1987621 2090574 1857963 1736412 1928191 1616653
2170 1616653 1571825 1750249 1998467 2434020 2269724 2188596 2468267 2626295 2429368 2598888
2160 2598888 2966131 2881494 2576993 2521730 2595300 2391109 2475542 2494298 2924181 2950174 2780109
2149 2780109 2829174 3115734 3269721 3329396 3748088 3853306 3889307 4454783 3878297 3872081
2139 3872081 4431423 4447165 4429314 4322699 5105220 5126788 5318735 5229399 5393063 6064956
2129 6064956 6465279 6008410 6247370 6274891 6557909 6742036 7004936 7214775 7425666 7723884
2119 7723884 7383268 8130612 8248136 8313918 8768467 8911830 9365278 9685982 10247104 9795145
$$ packed form
2190H79948N8571O6407K71906k61322N27429j17954l7277k96270J72307J76419
2180A440164j08649k90038L77081J84893L84170J02953k32611j21551J91779l11538
2170A616653m4828J78424K48218M35553j64296q1128K79671J58028j96927J69520
2160B598888L67243q4637l04501n5263P3570k04191Q4433J8756M29883K5993j70065
2149B780109M9065K86560J53987N9675M18692J05218L6001N65476n76486o216
2139C872081N59342J5742j7851j06615P82521K1568J91947q9336J63664O71893
2129F064956M00323m56869K38960K7521K83018J84127K62900K09839K10891K98218
2119G723884l40616P47344J17524O5782M54549J43363M53448L20704N61122m51959
$$ plain form
2109 9795145 9981531 10475307 10742822 11054327 11582724 11540650 11687116 12071358 12571930 12858068
2099 12858068 13406234 13762978 14449437 15768461 16647606 17297502 18361085 19178340 20486075
2090 20486075 21446144 22682389 24128373 25707335 27211707 29316117 31380752 34377102
2082 34377102 37364606 40640605 44451521 50078915 55416347 60184004 65724512 73313649
2074 73313649 81893284 93065881 104872920 120055658 138421079 162470016 190769412
2067 190769412 226634458 273597932 332549772 335050972 278075642 226845914 176754695
2060 176754695 139672922 114665374 98297983 85483420 75789022 68190719 63341298
2053 63341298 58699585 55645218 52619409 48848488 44945483 41514034 38016816 34342034
$$ packed form
2109I795145J86386M93776K67515L11505N28397m2074J46466L84242N00572K86138
2099A2858068N48166L56744O86459J319024Q79145O49896J063583Q17255J307735
2090B0486075R60069J236245J445984J578962J504372K104410K064635K996350
2082C4377102K987504L275999L810916N627394N337432M767657N540508P589137
2074G3313649Q579635J1172597J1807039J5182738J8365421K4048937K8299396
2067A90769412L5865046M6963474N8951840K501200n6975330n1229728n0091219
2060A76754695l7081773k5007548j6367391j2814563r694398p598303m849421
2053F3341298m641713l054367l025809l770921l903005l431449l497218l674782
$$ plain form
2045 34342034 32360855 30532573 28322004 26586065 24625616 23442658 22628853 21856273
2037 21856273 20821639 20229407 19618907 18980365 17743902 17149640 16311082 15501061 15029438
2028 15029438 14765853 13812015 12745221 12037309 11649670 11050542 10568212 9971741 9622353
2019 9622353 9699952 9526018 8999120 8349229 8124285 8030896 7951020 7779258 7677888 7518781
2009 7518781 7514665 6898971 7204095 6815290 6533226 6443648 6538743 5958906 5434227 5290884
1999 5290884 5213441 5614838 5439166 5384957 5375199 4989486 4613389 4856389 4667301 4460727
1989 4460727 4450426 3951624 4116795 3845381 3678451 3657258 3365865 3201078 2987567 3176322
1979 3176322 2837300 2854053 3026242 2671394 2315489 2229152 2325814 2314933 2401401 2264056
$$ packed form
2045C4342034j981179j828282k210569j735939j960449j182958q13805p72580
2037B1856273j034634n92232o10500o38542j236463n94262q38558q10021m71623
2028A5029438k63585r53838j066794p07912l87639n99128m82330n96471l49388
2019I622353P7599j73934n26898o49891k24944r3389p9876j71762j01370j59107
2009G518781m116o15694L05124l88805k82064q9578R5095n79837n24679j43343
1999E290884p7443M01397j75672n4209r758l85713l76097K43000j89088k06574
1989D460727j0301m98802J65171k71414j66930k1193k91393j64787k13511J88755
1979C176322l39022J6753J72189l54848l55905q6337R6662j0881Q6468j37345
$$ plain form
1969 2264056 2499863 2308643 1808596 1955089 1437645 1541400 1885222 1404508 1533118 1749240
1959 1749240 2099019 2094300 2419848 2280763 1918896 1444109 1600458 1875414 1910442 989358
1949 989358 1289662 1323748 1178844 1253534 1677380 1871619 1269517 1612758 1693260 1502765
1939 1502765 1420790 983594 635445 1085886 1502059 1232521 1303761 1439308 1252853 1122354
1929 1122354 1427013 1485641 1302244 1277089 1714713 1691411 1179144 1529321 1314243 1336585
1919 1336585 817732 802586 1442849 1450381 1348231 1218609 1059491 975612 993762 1088765 1033190
1908 1033190 940008 802938 388218 900077 652920 670510 813228 458484 301397 948181
1898 948181 994274 597852 516091 248923 319554 430309 538260 323855 836651 651619
$$ packed form
1969B264056K35807j91220n00047J46493n17444J03755L43822m80714J28610K16122
1959A749240L49779m719L25548j39085l61867m74787J56349K74956L5028r21084
1949I89358L00304L4086j44904P4690M23846J94239o02102L43241Q0502j90495
1939A502765q1975m37196l48149M50441M16173k69538P1240J35547j86455j30499
1929A122354L04659N8628j83397k5155M37624k3302n12267L50177k15078K2342
1919A336585n18853j5146O40263P532j02150j29622j59118q3879J8150R5003n5575
1908A033190r3182j37070m14720N11859k47157J7590J42718l54744j57087O46784
1898I48181M6093l96422q1761k67168P0631J10755J07951k14405N12796j85032
$$ plain form
1888 651619 297787 134065 539631 551277 717986 527564 244630 366897 253291 148071
1878 148071 170793 509743 817883 519213 -30540 238732 632230 259071 127505 137954
1868 137954 278831 279486 420165 846441 635687 299165 30563 360604 529686 583245
1858 583245 664072 813142 114724 575957 446480 184020 473147 765794 747818 292073
1848 292073 509379 846601 680048 782239 614706 624650 478741 233746 360036 140673
1838 140673 631711 269551 283973 309861 379488 211563 119652 303885 616901 819328
1828 819328 1047409 1059815 1807593 1863352 1690444 1305879 1571314 1508040 1060644 1332951
1818 1332951 1518888 990242 990434 899216 945966 877225 817246 412833 226552 937005 844385
$$ packed form
1888F51619l53832j63722M05566J1646J66709j90422k82934J22267j13606j05220
1878A48071K2722L38950L08140k98670n49753K69272L93498l73159j31566J0449
1868A37954J40877O55J40679M26276k10754l36522k68602L30041J69082N3559
1858E83245Q0827J49070o98418M61233j29477k62460K89127K92647j7976m55745
1848B92073K17306L37222j66553J02191j67533R944j45909k44995J26290k19363
1838A40673M91038l62160J4422K5888O9627j67925r1911J84233L13016K02427
1828H19328K28081J2406P47778N5759j72908l84565K65435o3274m47396K72307
1818A332951J85937n28646J92r1218M6750o8741n9979m04413j86281P10453r2620
$$ plain form
1807 844385 479216 634960 399064 298038 351763 723077 529986 464717 489820 475793
1797 475793 -240159 -21164 833808 380666 59005 -143203 -48496 6835 162107 -144014
1787 -144014 -16109 -293092 568481 385828 370327 165993 165512 -498315 -522344 77359 263403
1776 263403 -195587 278629 231094 230792 500393 316153 239820 -212378 -449268 -209879 -571899
1765 -571899 -761031 -720419 -414430 9750 -247633 -407812 385653 257802 -397181 -265935
1755 -265935 -210673 -375876 -339511 -102460 80439 6423 -6217 541703 493202 249661 327596
1744 327596 143117 101707 264219 -275864 -99164 163862 535348 180513 117588 -146274
1734 -146274 -328794 4189 -107332 -106560 -36445 -436299 -250195 -118622 181986 232902 289217
$$ packed form
1807H44385l65169J55744k35896j01026N3725L71314j93091o5269K5103j4027
1797D75793p15952K18995Q54972m53142l21661k02208R4707N5331J55272l06121
1787a44014J27905k76983Q61573j82653j5501k04334m81o63827k4029N99703J86044
1776B63403m58990M74216m7535l02K69601j84240p6333m52198k36890K39389l62020
1765e71899j89132M0612L05989M24180k57383j60179P93465j27851o54983J31246
1755b65935N5262j65203L6365K37051J82899p4016j2640N47920m8501k43541P7935
1744C27596j84479m1410J62512n40083J76700K63026L71486l54835o2925k63862
1734a46274j82520L32983j11521P72P0115l99854J86104J31573L00608N0916N6315
$$ plain form
1723 289217 554196 590519 396126 700211 227463 -146148 -230514 -220370 298954 23892
1713 23892 81266 13127 -128017 -118845 -330737 119991 -130220 -243995 41371 -100630 9958
1702 9958 -51526 321866 -176933 -598870 -689495 -417348 -101774 -66051 378536 328660 -41916
1691 -41916 -30417 -117768 65995 28279 -543885 -90990 100151 1338 47595 -397842 -111582
1680 -111582 -173205 -120054 -265297 -267653 -580329 -698053 11570 2911 168489 -163126 -447344
1669 -447344 -304685 -73215 -27817 -249450 39141 340590 -270341 139559 -78169 487226
1659 487226 842963 316825 330551 160663 -64735 83933 545210 715515 505110 595089
1649 595089 598130 578592 368935 -178726 -288235 -250431 -536841 -63080 -425154 25767
$$ packed form
1723B89217K64979L6323j94393L04085m72748l73611q4366J0144N19324k75062
1713B3892N7374o8139j41144R172k11892M50728k50211j13775K85366j42001J10588
1702I958o1484L73392m98799m21937r0625K72147L15574L5723M44587m9876l70576
1691d1916J1499q7351J83763l7716n72164M52895J91141r8813M6257m45437K86260
1680a11582o1623N3151j45243k356l12676j17724P09623q659J65578l31615k84218
1669d47344J42659K31470M5398k21633K88591L01449o10931M09900k17728N65395
1659D87226L55737n26138J3726j69888k25398J48668M61277J70305k10405Q9979
1649E95089L041j9538k09657n47661j09509L7804k86410M73761l62074M50921
$$ plain form
1639 25767 232146 -120162 -248002 -373253 -515109 -407132 -226947 -298338 -132467 -359052
1629 -359052 -532297 -564030 -161479 -130836 207944 41400 -108834 -255460 45982 -365568
1619 -365568 -394088 -54165 386328 265225 -123053 -250294 -123301 -158226 -44728 -55076
1609 -55076 51162 -99305 165588 -80837 122917 196788 441342 450728 53417 100284 -61430
1598 -61430 -361534 -691863 -236356 -389302 -447789 -168374 -51174 20103 78290 109045 501984
1587 501984 730366 441278 -163387 144671 38997 -270578 -338426 -492937 -339757 -36399
1577 -36399 259214 -106178 20409 -22369 5446 244340 -319080 -535796 -809509 -216634
1567 -216634 -133799 -154135 26228 -272989 -12488 -459691 -572154 -756177 -334709 -540360
$$ packed form
1639B5767K06379l52308j27840j25251j41856J07977J80185p1391J65871k26585
1629c59052j73245l1733M02551L0643L38780j66544j50234j46626L01442m11550
1619c65568k8520L39923M40493j21103l88278j27241J26993l4925J13498j0348
1609e5076J06238j50467K64893k46425K03754P3871K44554R386l97311M6867j61714
1598f1430l00104l30329M55507j52946n8487K79415J17200P1277N8187L0755L92939
1587E01984K28382k89088o04665L08058j05674l09575o7848j54511J53180L03358
1577c6399K95613l65392J26587m2778K7815K38894n63420k16716k73713N92875
1567b16634Q2835k0336J80363k99217K60501m47203j12463j84023M21468k05651
$$ plain form
1557 -540360 -449221 -171502 -662834 -762595 -754627 -737062 -634762 -231674 -332268 -197006 -269598
1546 -269598 -612764 225271 273021 159991 61261 -241510 -177291 164103 287625 1822
1536 1822 -196221 -235126 -373867 175069 -216361 -155500 -12572 273509 85365 -37626
1526 -37626 -205323 -298916 -302671 -60700 -81384 187919 156100 -649499 -91294 -227306 -2711
1515 -2711 82998 -365438 -864305 -407077 -507796 -46441 -18681 83500 -103723 101733
1505 101733 234770 -140660 -348220 2454 -247840 -123086 -216235 67091 -64079 137840
1495 137840 -450850 -60447 271835 90404 -228623 18975 -181572 -134463 27500 156837
1485 156837 333960 313585 -21504 17625 88397 -179957 -508465 -270855 45847 14765
$$ packed form
1557e40360R1139K77719m91332r9761P968J7565J02300M03088j00594J35262p2592
1546b69598l43166Q38035M7750j13030r8730l02771O4219L41394J23522k85803
1536A822j98043l8905j38741N48936l91430O0861J42928K86081j88144j22991
1526c7626j67697r3593l755K41971k0684K69303l1819q05599N58205j36012K24595
1515b711Q5709m48436m98867M57228j00719M61355K7760J02181j87223K05456
1505A01733J33037l75430k07560L50674k50294J24754r3149K83326j31170K01919
1495A37840n88690L90403L32282j81431l19027K47598k00547M7109J61963J29337
1485A56837J77123k0375l35089L9129P0772k68354l28508K37610L16702l1082
$$ plain form
1475 14765 -61901 60764 446557 -43918 550640 588528 610820 714998 366789 245991
1465 245991 23435 -385964 -95639 -305681 -243142 -360262 -203961 -389698 -77264 -4317
1455 -4317 8520 -158128 119846 395726 142850 120826 -309174 -715496 -122132 131369
1445 131369 -108248 -16701 -27808 -58012 294870 -153542 -949711 -544435 -388927 -420446
1435 -420446 -46462 458905 374441 193955 -73093 -165405 -38781 -384243 -232105 77124
1425 77124 346474 461660 140650 -155613 -27142 -202990 33539 -402492 -378490 -460855
1415 -460855 -7725 313661 357591 -151395 -161922 -53104 254594 97679 74383 141449
1405 141449 -134269 -121457 179691 171325 56910 -138058 -247879 -462921 -142862 246759
$$ packed form
1475A4765p6666J22665L85793m90475N94558L7888K2292J04178l48209j20798
1465B45991k22556m09399K90325k10042O2539j17120J56301j85737L12434P2947
1455d317J2837j66648K77974K75880k52876k2024m30000m06322N93364K53501
1445A31369k39617R1547j1107l0204L52882m48412p96169M05276J55508l1519
1435d20446L73984N05367q4464j80486k67048r2312J26624l45462J52138L09229
1425G7124K69350J15186l21010k96263J28471j75848K36529m36031K4002q2365
1415d60855M53130L21386M3930n08986j0527J08818L07698j56915k3296O7066
1405A41449k75718J2812L01148q366j14415j94968j09821k15042L20059L89621
$$ plain form
1395 246759 11132 -64828 -140260 115566 -331431 -758622 -728792 -521598 -478768 -23198
1385 -23198 227253 -73382 -30718 14346 60709 -226288 -43294 -170570 127275 6539
1375 6539 -622712 -872140 -791617 -191283 -594347 -965361 -639819 -116955 -469333 -1460
1365 -1460 281169 265707 52323 117050 115607 -154786 -369589 -94726 -519381 -556302 -429445
1354 -429445 -430233 -612367 -757609 -235500 -249540 -531130 -489664 -416127 -347266 -265200 102597
1343 102597 -94415 -120879 -324137 -681843 -276992 91762 203472 -136492 -105109 -390371
1333 -390371 -458325 -92182 -181041 11770 -81139 34867 317215 169815 -76952 -80577 -58633
1322 -58633 -281449 -386908 235117 78782 55658 -222901 -97132 -486722 -424110 -277378
$$ packed form
1395B46759k35627p5960p5432K55826m46997m27191K9830K07194M2830M55570
1385b3198K50451l00635M2664M5064M6363k86997J82994j27276K97845j20736
1375F539o29251k49428Q0523O00334m03064l71014L25542N22864l52378M67873
1365a460K82629j5462k13384O4727j443k70393k14803K74863m24655l6921J26857
1354d29445p88j82134j45242N22109j4040k81590M1466P3537O8861Q2066L67797
1343A02597j97012k6464k03258l57706M04851L68754J11710l39964L1383k85262
1333c90371o7954L66143q8859J92811r2909J16006K82348j47400k46767l625K1944
1322e8633k22816j05459O22025j56335k3124k78559J25769l89590O2612J46732
$$ plain form
1312 -277378 -141185 19804 186562 -21642 155600 565592 76948 -290719 59288 -146207
1302 -146207 -165441 169531 32703 -34421 -270135 204309 3057 -8976 -86788 -91913 -358972
1291 -358972 -464316 -305726 -415840 127462 456110 481672 142159 162440 212564 -92271
1281 -92271 -144347 -444804 -207431 279198 34501 -434921 -468433 -298752 -292660 -306066 -41936
1270 -41936 -173517 69221 38945 -9662 -453343 -161842 -212098 -37972 -191504 -334805
1260 -334805 -164003 43834 20143 -53627 20148 222564 101434 -121759 -108675 85326
1250 85326 -217286 -151743 -17260 -295510 -404538 209632 419950 226867 -109461 -127201
1240 -127201 260583 36907 43922 -431984 -181218 -164366 -231623 -229665 289138 601841 259269
$$ packed form
1312b77378J36193J60989J66758k08204J77242M09992m88644l67667L50007k05495
1302a46207j9234L34972j36828o7124k35714M74444k01252j2033p7812n125k67059
1291c58972j05344J58590j10114N43302L28648K5562l39513K0281N0124l04835
1281i2271n2076l00457K37373M86629k44697m69422l3512J69681O092j3406K64130
1270d1936j31581K42738l0276m8607m43681K91501n0256J74126j53532j43301
1260c34805J70802K07837k3691p3770P3775K02416j21130k23193J3084J94001
1250H5326l02612O5543J34483k78250j09028O14170K10318j93083l36328j7740
1240a27201L87784k23676P015m75906K50766J6852o7257J958N18803L12703l42572
$$ plain form
1229 259269 314799 240202 243821 576866 174983 32606 -80772 318925 73629 -53191
1219 -53191 -367572 -622712 -605982 -299024 138417 -270021 -132807 -39217 556007 480009
1209 480009 162587 30332 -118478 176828 -19413 -413845 -79750 -404154 -220769 -32478
1199 -32478 -85639 -75701 -24716 -591783 -72216 218421 -145502 -216193 59836 256690 -208244
1188 -208244 396714 183142 -250311 -167944 -246571 431650 516407 -230931 -518288 -54129
1178 -54129 -190090 174001 -223719 -677102 -35698 -99655 25512 -259530 -82717 -32360
1168 -32360 -173968 -363683 118955 300207 696557 -138919 -266201 -607382 -731279 -328459
1158 -328459 -406825 59509 63264 163969 660472 387520 -184680 -341472 78785 -372851
$$ packed form
1229B59269N5530p4597L619L33045m01883j42377j13378L99697k45296j26820
1219e3191l14381k55140J6730L06958M37441m08438J37214R3590N95224p5998
1209D80009l17422j32255j48810K95306j96241l94432L34095l24404J83385J88291
1199c2478n3161R938N0985n67067N19567K90637l63923p0691K76029J96854m64934
1188b08244O04958k13572m33453Q2367p8627O78221Q4757p47338k87357M64159
1178e4129j35961L64091l97720m53383O41404o3957J25167k85042J76813N0357
1168c2360j41608j89715M82638J81252L96350q35476j27282l41181j23897M02820
1158c28459p8366M66334L755J00705M96503k72952n72200j56792M20257m51636
$$ plain form
1148 -372851 -588461 -608266 -497902 -182463 149679 85779 -382885 -387295 -407398 238649 -587316
1137 -587316 -692431 -862576 -410399 273731 9307 452259 108527 -118094 74701 217722
1127 217722 213448 -46697 201796 -38534 214684 345824 290944 162282 -374640 -48986
1117 -48986 106784 -153874 -59695 -155027 41256 -71012 -135153 -97762 -260341 -272010 340607
1106 340607 176769 -413245 256091 818944 279267 334590 363953 169083 53284 271639
1096 271639 139186 407919 567934 -45491 -442077 -260841 125106 -89797 -180618 513513
1086 513513 398426 -245315 109944 -212701 -356835 326924 163527 -165400 -243417 -157663
1076 -157663 -40066 -158375 -143909 150245 444546 26248 -172037 -270817 4401 -106852
$$ packed form
1148c72851k15610j9805J10364L15439L32142o3900m68664m410k0103O46047q25965
1137e87316j05115j70145M52177O84130k64424M42952l43732k26621J92795J43021
1127B17722m274k60145K48493k40330K53218J31140n4880j28662n36922L25654
1117d8986J55770k60658R4179r5332J96283j12268o4141L7391j62579j1669O12617
1106C40607j63838n90014O69336N62853n39677N5323K9363j94870j15799K18355
1096B71639j32453K68733J60015o13425l96586J81236L85947k14903r0821O94131
1086E13513j15087o43741L55259l22645j44134O83759j63397l28927p8017Q5754
1076a57663J17597j18309J4466K94154K94301m18298j98285r8780K75218j11253
$$ plain form
1066 -106852 -84354 -309215 -157429 85580 18507 -248624 72569 -270545 -379218 -168860
1056 -168860 -232794 -62182 210696 -221925 -81784 -225629 -154195 28907 -129793 -506949
1046 -506949 281468 252385 321836 414431 -18636 -53228 -15199 -37469 -24305 -211435 82971
1035 82971 573305 65265 16004 161124 17190 -339611 -302460 -504079 -304454 -432277
1025 -432277 -307449 -101730 190485 -191315 -441500 -485181 -389151 -118287 -409563 119239
1015 119239 239918 -146659 -147217 427212 214787 -11480 169241 -297444 -12198 268210
1005 268210 598043 318946 650631 93867 -107256 380831 282173 250652 281527 80547
995 80547 577932 168412 -26308 -175191 83048 -98416 325994 127435 -60649 -434721
$$ packed form
1066a06852K2498k24861J51786K43009o7073k67131L21193l43114j08673K10358
1056a68860o3934J70612K72878m32621J40141j43845P1434J83102j58700l77156
1046e06949P88417k9083O9451R2595m33067l4592L8029k2270J3164j87130K94406
1035H2971M90334n08040m9261J45120j43934l56801L7151k01619J99625j27823
1025d32277J24828K05719K92215l81800k50185m3681R6030K70864k91276N28802
1015A19239J20679l86577n58N74429k12425k26267J80721m66685K85246K80408
1005B68210L29833k79097L31685n56764k01123M88087r8658l1521L0875k00980
995H0547M97385m09520j94720j48883K58239j81464M24410j98559j88084l74072
$$ plain form
985 -434721 -208438 -232384 -114707 -104591 264525 290565 93159 341319 135428 87242 -136983
974 -136983 -195308 -417211 -145506 -106908 -435509 -501387 -386966 -486333 -346146 -224027 125614
963 125614 414855 447186 195964 148878 345178 419893 -27040 -28251 -52078 86072 86980
952 86980 1142 -342164 -478256 -432287 -194494 -406327 -12622 -350665 -432122 -125818 42627
941 42627 118479 -77178 -574773 -256352 73372 3867 -193478 253889 311204 -49227 -331984
930 -331984 78074 307320 -13859 -526364 -331748 -59290 112280 3025 -308515 -245060
920 -245060 42160 -59155 -99735 151205 -117819 -63730 -348745 -42664 196428 304228
910 304228 124187 -117692 -94863 -94637 -106662 -290362 -429052 -324102 2228 47899 -131574
$$ packed form
985d34721K26283k3946J17677J0116L69116K6040j97406K48160k05891m8186k24225
974a36983n8325k21903K71705L8598l28601o5878J14421r9367J40187J22119L49641
963A25614K89241L2331k51222m7086J96300P4715m46933j211k3827J38150R08
952H6980q5838l43306j36092M5969K37793k11833L93705l38043q1457L06304J68445
941D2627P5852j95657m97595L18421L29724o9505j97345M47367N7315l60431k82757
930c31984M10058K29246l21179n12505J94616K72458J71570j09255l11540O3455
920b45060K87220j01315m0580K50940k69024N4089k85015L06081K39092J07800
910C04228j80041k41879K2829K26j2025j83700j38690J04950L26330M5671j79473
$$ plain form
899 -131574 -46522 -47958 206007 175473 -345765 122697 457451 55801 200840 -115104 -312581
888 -312581 -12494 27598 133562 266592 286143 -5800 128970 220244 127537 152752 305091
877 305091 394057 350853 29237 -225172 336169 388821 -362617 74025 -242466 -170796 100961
866 100961 -118695 -390904 -437914 -74602 -58739 63060 -35356 -1793 -78153 -66924 220284
855 220284 -46539 -548558 -354028 185192 302098 345738 423281 177401 368343 111997
845 111997 -283960 -490950 -292079 -529045 20720 -247484 -216578 568160 239690 107092
835 107092 419361 -28585 -328821 -194818 51311 166759 89330 62138 413551 -56372
825 -56372 74412 150830 254114 564857 373109 202412 -152875 266882 188039 29303
$$ packed form
899a31574Q5052j436K53965l0534n21238M68462L34754m01650J45039l15944j97477
888c12581L00087M0092J05964J33030J9551k91943J34770R1274r2707K5215J52339
877C05091Q8966m3204l21616k54409N61341N2652p51438M36642l16491P1670K71757
866A00961k19656k72209m7010L63312J5863J21799r8416L3563p6360J1229K87208
855B20284k66823n02019J94530N39220J16906M3640P7543k45880J90942k56346
845A11997l95957k06990J98871k36966N49765k68204L0906P84738l28470j32598
835A07092L12269m47946l00236J34003K46129J15448p7429k7192L51413m69923
825e6372J30784P6418J03284L10743j91748j70697l55287M19757p8843j58736
$$ plain form
815 29303 439124 279174 -226344 -48865 260241 -98350 259792 474279 218804 -152943
805 -152943 -113713 -39706 -355339 -448914 -764399 -637841 44903 100307 66842 -18557 5677
794 5677 190419 152451 246407 -82921 -57059 196126 59650 116125 514405 496450 197734
783 197734 297837 -282973 -173912 -251782 -188737 189340 -137833 116157 337820 323455
773 323455 -472875 -197494 -21360 -298172 -374708 -316970 191143 26292 -199112 -269319
763 -269319 -30585 139266 65166 -84632 -80469 -205320 -265658 -133064 289218 130948 -119875
752 -119875 -150284 -155273 9542 -236811 186735 4761 235977 -19379 222425 -162446
742 -162446 -190640 -395219 147529 393703 214881 -120290 -155014 -69254 148797 -31180
$$ packed form
815B9303M09821j59950n05518J77479L09106l58591L58142K14487k55475l71747
805a52943L9230P4007l15633r3575l15485J26558O82744N5404l3465q5399K4234
794E677J84742l7968R3956l29328K5862K53185j36476N6475L98280j7955k98716
783A97734J00103n80810J09061p7870O3045L78077l27173K53990K21663j4365
773C23455p96330K75381J76134k76812p6536N7738N08113j64851k25404p0207
763b69319K38734J69851p4100j49798M163j24851o0338J32594M22282j58270k50823
752a19875l0409m989J64815k46353M23546j81974K31216k55356K41804l84871
742a62446k8194k04579N42748K46174j78822l35171l4724Q5760K18051j79977
$$ plain form
732 -31180 -553919 -477689 -890983 -207275 -133861 -51797 175669 -389916 -179219 -259306 -240767
721 -240767 -322019 424035 616384 613577 719227 191569 24028 172118 348113 175193
711 175193 255123 14526 -82683 -71269 -279387 -284702 209723 626342 485893 198126 385907
700 385907 16166 -92649 -71787 -328306 134828 159840 -36772 255458 393307 577867
690 577867 628095 749028 282289 180671 453338 244718 553578 114949 -48541 531418
680 531418 481122 666608 65117 -141325 -86733 60983 -473953 -409670 -326478 211335 215725
669 215725 255733 297618 522345 352384 -40536 -127622 14517 -129932 -61914 218327 154213
658 154213 -2336 -8830 391851 587574 158865 65122 410084 -96846 -322400 -204794
$$ packed form
732c1180n22739P6230m13294O83708P3414Q2064K27466n65585K10697q0087J8539
721b40767q1252P46054J92349k807J05650n27658j67541J48090J75995j72920
711A75193P9930k40597r7209J1414k08118n315M94425M16619j40449k87767J87781
700C85907l69741j08815K0862k56519M63134K5012j96612K92230J37849J84560
690E77867N0228J20933m66739j01618K72667k08620L08860m38629j63490N79959
680E31418n0296J85486o01491k06442N4592J47716n34936O4283Q3192N37813M390
669B15725M0008M1885K24727j69961l92920q7086J42139j44449O8018K80241o4114
658A54213j56549o494M00681J95723m28709r3743L44962n06930k25554J17606
$$ plain form
648 -204794 -545582 -76030 76299 -201975 -94737 106541 245335 -266995 2088 257605
638 257605 295929 510885 586612 -198893 -150725 325154 -246832 24080 199124 -9808
628 -9808 228398 353987 -366919 -525796 -280735 -453168 -479952 -196050 -192380 202590 609291
617 609291 187721 95539 223384 175064 -263631 -45466 -124608 -303719 -269559 85001 145937
606 145937 116156 -94322 -63808 -76851 -200336 -406615 141858 526202 201808 206847 208209
595 208209 405173 320631 97904 -83825 -100356 -166596 -101247 329075 23441 170611 307402
584 307402 441666 -135439 207864 111903 50001 276335 156729 -414161 -121135 60296
574 60296 -466853 288540 670546 382765 300861 110252 -493893 -466760 -167133 -93511 -135989
$$ packed form
648b04794l40788M69552J52329k78274J07238K01278J38794n12330K69083K55517
638B57605L8324K14956P5727p85505M8168M75879n71986K70912J75044k08932
628i808K38206J25589p20906j58877K45061j72433k6784K83902L670L94970M06701
617F09291m21570r2182J27845m8320m38695K18165p9142j79111L4160L54560O0936
606A45937k9781k10478L0514j3043j23485k06279N48473L84344l24394N039J362
595B08209J96964q4542k22727j81729j6531o6240O5349M30322l05634J47170J36791
584C07402J34264n77105L43303r5961o1902K26334j19606n70890K93026J81431
574F0296n27149P55393L82006k87781q1904j90609o04145K7133K99627P3622m2478
$$ plain form
563 -135989 -35061 -145863 -221180 -277562 115056 210823 77326 204690 -150935 -271252
553 -271252 -454568 -518809 -90584 4526 -163389 -324394 -372898 -508269 75291 108383 82882
542 82882 70686 77247 118913 95762 -25657 -9692 176122 -120759 -36730 -317512 -486911
531 -486911 -193636 -207758 -394 -426112 -513253 -405890 5170 141913 248336 488293
521 488293 260711 352751 585720 467011 117674 311375 544401 -5835 -206311 -91206
511 -91206 219421 -127496 -102092 186713 106486 -163575 -91518 -287116 55060 65851 126540
500 126540 213358 1324 25954 -62478 144328 -166687 241929 11797 187509 -103425
490 -103425 41716 111868 -108081 -287594 -97378 -206061 93290 312638 -35424 -95462
$$ packed form
563a35989J00928j10802p5317n6382L92618R5767j33497J27364l55625j20317
553b71252j83316o4241M28225R5110j67915j61005m8504j35371N83560L3092k5501
542H2882j2196O561M1666k3151j21419J5965J85814k96881Q4029k80782j69399
531d86911K93275j4122K07364m25718q7141J07363M11060J36743J06423K39957
521D88293k27582R2040K32969j18709l49337J93701K33026n50236k00476J15105
511i1206L10627l46917K5404K88805q0227k70061P2057j95598L42176J0791O0689
500A26540Q6818k12034K4630q8432K06806l11015M08616k30132J75712k90934
490a03425J45141P0152k19949j79513J90216j08683K99351K19348l48062o0038
$$ plain form
480 -95462 68823 378421 99846 171910 182069 -42570 24996 229463 -204401 -509650 -408452
469 -408452 -422380 -319646 -453545 -279739 -199599 59151 157034 -232656 392594 143636
459 143636 123333 -91548 -123232 476002 477309 267336 496183 391527 -154108 -608862 -569360
448 -569360 -237206 -345828 -448294 -397622 -160694 107257 393085 496413 616686 123438
438 123438 302095 138557 -175915 -303783 161986 61178 -270372 -424886 -193050 -23812
428 -23812 -211960 245157 116616 103882 -163028 174468 -40032 -161902 -228029 26980
418 26980 -189304 -358201 13301 554401 421609 305565 594123 124989 -281956 109912
408 109912 239226 403916 506832 133528 -49661 128716 -5836 80966 75138 241982
$$ packed form
480i5462J64285L09598k78575P2064J0159k24639O7566K04467m33864l05249J01198
469d08452j3928J02734j33899J73806Q0140K58750R7883l89690O25250k48958
459A43636k0303k14881l1684N99234J307k09973K28847j04656n45635m54754L9502
448e69360L32154j08622j02466N0672K36928K67951K85828J03328J20273m93248
438A23438J78657j63538l14472j27868M65769j00808l31550j54514K31836J69238
428b3812j88148M57117j28541j2734k66910L37496k14500j21870o6127K55009
418B6980k16284j68897L71502N41100j32792j16044K88558m69134m06945L91868
408A09912J29314J64690J02916l73304j83189J78377j34552Q6802n828J66844
$$ plain form
398 241982 113035 227567 99065 -76062 300689 221695 466923 61382 -64380 -219147
388 -219147 -122842 436967 258122 -54052 95186 -361442 -657668 -81721 93469 112298
378 112298 125515 73437 259595 248213 600230 140018 477116 446426 115678 552171 1004413
367 1004413 511983 55796 -301810 -107919 131302 501368 -47851 -150258 -291676 -599402
357 -599402 -419767 312303 858033 707432 632936 198907 259800 32869 -27319 43898 582340
346 582340 191291 -122906 -290955 308878 570174 252142 299052 -477619 -273844 -1067
336 -1067 210015 445021 674255 461079 320280 3302 126455 270357 78509 -157651
326 -157651 -344615 -94175 83112 -23989 62435 351823 -203691 -44325 98370 -51539
$$ packed form
398B41982j28947J14532j28502j75127L76751p8994K45228m05541j25762j54767
388b19147R6305N59809j78845l12174J49238m56628k96226N75947J75190J8829
378A12298J3217n2078J86158j1382L52017m60212L37098l0690l30748M36493M52242
367A004413m92430m56187l57606J93891K39221L70066n49219j02407j41418l07726
357e99402J79635P32070N45730j50601p4496m34029O0893k26931o0188P1217N38442
346E82340l91049l14197j68049N99833K61296l18032M6910p76671K03775K72777
336a067K11082K35006K29234k13176j40799l16978J23153J43902j91848k36160
326a57651j86964K50440J77287j07101Q6424K89388n55514J59366J42695j49909
$$ plain form
316 -51539 78888 201625 312860 216731 -129123 74776 -12059 360447 518288 120948
306 120948 -32294 -25035 120142 297824 86361 524934 51904 -1511 97579 -20060 7496
295 7496 -7493 241308 165487 228468 590496 421209 -91325 -292526 -536961 -453457 297651
284 297651 579411 394954 712780 437068 -34612 228063 466849 34292 -1395 -371220
274 -371220 -384762 104707 59130 264163 318217 -6373 -24426 202818 -221988 282792 340394
263 340394 -175737 -258833 -285245 -148788 -297944 -178140 -336309 -440785 -320008 -4543
253 -4543 249860 228042 492877 840143 -13770 252519 593710 294045 383079 471485 -66036
242 -66036 -141582 329119 758100 338075 219987 376339 101479 409724 121159 460841
$$ packed form
316e1539J30427J22737J11235r6129l45854K03899q6835L72506J57841l97340
306A20948j53242P259J45177J77682k11463M38573m73030n3415R9090j17639K7556
295G496j4989K48801p5821O2981L62028j69287n12534k01201k44435Q3504P51108
284B97651K81760j84457L17826k75712m71680K62675K38786m32557l5687l69825
274c71220j3542M89469m5577K05033N4054l24590j8053K27244m24806N04780N7602
263C40394n16131q3096k6412J36457j49156J19804j58169j04476J20777L15465
253d543K54403k1818K64835L47266q53913K66289L41191k99665Q9034Q8406n37521
242f6036p5546M70701M28981m20025j18088J56352k74860L08245k88565L39682
$$ plain form
232 460841 146366 238957 -192886 122808 252310 567987 477753 133035 296555 202547
222 202547 480887 804158 608158 -73000 360757 67039 288602 37734 -113276 103951
212 103951 470535 413603 463908 -61666 -391341 -353660 -254561 -153939 265734 -14244 254157
201 254157 214770 176795 256315 182997 447213 407081 642080 455734 404300 247397 409904
190 409904 240941 -180151 -314322 166063 -128685 -206643 60073 -36760 -258551 -124622
180 -124622 -169709 70539 234786 98549 149972 353349 592769 471560 144167 187929
170 187929 454021 165807 341981 83153 -182260 240954 427717 302507 184842 216260
160 216260 27647 347393 386059 114882 -29022 2298 10770 109521 176906 165845 -123182
$$ packed form
232D60841l14475R2591m31843L15694J29502L15677r0234l44718J63520r4008
222B02547K78340L23271j96000o81158M33757k93718K21563k50868j51010K17227
212A03951L66584n6932N0305n25574l29675L7681R9099J00622M19673k79978K68401
201B54157l9387l7975P9520p3318K64216m0132K34999j86346n1434j56903J62507
190D09904j68963m21092j34171M80385k94748p7958K66716r6833k21791J33929
180a24622m5087K40248J64247j36237N1423K03377K39420j21209l27393M3762
170A87929K66092k88214J76174k58828k65413M23214J86763j25210j17665L1418
160B16260j88613L19746L8666k71177j43904L1320Q472R8751O7385j1061k89027
$$ plain form
149 -123182 -59372 -255419 -246332 -340320 -181362 351914 232113 80826 -115498 253892 249770
138 249770 228127 357499 81890 -231030 -372950 56760 150788 -85519 73851 333119
128 333119 -136341 59212 -152206 113244 154235 12948 440794 80050 -166108 -17594
118 -17594 249666 280206 235161 -144746 352 87607 -13796 -310768 40039 110428 -56148
107 -56148 -359775 208889 -221510 -379603 234663 235696 99010 25162 -103102 109181 13340
96 13340 123695 130112 -113054 101458 351307 98583 384289 647570 313696 241397 157686
85 157686 126389 -160088 246397 28624 262376 324658 114093 155280 23097 -44293 72653
74 72653 323504 153861 140793 387175 238868 305994 514002 177168 -110696 -67269 112250
$$ packed form
149a23182O3810j96047R087r3988J58958N33276j19801j51287j96324L69390m122
138B49770k1643J29372k75609l12920j41920M29710R4028k36307J59370K59268
128C33119m69460J95553k11418K65450M0991j41287M27846l60744k46158J48514
118a7594K67260L0540m5045l79907J45098Q7255j01403k96972L50807P0389j66576
107e6148l03627N68664m30399j58093O14266J033j36686p3848j28264K12283r5841
96A3340J10355O417k43166K14512K49849k52724K85706K63281l33874p2299q3711
85A57686l1297k86477M06485k17773K33752O2282k10565M1187j32183o7390J16946
74G2653K50851j69643j3068K46382j48307O7126K08008l36834k87864M3427J79519
$$ plain form
63 112250 352171 319679 288368 99952 -44198 98324 37834 -78228 120949 160743 -10580
52 -10580 62491 151519 49934 101185 310024 248237 307874 150241 105052 317617 103589
41 103589 234149 10695 76994 315972 399535 300522 445977 462028 165372 160850 -96276
30 -96276 222563 483550 506493 470700 -138785 56932 145343 11969 164126 465211 141906
19 141906 46900 170199 -48166 266708 96274 -229871 -124987 -146600 50700 15750 -154313
8 -154313 17233 298377 169556 -108885 258731 78796 -45153 -243849
0 -243849
$$ packed form
63A12250K39921l2492l1311j88416j44150J42522o0490j16062J99177L9794j71323
52a0580P3071Q9028j01585N1251K08839o1787N9637j57633m5189K12565k14028
41A03589J30560k23454O6299K38978Q3563r9013J45455J6051k96656m522k57126
30i6276L18839K60987K2943l5793o09485J95717Q8411j33374J52157L01085l23305
19A41906r5006J23299k18365L14874j70434l26145J04884k1613J97300l4950j70063
8a54313J71546K81144j28821k78441L67616j79935j23949j98696
0b43849
$$ Imaginary data points
##PAGE= N=2
##DATA TABLE= (X++(I..I)), XYDATA
$$ plain form
16383 -2605484 -2481298 -2530799 -2510347 -2540417 -2550428 -2306324 -2377022 -2402697 -2570958 -2765213
16373 -2765213 -2446699 -2532556 -2372057 -2152395 -2025217 -2091303 -2102341 -2203503 -2067735 -1796229
16363 -1796229 -1809493 -1770165 -1786614 -2075148 -2452456 -2050946 -1766544 -1580558 -1846192 -1918539
16353 -1918539 -1712615 -1621705 -1467658 -1788145 -1518737 -1744949 -1908322 -1750123 -1575527 -1994541
16343 -1994541 -1737922 -1154687 -1258974 -1505068 -1240717 -997947 -1235140 -1369306 -1551664
16334 -1551664 -1536543 -1083734 -1169830 -1400110 -1329950 -1074221 -703533 -731611 -605128 -761279
16324 -761279 -1188126 -1150205 -1170815 -1064550 -764502 -721953 -476080 -917371 -662406 -714393
16314 -714393 -375085 -66230 -184606 4896 -107215 -179163 -10542 -33350 -301003 -412014
$$ packed form
16383b605484J24186m9501K0452l0070j0011K44104p0698k5675j68261j94255
16373b765213L18514q5857J60499K19662J27178o6086j1038j01162J35768K71506
16363a796229j3264L9328j6449k88534l77308M01510K84402J85986k65634p2347
16353a918539K05924R0910J54047l20487K69408k26212j63373J58199J74596m19014
16343a994541K56619N83235j04287k46094K64351K42770k37193j34166j82358
16334a551664J5121M52809q6096k30280P0160K55729L70688k8078J26483j56151
16324g61279m26847L7921k0610J06265L00048M2549K45873m41291K54965n1987
16314g14393L39308L08855j18376J89502j12111p1948J68621k2808k67653j11011
$$ plain form
16304 -412014 -683241 -375766 -89760 -189635 115707 405836 237488 -54555 77656 181208
16294 181208 123146 140389 210640 376446 221645 -32387 197856 669547 200343 205414
16284 205414 199138 -4512 143170 273977 243966 525367 545377 317679 568687 501817
16274 501817 954115 879508 700887 91673 298438 785783 891157 915296 1153382 1169199
16264 1169199 862393 396426 483902 841934 997381 820238 926892 1042880 941609 1015400
16254 1015400 1133900 1569872 1422224 1524472 1384066 1045397 1243555 1371561 1113979
16245 1113979 1101894 1301954 1217623 890994 983863 795396 630755 1032549 1157124 1599623
16235 1599623 1382364 948108 1077535 1274222 1350422 1731680 1922427 1483596 1695982 1501154
$$ packed form
16304d12014k71227L07475K86006r9875L05342K90129j68348k92043J32211J03552
16294A81208n8062J7243P0251J65806j54801k54032K30243M71691m69204N071
16284B05414o276k03650J47682J30807l0011K81401K0010k27698K51008o6870
16274E01817M52298p4607j78621o09214K06765M87345J05374K4139K38086J5817
16264A169199l06806m65967Q7476L58032J55447j77143J06654J15988j01271P3791
16254A015400J18500M35972j47648J02248j40406l38669J98158J28006k57582
16245A113979j2085K00060q4331l26629R2869j88467j64641M01794J24575M42499
16235A599623k17259m34256J29427J96687P6200L81258J90747m38831K12386j94828
$$ plain form
16225 1501154 1239805 1554582 1650227 1996157 1820101 1782214 1928035 2039266 1947912 1242539
16215 1242539 1507472 1893570 2027128 1429271 1516385 1332739 1414207 1622238 1416661 1736339
16205 1736339 1762824 1789097 1842961 1750745 1615153 1684202 1937466 1490041 1980968 2023309
16195 2023309 2151403 2040234 1909567 1527612 1316695 1986272 2037229 2168841 1949836 1690466
16185 1690466 1755737 1449914 1371811 1547860 1781746 1858647 1951449 2327492 2642287 2841127
16175 2841127 1923130 1695188 1603858 1817921 2208263 2019402 1626224 1587007 1700335 1494783
16165 1494783 1707682 1836182 2056662 2108449 1858314 1902421 2083325 2137962 2019796 2420417
$$ packed form
16225A501154k61349L14777R5645L45930j76056l7887J45821J11231r1354p05373
16215A242539K64933L86098J33558n97857Q7114j83646Q1468K08031k05577L19678
16205A736339K6485K6273N3864r2216j35592O9049K53264m47425M90927M2341
16195B023309J28094j11169j30667l81955k10917O69577N0957J31612k19005k59370
16185A690466O5271l05823p8103J76049K33886P6901R2802L76043L14795J98840
16175B841127r17997k27942r1330K14063L90342j88861l93178l9217J13328k05552
16165A494783K12899J28500K20480N1787k50135M4107J80904N4637j18166M00621
$$ [...]
##END NTUPLES=NMR SPECTRUM
##END=
