##TITLE=1H_CG-1150-A3
 CDCl3, 8 sc, 
 5.08.2021
##JCAMPDX= 6.0         $$ Bruker NMR JCAMP-DX V2.0
##DATA TYPE= NMR SPECTRUM
##DATA CLASS= NTUPLES
##ORIGIN= UXNMR, Bruker Analytische Messtechnik GmbH
##OWNER= root
$$ XWIN-NMR		Version 3.5
$$ Thu Aug  5 11:21:03 2021 Russian Standard Time (UT+4h)  she@DPX200
##.OBSERVE FREQUENCY= 200.131506
##.OBSERVE NUCLEUS= ^1H
##.ACQUISITION MODE= SIMULTANEOUS
##.ACQUISITION SCHEME= undefined
##.AVERAGES= 8
##.DIGITISER RES= 18
##SPECTROMETER/DATA SYSTEM= spect
##.PULSE SEQUENCE= zg30
##.SOLVENT NAME= CDCl3
##.SHIFT REFERENCE= (INTERNAL, CDCl3, 0, 17.5008)
##AUDIT TRAIL= $$ (NUMBER, WHEN, WHO, WHERE, WHAT)
$$ ##TITLE= Audit trail, XWIN-NMR		Version 3.5
$$ ##JCAMPDX= 5.01
$$ ##ORIGIN= Bruker BioSpin GmbH
$$ ##OWNER= she
$$ F:/spectra/data/she/nmr/H-F/1/pdata/1/auditp.txt
$$ ##AUDIT TRAIL=  $$ (NUMBER, WHEN, WHO, WHERE, WHAT)
(   1,<2021-08-05 11:19:53.56 +0400>,<she>,<DPX200>,
      <created by zg, POWCHK disabled, PULCHK disabled
       configuration hash MD5:
       00 E9 B6 7A A2 85 ED C7 34 08 36 98 17 FE 4E 26
       data hash MD5: 16K
       A5 F7 A6 9C A5 42 31 3B A4 36 DE 7E 17 8D AD 0A>)
(   2,<2021-08-05 11:19:56.15 +0400>,<she>,<DPX200>,
      <Start of raw data processing
       efp BC_mod = 2 LB = 0.24 FT_mod = 6 PKNL = 1 PHC0 = -13350.28 PHC1 = 5.800991 SI = 16K 
       data hash MD5: 16K
       50 1E 9F 95 64 49 7B 01 79 AE 64 9C 39 21 E9 FE>)
(   3,<2021-08-05 11:20:18.65 +0400>,<she>,<DPX200>,
      <pk PHC0 = -6.315793 PHC1 = 9 
       data hash MD5: 16K
       47 AD 67 66 1F 4F 2B 5C 61 CD 54 05 AB BB DD 73>)
(   4,<2021-08-05 11:20:22.09 +0400>,<she>,<DPX200>,
      <abs ABSG = 5 
       data hash MD5: 16K
       84 DD 06 E5 A2 E4 6A 9D C5 83 EF 61 1E 83 AC E1>)
$$ ##END=
$$ 
$$ hash MD5
$$ 5B 48 AA FB 9F 97 22 AE 13 B2 B9 D7 A6 33 83 7B
##$RELAX= 
##$RELAX= 
##$RELAX= 
##$RELAX= 
##$RELAX= 
##$RELAX= 
$$ Bruker specific parameters
$$ --------------------------
##$DU= <F:/spectra>
##$EXPNO= 1
##$NAME= <H-F>
##$PROCNO= 1
##$TYPE= <nmr>
##$USER= <she>
##$AMP= (0..31)
100 100 100 100 100 100 100 100 100 100 100 100 100 100 100 100 100 100 
100 100 100 100 100 100 100 100 100 100 100 100 100 100 
##$AQSEQ= 0
##$AQ_mod= 1
##$AUNM= <au_zg>
##$AUTOPOS= <>
##$BF1= 200.13
##$BF2= 200.13
##$BF3= 200.13
##$BF4= 200.13
##$BF5= 200.13
##$BF6= 200.13
##$BF7= 200.13
##$BF8= 200.13
##$BYTORDA= 1
##$CFDGTYP= 0
##$CFRGTYP= 5
##$CHEMSTR= <none>
##$CNST= (0..31)
1 1 145 1 1 1 1 1 1 1 1 1 1 1 1 1 1 1 1 1 1 1 1 1 1 1 1 1 1 1 1 1 
##$CPDPRG= <>
##$CPDPRG1= <>
##$CPDPRG2= <>
##$CPDPRG3= <>
##$CPDPRG4= <mlev>
##$CPDPRG5= <mlev>
##$CPDPRG6= <mlev>
##$CPDPRG7= <mlev>
##$CPDPRG8= <mlev>
##$CPDPRGB= <>
##$CPDPRGT= <>
##$D= (0..31)
0 1.2 0 0 0 0 0 0 0 0.06 0 0.03 0 0 0 0 0.0002 0 0 0 0 0 0 0 0 0 0 0 0 
0 0 0 
##$DATE= 1628147993
##$DBL= (0..7)
120 120 120 120 120 120 120 120 
##$DBP= (0..7)
150 150 150 150 150 150 150 150 
##$DBP07= 0
##$DBPNAM0= <>
##$DBPNAM1= <>
##$DBPNAM2= <>
##$DBPNAM3= <>
##$DBPNAM4= <>
$$ [...]
##$SUBNAM3= <"">
##$SUBNAM4= <"">
##$SUBNAM5= <"">
##$SUBNAM6= <"">
##$SUBNAM7= <"">
##$SUBNAM8= <"">
##$SUBNAM9= <"">
##$SW= 20.0188882624521
##$SWIBOX= (0..15)
0 0 2 0 0 0 0 0 0 0 0 0 0 0 0 0 
##$SW_h= 4006.41025641026
##$TD= 16384
##$TD0= 1
##$TE= 0
##$TE2= 300
##$TE3= 300
##$TEG= 300
##$TL= (0..7)
0 120 120 120 120 120 120 120 
##$TP= (0..7)
150 150 150 150 150 150 150 150 
##$TP07= 0
##$TPNAME0= <>
##$TPNAME1= <>
##$TPNAME2= <>
##$TPNAME3= <>
##$TPNAME4= <>
##$TPNAME5= <>
##$TPNAME6= <>
##$TPNAME7= <>
##$TPOAL= (0..7)
0.5 0.5 0.5 0.5 0.5 0.5 0.5 0.5 
##$TPOFFS= (0..7)
0 0 0 0 0 0 0 0 
##$TUNHIN= 0
##$TUNHOUT= 0
##$TUNXOUT= 0
##$USERA1= <user>
##$USERA2= <user>
##$USERA3= <user>
##$USERA4= <user>
##$USERA5= <user>
##$V9= 5
##$VALIST= <valist>
##$VCLIST= <CCCCCCCCCCCCCCC>
##$VD= 0
##$VDLIST= <DDDDDDDDDDDDDDD>
##$VPLIST= <PPPPPPPPPPPPPPP>
##$VTLIST= <TTTTTTTTTTTTTTT>
##$WBST= 1024
##$WBSW= 4
##$XGAIN= (0..3)
0 0 0 0 
##$XL= 0
##$YL= 0
##$YMAX_a= 294949
##$YMIN_a= -276224
##$ZGOPTNS= <>
##$ZL1= 120
##$ZL2= 120
##$ZL3= 120
##$ZL4= 120
##$ABSF1= 17.46778
##$ABSF2= -2.551258
##$ABSG= 5
##$ABSL= 3
##$ALPHA= 0
##$AQORDER= 0
##$ASSFAC= 0
##$ASSFACI= 0
##$ASSFACX= 0
##$ASSWID= 0
##$AUNMP= <proc_1d>
##$AZFE= 0.1
##$AZFW= 0.1
##$BCFW= 0
##$BC_mod= 2
##$BYTORDP= 0
##$COROFFS= 0
##$CY= -3
##$DATMOD= 1
##$DC= 0
##$DFILT= <>
##$DTYPP= 0
##$F1P= 0
##$F2P= 0
##$FCOR= 1
##$FTSIZE= 16384
##$FT_mod= 6
##$GAMMA= 0
##$GB= 0
##$INTBC= 1
##$INTSCL= 1.334414e-10
##$ISEN= 128
##$LB= 0.24
##$LEV0= 0
##$LPBIN= 0
##$MAXI= 10000
##$MC2= 0
##$MEAN= 0
##$ME_mod= 0
##$MI= 1.114404
##$NCOEF= 0
##$NC_proc= -7
##$NLEV= 6
##$NOISF1= 3.799351
##$NOISF2= 2.8
##$NSP= 0
##$NTH_PI= 0
##$NZP= 0
##$OFFSET= 17.50077
##$PC= 1
##$PHC0= -13356.6
##$PHC1= 14.80099
##$PH_mod= 1
##$PKNL= yes
##$PPARMOD= 0
##$PSCAL= 0
##$PSIGN= 0
##$REVERSE= no
##$SF= 200.130006774785
##$SI= 16384
##$SIGF1= 3
##$SIGF2= 2
##$SINO= 5.538805
##$SIOLD= 16384
##$SREGLST= <1H.CDCl3>
##$SSB= 0
##$STSI= 16384
##$STSR= 0
##$SW_p= 4006.41025641026
##$SYMM= 0
##$S_DEV= 0
##$TDeff= 16384
##$TDoff= 0
##$TI= <>
##$TILT= no
##$TM1= 0
##$TM2= 0
##$TOPLEV= 0
##$USERP1= <user>
##$USERP2= <user>
##$USERP3= <user>
##$USERP4= <user>
##$USERP5= <user>
##$WDW= 1
##$XDIM= 16384
##$YMAX_p= 412182659
##$YMIN_p= -598352
$$ End of Bruker specific parameters
$$ ---------------------------------
##NTUPLES= NMR SPECTRUM
##VAR_NAME=  FREQUENCY,     SPECTRUM/REAL,   SPECTRUM/IMAG
##SYMBOL=    X,             R,               I
##VAR_TYPE=  INDEPENDENT,   DEPENDENT,       DEPENDENT
##VAR_FORM=  AFFN,          ASDF,            ASDF
##VAR_DIM=   16384,         16384,           16384
##UNITS=     HZ,            ARBITRARY UNITS, ARBITRARY UNITS
##FACTOR=    0.24454680195387, 1,            1
##FIRST=     3502.42933250744, 0,            0
##LAST=      -503.980923902821, 0,           0
##MIN=       -503.980923902821, -598352,     0
##MAX=       3502.42933250744, 412182659,    0
$$ Real data points
##PAGE= N=1
##DATA TABLE= (X++(R..R)), XYDATA
$$ [...]
5550A80927o4945M7713m416K06149r3525q8998n4754l4442j81444o7821J1494
5539a44062r3706J34103M32366j73173j50913j29866J92263n3638J14093L821
5529A31288k07733j7176k75360P015K30888J25375m4732q7980l8813O5625K00537
5518H8934j01367r4056J45153R2890L6506R5315n0344p2370M7493K1937l2239
5507A77852O144k01568M5374K18284k05178R1224l4859n534K74030n3752K0078
5496C32095n1406J2281j1244p5729j95527o4829J12473J63784N015j00148J07126
5485B33891q3492j6108j15655K78552q5994j86869j79051j192R6070K15328p4698
5474H0782l6357J12424m6453K44876n8903J19238l45681o19J96399j10480K5841
$$ plain form
5550 180927 115982 163695 159279 365428 271903 182905 128151 93709 -87735 -155556 -144062
5539 -144062 -237768 -103665 328701 155528 4615 -125251 67012 13374 127467 131288
5529 131288 -76445 -93621 -368981 -361966 -131078 -5703 -50435 -138415 -177228 -111603 88934
5518 88934 -12433 -106489 38664 131554 168060 263375 213031 140661 188154 210091 177852
5507 177852 183996 -17572 27802 246086 40908 132132 97273 91739 365769 312017 332095
5496 332095 280689 292970 281726 205997 10470 -54359 58114 221898 226913 126765 233891
5485 233891 150399 134291 18636 297188 211194 24325 -154726 -155918 -59848 155480 80782
5474 80782 44425 156849 110396 355272 296369 415607 69926 69307 265706 155226 181067
5463A81067m781m8861R2625M3171j50935P8587J11185j44727k64876J39720L04249
5452C36424o937j67806n845j03904L00993k24098p2275k4934J44759R118J84j22507
5440F3172p6140m0226N5553j04969Q403k4258J18466M8153j22853K65709m584
5429A86426J5536R0917o8233j67737J52860p9733k5520o0013Q4209J46782k80243
5418d749J7018K03487j44317L0098L786P7108k10183r573J63496M1118M8797j9280
5406A96806p2501j2357P7536Q0093K3829m57k07794j25450Q2206J92770K17822
5395D52503j55521k50604K6678K6204J37286J06697j70535p6008J76955R6241
5385C69896k34170q3160O3878K48946r4850k02878Q7027J28193m4680Q6745n7759
$$ plain form
5463 181067 176286 127425 220050 263221 112286 190873 302058 157331 -107545 32175 336424
5452 336424 329487 161681 155836 51932 352925 128827 56552 31618 176377 185495 185679 63172
5440 63172 -12968 -53194 2359 -102610 -94207 -118465 1 48154 -74699 191010 186426
5429 186426 201962 292879 224646 56909 209769 130036 104516 44503 128712 275494 -4749
5418 -4749 12269 215756 71439 101537 105323 182431 -27752 -37325 126171 167289 216086 196806
5406 196806 124305 111948 189484 269577 293406 292949 85155 -40295 41911 234681 452503
5395 452503 296982 46378 73056 99260 236546 343243 172708 96700 273655 369896
5385 369896 135726 52566 116444 365390 270540 67662 154689 282882 238202 324947 267188
5374B67188K4168K1926j70119M6572N1403p3524K35937J54369r9991n8840o3789
5363C35300K8645j03462k1341O4808j13420J31323j00783m4513R72N5481J24868
5352C57878O7886R6377k49726k0128K36169L7799R7535l14816q1445O6086O9208
5341C62823J67730m5150r3468j88118R3735k1870K07171j45702L64219J6586j80341
5330E37615j66740K36622J73270j41393j44030J24419M4492k46666K15377M2388
5320F75354r79r3633K2851n9464R907P2678K67313R6018j94583j54389K361J53030
5308G96464o9109l75498j79512K76590q528J47J08827o6071K7797J23533Q4410
5297G19050o5988j59687L32527k8262L6523m5598r7754n7490o924O5492q0553
$$ plain form
5374 267188 291356 313282 143163 189735 241138 167614 403551 557920 457929 399089 335300
5363 335300 363945 260483 239142 303950 190530 321853 221070 176557 177529 233010 357878
5352 357878 425764 522141 272415 252287 488456 526255 623790 308974 227529 293615 362823
5341 362823 530553 485403 391935 203817 297552 275682 482853 337151 701370 717956 537615
5330 537615 370875 607497 780767 639374 495344 619763 664255 417589 632966 675354
5320 675354 674375 580742 603593 544129 554036 626714 894027 990045 795462 641073 643434 796464
5308 796464 727355 351857 172345 448935 440407 440554 549381 483310 511107 634640 719050
5297 719050 653062 493375 825902 797640 834163 788565 690811 633321 626397 691889 611336
5286F11336Q837Q204j7834p7515N0234n2312o924L2437J27943K867r7651K24856
5274H14478J34975j83596m6925K41539k67023j4593q6541j49472j8955j22706
5264C01181K41384N8039j62951O9834r795k2520K17956r4132J37359r5205K31178
5253H72328J2291J28724m5362j84241J22215R4540R7062k6037K9192K1800P3456
5242A195968j51114j53973Q9274J86724k02339m3119O6173J75991K74655Q5827
5232A524067l92294J81159K39004j92592J19228K68051k1369o3220J32362j46392
5222A648004M00916L74600N2537j0820n5767K3391L4766p0256m8462p6840K48437
5211B520506J32261N750J99390k42703j35647L65780L66903J59098J61267J54361
$$ plain form
5286 611336 620173 628377 610543 533028 583262 530950 524026 556463 684406 687273 589622 814478
5274 814478 949453 765857 718932 960471 693448 678855 592314 442842 423887 301181
5264 301181 542565 600604 437653 507487 497692 475172 693128 598996 736355 641150 872328
5253 872328 884619 1013343 967981 783740 905955 1000495 1097557 1071520 1100712 1122512 1195968
5242 1195968 1044854 890881 980155 1166879 964540 921421 987594 1163585 1438240 1524067
5232 1524067 1131773 1312932 1551936 1359344 1478572 1746623 1725254 1662034 1794396 1648004
5222 1648004 2048920 2423520 2476057 2465237 2409470 2432861 2467627 2397371 2348909 2272069 2520506
5211 2520506 2652767 2658517 2857907 2615204 2479557 2845337 3212240 3371338 3532605 3686966
5201C686966J91766K35056L65383L47681M35819J59235Q1641K77178P4947J95321
5191F050993J88957j25882o0493R4887k53837O4837j30508K10128p6772J4871
5181E977181J82189M51270O9607J46792M36722K59886J85335K40181N0898j0286
5171G989775J70161J52217r0150l46659m04758k44436m23860k20702k20844k48505
5161F112239j78357J24750j31006k85596J12063k33109R3966k0068m0547J03942
5151E658277J38651J32297k65550k78148j15551j87869k13579l97108j42450k74405
5141D054565j68656n26695o7205j15482j39591J51232j47838m9355l6689l7706
5131B916580p4944m8005r3490o749j75415j15846r1501l29468n9383P1652j82698
$$ plain form
5201 3686966 3878732 4113788 4479171 4826852 5262671 5421906 5503547 5780725 5855672 6050993
5191 6050993 6239950 6114068 6053575 6148462 5894625 5959462 5828954 6039082 5962310 5977181
5181 5977181 6159370 6610640 6680247 6827039 7263761 7523647 7708982 7949163 8000061 7989775
5171 7989775 8159936 8312153 8222003 7875344 7470586 7226150 6802290 6581588 6360744 6112239
5161 6112239 5933882 6058632 5927626 5642030 5754093 5520984 5614950 5594882 5554335 5658277
5151 5658277 5796928 5929225 5663675 5385527 5269976 5082107 4868528 4471420 4328970 4054565
5141 4054565 3885909 3359214 3292009 3176527 3036936 3188168 3040330 2990975 2954286 2916580
5131 2916580 2841636 2793631 2700141 2693392 2517977 2402131 2310630 1981162 1921779 1993431 1810733
5120A810733r5940M1026J76441L9921j66475O3272j39514Q8465Q9134J92605K9682
5109B129350L24026j20465K01409K2748K09756J1724n2578J75672n0181p5998
5099B775463k65562l23791j90676j39685j37626j13556J28948l5732j3658j03173
5089A580952l536J0265k5225Q9543j28924J29851J91988m52P0179K10093Q031
5078B132765K06518J98861L9990K65374P6999j10609j76308o9555k51122k33185
5068B079728j17069j3930q1948j74962k65914j29713K43480j64094K54243J91865
5058A821686M7258j66507j97962J55781J58826P2289j73437j52854Q5075j68771
5048A481384j22923M2704M34376j49078k5108L9174j06375j78805j21833J44964
$$ plain form
5120 1810733 1714793 1755819 1932260 1972181 1805706 1868978 1729464 1817929 1907063 2099668 2129350
5109 2129350 2453376 2332911 2534320 2557068 2766824 2778548 2725970 2901642 2851461 2775463
5099 2775463 2509901 2186110 1995434 1855749 1718123 1604567 1733515 1697783 1684125 1580952
5089 1580952 1577416 1587681 1562456 1651999 1523075 1652926 1844914 1844462 1914641 2124734 2132765
5078 2132765 2339283 2538144 2578134 2843508 2920507 2809898 2633590 2564035 2312913 2079728
5068 2079728 1962659 1948729 1866781 1691819 1425905 1296192 1539672 1375578 1629821 1821686
5058 1821686 1868944 1702437 1504475 1660256 1819082 1891371 1717934 1565080 1650155 1481384
5048 1481384 1358461 1401165 1835541 1686463 1661355 1700529 1594154 1415349 1293516 1438480
5038A438480K6188n1542k22377r0269P6691L2347J77602J34634j10169J8998k34506
5027A196077j58034Q8499j30197k1780k53937K43143l6167M1029r1913N5446q4526
5016H47640m8454P5057m4651J81660R530p9923l7852J21869Q8287o5971N3126
5005A100318j85380R868P9667k31128j3255K8662J25245J56896K12429j16872
4995A166450r5085P7582k94242p4500K00160j66938M8773j0854q2876J82908O8536
4984A019914o2717j4699L276J19927r0330k23803P7900J09287r3621J84605K42240
4973A271979J41389k73279j59375M0115n5167K92805J13764p2728k66295j04363
4963I28845J70379q6216O0181L89281K429l77763j18776J40676J3848o5037m0630
$$ plain form
5038 1438480 1464668 1413126 1190749 1100480 1177171 1209518 1387120 1521754 1411585 1430583 1196077
5027 1196077 1038043 1126542 996345 974565 720628 963771 927604 968633 876720 932166 847640
5016 847640 799186 874243 829592 1011252 1020782 940859 903007 1024876 1113163 1047192 1100318
5005 1100318 914938 924806 1004473 773345 760090 788752 913997 1070893 1283322 1166450
4995 1166450 1071365 1148947 854705 780205 980365 813427 862200 851346 768470 951378 1019914
4984 1019914 957197 942498 945774 1065701 975371 751568 829468 938755 845134 1029739 1271979
4973 1271979 1413368 1140089 980714 1020829 965662 1258467 1372231 1299503 1033208 928845
4963 928845 1099224 1013008 1073189 1462470 1464899 1087136 968360 1109036 1122884 1057847 1017217
4952A017217N827j925l660J8964J50691p0157l5472Q6529r9129k23695n7935J53449
4940I40704j94512J42989J71908k0703l4158J89294J20474p5766j21667o1251
4930A057312m9499J03571J70927j36116N4717J83132j54065N2972j4655R6862
4920A365158k14930n5089K22231m568l7918o848K53582j61554O3464m4071j6613
4909A362844Q2642k04083j1107R8094K2298m1595J31007j44768K59006r7198p4015
4898A383125m1612J80247K79471J28563Q1594j83459K822K10191J15567K0170
4888B176679J71517Q9599k288K3871J43243j06348n2819k53299k44653j04251
4878A841251p7405j53439j5140k20074k8093k030r6506P8367l33002r2677R4412
$$ plain form
4952 1017217 1023044 1021119 1017459 1036423 1187114 1116957 1081485 1168014 1068885 845190 787255 940704
4940 940704 746192 889181 1061089 1040386 1006228 1195522 1315996 1240230 1118563 1057312
4930 1057312 1007813 1111384 1282311 1146195 1200912 1384044 1229979 1282951 1268296 1365158
4920 1365158 1150228 1095139 1317370 1312802 1274884 1268036 1521618 1360064 1423528 1379457 1362844
4909 1362844 1445486 1241403 1230296 1328390 1350688 1309093 1440100 1295332 1554338 1457140 1383125
4898 1383125 1341513 1521760 1801231 1929794 2011388 1827929 1830751 2040942 2156509 2176679
4888 2176679 2348196 2437795 2435507 2459378 2602621 2496273 2443454 2190155 1945502 1841251
4878 1841251 1763846 1610407 1595267 1375193 1347100 1345070 1248564 1326931 993929 901252 995664
4867I95664l715K00023J00318j98450K34409P3730k26293Q297J66947P1787p1191
4856A351526n0278k11517K14194j24320k69585j553j83524J35956J19963J75861
4846A156723l4003o7363J08125J37650n3705l90773l5250K88295J81585q8675
4836A202609j2549j9088K5468M4465m7864M9030N6191J0m36230p0232K46601K35507
4824A273918J6935l2724j30328r363M5250n7539j15938K6000L82287J14331j09688
4813A403141j27991J97207j2258M2224J85826J1925L6637J4057l8970k9688j46155
4802A535955J85494J49199O8693R9547k13460M4823L77155J12239J82520J11759
4792B653924K94815J79215K44331K93915L13460J65857K85131J06843o5226o5314
$$ plain form
4867 995664 991949 1191972 1292290 1093840 1328249 1401979 1175686 1183983 1350930 1422717 1351526
4856 1351526 1301248 1089731 1303925 1179605 910020 908467 724943 860899 980862 1156723
4846 1156723 1122720 1055357 1163482 1301132 1247427 856654 821404 1109699 1291284 1202609
4836 1202609 1190060 1170972 1196440 1240905 1193041 1242071 1298262 1298272 862042 791810 1038411 1273918
4824 1273918 1290853 1258129 1127801 1118438 1163688 1106149 990211 1016211 1398498 1512829 1403141
4813 1403141 1275150 1472357 1460099 1502323 1688149 1700074 1736711 1750768 1711798 1682110 1535955
4802 1535955 1721449 1870648 1939341 2038888 1825428 1870251 2247406 2359645 2542165 2653924
4792 2653924 2948739 3127954 3372285 3666200 3979660 4145517 4430648 4537491 4472265 4406951
4782D406951j19098j21950R7846n3158J4245k74495n3345j32089J30813n7293
4772C838427M5487L89754J30668L82972O4404k4947K46679J93709n661n7968k58369
4761D945155J918k36686l58740m5770j0269k14795j054L46159J06570J72308M4505
4750D749301J00491K57034P9012j69680p9062K6547k90179L4367l6229R7557K8963
4739D798122o3353o6775R656j04809j21137N0011J42516k33382N8288j04006O2966
4728D428097l8825J57007p5961k73800k00236m62102m05837k97375l81144Q2581
4718B532405m4051j77729k19151K6274o6543k1947j19471j39491j71029k85326
4708A313941M1958P102J5266J34045r85J13396R6477k71561K56601p5915j08713
$$ plain form
4782 4406951 4287853 4165903 4263749 4210591 4224836 3950341 3896996 3764907 3895720 3838427
4772 3838427 3883914 4273668 4404336 4787308 4851712 4826765 5073444 5267153 5261492 5203524 4945155
4761 4945155 4947073 4710387 4351647 4305877 4295608 4080813 4079759 4425918 4532488 4704796 4749301
4750 4749301 4849792 5106826 5185838 5016158 4937096 4963643 4673464 4707831 4671602 4769159 4798122
4739 4798122 4734769 4667994 4677650 4572841 4451704 4501715 4644231 4410849 4469137 4365131 4428097
4728 4428097 4389272 4546279 4470318 4196518 3996282 3534180 3128343 2830968 2449824 2532405
4718 2532405 2488354 2310625 2091474 2117748 2051205 2029258 1909787 1770296 1599267 1313941
4708 1313941 1355899 1363001 1378267 1512312 1511327 1624723 1721200 1449639 1706240 1630325 1521612
4697A521612K74Q7776K285j68909k4700J66862j35430j90814P8852j02601l2747
4686A202460l6081R6683j24031J29738K62666k72258J57319J27648k96416k29157
4676A018571J34896q6696j15721L600N6331Q3103j89021J43540n5131k66465L25093
4665A052100k6751j11794J84461k1408j8828P0833j0695Q685j50576K0147L4049
4654A030223j5169n0838K4069J25445J44636k27055P501k0929Q5004k14864l0080
4643H57943J78506o1786K15229R2237k9136k48639J9349J08487j20370J44589
4633A156409o7477j48066R5382l0520k219K3065j15709n5927J11908N5083j63184
4622H58745l9808L52493l8059j44025J31742M4602j16517j12357o0183J50927
$$ plain form
4697 1521612 1521886 1609662 1611947 1443038 1418338 1585200 1449770 1258956 1337808 1235207 1202460
4686 1202460 1166379 1263062 1139031 1268769 1531435 1259177 1416496 1544144 1247728 1018571
4676 1018571 1153467 1066771 951050 954650 1010981 1094084 905063 1048603 993472 727007 1052100
4665 1052100 1025349 913555 1098016 1076608 1057780 1128613 1117918 1126603 976027 996174 1030223
4654 1030223 1015054 964216 988285 1113730 1258366 1031311 1038812 1017883 1102887 888023 857943
4643 857943 1036449 974663 1189892 1282129 1252993 1004354 1023703 1132190 1011820 1156409
4633 1156409 1088932 940866 1036248 1005728 1003509 1026574 910865 854938 966846 1021929 858745
4622 858745 818937 1171430 1133371 989346 1121088 1165690 1049173 936816 876633 1027560
4612A027560j5915l8244K06637o2890J42872O5800j62055j34526j58335J54518
4602A025422Q758j29840p377j49760K00977Q671J1783K05497k7866j68755N3729
4591A031239J45404N8056k82574q1242L84245j6466J4761J5869j34355j26877
4581A008060J25876N0916K19125l67292l0789m7870N6168R3905j75241R7653R3526
4570A124037r9399J82184L08440j71862p3884l627N5220N8566L4423J57782j18176
4559A453704o9023Q9525k4863j59221L1474J544j4300j69894J99963J65363q2827
4548A421445N1328k349j1850j27441J10698k16867o4338Q0645N0565K8990L6825
4537A357651O6288N8146Q2731j73606J7472P6216j77348J20949J86592P5395J15348
$$ plain form
4612 1027560 1011645 973401 1180038 1117148 1260020 1325820 1163765 1029239 870904 1025422
4602 1025422 1034180 904340 896963 747203 948180 956851 968634 1174131 1146265 977510 1031239
4591 1031239 1176643 1234699 952125 870883 1255128 1238662 1253423 1269292 1134937 1008060
4581 1008060 1133936 1184852 1403977 1036685 1005896 958026 1014194 1108099 932858 1030511 1124037
4570 1124037 1024638 1206822 1515262 1343400 1269516 1265889 1321109 1379675 1414098 1571880 1453704
4559 1453704 1384681 1474206 1449343 1290122 1321596 1323140 1308840 1138946 1338909 1504272 1421445
4548 1421445 1472773 1470424 1458574 1331133 1441831 1224964 1160626 1241271 1291836 1320826 1357651
4537 1357651 1423939 1482085 1564816 1391210 1408682 1484898 1307550 1428499 1615091 1690486 1805834
4526A805834j82502m8592l886r928R0520J60575J35679K0704O6053l23806O3866
4515A774517M15038K05623j60910K22302k49302j26943R2244J951o581r206J31240
4504B289973J55322k9459K27847j31930J13689L97025R3500l00487R9017L4834
4494B949331q0757J61153k6844N07976M2469j8198J4670K56684q5360j2357M93906
4483D202673K53790K93299N56586O81687O10441M18967O49102P61856Q53885J031253
4473A0313539J315162J504103J642872J689578J511128Q35401l93280j425629
4465A6992874k253678k305236k177635j414669j084330r52697m11023m27023m47047
4456E519536n03305j31470o7645k66928k01078n5442k24092l4582k4153M9715
$$ plain form
4526 1805834 1623332 1574740 1570854 1560926 1651446 1812021 1947700 1968404 2034457 1710651 1774517
4515 1774517 2189555 2395178 2234268 2456570 2207268 2080325 2172569 2174520 2167939 2158733 2289973
4504 2289973 2445295 2415836 2643683 2511753 2625442 3022467 3115967 2815480 2914497 2949331
4494 2949331 2868574 3029727 3002883 3510859 3553328 3535130 3549800 3806484 3721124 3708767 4202673
4483 4202673 4456463 4749762 5306348 5988035 6598476 7017443 7666545 8428401 9282286 10313539
4473 10313539 11628701 13132804 14775676 16465254 17976382 18811783 18418503 16992874
4465 16992874 14739196 12433960 10256325 8841656 7757326 6804629 6393606 5966583 5519536
4456 5519536 5016231 4884761 4817116 4550188 4349110 4293668 4069576 4034994 4010841 4060556
4446D060556r7062k61575k27732J87200j98003k7308R1074J15745Q9153l8719
4436C693329k2068J30203n9180P3104n8198q2913Q0866j65152M6979L23488J84225
4425D144683j98676M3526J23613L86147M66615L33351L18301K94691M17827L71214
4415F701292O15830Q34590P95635J109776J077340J539675J365810J368356J548573
4406A6956877J059114l7811q16164j271537k126472k114054j876287j505715r47287
4397G320664m16125k85683o38463n08134m73245k13483k99856l89793l44696o875
4387C744311R7057j43594J2860r6125j02697j82526k39623J35515k65754k55340
4377B704084J9747J36923n3620n5789m03293L03976J13301j18541j89996p2330
$$ plain form
4446 4060556 3963494 3701919 3474187 3661387 3463384 3436076 3527150 3642895 3732048 3693329
4436 3693329 3671261 3801464 3742284 3815388 3757190 3674277 3755143 3589991 3636970 3960458 4144683
4425 4144683 3946007 3989533 4113146 4499293 4965908 5299259 5617560 5912251 6330078 6701292
4415 6701292 7317122 8151712 8947347 10057123 11134463 12674138 14039948 15408304 16956877
4406 16956877 18015991 17978180 17162016 15890479 13764007 11649953 9773666 8267951 7320664
4397 7320664 6904539 6618856 5980393 5472259 4999014 4785531 4485675 4095882 3751186 3744311
4387 3744311 3841368 3697774 3710634 3614509 3511812 3329286 3089663 3225178 2959424 2704084
4377 2704084 2723831 2860754 2807134 2751345 2348052 2652028 2765329 2646788 2456792 2384462
4367B384462K18115k29491p7473J73287j93418o8389K51161n5877O5665q2841
4357B385201q5645k10095J56043k4757J25888J04162k45878R6958J82276l2680
4347B451473k50257J17018L7743J8830K37675j27531q0236j24995K5369p1547
4337B233542k7811l6632J50615R3170l9673j83640J0078j07721Q3432K69312J15555
4326B560227M8741j57440j18559j73305J13583L0490r3831K17478J2161M9395
4316B488940o1685J77110j41133L5740N694Q6936J86201m35895O5012J41336k63818
4305B284438J13613J47338M7364N8065k8907r9283j10761J15709R5463J13908
4295B736947k75170n4003j43875K08019j05973J12099J65348k8333p4652j49872
$$ plain form
4367 2384462 2602577 2373086 2295613 2468900 2275482 2207093 2458254 2402377 2468042 2385201
4357 2385201 2299556 2089461 2245504 2220747 2346635 2450797 2204919 2301877 2484153 2451473
4347 2451473 2201216 2318234 2355977 2374807 2612482 2484951 2404715 2279720 2305089 2233542
4337 2233542 2205731 2169099 2319714 2412884 2373211 2189571 2199649 2091928 2175360 2444672 2560227
4326 2560227 2608968 2451528 2332969 2159664 2273247 2303737 2209906 2427384 2439545 2488940
4316 2488940 2427255 2604365 2463232 2498972 2504666 2591602 2777803 2341908 2406920 2548256 2284438
4305 2284438 2398051 2545389 2592753 2650818 2621911 2522628 2411867 2527576 2623039 2736947
4295 2736947 2461777 2407774 2263899 2471918 2365945 2478044 2643392 2615059 2540407 2390535
4285B390535j94491J54302M1161K3511J66769o2442K12736j12171j606m1189J4636
4274B591751j99103J22766K98761J42988J37676j93257J1395K42860j21378N6033
4264C090492K48728o2954k58234n941Q4051K14726k8538j376n2979O9837N7087
4253C354899J28782J81467j98800P1622M2546l0355L9803J4666P2740l1042N203
4242C651531J8950l645L55957K4824J33886J38264n8673P3778K22635J0543j25461
4231D442589K4498M30879P4491J13704K6126K19660K19402j62470K12995J18782
4221E720656K68817J29372J08630J65439l2893K61139p2714K92415J11725J03703
4211G056289L74355L79279M3229J25746L93039J77464R2931J86091K38213J58488
$$ plain form
4285 2390535 2196044 2350346 2391507 2415018 2581787 2519345 2732081 2619910 2618304 2577115 2591751
4274 2591751 2392648 2515414 2814175 2957163 3094839 2901582 2912977 3155837 3034459 3090492
4264 3090492 3339220 3276266 3018032 3012091 3096142 3310868 3282330 3280954 3227975 3297812 3354899
4253 3354899 3483681 3665148 3466348 3537970 3580516 3550161 3589964 3604630 3677370 3646328 3651531
4242 3651531 3670481 3666836 4022793 4047617 4181503 4319767 4261094 4334872 4557507 4568050 4442589
4231 4442589 4467087 4897966 4972457 5086161 5112287 5331947 5551349 5388879 5601874 5720656
4221 5720656 5989473 6118845 6227475 6392914 6360021 6621160 6548446 6840861 6952586 7056289
4211 7056289 7430644 7809923 7853152 7978898 8371937 8549401 8642332 8828423 9066636 9225124
4201I225124P47288M44517K70368K86382O25242L04589M15264Q98221O58296P29838
4191A4605129O00317N63640R40542R26047J032348J257296J541035J462877J750818
4182B4680049J578331J779516K069068K101380K379499K069894J615238J616550
4174C9889525J508425Q37602l12116q87050j044515n61809j03509K04113N81789
4165D0112455J96643P18849N36076L44432N99534K84451N07941M78255r6895M0423
4155D3722164K1204K14779m32966j32479K13811m08832l66987k63759j26476J19642
4145D2560101J98054M01580O76498M75017R16764J031308P39712O09388M60598
4136D8069020N00384K57017Q6881j9083k5898J8048j3161j11452m48579q04639
$$ plain form
4201 9225124 9972412 10416929 10687297 10973679 11598921 11903510 12318774 13216995 13875291 14605129
4191 14605129 15205446 15769086 16709628 17635675 18668023 19925319 21466354 22929231 24680049
4182 24680049 26258380 28037896 30106964 32208344 34587843 36657737 38272975 39889525
4174 39889525 41397950 42235552 41923436 41036386 39991871 39430062 39326553 39530666 40112455
4165 40112455 40309098 41027947 41564023 41908455 42507989 42792440 43300381 43778636 43681741 43722164
4155 43722164 43743368 43958147 43525181 43392702 43606513 43197681 42830694 42566935 42440459 42560101
4145 42560101 42758155 43159735 43836233 44311250 45228014 46259322 46999034 47608422 48069020
4136 48069020 48569404 48826421 48913302 48894219 48868321 48886369 48873208 48761756 48313177 47508538
4126D7508538j081300j080448j369762j629160j843011j873515j841110j841055
4118C4949177j991980k031554j732156j800565j813622j178451j192955j021128
4110B2186766p50504o11576q37490n42310l99615n64592k25999j46582m77941
4101A7630157j66422K1619j07698m85m434p3991l18513l02705m5316K82847J01998
4090A7017057j02417j4589Q1652m0419j67717q3858K8736K13402M46493J47159
4080A7525499N0654L01581K91727K88942L89303O22777P99385M26251N93255J038935
4070B2328309P59347N42129Q32727J004882O55547O99852J263050J302510J137654
4061C0526007J421674J687550J716276J874038K022428J988135K012887J868902
$$ plain form
4126 47508538 46427238 45346790 43977028 42347868 40504857 38631342 36790232 34949177
4118 34949177 32957197 30925643 29193487 27392922 25579300 24400849 23207894 22186766
4110 22186766 21436262 20824686 19987196 19444886 19045271 18480679 18254680 18108098 17630157
4101 17630157 17463735 17485354 17377656 17377171 17372737 17298746 16980233 16677528 16632212 16915059 17017057
4090 17017057 16914640 16900051 16981703 16941284 16773567 16689709 16718445 16931847 17378340 17525499
4080 17525499 17576153 17877734 18169461 18458403 18847706 19470483 20269868 20696119 21289374 22328309
4070 22328309 23087656 23629785 24462512 25467394 26122941 26822793 28085843 29388353 30526007
4061 30526007 31947681 33635231 35351507 37225545 39247973 41236108 43248995 45117897
4053D5117897J696163J813149J722899J088432Q56148P94420K09219K07245j17973
4044E3387599m03843l40013p48535n87583l27692q86261q09354m23243m99830
4035D8361245p34640m94576n17062l38933l94833K1202j61145j24611K16971j2358
4025D5821260K59656K06472K52283j16457m7151k26843m28625l5736m93772o82989
4015D4508098l65219p05832o36731p74706q64004r60517p12932r47846o19688
4006C7920623l76976n83449n95601o36644j140043p56544r28824j132585j030772
3997C0739185j464252j042208j412959j066682j157605q27334p69931m59259l67219
3988B2171736p08590m24967j13557m96806j59822k60520P1716j25001n7517O369
$$ plain form
4053 45117897 46814060 48627209 50350108 51438540 52294688 53089108 53298327 53505572 53387599
4044 53387599 52983756 52643743 51895208 51307625 50979933 50093672 49284318 48861075 48361245
4035 48361245 47626605 47132029 46614967 46276034 45881201 45902403 45741258 45616647 45833618 45821260
4025 45821260 46080916 46287388 46539671 46423214 46376063 46149220 45720595 45684859 45191087 44508098
4015 44508098 44142879 43437047 42800316 42025610 41161606 40201089 39488157 38540311 37920623
4006 37920623 37543647 36960198 36364597 35727953 34587910 33831366 32902542 31769957 30739185
3997 30739185 29274933 28232725 26819766 25753084 24595479 23768145 22998214 22538955 22171736
3988 22171736 21463146 21038179 20924622 20427816 20267994 20007474 20079190 19954189 19896672 19903041
3978A9903041K54603k1247j57716K13965q0525j82680m37703j57099O6490k38878
3968A9162251k3244l73038q5869Q0636q3544j7882k08228J22978K68324Q6876
3958A8929260Q629L62165K46152P5368j65343J59411k38166N3142n55322j53626
3948A8721670j08994k44309k44889l19705m90481k38416k62485k38336j96126
3939A6377929q8798K2899j96041K7594N6181J07120L20772K1261J00976L58145
3929A7108038K03166j73754q6085l1048k22350j06818k20243k12427l79311k99095
3919A5580073q4668l4089l4495k36066m7625K91827j5445J40764Q8807J24276
3909A5773359L50783K64100L24398K47099L30326M18804N92539K80350K75393
$$ plain form
3978 19903041 20157644 20136397 19978681 20192646 20112121 19929441 19491738 19334639 19401129 19162251
3968 19162251 19139007 18765969 18680100 18760736 18677192 18659310 18451082 18574060 18842384 18929260
3958 18929260 18937889 19300054 19546206 19621574 19456231 19615642 19377476 19430618 18875296 18721670
3948 18721670 18612676 18368367 18123478 17803773 17313292 17074876 16812391 16574055 16377929
3939 16377929 16289131 16312030 16115989 16143583 16199764 16306884 16627656 16648917 16749893 17108038
3929 17108038 17311204 17137450 17051365 17020317 16797967 16691149 16470906 16258479 15879168 15580073
3919 15580073 15495405 15461316 15426821 15190755 15143130 15434957 15419512 15560276 15649083 15773359
3909 15773359 16124142 16388242 16712640 16959739 17290065 17708869 18301408 18581758 18857151
3900A8857151M54367Q53379O83686M18181J98043L043n87241l61252o36173p44378
3890A9138806j30022k32420L4082j36687k62472o4645k5560r4711M55195K46484
3880A8928050P6470M92834J53273L14992N89652K48768J09411K71440L31402L78241
3870B1894533N76622J28043L83299L55699L89055L33464N64383M92718L27153
3861B5444969O12084Q75002O15027Q26954P03410Q25980P58983Q13355J046548
3852C2522312J111706Q67130J062215J339509J346539J543155J423521J865466
3844D3081553J904833K090464K328281K740249L071313L407762M199736M961981
3836F7786172N421061N779476O471582O318967N332553L499305J438380L97579
$$ plain form
3900 18857151 19311518 20164897 20848583 21266764 21464807 21467850 20880609 20519357 19883184 19138806
3890 19138806 19008784 18776364 18810446 18673759 18411287 18346642 18321082 18226371 18681566 18928050
3880 18928050 19004520 19497354 19650627 19965619 20555271 20804039 20913450 21184890 21516292 21894533
3870 21894533 22471155 22599198 22982497 23338196 23727251 24060715 24625098 25117816 25444969
3861 25444969 26057053 26932055 27547082 28374036 29077446 29903426 30662409 31475764 32522312
3852 32522312 33634018 34501148 35563363 36902872 38249411 39792566 41216087 43081553
3844 43081553 44986386 47076850 49405131 52145380 55216693 58624455 62824191 67786172
3836 67786172 73207233 78986709 85458291 91777258 97109811 100609116 102047496 102445075
3828A02445075j24439J5415J486547L056330M977270N850999P466804Q692431
3820A33866432J0024997J1576542J1714581J1325638J0193038R089566P468580
3813B05259374L931125j218636p335836j2359389j4426071j4584085j3287171
3806A45979311j1260369r094496q018969o425071n115639m586352l968790l363259
3798I4146366l125466k990728l023604k608659k267961j906113j749802j320499
3790G5153534j211799j310717q42071j062857j525881j724200j698746j612117
3782F4165146j797024j845595j375039j368167r27878j066390q84272r52682j287179
3773E2660920j289272j453851j583938j622637j622408j565546j156893r73444
$$ plain form
3828 102445075 102320636 102336051 103822598 106878928 111856198 117707197 125174001 133866432
3820 133866432 143891429 155467971 167182552 178508190 188701228 197790794 205259374
3813 205259374 209190499 207971863 200636027 188276638 173850567 159266482 145979311
3806 145979311 134718942 125624446 117605477 111180406 106064767 101478415 97509625 94146366
3798 94146366 91020900 88030172 85006568 82397909 80129948 78223835 76474033 75153534
3790 75153534 73941735 72631018 71788947 70726090 69200209 67476009 65777263 64165146
3782 64165146 62368122 60522527 59147488 57779321 56851443 55785053 54900781 53948099 52660920
3773 52660920 51371648 49917797 48333859 46711222 45088814 43523268 42366375 41392931
3765D1392931j243401j145249j001200q19373r83359j217278r98208j169284j167733
3756C1647846j230092j012850q82259p36653j032764q71215o53481n63874p65134
3747B3899524q10931o71715l39905p30878m22517m84786n93391k39679l63749
3738A9241973j92960l78204l37498j89207j24826m71930j61588l55694l44152
3729A6685914R6869k23070j91810m27896k97178j29308m71233q796j54999j17569
3719A4760924q8218k11100q6303j92222k65017l92346l22450j9430j80423j06588
3709A2896827j91645j54339J49358k16051J1942j21982k0358k98139M2725j69909
3699A1928429j8045k9520J0673P2166L7762k1447J57673k52971j07763R5001L2067
$$ plain form
3765 41392931 40149530 39004281 38003081 37183708 36200349 34983071 33984863 32815579 31647846
3756 31647846 30417754 29404904 28522645 27785992 26753228 25882013 25228532 24664658 23899524
3747 23899524 23088593 22416878 22076973 21346095 20923578 20438792 19845401 19605722 19241973
3738 19241973 19049013 18670809 18333311 18144104 18019278 17547348 17385760 17030066 16685914
3729 16685914 16782783 16559713 16367903 15940007 15642829 15513521 15042288 15033492 14878493 14760924
3719 14760924 14672706 14461606 14375303 14183081 13918064 13525718 13203268 13183838 13003415 12896827
3709 12896827 12705182 12550843 12700201 12484150 12496092 12374110 12353752 12055613 12098338 11928429
3699 11928429 11910384 11880864 11891537 11963703 12001465 11980018 12137691 11884720 11776957 11871958 11904025
3688A1904025J50436k1906j98802r7253q1388l21773M2632j25781j39608k8925
3678A1081657n6416J69557R9264k42591j90183P9276k88942j15917J33723j41770
3668A0527658K8498r3539k6840L43376K8247j23464L80181j90341q6193j17314
3658A0670269P3825P1027J80339L557M3087K9182J77096l24104j12136K60940
3648A1073082j34859j50594j1653j23308k2217R9741k26534Q9722N2936j43594
3638A0502722Q3312K15306R8757R0123K08553j52409j56994j67595j25100j62033
3628A0434642j00413j15662K7382j39749o302J02887J5736J4667L84607J44676
3618A0762471l7617m6543l1973K08867O4830n6628Q2808N8321J1284j16906o6887
$$ plain form
3688 11904025 12054461 12032555 11833753 11736500 11655112 11333339 11375971 11250190 11110582 11081657
3678 11081657 11025241 11194798 11294062 11051471 10861288 10940564 10651622 10535705 10669428 10527658
3668 10527658 10556156 10462617 10435777 10779153 10807400 10683936 11064117 10873776 10787583 10670269
3658 10670269 10744094 10815121 10995460 10999017 11042104 11071286 11248382 10924278 10812142 11073082
3648 11073082 10938223 10787629 10775976 10652668 10630451 10730192 10503658 10593380 10646316 10502722
3638 10502722 10586034 10801340 10900097 10990220 11198773 11046364 10889370 10721775 10596675 10434642
3628 10434642 10334229 10218567 10245949 10106200 10099898 10202785 10218521 10233188 10617795 10762471
3618 10762471 10724854 10678311 10646338 10855205 10920035 10863407 10946215 11004536 11015820 10898914 10832027
3607A0832027R7183P8739K01581K75535R3968J5257Q9132J3723K57143M2326K50466
3596A2247080O4365K07303L01486L6130L29138K41102j30796m8048J17183k17913
3586A3147030K62923k0759L08781L05986J04112R5197M02180K08984J60283N95887
3576A5570604J6165M17834L09596K85401L09137K36842L09049P75107M82944J24755
3566A8837434L28157N84546L35864O37656L32820N94405Q57073P69975Q63787
3557B4141717J019908J198396J323850J438291J300377J444612J701403J619285
3549C5187839J592224J606223J720550J604043J341648J411421J437820J024217
3541D6925985Q53582R23292P92865N52732J040356J124537J030060J155320J356166
$$ plain form
3607 10832027 10929210 11007949 11209530 11485065 11579033 11594290 11683422 11697145 11954288 11996614 12247080
3596 12247080 12311445 12518748 12820234 12856364 13185502 13426604 13295808 13247760 13364943 13147030
3586 13147030 13409953 13389194 13697975 14003961 14108073 14203270 14605450 14814434 14974717 15570604
3576 15570604 15586769 16004603 16314199 16599600 16908737 17145579 17454628 18229735 18712679 18837434
3566 18837434 19165591 19750137 20086001 20723657 21056477 21650882 22507955 23277930 24141717
3557 24141717 25161625 26360021 27683871 29122162 30422539 31867151 33568554 35187839
3549 35187839 36780063 38386286 40106836 41710879 43052527 44463948 45901768 46925985
3541 46925985 47779567 48702859 49495724 50048456 51088812 52213349 53243409 54398729 55754895
3532E5754895J776228J645297J626540J631248J907028K172267K165608K139205
3524G0818316K295803K346661K318213K411403J653219J557698J207822O48897
3516H5258032K48426k09261o29001q00579n50186o87162q73195p78121r25619
3507H0053334q93020j235770j754740k474687k398913k903595l207048l409055
3499F1776506l792285l489115l615492l164193k944481k725271k416024k406640
3491C7223005j859910j764653j458668j348465j294769j327925r49711p64014
3483B6454890q22958o33896q15245n59605o52918o00315l14894k94891m73078
3474B1287090j55723l34893j14150l52091l44484j76787o2252l6139j90993j81769
$$ plain form
3532 55754895 57531123 59176420 60802960 62434208 64341236 66513503 68679111 70818316
3524 70818316 73114119 75460780 77778993 80190396 81843615 83401313 84609135 85258032
3516 85258032 85506458 85297197 84668196 83867617 83317431 82630269 81757074 80978953 80053334
3507 80053334 79160314 77924544 76169804 73695117 71296204 68392609 65185561 61776506
3499 61776506 57984221 54495106 50879614 47715421 44770940 42045669 39629645 37223005
3491 37223005 35363095 33598442 32139774 30791309 29496540 28168615 27218904 26454890
3483 26454890 25631932 24998036 24182791 23623186 22970268 22369953 22055059 21760168 21287090
3474 21287090 21131367 20796474 20682324 20330233 19985749 19808962 19746710 19710571 19519578 19337809
3464A9337809k649j55340k2716l28497L5087J89055k06416J21406k9653j22340
3454A8815746J67714m9121L11428R3110L0128o7238K95588Q2303J03719K23402
3444B0006779K58970J56171L63549K63505L79834L20342J84652K42107L23502
3435B2499411J15212K60634M99776L00918L86437O1741K75309M41756K85835O1511
3425B5188540L00387N62735L18011J97060O26799L91883K21932L00902N09053
3416B8617302O26877P56139R80706O20430O41713J324473J192027J341119J772424
3407C7873210J401958J537106J625672J663476K015080J909571J658366J995073
3399E1679512K220259K181066K151332K476037K508520K594331L060616K479680
$$ plain form
3464 19337809 19335160 19179820 19157104 18828607 18863694 19052749 18846333 18967739 18938086 18815746
3454 18815746 18983460 18934339 19245767 19338877 19369005 19301767 19597355 19679658 19783377 20006779
3444 20006779 20265749 20421920 20785469 21048974 21428808 21749150 21933802 22175909 22499411
3435 22499411 22614623 22875257 23375033 23675951 24062388 24124129 24399438 24841194 25127029 25188540
3425 25188540 25488927 26051662 26369673 26566733 27193532 27585415 27807347 28108249 28617302
3416 28617302 29244179 30000318 30981024 31601454 32243167 33567640 34759667 36100786 37873210
3407 37873210 39275168 40812274 42437946 44101422 46116502 48026073 49684439 51679512
3399 51679512 53899771 56080837 58232169 60708206 63216726 65811057 68871673 71351353
3391G1351353K455351K489835K395452K231917K029092J794951J466040J002393
3383H7216384J037382J018794M33533O187r4904k82738q98436j351148j233189
3374H5851865j249105j020829r93048r35293o10237j40963N60407J288464J824791
3365H4576052K436623K858971L859740M117921N031764N373110N769882N685020
3357A19709083N717579N352392M766645L572512L359954K553268J160791L47657
3349A46539881m77814p96282j370448k026178k483980k663994k768917l144513
3341A30807755l476200m086445m353778m462920m776538m995121n496319m969066
3333I4191368n112516n226871m977928m666640m278359m199347l711978l228919
$$ plain form
3391 71351353 73806704 76296539 78691991 80923908 82953000 84747951 86213991 87216384
3383 87216384 88253766 89272560 89706093 89712280 89617376 89334638 88436202 87085054 85851865
3374 85851865 84602760 83581931 82588883 81653590 81043353 80902390 81462797 82751261 84576052
3365 84576052 87012675 89871646 93731386 97849307 102881071 108254181 114024063 119709083
3357 119709083 125426662 130779054 135545699 139118211 142478165 145031433 146192224 146539881
3349 146539881 146062067 145265785 143895337 141869159 139385179 136721185 133952268 130807755
3341 130807755 127331555 123245110 118891332 114428412 109651874 104656753 99160434 94191368
3333 94191368 89078852 83851981 78874053 74207413 69929054 65729707 62017729 58788810
3325E8788810k980601k982450k681785j972226k329353j764125j774527j622669
3317D0681074j294154j168535j064082r29751q00707o88635q74509m20601n66505
3308C2873595l16104l88662k46722k93511R0398k0241j60448L7679J8055q0305
3298C1513734n6871J09372J60639j12479n413l93285l17321j9411l60548m90038
3288C0028379n34486o45344r06860q72916q98000p93240p33077p32487q43737
3279B3068232n74571n32978p54200o05230m22814o18851l61573p90663l17114
3270A8090238l13850k70612j94323j80068l29022l26006k06686k46420r4444J4739
3260A5943546j90381j9779j08537j19303L3803j38688L06210p6527k15202j35895
$$ plain form
3325 58788810 55808209 52825759 50143974 48171748 45842395 44078270 42303743 40681074
3317 40681074 39386920 38218385 37154303 36224552 35423845 34735210 33860701 33440100 32873595
3308 32873595 32557491 32168829 31922107 31628596 31718994 31698753 31538305 31575984 31594039 31513734
3298 31513734 31456863 31566235 31726874 31614395 31608982 31215697 30898376 30878965 30518417 30028379
3288 30028379 29493893 28848549 27941689 27068773 26170773 25377533 24644456 23911969 23068232
3279 23068232 22493661 21960683 21206483 20601253 20178439 19559588 19198015 18407352 18090238
3270 18090238 17776388 17505776 17311453 17131385 16802363 16476357 16269671 16023251 15928807 15943546
3260 15943546 15753165 15733386 15624849 15505546 15539349 15400661 15706871 15630344 15415142 15279247
3250A5279247J05978j23790M9631K24558M2708o5888J38970n6529K19593K03849
3240A6018327k638j15610q07M35621N0545J71681j78632j53853O9402J32903M2634
3229A6469573m0089K75462L12669L16970J37986O1819L74190J84762M94386J53885
3219A8741613N42758P28218L20470K96259N47342O00355N86200M82807M62819
3210B3308841L92227M09671M14229N15297N21387N63786P13600P22390P92258
3201B8353686O60489O63130P35430Q44147P84707Q70741O87608O80768L39591
3192C4620297K95068P9221K96560N43694L74351J85257J65427L41620L50846N10183
3182C7762524K86709L85652K42703O08022N41163M7294P34495N73186L31503Q22846
$$ plain form
3250 15279247 15385225 15261435 15311066 15535624 15578332 15512444 15651414 15594885 15814478 16018327
3240 16018327 16015689 15900079 15899272 16334893 16385438 16557119 16378487 16224634 16294036 16426939 16469573
3229 16469573 16429484 16704946 17017615 17334585 17472571 17534390 17908580 18093342 18587728 18741613
3219 18741613 19284371 20012589 20333059 20629318 21176660 21777015 22363215 22846022 23308841
3210 23308841 23701068 24110739 24524968 25040265 25561652 26125438 26839038 27561428 28353686
3201 28353686 29014175 29677305 30412735 31256882 32041589 32912330 33599938 34280706 34620297
3192 34620297 34915365 34994586 35291146 35834840 36209191 36394448 36559875 36901495 37252341 37762524
3182 37762524 38049233 38434885 38677588 39285610 39826773 39874067 40608562 41181748 41513251 42336097
3172D2336097Q62250Q11802J264438J445626J429203J559449J486592J862996
3164E3058453J948216J938103J508607J863518K048689J990930J892322J923898
3156F8172736K080072K212452K231853K362452K758031K905271L427820L397314
3148H9548001L385367L378742L530247L109902L301242K548097K433828K281801
3140A13517227J619198J380097J184513J470936J511242J708649J787158K012169
3132A26191189J849080J856284J687913J731536J321574N97214M16062J28281
3124A35779133j65257p64306q36682j100547j100568j412086j520499j809914
3116A27069274j991394k131545k113522j977293k209484k415909k502404k478344
$$ plain form
3172 42336097 43198347 44010149 45274587 46720213 48149416 49708865 51195457 53058453
3164 53058453 55006669 56944772 58453379 60316897 62365586 64356516 66248838 68172736
3156 68172736 70252808 72465260 74697113 77059565 79817596 82722867 86150687 89548001
3148 89548001 92933368 96312110 99842357 102952259 106253501 108801598 111235426 113517227
3140 113517227 115136425 116516522 117701035 119171971 120683213 122391862 124179020 126191189
3132 126191189 128040269 129896553 131584466 133316002 134637576 135234790 135650852 135779133
3124 135779133 135613876 134849570 134012888 132912341 131811773 130399687 128879188 127069274
3116 127069274 125077880 122946335 120832813 118855520 116646036 114230127 111727723 109249379
3108A09249379k884473l289477l370125l251767l345696l553183l629722l382874
3100H2542062l057865l466809k950739k413718k266187j714169j641331j651585
3092F3379659r66017j056479j218805j320197j232683j425745j175163j079810
3084E3904760j280635j176909j061829p18061r10946q30929m89034j51240l71268
3075D6913909k71258k04411j44590k00470N0016R0351K3585k45134j80647K2689
3065D5854040r0022j36588o9663l88628n81964j003084o64662p02638p68383j122891
3055D0325517o03926o04389m56831q55882n90971p38937p88309p32285o48593
3046C4305394l75332o55544n24406n53918K72k78086l52918L5418l0586M0213
$$ plain form
3108 109249379 106364906 103075429 99705304 96453537 93107841 89554658 85924936 82542062
3100 82542062 79484197 76017388 73066649 70652931 68386744 66672575 65031244 63379659
3092 63379659 62413642 61357163 60138358 58818161 57585478 56159733 54984570 53904760
3084 53904760 52624125 51447216 50385387 49667326 48756380 47925451 47436417 47285177 46913909
3075 46913909 46642651 46438240 46293650 46093180 46143196 46233547 46257132 46011998 45831351 45854040
3065 45854040 45764018 45627430 45557767 45169139 44587175 43584091 42919429 42216791 41448408 40325517
3055 40325517 39721591 39117202 38660371 37804489 37213518 36474581 35686272 34953987 34305394
3046 34305394 33930062 33274518 32750112 32196194 32196466 31918380 31565462 31600880 31570294 31610507
3036C1610507o446j86737L55535p5232j32060k29897l21536k10467l7116k67529
3026C0499022J92871J65422j77795Q4657Q9379L02435L33566N72819O03170L97759
3016C3063305M40228P09873R38882R37604J071933J124064J230152J171479J480325
3007D2167845J598490J880514K237724K233289K374142K649199K743417K756722
2999F0641342K749766K877435K840243K915213L173392L226569L302071L473899
2991H5199930L243699L654777L646404L778898M286150L901307L637786L505243
2983A14854194K956366K334826J393224L94940m24120j574684k957325m074390
2975A12903031n161905n997827o060028o289785o491601n889173n316340n321955
$$ plain form
3036 31610507 31604061 31417324 31772859 31697627 31565567 31335670 31014134 30803667 30766551 30499022
3026 30499022 30691893 30857315 30679520 30764177 30853556 31155991 31489557 32062376 32665546 33063305
3016 33063305 33503533 34213406 35152288 36089892 37161825 38285889 39516041 40687520 42167845
3007 42167845 43766335 45646849 47884573 50117862 52492004 55141203 57884620 60641342
2999 60641342 63391108 66268543 69108786 72023999 75197391 78423960 81726031 85199930
2991 85199930 88443629 92098406 95744810 99523708 103809858 107711165 111348951 114854194
2983 114854194 117810560 120145386 121538610 121933550 121509430 119934746 116977421 112903031
2975 112903031 107741126 101743299 95683271 89393486 82901885 77012712 71696372 66374417
2967F6374417m769931m286417l431501l113145k950424k441496k071706j984369
2959D1325428k016819j535954j499816j177127q44941j117876j328121q48976
2951C0955798r07559q61158o10273p12977q19123p50735l50048o80137m34557
2942B4829231o91044p34266n40589k85512l38653n85495n90649l61981k91298
2933B0409744m17240n20552m55230l69997n66448j18419l41524k33447k86981
2924A7099906k84774m92308k32151j38991l85745j2813k34602j16685k37362j02747
2914A4861728K8062k81751j90477j02357j93191j98460k51321n944L5993M2545
2904A3744827o6128j68586j72737j82297L8413k18329k73291R0975J09783j72105
$$ plain form
2967 66374417 61604486 57318069 53886568 50773423 47822999 45381503 43309797 41325428
2959 41325428 39308609 37772655 36272839 35095712 34250771 33132895 31804774 30955798
2951 30955798 30048239 29187081 28576808 27863831 27044708 26293973 25943925 25263788 24829231
2942 24829231 24138187 23403921 22863332 22577820 22239167 21653672 21063023 20701042 20409744
2933 20409744 19992504 19471952 19016722 18646725 18080277 17961858 17620334 17386887 17099906
2924 17099906 16815132 16322824 16090673 15951682 15565937 15553124 15318522 15201837 14964475 14861728
2914 14861728 14889790 14608039 14417562 14315205 14122014 13923554 13672233 13666289 13702282 13744827
2904 13744827 13678699 13510113 13337376 13155079 13193492 12975163 12701872 12792847 12902630 12730525
2894A2730525n5156J82975k4423m08097l3138p9389N0945q3665j65276j46755
2884A1968546L9372j0296r5252J23370K57185l13938R903J10874m20724L3604
2874A1702644k16900j48757n7925J5740k06029j05126k06617r3201J46648n7018
2864A0773459J1864k6663o3523O9150j71545j30529K64134K6400j45045M22016
2854A1029718R3806k63237k71457n6192o6430J06322L07273J67456p6329R535
2844A0980465P7174J72424K5587o1620K22042k24871j09511L61829K32938p2284
2834A1604173J58268K91981r0557J77263J88044m6300K24788K52165L89159K85240
2824A3434224Q9611J37314J42173J93056J99935N39352N44872M49650J73000R7489
$$ plain form
2894 12730525 12675369 12858344 12833921 12425824 12392686 12313297 12364242 12280577 12115301 11968546
2884 11968546 12007918 11997622 11902370 12025740 12282925 11968987 11978890 12089764 11669040 11702644
2874 11702644 11485744 11336987 11279062 11294802 11088773 10983647 10777030 10683829 10830477 10773459
2864 10773459 10785323 10758660 10695137 10764287 10592742 10462213 10726347 10752747 10607702 11029718
2854 11029718 11123524 10860287 10588830 10532638 10466208 10572530 10879803 11047259 10970930 10980465
2844 10980465 11057639 11230063 11255650 11194030 11416072 11191201 11081690 11443519 11676457 11604173
2834 11604173 11762441 12054422 11963865 12141128 12329172 12282872 12507660 12759825 13148984 13434224
2824 13434224 13523835 13661149 13803322 13996378 14196313 14735665 15280537 15730187 15903187 16000676
2814A6000676M05967N40742N84658K83046K44353K31312L25465O26941M60998
2805A9704158M94617O68629J63460O17635O77285O00079O01233O51854O99122
2796B4878072N67794O28607N82776O95361R42940P08100Q68716Q20724Q47050
2787C1540140J077930R81224P16560R78969J428949J039532J120073J234373J436103
2778D1553853J418073J342170J222571J607148J811727J793569J769195K023109
2770E4541415K183349K277592K726117K517575K929339L307765L256316L744732
2762G7484200L833122M598401N130283N402404O139728O792159P744220Q363272
2754A25487789Q883057J0503590J1998908J2604579J3752089J4535994J4956677
$$ plain form
2814 16000676 16406643 16947385 17532043 17815089 18059442 18290754 18616219 19243160 19704158
2805 19704158 20198775 20867404 21030864 21648499 22325784 22925863 23527096 24178950 24878072
2796 24878072 25445866 26074473 26657249 27352610 28295550 29003650 29872366 30693090 31540140
2787 31540140 32618070 33599294 34315854 35294823 36723772 37763304 38883377 40117750 41553853
2778 41553853 42971926 44314096 45536667 47143815 48955542 50749111 52518306 54541415
2770 54541415 56724764 59002356 61728473 64246048 67175387 70483152 73739468 77484200
2762 77484200 81317322 85915723 91046006 96448410 102588138 109380297 117124517 125487789
2754 125487789 134370846 144874436 156873344 169477923 183230012 197766006 212722683
2747B12722683J5199051J4803331J4273475J3933723J2436751R697506O850843
2740B99917363N846740P930384J2154928J6414140J9807178K0657140J7899163
2733D00627036J1362185J93438j4188054k7344879l4494458l6002693l2754758
2726B67397817k7913862k3407446j9455399j6579705j4252846j2361699j0998638
2719A42428222r698935q224165p394133o540382n967184n452524m760074m079029
2711I0311796l997704l545247l131629l144078k989019k494177k504432k549897
2703F5955613k777760k695494k436703k391093k141382j935880j583813j470184
2695D8523304j642346j492856j251976j269849q44187j147276j051439j001709
$$ plain form
2747 212722683 227921734 242725065 256998540 270932263 283369014 293066520 299917363
2740 299917363 305764103 313694487 325849415 342263555 362070733 382727873 400627036
2733 400627036 411989221 412182659 397994605 370649726 336155268 300152575 267397817
2726 267397817 239483955 216076509 196621110 180041405 165788559 153426860 142428222
2719 142428222 132729287 124505122 117110989 110570607 104603423 99150899 94390825 90311796
2711 90311796 86314092 82768845 79637216 76493138 73504119 71009942 68505510 65955613
2703 65955613 63177853 60482359 58045656 55654563 53513181 51577301 49993488 48523304
2695 48523304 46880958 45388102 44136126 42866277 42022090 40874814 39823375 38821666
2687C8821666r39066q07913q62405p50898o73994o23033o56376q36881n63278
2678C2107822l44885k99010m36181l62438m28118k55975k63226l60836k30378
2669B9126775m23196k04068k30999j43314l02369m03152m08369l02713m91219
2660B6217376l14210m87617j01249l06907l82678j22815l06254l51211l53109
2651B3491326o07288n29874p08240n54586m86481o79651l74276n38106n40923
2642A8471901l14013k27107m24084k50462l70808k37715k42168l05799n50045
2633A5549700k72471J00170j84388k10259j8057m65220k94194j61894j45754l25239
2623A3572394k08589j80776j71254j68080l39928l25791j06292l9784q4503n8418
$$ plain form
2687 38821666 37882600 37074687 36212282 35461384 34787390 34164357 33507981 32671100 32107822
2678 32107822 31762937 31463927 31027746 30665308 30237190 29981215 29717989 29357153 29126775
2669 29126775 28703579 28499511 28268512 28125198 27822829 27419677 27011308 26708595 26217376
2660 26217376 25903166 25415549 25314300 25007393 24624715 24501900 24195646 23844435 23491326
2651 23491326 22884038 22354164 21645924 21091338 20604857 19925206 19550930 19012824 18471901
2642 18471901 18157888 17930781 17506697 17256235 16885427 16647712 16405544 16099745 15549700
2633 15549700 15277229 15377399 15193011 14982752 14964695 14499475 14205281 14043387 13897633 13572394
2623 13572394 13363805 13183029 13011775 12843695 12503767 12177976 12071684 12031900 11947397 11888979
2613A1888979l50233j76100J02453k7968k66060m02743N1770n1062r3165M957
2603A0680828l07230j82746R2478l6054k19271j13887O5211j05544l8088j60100
2593I675597p2589j3369j11866K1963o9560j20356N2102n4909k53546j03029o2530
2582H887908J54935o059j49736j94700j12390j33268P9083J83283j59064o1131
2572H488861k42461l50194k319j05804l3447j81371J48210R0186n0431L2841j44679
2561G649392P3788j65466k34217N218j27471j706R0576L6681j06685j89296J11795
2550G142609N2878p284M6734J655j21157O0692J58136k40910j56604m5789j32405
2539F758555j84079R5314j07005L10602j71861k30720k9268j52158j37129k72817
$$ plain form
2613 11888979 11538746 11362646 11465099 11437131 11171071 10768328 10820098 10769036 10675871 10680828
2603 10680828 10373598 10190852 10283330 10247276 10028005 9914118 9979329 9873785 9835697 9675597
2593 9675597 9603008 9589639 9477773 9499736 9430176 9309820 9361922 9307013 9053467 8950438 8887908
2582 8887908 9042843 9036784 8887048 8692348 8579958 8446690 8525773 8709056 8549992 8488861
2572 8488861 8246400 7896206 7893887 7788083 7754636 7573265 7721475 7811661 7761230 7794071 7649392
2561 7649392 7723180 7557714 7323497 7328715 7201244 7199538 7290114 7326795 7220110 7030814 7142609
2550 7142609 7195487 7188203 7234937 7236592 7115435 7176127 7334263 7093353 6936749 6890960 6758555
2539 6758555 6574476 6669790 6562785 6873387 6701526 6470806 6441538 6289380 6152251 5879434
2529E879434M4970m0937o2602k59593q8489j16971r9122J38526k4040m6682k55237
2518E069257j29040j59983k12254J41561R1794j13776j51352O2476J33846N3988
2508D786517o1770J0456q8596O6744K58148k41336o2395J01650L8213n6529M9788
2497D800890q4714l41292N9786K5146O1716K79299K69120r2934R3698o3890k24653
2486D782172J72128P2627Q613P116J9829l1996O2866J7002n5839J13519n2704
2475E115333O0145l09350k00557k23976L251j85427l96065j66151M6229L5264
2465C778696j28053o0225j56653o4864k74906J1172p9201N7747k8618K6092K2207
2454C103394l15347J90282n168j75718j67030K36030p544q8501k11467o2832m0471
$$ plain form
2529 5879434 5924404 5883467 5820865 5561272 5472783 5355812 5256690 5395216 5371176 5324494 5069257
2518 5069257 4940217 4780234 4567980 4709541 4801335 4687559 4536207 4598683 4732529 4786517
2508 4786517 4724747 4735203 4646607 4713351 4971499 4730163 4667768 4769418 4807631 4751102 4800890
2497 4800890 4716176 4374884 4434670 4459816 4521532 4800831 5069951 4977017 5070715 5006825 4782172
2486 4782172 4954300 5026927 5035540 5042656 5062485 5030489 5093355 5110357 5054518 5168037 5115333
2475 5115333 5175478 4866128 4665571 4441595 4444846 4259419 3863354 3697203 3743432 3778696
2465 3778696 3650643 3590418 3433765 3368901 3093995 3105167 3025966 3083713 3055095 3081187 3103394
2454 3103394 2788047 2978329 2973161 2797443 2630413 2866443 2858899 2770398 2558931 2496099 2455628
2443B455628n7933q7940r1897K14842O9272j3799l69497J24526j05963R7936r4119
2432B141056j89542L1243j30101K23J13702J06995l4931k881j8696n71M6053l5965
2420B026585q7757k44478J66677P7782M5729J9503k1081k07338l1981P8385k19663
2409A602363K25603j22533R0752J23519k3720J5546q9656p3687k0117K11149m93
2398A938726k40976L3809j57P6100j03537l76844l9674m2532J80742M89J24156
2387A550302J86828N96m0540k07655o9063o7894P3606j47118R0243J73719j66198
2376A376826J19164L5737N462L1421k2716n7265P9648r7813L1435K82342k54900
2365A529341L7602j03963M1135l9125N9304J43296k99297l13935L3621Q2043j1564
$$ plain form
2443 2455628 2397695 2309755 2217858 2432700 2501972 2488173 2118676 2243202 2137239 2235175 2141056
2432 2141056 1951514 1982757 1852656 1852879 1966581 2073576 2038645 2035764 2017068 2016497 2062550 2026585
2420 2026585 1938828 1694350 1861027 1938809 1984538 2004041 1982960 1775622 1743641 1822026 1602363
2409 1602363 1827966 1705433 1796185 1919704 1895984 1911530 1821874 1748187 1728070 1939219 1938726
2398 1938726 1697750 1731559 1731402 1807502 1703965 1327121 1287447 1244915 1425657 1426146 1550302
2387 1550302 1737130 1737726 1697186 1489531 1420468 1352574 1426180 1279062 1369305 1543024 1376826
2376 1376826 1495990 1531727 1537189 1568610 1545894 1488629 1568277 1470464 1501899 1784241 1529341
2365 1529341 1566943 1462980 1504115 1464990 1524294 1667590 1368293 1054358 1087979 1170022 1158458
2354A158458j24053l8933J66392P1213q6211O859j86399J95636K5797J85847N6660
2343A431266p4873k7998j3254l9203K8211j0694k8208l9085j10799J63626q5341
2332A193648O2322p7933J81316m10571m7437L9534J82373j2122P4683K7904j16245
2321A097472o8940r823j25455K16425P806M375K69809j40361O1932k32054J68018
2310A249204l9938O5187l3289r962J62279K86964k8402J13843L79212l44866k01600
2299A598632j97973l30643M389J40442j53100m886j65594J83358q6128l8301R376
2288I59572k0983L82164L1280k69411K10609l2097j56534q6490l53615L59634
2278A024129K3430o5411j82556m4344J57774l0735j61796k30000J82595M7652
$$ plain form
2354 1158458 1034405 995472 1161864 1233077 1146866 1153725 967326 1162962 1188759 1374606 1431266
2343 1431266 1356393 1328395 1315141 1275938 1304149 1293455 1265247 1226162 1115363 1278989 1193648
2332 1193648 1255970 1178037 1359353 948782 901345 940879 1123252 1111130 1185813 1213717 1097472
2321 1097472 1028532 1018709 893254 1109679 1117485 1121860 1391669 1251308 1313240 1081186 1249204
2310 1249204 1209266 1274453 1241164 1231202 1393481 1680445 1652043 1765886 2145098 1800232 1598632
2299 1598632 1400659 1070016 1074405 1214847 1061747 1056861 891267 1074625 988497 950196 959572
2288 959572 938589 1320753 1352033 1082622 1293231 1261134 1104600 1018110 664495 1024129
2278 1024129 1047559 982148 799592 755248 913022 882287 720491 490491 673086 720738
2268G20738P4099j1043J24830K40573l26738j23783K57764j73611k5075L66973
2258A124727k15389p6344J33497N3721k11241j35544l5666J10847J36552M8600
2248I33760n3560M745n1692k3219j2473k28913L03564P4907l9193j3837P3328
2237I67417k45717j01301N3991M3602Q38J66151J853k07772q9022K95565J95150
2226A080755j54277J41566J37217k40332j61350J01794j09703l3694n0075R1891
2216H03792J03605n386k00199M1512R1288q3115J46828q9464J54395j0585k52640
2205G00031K45216j75815N2860M6115m8279q5007j65091J39217o5288M6702J46338
2194H36999L3106J9503k9247J50201j76143N5008j11642j48091J33248K00151
$$ plain form
2268 720738 794837 783794 908624 1149197 822459 698676 956440 782829 757754 1124727
2258 1124727 909338 832994 966491 1020212 808971 673427 637761 748608 885160 933760
2248 933760 880200 884945 833253 810034 797561 568648 872212 947119 907926 894089 967417
2237 967417 721700 620399 674390 717992 718830 884981 886834 679062 590040 885605 1080755
2226 1080755 926478 1068044 1205261 964929 803579 905373 795670 761976 711901 803792
2216 803792 907397 902011 701812 743324 834612 751497 898325 808861 963256 952671 700031
2205 700031 945247 769432 822292 868407 820128 735121 570030 709247 643959 690661 836999
2194 836999 870105 889608 860361 1010562 834419 889427 777785 629694 762942 963093
2184I63093l52584j9826J21350R6537K87675l9577o6715j51132J97628O1777k33301
2173H64925j82149K60264J70472P4936J05271j90016m869J4168p6838K1345l88
2162A057121j43176Q0292m6987J19097J28417P1802k03322r3643L23721K68148
2152A561470j40112j36715L19491p9570l5857M6697j57737M9072K37470l6984
2142A627225Q9353K03694N1563J23202M1434J37913J9618Q5050J3752o5120K28797
2131B556481M5373q9740L17940K06239r7652k6374j44618K56728k33073p66J75422
2120B965960r9054L5927K21636L33016N1185j03610N4522L13542L76713J2716
2110D162553j69665J70725J74636K12817K28884M35716L09799J25104K29653P6683
$$ plain form
2184 963093 610509 590683 712033 808570 1096245 1056668 989953 838821 1036449 1098226 864925
2173 864925 682776 943040 1113512 1188448 1293719 1103703 1098834 1113002 1036164 1057509 1057121
2162 1057121 913945 994237 947250 1066347 1194764 1266566 1063244 969601 1293322 1561470
2152 1561470 1421358 1284643 1604134 1524564 1488707 1535404 1377667 1426739 1664209 1627225
2142 1627225 1716578 1920272 1971835 2095037 2136471 2274384 2294002 2379052 2392804 2327684 2556481
2131 2556481 2601854 2512114 2830054 3036293 2938641 2912267 2767649 3024377 2791304 2790538 2965960
2120 2965960 2866906 2902833 3124469 3457485 3508670 3405060 3459582 3773124 4149837 4162553
2110 4162553 3992888 4163613 4338249 4551066 4779950 5215666 5525465 5650569 5880222 5956905
2100E956905K17950n3731L47145L67829N45673J30662M69993L71492K34091M91287
2090I079296K54991J21392M79440M96642L75770P07462N76437Q63056O58075J076479
2080A4689040J136666J793143J627744K156042K754475K676869K269348K753707
2072C1857034L523940M473215N095935N875536P471660R401608J2371171J3758005
2064I3828104J8534073J8438429J2167665p502042k3622970k5256310j9076269
2057F7510680j1773720q747909n939955m612448l371564l002100k157923j812807
2049B6092254j540015j687106j715881k018690j663359j394812j023194r17859
2041A4131338p71067r49282o08812m75350l86817r36746n10985o40247k77667
$$ plain form
2100 5956905 6174855 6121124 6468269 6836098 7381771 7512433 7982426 8353918 8588009 9079296
2090 9079296 9334287 9455679 9935119 10431761 10807531 11514993 12091430 12954486 13612561 14689040
2080 14689040 15825706 17618849 19246593 21402635 24157110 26833979 29103327 31857034
2072 31857034 35380974 39854189 44950124 50825660 58297320 67698928 80070099 93828104
2064 93828104 112362177 130800606 142968271 135466229 111843259 86586949 67510680
2057 67510680 55736960 46989051 41049096 36436648 33065084 30062984 27905061 26092254
2049 26092254 24552239 22865133 21149252 19130562 17467203 16072391 15049197 14131338
2041 14131338 13360271 12410989 11802177 11326827 10940010 10003264 9492279 8852032 8574365
2032H574365k50497j8501j30906o96669m21522q6311k38278l00676m11996j98001
2022E821008j42011j18554m2464R2988k70079j59537k93035q6046Q4919K6556
2012D913745l40537m71352K3584j7092j0526M8348j73379k1076j35097k4840j63345
2001C628433k27776k35885j40487j9351J14570m6397j59322k2913j04746n6607
1991B729519l1283k04466j06120l6975r5010J40790k19278j9646l38196J44800
1981A964135k31787L7385m0691m3414N1259O9197Q1598q7824n6000J61873j39689
1970A766042J97664k5069j09594o1134r1775j84364o2769J68615O376l9536l0187
1959A534269k04701l7196O3550n8009j17425K17798j18089J45803J6777j79653
$$ plain form
2032 8574365 8323868 8305367 8174461 7477792 7056270 6969959 6731681 6431005 6019009 5821008
2022 5821008 5678997 5560443 5517979 5610967 5340888 5181351 4888316 4802270 4887189 4913745
2012 4913745 4573208 4101856 4125440 4108348 4097822 4146170 3972791 3951715 3816618 3791778 3628433
2001 3628433 3400657 3164772 3024285 3004934 3119504 3073107 2913785 2890872 2786126 2729519
1991 2729519 2698236 2493770 2387650 2350675 2255665 2396455 2177177 2157531 1819335 1964135
1981 1964135 1732348 1769733 1729042 1685628 1736887 1806084 1887682 1799858 1743858 1905731 1766042
1970 1766042 1963706 1938637 1829043 1767909 1676134 1491770 1429001 1597616 1603992 1564456 1534269
1959 1534269 1329568 1292372 1355922 1297913 1180488 1398286 1280197 1426000 1442777 1263124
1949A263124L5359J22786j27592j87406k8573j7682Q0851L20377j70808l65087
1939I25349J32830j04799J31287m7979J59095J40083k09547r9987m0081k68470
1929G17781L5983J82586P090M6475l8886j63275K20407k18943j07860J35641M2870
1918H59869P2378K17498o5991j30960j64542J11219K43276l2412p0287J17014
1908A157062l29067j43040k3166J06801J94990k86730L6924P3799K30165q2957
1898I34781k5136P1907j25580o9681L2067k9527P7768J73619l05842k06322m62
1887E27592J36380K71164k69659j13387M7675o5827J82244j08337k6675r6730
1877D84440R7453q1548k14277J47380J76900P8625L652J17526j71403J25518M813
$$ plain form
1949 1263124 1298483 1421269 1293677 1106271 1077698 1060016 1140867 1461244 1290436 925349
1939 925349 1058179 953380 1084667 1036688 1195783 1335866 1126319 1026332 986251 717781
1929 717781 753764 936350 943440 989915 951029 787754 1008161 789218 681358 816999 859869
1918 859869 932247 1149745 1083754 952794 788252 899471 1142747 1110335 1040048 1157062
1908 1157062 827995 684955 661789 768590 963580 676850 713774 787573 1017738 934781
1898 934781 909645 981552 855972 786291 818358 788831 866599 1040218 734376 528054 527592
1887 527592 663972 935136 665477 552090 599765 533938 716182 607845 581170 484440
1877 484440 581893 500345 286068 433448 610348 688973 692625 810151 638748 764266 769079
1866G69079l04020J23730J52697j68234k9757m0853l7870P9243J04733K68803
1856I17551j02522j15863q9996l5297J04354l19454m7201K11667R0021k29K2047
1845F35078o1921o0082P1258j25697J83565k4830j80433L6654Q3059j17480j19342
1834C19829J63866k1678O2908K47755n0036k05402p1849J21349P1994m4051J68440
1823G63125K35233O168J18537k61269j43496K76756k104j51475j0574M6394N034
1812H82329j03994j24933O7906J17903k49430l8383J60925l24640O7307R0435
1802E45425J05981k07546J07613r6010l8561K31681k6987K3777k7756j29662j87735
1791C00220K44369j23672n6085p4531R3677K18011p8363j26754J01647j77605
$$ plain form
1866 769079 465059 588789 741486 573252 543495 502642 464772 544015 648748 917551
1856 917551 815029 699166 609170 573873 678227 358773 311572 523239 613260 613031 635078
1845 635078 573157 513075 584333 458636 642201 617371 436938 473592 556651 439171 319829
1834 319829 483695 462017 524925 772680 722644 517242 445393 566742 638736 594685 763125
1823 763125 998358 1004526 1123063 861794 718298 995054 992950 841475 830901 877295 882329
1812 882329 778335 653402 721308 839211 589781 551398 712323 387683 454990 545425
1802 545425 651406 443860 551473 455463 416902 648583 621596 645373 617617 487955 300220
1791 300220 544589 420917 364832 290301 383978 601989 523626 396872 498519 320914
1781C20914j34453K32460j58053J23277q519l001m6061O6073o208k46644L5745
1770A75530j4642J95104P7151l8507J2558n1041r7648J56730j90408K31369K44030
1759G00226j48033j42242p0630M6892p3963l6653r4540J45396m8441J50745k11521
1748B17236j8819J23829K03455m060j38022o7316j83427J95757R5524J17788N522
1737E47467j11943K948j33218j24598L10106J3994j94372p5397k4174P3163p1798
1726B12178q996J2005J751J70684K35626J00641j07590j22820l4787N8595o7161
1715D50126j26499k1750j50102j9241J10827P7727k644k117m0881n1365r9447
1704A24634P954J57984n8903Q7882J33294l31961J81868r9119j95644j25594Q6259
$$ plain form
1781 320914 186461 418921 260868 384145 375626 372625 326564 392637 386429 139785 175530
1770 175530 160888 355992 433143 394636 407194 356153 258505 415235 224827 456196 700226
1759 700226 552193 409951 339321 386213 312250 275597 181057 326453 278012 428757 217236
1748 217236 198417 322246 525701 521641 383619 316303 132876 328633 424157 541945 547467
1737 547467 435524 438472 305254 180656 490762 504756 310384 234987 210813 283976 212178
1726 212178 203182 215187 216938 387622 623248 723889 616299 493479 458692 517287 450126
1715 450126 323627 301877 151775 132534 243361 321088 318444 316327 275446 224081 124634
1704 124634 132588 290572 231669 319551 452845 120884 302752 203633 7989 -117605 -31346
1693c1346J85612k6624j74081K25376J65666j39195K5116n3945J77645j86529
1683A67695j4399j20597n801n7332K44591J44367J31621O8991k71782p5615p7637
1672A34102r0054J63267m167r7871P1371O1422j7155J12239K42205j19698j35672
1661C19989R111p1093k99284J15573K07782J27629j5895q2685P1388p8505o9093
1650B34917k246K0019r3242m5533J74932o9662j03228J12731k17704M7827m9689
1639I122J36071K52885L6908p277J62325k14239l34046P1904N1193K5446P6136
1628B66428o0991O2780q5388k4847J16853j45670j75656J45543O7929j1669j08242
1617D7070j807J24105K01024k32739k7186J08124L5259r3977k31490J57543o1829
$$ plain form
1693 -31346 154266 127642 -46439 178937 344603 205408 230524 176579 354224 167695
1683 167695 153296 32699 26898 -30434 214157 358524 490145 559136 287354 211739 134102
1672 134102 44048 207315 203148 105277 176648 238070 220915 333154 575359 455661 319989
1661 319989 329100 258007 -41277 74296 282078 409707 393812 311127 382515 304010 234917
1650 234917 232671 252690 159448 113915 288847 219185 115957 228688 10984 58811 9122
1639 9122 145193 398078 434986 427709 590034 375795 41749 113653 164846 190292 266428
1628 266428 205437 268217 182829 157982 274835 129165 -46491 99052 166981 155312 47070
1617 47070 45263 169368 370392 137653 110467 218591 253850 159873 -71617 85926 24097
1606B4097P8117P0046j23141Q3926R78K08613j8892k08609J86356l5504K2295
1595B88282O409o9287j39472J96292j15578K27028n9870O8528P8840k84678P24
1584A97218l4983j21084j6966J51131r9548P462M70755k65325r5509j18383r9840
1573b5072K31114k03868j26736K73162J00237j64303J7181n3673p0501J140n7377
1562g8696K10615K19392l9285p9357Q6310l0809o8335J54585k01745J08625k10937
1551G0363j19463R2518Q1624K01518k9075p8708j9308m0455k71983L41111j93560
1540C4582J8707J05897m3260l2535m8490O3027K50350M4340j73686N3711j4880
1529B57763j59796R7521q1879K552N9394j09967N0458l2738P7649R4610j12203
$$ plain form
1606 24097 102214 172260 49119 133045 134023 342636 323744 115135 301491 265987 288282
1595 288282 294691 225404 85932 282224 166646 393674 333804 402332 481172 196494 197218
1584 197218 162235 41151 24185 175316 75768 83230 553985 288660 193151 74768 -25072
1573 -25072 206042 2174 -124562 148600 248837 84534 101715 48042 -22459 -21319 -78696
1562 -78696 131919 351311 312026 232669 318979 288170 219835 374420 172675 281300 70363
1551 70363 -49100 43418 125042 326560 297485 218777 199469 159014 -112969 228142 34582
1540 34582 53289 159186 115926 83391 34901 97928 348278 392618 218932 272643 257763
1529 257763 97967 195488 113609 116161 175555 65588 116046 83308 160957 255567 143364
1518A43364r6843Q5571O0197O1203k50222m4222J14371K97999j59638j41250k45351
1507a74821p7804L67165q2197r6183J31106J73011k12818k25604L38430n1675
1497H8610K7981L0229k02623r8173K8646K04645j25808J13377l095l0254p2135
1486c8600o9862K72544l07103r7640J08774L06496q2129J73111K35273k32098
1476B68766j3570J42657j77375j78053M4697Q9946j08436L25176n2736k92144
1466D8928k2146K08566P2828p1361q8724J13217j30357p1484m910L379j36789
1455g8853m1947J23551q9062r6088J22792q003n2568J66645r7862L24199k9261
1444B43543n7597r111M754l181q7468J51912k9135n4940J23556j45265J02587
$$ plain form
1518 143364 46521 132092 192289 253492 3270 -40952 73419 371418 211780 70530 -174821
1507 -174821 -252625 114540 32343 -63840 67266 240277 27459 -198145 140285 88610
1497 88610 116591 146820 -55803 -153976 -125330 79315 -46493 66884 63789 33535 -38600
1486 -38600 -108462 164082 -143021 -240661 -131887 174609 92480 265591 500864 268766
1476 268766 255196 397853 220478 42425 87122 177068 68632 393808 341072 48928
1466 48928 26782 235348 308176 236815 148091 261308 130951 59467 54557 57936 -78853
1455 -78853 -120800 2751 -86311 -182399 -59607 -67610 -120178 46467 -51395 272804 243543
1444 243543 185946 176835 181589 178408 90940 242852 213717 158777 282333 137068 239655
1433B39655k74980k6691K69206l09974J41154J06269p1668k59437J58250J12028
1423H3812j11626R1235q6682j24476J23433K76908L6401J491j291L6251K3868
1412C49324j6702r1764K05026l62419j31833K18790J99981l150o5205j02731k6603
1401A72714j80485n8497J48397j3366K1310K936o0345K4621R4024j59770j45413
1390a53874K82247k8254n6094J67280J57247k54476p4087k5574K044M3000m7546
1379A1913Q2097J81686k25858Q7532j9241l548J1776J33669Q2056j57398q6511
1368I8173O8183J90388j77172O9843p8497j49001j38164P442J05731k6105J75228
1357A46049R022m110l467K4749K12077k73554m4086K5664K37015K69637l02189
$$ plain form
1433 239655 -35325 -62016 207190 -102784 38370 144639 72971 -186466 -28216 83812
1423 83812 -27814 63421 -23261 -147737 -24304 252604 289005 290496 289205 325456 349324
1412 349324 332622 240858 445884 83465 -48368 170422 370403 367253 302048 199317 172714
1401 172714 -7771 -66268 82129 68763 90073 93009 32664 57285 151309 -8461 -153874
1390 -153874 128373 100119 44025 211305 368552 114076 39989 14415 16459 59459 11913
1379 11913 94010 275696 49838 137370 118129 114581 126357 260026 342082 184684 98173
1368 98173 166356 356744 179572 249415 170918 21917 -116247 -108805 -3074 -29179 146049
1357 146049 155071 150961 147494 172243 384320 110766 66680 92344 329359 598996 296807
1346B96807k16897N3328j5363j45074J28325k02332k31359J99394r336N5594L52290
1335B65377q8685j22973M3354n8723p901j58657J46374K99527J90268j88294k05617
1324A14050k61037R6048K11461J16139l8936p9466p0060P3659j19339r9716J29986
1313G2789j90778N4568J92000j48544K7866K28798p7694L1316j19743j88255J27983
1302A0306j90659R4243M1559Q54J59155q8225r159L2172J4099j34231j1213M2735
1290c8364J01775R1846l6210J076q1710O7737j16676J48785j29282R4404q1422
1279B1959K85829L7426j99925j33960r646R0404J83306J02058k07278j50092k14446
1268a94365J82084j24838K428K01927p4426J28258k32573K40496l1799l9078j0643
$$ plain form
1346 296807 79910 133238 117875 -27199 101126 -101206 -332565 -133171 -142507 -86913 265377
1335 265377 176692 53719 97073 38350 30449 -128208 18166 317693 507961 319667 114050
1324 114050 -146987 -50939 160522 276661 237725 158259 88199 161858 42519 -57197 72789
1313 72789 -117989 -63421 128579 -19965 7901 236699 159005 190321 70578 -117677 10306
1302 10306 -180353 -86110 -44551 -43697 115458 27233 18074 50246 64345 -69886 -81099 -38364
1290 -38364 63411 155257 119047 120123 38413 106150 -10526 138259 8977 103381 21959
1279 21959 307788 345214 145289 11329 1683 92087 275393 377451 170173 20081 -194365
1268 -194365 -12281 -137119 -134691 67236 -7190 121068 -111505 128991 97192 58114 47471
1257D7471j97984l3117J60539M4245r2802R1876k27291K35056l8228O9457P0321
1246A29543l9453n2091M9321j23978J56025K797J22056J0404O394j22775r1423
1235D6820m0838q035J29400j12537Q0316j29110J19540j13150j5573J90633K20014
1224C67480k16581j05510K04429k381q2130J2972M2912k78233K91481M9038k15353
1213F8124j70543L75783r8918j60554j20467K25838R8296l1839K0933l2417M538
1202A78774j00309k2880K9151P0504K0827j79630m324Q4489M3854m2641j61370
1191h3555j56713K68017J58161k17290o5256m666K17036L274J80722m2395j71063
1180H6272n3643O5744J03296M7811o7811k57424o2150j2358L5905K12935M8517
$$ plain form
1257 47471 -150513 -183630 -23091 21154 -71648 20228 -207063 27993 -10235 59222 129543
1246 129543 90090 37999 87320 -36658 119367 122164 244220 254624 261018 138243 46820
1235 46820 5982 -2053 127347 14810 95126 -33984 85556 -27594 -43167 147466 367480
1224 367480 150899 45389 249818 247437 165307 178279 221191 -57042 234439 283477 68124
1213 68124 -102419 273364 174446 13892 -106575 119263 217559 185720 206653 174236 178774
1202 178774 78465 55585 84736 155240 176067 -3563 -7887 76602 120456 77815 -83555
1191 -83555 -240268 27749 185910 -31380 -96636 -101302 115734 119008 299730 257335 86272
1180 86272 32629 98373 201669 249480 181669 -75755 -137905 -150263 -114358 98577 147094
1169A47094k7506J2700l6419Q448k23014p9627N7294L04638l2301j57066J01526
1158G5767n0074K3051q2542K96280K3286j59045j36653j48957k2430J41219J04807
1147F4709r3135J3458j17436N225J27419J61387l3350m2257K48020l8742q2846
1136B12452j24794k7917j7199j32727L8289L06009o5284p8819m7158Q9347q8226
1125F3973j01180j81241K72826Q311q0017K54825r7982O4594j28563M6009n8628
1114F2927j27933M9253K82608q7472Q1657j05835k32180J44741J51710j38580
1104H0896j85174L36025l2915K8478q3713j01996J22865j4231j51532o6946L41581
1093B73338l5908j0483k77973J1348J0015n1748J6256J4297j37489J24293P0008
$$ plain form
1169 147094 119588 132288 95869 104317 -118697 -198324 -141030 163608 131307 -25759 75767
1158 75767 25693 48744 -33798 262482 285768 126723 -9930 -158887 -181317 -40098 64709
1147 64709 -28426 -14968 -132404 -127179 240 161627 128277 86020 334040 295298 212452
1136 212452 87658 59741 42542 -90185 -51896 254113 188829 110010 62852 152199 63973
1125 63973 -37207 -218448 54378 62689 -17328 237497 139515 204109 75546 121555 62927
1114 62927 -65006 -15753 266855 179383 261040 155205 -76975 67766 219476 80896
1104 80896 -104278 231747 198832 227310 143597 41601 164466 150235 -1297 -68243 273338
1093 273338 237430 226947 -51026 -39678 -29663 -81411 -65155 -50858 -188347 -64054 5954
1082E954J44263J09293j27074Q2476k14412j6136M8681q2066j64157K61682K9618
1071G8122K7211j72874L7251J36604r7491L11171j70300o649r2636j55806J22105
1060A6708Q355J30007j01949P1482l35635J31791K1330j50533R8581M53633k66405
1049G7365J31469j67380j20209J24930j88102P9060J43688k01252k746k13654
1039c36831J98397P5951j90983K16510j39665K4692J09554N5842L5593j4351j20411
1028h5702J09121j00853l4817Q2107l0051k8891p9014J24579K56676l85086P3073
1017i8858P285n7492J30996J38111n9231J15061k87017J93259J29271k48820l1419
1006f8854J45786k26716J28051K3584l8890J77876k15380n7656k28676J08979
$$ plain form
1082 5954 150217 259510 132436 214912 500 -15636 33045 -49021 -213178 48504 78122
1071 78122 105333 -67541 -30290 106314 8823 319994 149694 143045 50409 -105397 16708
1060 16708 25063 155070 53121 124603 -211032 -79241 -57911 -208444 -109863 343770 77365
1049 77365 208834 41454 -78755 46175 -141927 -62867 80821 -120431 -123177 -336831
1039 -336831 -138434 -62483 -253466 -36956 -176621 -151929 -42375 13467 49060 34709 -85702
1028 -85702 23419 -77434 -112251 -30144 -60195 -89086 -168100 -43521 213155 -171931 -98858
1017 -98858 -91573 -149065 -18069 120042 60811 175872 -111145 82114 211385 -37435 -68854
1006 -68854 76932 -149784 -21733 1851 -37039 140837 -74543 -132199 -360875 -251896
996b51896K56098L31136j11981l26640O9348n0148Q7000P2528Q0718j56507l7354
985c7698K08008p3573k27510L3897J51933O7953j44924k22458L67573J31750k33650
974B1301j18636o1440J3612J43528o7948p2324J86428m1787Q9695j08595J18321
963A02155J22944j8268k64023o3390K13152l2869j49704J92121R2911N969m7626
952A53372q4530L5424l2673j61504Q0275j20370L8616P1710J79137q524l56374
941b05441M5622K74785K7829o979R5171q1317j97092j26822K17571r1176j65747
930b13596J7319J22503M4910J2601J4455K8431o3623J15394o2123M3825N744k0749
918D5091L9490K01250k07827k8844r8161J04211j60217l696J55620j14978O3003
$$ plain form
996 -251896 4202 335338 223357 -103283 -33935 -84083 2917 75445 156163 -344 -37698
985 -37698 170310 96737 -130773 -96876 55057 123010 -21914 -244372 123201 254951 21301
974 21301 -97335 -158775 -145163 -1635 -69583 -141907 44521 2734 92429 -16166 102155
963 102155 225099 206831 -57192 -120582 92570 59701 -90003 102118 195029 200998 153372
952 153372 68842 104266 71593 -89911 -9636 -130006 -91390 -19680 159457 150933 -205441
941 -205441 -159819 114966 142795 135816 230987 149670 -47422 -174244 43327 -47849 -213596
930 -213596 -196277 -73774 -28864 -16263 -1808 26623 -37000 78394 16271 60096 65840 45091
918 45091 84581 285831 78004 49160 -49001 55210 -105007 -108703 46917 -68061 -5058
907e058r1188m7895m4844N7119j17545k0180k2350K67026O0935j94351n693R4870
895f9154J53911j36477r3575j33447J78015J69910j94533P4642O2174k61899n5457
884c05890J56594J27285N4476j39019j04150j6506l1692J20600J9512J95019m9902
873B6327j16408J91295j05636j87118K02929j69118K9791L364j29798k6426k8866
862c09664L47521j34313J17677J14958j20060j92559M8583L88731J32747k54422
852A39199q7168O8001O5701k40341j98880J24516p4989K27384m8436j35216k3480
841a83709j31589k83054L04568J01966J10609k7529L8690R2755j65944L14691
831A71454q4232M7873L8581k23914R9385J03278K6655Q0644q4545j03471R1669
$$ plain form
907 -5058 -96246 -144141 -188985 -131866 -249411 -269591 -291941 -24915 36020 -158331 -164024 -69154
895 -69154 84757 -51720 -145295 -278742 -100727 69183 -125350 -50708 11466 -250433 -305890
884 -305890 -149296 -22011 32465 -106554 -210704 -227210 -258902 -138302 -118790 76229 26327
873 26327 -90081 101214 -4422 -191540 11389 -157729 -127938 -124574 -254372 -280798 -309664
862 -309664 37857 -96456 21221 136179 16119 -176440 -127857 260874 393621 139199
852 139199 52031 120032 185733 -54608 -253488 -128972 -203961 23423 -25013 -160229 -183709
841 -183709 -315298 -598352 -293784 -191818 -81209 -108738 -70048 22707 -143237 171454
831 171454 87222 135095 173676 -50238 49147 152425 179080 259724 175179 71708 163377
820A63377j71291L0798k2232o664O7650K99918l53395r802J86579q9850J33132
809B28220q9394M0296k6506r0508P5809j35331r7059K09672l2224l67484J7073
798b67436L39689m5873N7932j9594j91943l20955K18897K48068K25102j50470
788I3417O3018j03022k961k4405J04595j33132J15649k9630r7434k76988R605
777b81288K41765O7614k8566J29010o2965L6034j9683J7690M7911k82312J28800
766e990M0993J97798m568k04683j6278p571O6978n2131p0885K7568r3652p5784
754a98205l9119K72019J22827j94604J2818j37642o4238J96479K4934j3853P0820
743E2236r6472k03442k6143J78572J56135J28214j7008j72416l21906k2333L64423
$$ plain form
820 163377 -7914 22884 652 -6012 61638 361556 8161 -1641 184938 95088 228220
809 228220 138826 179122 152616 62108 137917 2586 -94473 115199 82975 -284509 -267436
798 -267436 72253 26380 84312 64718 -127225 -448180 -229283 18785 243887 93417
788 93417 156435 53413 50452 26047 130642 -2490 113159 83529 -13905 -290893 -281288
777 -281288 -39523 28091 -475 128535 65570 101604 81921 99611 147522 -134790 -5990
766 -5990 35003 232801 228233 23550 7272 -299 66679 14548 -56337 -28769 -122421 -198205
754 -198205 -237324 34695 157522 -37082 -24264 -161906 -226144 -29665 -4731 -18584 52236
743 52236 -44236 -247678 -273821 -95249 60886 189100 172092 -324 -322230 -344563 19860
732A9860N5228k643r1668M0846j80235n9665R2398Q2284j97442J66027J09906
721C4896q8030O005J4117P2010q550J06068J78115n5043k16156j08635L8821k39891
709b66273Q124K285j75053r3309J55140j04164O5466M18382L05600Q6836l37606
698F5428j2411j35888J80822j31165J3363J1428j91M7590r7057n2121J8097P0162
686b1943O1121M588o859q5807K31294J11020k62796l04612J21654L8433j6340
675a30247P3433j77688K08993k8023K11912r4338r6281J67359k59641j63633J29825
664a58329K21132j91392N288o6068k5815K05987j95810N2041K46516K20962l79827
653f5315j40120j56409K59332Q8779R7737j77555J47605j89826p0307N8148K70147
$$ plain form
732 19860 75088 72445 -19223 21623 -158612 -218277 -125879 -43595 -241037 -75010 34896
721 34896 -53134 -47129 -33012 38998 30448 136516 314631 259588 43432 -65203 -26382 -266273
709 -266273 -258149 -255864 -430917 -524226 -369086 -473250 -407784 10598 316198 403034 65428
698 65428 53017 -82871 97951 -33214 -19851 -8423 -8614 38976 -58081 -110202 -92105 -21943
686 -21943 39178 43766 36907 -48900 182394 293414 30618 -273994 -152340 -113907 -130247
675 -130247 -56814 -234502 -25509 -53532 158380 64042 -32239 135120 -124521 -288154 -158329
664 -158329 62803 -128589 -123301 -189369 -215184 -9197 -205007 -152966 93550 314512 -65315
653 -65315 -205435 -361844 -102512 -13733 84004 -93551 54054 -135772 -206079 -147931 122216
642A22216l8527m4795k0743m1078j80016P5455L75724j33250j58728R1033N0453
631I7744p2254n0538N972M9423n7496K5942j72014Q4191j7362P4606j15680m0835
619a88301j85544K93775J52793R300k12421o2038J33137L6450L08336k61011O2952
608H7428J35353l48850j2354J62407J18494r2025j89240j68895O3389M993J267
597b38033k8878J90245q2556q6938J8406m4352Q9275J57199K4231j53227j50311
586c04939L23677k334j40860J28991j1868J3831k2331K767o2627j88582K16998
575d7277j40639J00254Q7490O972j81528M7925L5509n0743j30225j10515J17074
564b65703Q179j2743J01591l5580o0393J86908K80340k41988r6677J6611k0365
$$ plain form
642 122216 83689 38894 18151 -22927 -202943 -127488 248236 114986 -43742 47291 97744
631 97744 25490 -25048 -19076 30347 -27149 -1207 -173221 -89030 -106392 -31786 -147466 -188301
619 -188301 -373845 -80070 72723 82023 -130398 -192436 -59299 -22849 285487 24476 87428
608 87428 222781 -126069 -138423 23984 142478 50453 -138787 -307682 -244293 -239300 -238033
597 -238033 -266911 -76666 -159222 -246160 -227754 -272106 -182831 -25632 -1401 -154628 -304939
586 -304939 18738 16404 -124456 4535 -7333 6498 -15833 -13066 -75693 -264275 -47277
575 -47277 -187916 -87662 -172 6800 -174728 -126803 -91294 -142037 -272262 -382777 -265703
564 -265703 -257524 -270267 -168676 -204256 -264649 -77741 202599 -39389 -136066 -119455 -139820
553a39820R4163j41555j79889J36194J10627l11586K09726K51447j51984k21932
543c44609J01949k6882K81667P5464m4789j12521j27693M6881q7060l5556K48583
532b4566K9610J95001j94161l67157N0388k3122M31062o8975k89484P163j21220
521c75461J18023J42050J54459j15407j30077L6770R3080j22849o834n464J1320
510b00390K6560p3883j13823P0441O7072L849J26850r543j23036J77433r0985
499a39455o0295K467p8594J09113K834r7921K22029P6266L0046Q5605k38664K1832
487f4737M8401j58600n1830R2917M5864l5548L9470k9951Q6354N7019r4180m5864
475a10685L8696j61892o6559J83932k7410o7579r6869J79633K18252P1707o6649
$$ plain form
553 -139820 -45657 -187212 -367101 -230907 -120280 -431866 -222140 29307 -122677 -344609
543 -344609 -242660 -269542 12125 87589 42800 -69721 -197414 -150533 -237593 -273149 -24566
532 -24566 5044 200045 5884 -361273 -310885 -334007 97055 28080 -261404 -254241 -375461
521 -375461 -257438 -115388 39071 -76336 -206413 -169643 -76563 -199412 -206246 -211710 -200390
510 -200390 -173830 -247713 -361536 -291095 -224023 -220174 -93324 -102867 -225903 -48470 -139455
499 -139455 -199750 -197283 -275877 -166764 -163930 -261851 -39822 36444 66490 152095 -86569 -64737
487 -64737 -16336 -174936 -226766 -133849 -87985 -123533 -84063 -114014 -27660 29359 -64821 -110685
475 -110685 -71989 -233881 -300440 -116508 -143918 -211497 -308366 -128733 89519 161226 94577
464I4577j85821k7611m5686j48941K63739Q2101p5632K1827q0577P57J17100l21834
452c06001k2087O0831J30542J78323j58287p0505L7610K17339k01949k08200J18792
441b23592J08686R7639Q5309k14827J03493k08633j26311L15350j25330k6621
431b14837R9509K3175j41760J25581K47328j93094o9294j34454J98163m1122o305
420a07110K05595k0221O596j12893M0953l5461r2404k17327j01466J67142K28179
409c8417k13888M0348n794J72195k50922j02739n609J7583L08578Q3392n7710
398e2983j40455J0242M2387M3317P4479j78956n7327K19912j03769n2129M4379
387a50903K94733p7553k94037M6639j67626p590J93338p8084j59403K64201L6410
$$ plain form
464 94577 -91244 -118855 -164541 -313482 -49743 32358 -43274 -21447 -102024 -101267 15833 -306001
452 -306001 -328088 -267257 -136715 41608 -116679 -187184 -149574 67765 -134184 -342384 -223592
441 -223592 -114906 -17267 68042 -146785 -43292 -251925 -378236 -62886 -188216 -214837
431 -214837 -115328 -92153 -233913 -108332 138996 -54098 -123392 -257846 -59683 -100805 -107110
420 -107110 98485 78264 84860 -28033 12920 -22541 -114945 -332272 -433738 -266596 -38417
409 -38417 -252305 -211957 -217751 -45556 -296478 -399217 -404826 -387243 -78665 4727 -52983
398 -52983 -193438 -183196 -140809 -97492 -23013 -201969 -259296 -39384 -143153 -195282 -150903
387 -150903 143830 66277 -227760 -181121 -348747 -356337 -162999 -241083 -400486 -136285 -99875
376i9875j37142L0927k28346N5917J49452J66433k68206L02772N9897j93147J04393
365e6925R5238M4487j13976k96626o797J47646n7008K25961j14240j87359o2844
354c82443p3008J89229K42465j0423k49386N4521Q6760m555R088o9753O2549j45148
342b90104L1122J20950R2466K5736r2032n7200k10731K20388k4754j31242M2606
331b72795R5559P4035k3628R127k43852O2557J14129l5534n5179J00865L4056
320a40660o6784q5042J26731l2133K80019j50846k69359l9094J40225J59880k43717
309c20780q8392P3498n0539N6298K77941k4223J29354j20060l50129J74068m7048
298b90012j20630O1234j78869k441K5710r5197J67569J75781M7128J06005l10014
$$ plain form
376 -99875 -237017 -206090 -434436 -378519 -229067 -62634 -330840 -28068 31829 -161318 -56925
365 -56925 38313 82800 -31176 -327802 -334599 -186953 -243961 -18000 -132240 -319599 -382443
354 -382443 -455451 -266222 -23757 -34180 -283566 -229045 -142285 -146840 -137752 -207505 -144956 -290104
342 -290104 -258982 -138032 -45566 -19830 -111862 -169062 -379793 -159405 -184159 -315401 -272795
331 -272795 -177236 -103201 -126829 -117702 -361554 -298997 -184868 -220402 -275581 -174716 -140660
320 -140660 -207444 -292486 -165755 -197888 82131 -68715 -338074 -377168 -236943 -77063 -320780
309 -320780 -409172 -335674 -386213 -329915 -51974 -76197 53157 -66903 -417032 -242964 -290012
298 -290012 -410642 -349408 -528277 -530718 -505008 -600205 -432636 -256855 -209727 -103722 -413736
287d13736L35436k83175n833M82707k04682J4570j69137j07273J46580P9555j73887
276b98875j28483K08791j48970k31342K20509K14072L2403n4714k3112j06060
266c15781J02857o3832Q8807Q2208K019M6012j55325j82753Q8863l6218K09221
255a33922J17505j12864O230j9058j41269K2062j1991k7196o9350k5067J12824
244b82096Q6327l004m7569K22847m3716r9957j14198R1140R9013J6115Q7175j75693
232a63616j81574N9788m426J74901Q0160l45766J45524m307m2346j06338L38094
221d9906r5647j62155Q7408n9378q4742R3592L1803r6890K96656k49136l92687
210f81082O3462K54544J08582J78377L4737R4912k93727P5826O1639j45439j5215
$$ plain form
287 -413736 -78300 -361475 -367308 115399 -89283 -74713 -243850 -351123 -204543 -124988 -298875
276 -298875 -427358 -218567 -367537 -598879 -378370 -164298 -131895 -186609 -209721 -315781
266 -315781 -212924 -276756 -187949 -105741 -103722 -57710 -213035 -395788 -306925 -343143 -133922
255 -133922 -16417 -129281 -123051 -142109 -283378 -261316 -273307 -300503 -369853 -394920 -282096
244 -282096 -195769 -198773 -246342 -23495 -67211 -167168 -281366 -190226 -91213 -75098 12077 -163616
232 -163616 -345190 -285402 -289828 -114927 -34767 -380533 -235009 -239316 -281662 -388000 -49906
221 -49906 -145553 -307708 -220300 -279678 -364420 -270828 -239025 -335915 -39259 -288395 -681082
210 -681082 -617620 -363076 -254494 -76117 -41380 53532 -240195 -164369 -102730 -248169 -263384
199b63384J41006K05393J3144k71992l659q5658n2897J83121J11585k03380j16581
188c43302M3934P712L3085K0409K801o9272n6159k41336J74614L14448R3433j26518
176a46151j56046q209r4970J78815m7790K8281j15206J89407P6640n7389l8507
165a91125Q670k41994m4305N9668M1037K59638r8001j47116J1847L3332n9727
154c68076n5399j19472O3824m4360K7865O6060J84375o7567j52831O5234K64905
143a35442j36520j00403J84760j03090j09854J42541R2763j04987q6504Q2491
133b74245L08047o2644p9407j22007k01515P3271J66146J27311o3245j16477j98242
122d43007J79784J45900j36022l2722J2680p6697J73396J16353k72415p1307O2429
$$ plain form
199 -263384 -122378 83015 96159 -175833 -179492 -265150 -318047 -134926 -23341 -226721 -343302
188 -343302 -299368 -291656 -258571 -238162 -235361 -304633 -360792 -602128 -427514 -113066 -19633 -146151
176 -146151 -302197 -310406 -405376 -226561 -274351 -246070 -361276 -171869 -95229 -152618 -191125
165 -191125 -182455 -424449 -468754 -409086 -368049 -108411 -206412 -353528 -341681 -308349 -368076
154 -368076 -423475 -542947 -479123 -523483 -495618 -429558 -245183 -312750 -465581 -400347 -135442
143 -135442 -271962 -372365 -187605 -290695 -400549 -258008 -165245 -270232 -356736 -274245
133 -274245 33802 -28842 -108249 -230256 -431771 -358500 -192354 -65043 -128288 -244765 -443007
122 -443007 -263223 -117323 -253345 -286067 -273387 -350084 -176688 -60335 -332750 -404057 -341628
111c41628K29364q2848j15142J1052M0561j43621q4990o4369l0088K80416q6075
100c87368J51075k4857j45831J7691J17862j88334p1383m0168J90585J43754J1323
89b25651j07098o015P2687n4114L8070J18866l37495L413J87190r3487n3203m8778
77e05615L4918J31956k6642M9543l8185R9396j01990j43525J63385K5969K8140
66b82650O1879J20574m3252j21261j13404Q9661J72973j24805j64728O7466R7715
55b39832O4570P844j5412J3981n2785R4024o3083k20904J23928Q6581k6350m696
43b32134l7312q6518J02599J7496k7991l7712K018n657O7804j94756o921L0398
31d08686P4868J64368J9276N5930k22253J03857P6871j40342O1891j02308o9389
$$ plain form
111 -341628 -112264 -195112 -310254 -299202 -258641 -402262 -487252 -551621 -581709 -301293 -387368
100 -387368 -236293 -261150 -406981 -389290 -271428 -459762 -531145 -571313 -380728 -236974 -225651
89 -225651 -332749 -338764 -266077 -320191 -282121 -163255 -500750 -497337 -310147 -403634 -456837 -505615
77 -505615 -470697 -338741 -365383 -315840 -354025 -254629 -356619 -500144 -336759 -310790 -282650
66 -282650 -220771 -100197 -143449 -264710 -378114 -288453 -115480 -240285 -405013 -337547 -239832
55 -239832 -175262 -167418 -182830 -168849 -221634 -127610 -190693 -411597 -287669 -201088 -227438 -232134
43 -232134 -269446 -355964 -253365 -235869 -263860 -301572 -299554 -305211 -237407 -432163 -439084 -408686
31 -408686 -333818 -169450 -150174 -94244 -316497 -212640 -135769 -276111 -214220 -316528 -385917
20c85917j17255J01552j27177J57992P3343J73267j45394q3362J37688J32046
10h3217k10179k56326l6024K06138n654j51670J61654m2038M3110j21524
0d95730
$$ plain form
20 -385917 -503172 -401620 -528797 -370805 -297462 -124195 -269589 -352951 -215263 -83217
10 -83217 -293396 -549722 -585746 -379608 -385262 -536932 -375278 -417316 -374206 -495730
0 -495730
$$ Imaginary data points
##PAGE= N=2
##DATA TABLE= (X++(I..I)), XYDATA
16383b642463Q1477J63285k8030j03659K23510L4243j20296p1133L1166J91397
16373b240503j35108m83M3811P7905L4557R8736r5178K2908M8207J69059K5541
16362a950548k2270J72656R4913J73000l3236J8396k32147J74806M4747j28187
16352a687870j9945J05893J15601r463P5392Q6918J77017j70767N2945L8659J9841
16341a215779j45417J66186O7585q3045J01850O500l9360J11267J84305p1665
16331i17573m2724J23996j02156r2542L10224R5276m6430K9265K1678K07753K01175
16320b12058j35495J7532N2592q7340q1512P1667J0553j49243p192K0602J37337
16309c62557K76405m4425N5152J25364r983l4089O3621m217m8884l6653N7215
$$ plain form
16383 -2642463 -2560986 -2397701 -2425731 -2529390 -2305880 -2271637 -2391933 -2463066 -2431900 -2240503
16373 -2240503 -2375611 -2376094 -2332283 -2254378 -2219821 -2121085 -2216263 -2193355 -2145148 -1976089 -1950548
16362 -1950548 -1972818 -1800162 -1705249 -1532249 -1565485 -1547089 -1779236 -1604430 -1559683 -1687870
16352 -1687870 -1707815 -1601922 -1486321 -1495784 -1420392 -1333474 -1156457 -1327224 -1274279 -1235620 -1215779
16341 -1215779 -1361196 -1195010 -1127425 -1210470 -1108620 -1102120 -1141480 -1030213 -845908 -917573
16331 -917573 -960297 -836301 -938457 -1030999 -720775 -625499 -671929 -642664 -620986 -413233 -212058
16320 -212058 -347553 -330021 -277429 -364769 -446281 -374614 -364061 -513304 -520496 -499894 -362557
16309 -362557 -86152 -130577 -75425 49939 39956 5867 69488 65271 16387 -20266 36949
16298C6949K09076l8350j26116l4577J1467J08157J91516J88537j18019K7062
16288D55702J52066j27594Q725R93M6145k6611K738J06398K937L7143J3568j09606
16276E62604J22018j733l4749J06633p4761K41849j14396M2116j25326j8896J26870
16265H32229J50298J26519J0945k256j2767k2576r0202k0347J92344l9701J03264
16254A227750k4609j01038M6456K03207L0140L3164J80575j38789J22771j45781
16244A433846j2144N5636o305j44476J17716J22071j2358o4229J61504j07741
16234A543520J48148O5763o7919L6152K20674n1948j47230l8345Q3027J28240
16224A920082j15759q9949R0782j55704O2256J49317R172R4956L4044o2640q1729
$$ plain form
16298 36949 246025 207675 81559 46982 58449 166606 358122 546659 428640 455702
16288 455702 607768 480174 488899 489892 536037 509426 512164 618562 621499 658642 672210 562604
16276 562604 684622 682889 648140 754773 680012 921861 807465 849581 724255 705359 832229
16265 832229 982527 1109046 1119991 1117735 1104968 1082392 992190 971843 1164187 1124486 1227750
16254 1227750 1203141 1102103 1148559 1351766 1381906 1415070 1595645 1456856 1579627 1433846
16244 1433846 1421702 1477338 1471033 1326557 1444273 1566344 1553986 1489757 1651261 1543520
16234 1543520 1691668 1757431 1689512 1725664 1946338 1894390 1747160 1708815 1791842 1920082
16224 1920082 1804323 1714374 1805156 1649452 1711708 1861025 1870197 1965153 1999197 1936557 1854828
16213A854828K01100N8152R4477k24120j7989J30711m172J75782m68k24883L11471
16202B354889j08173j40537l5617J15258j79275K7568K50013K6891j49354J127
16192B162790P5101n8980m1894l7873K14497P0182m4555K1225j14427J64393j36890
16181B273569O6148J18981j34352J09348k06456N0432J79086J24484J09613K52124
16171B942977j30470k88705o405j08316K3667M68j04080L93114K3978k34511J5148
16160B526865J57383J1122k37726j5640J52653J3869m6952k0380M3801j33299
16150B451696J40528n6578R7863k66743K23915P5044N2082Q685r1209L2901J4294
16139B682478K3987R4016K98964j79253j90790M205J40592K44259k03626k11453
$$ plain form
16213 1854828 2055928 2114080 2208557 1984437 1966448 2097159 2092987 2268769 2268301 2043418 2354889
16202 2354889 2246716 2106179 2070562 2185820 2006545 2034113 2284126 2311017 2161663 2162790
16192 2162790 2237891 2178911 2137017 2099144 2313641 2383823 2339268 2360493 2246066 2410459 2273569
16181 2273569 2339717 2458698 2324346 2433694 2227238 2277670 2456756 2581240 2690853 2942977
16171 2942977 2812507 2523802 2517397 2409081 2432748 2433216 2329136 2722250 2746228 2511717 2526865
16160 2526865 2684248 2695370 2457644 2442004 2594657 2608526 2561574 2541194 2584995 2451696
16150 2451696 2592224 2535646 2633509 2366766 2590681 2665725 2717807 2726492 2635283 2668184 2682478
16139 2682478 2706465 2800481 3099445 2920192 2729402 2733607 2874199 3118458 2914832 2703379
16129B703379j6235R7528J29350r738m9721n6931L4827j28869J7203n2390l0153
16118B638250J56629q046J97691o969k29669m6749J88195R7382R8490J75165l1048
16107C229321O9289j72320k36191L4828q105j78963l307Q6366m0935Q9772J71911
16096C041666q4448K45870j77022J636J04330k07220k8031J28336j3998J52187
16086C163306J7149m8356n5171N9648j05978r2007J68173j92326r3531J16948
16076B937855n7446J6472O1963O8171q8151k17947k5973j74029K29118K10548
16066B960581J2317r8894j2788L16981j08582j57438L3865M2943n8876J89631
$$ plain form
16129 2703379 2687144 2784672 2914022 2904284 2854563 2797632 2832459 2703590 2720793 2668403 2638250
16118 2638250 2794879 2786833 2984524 2977555 2747886 2701137 2889332 2986714 3085204 3260369 3229321
16107 3229321 3298610 3126290 2890099 2924927 2916822 2737859 2734552 2820918 2779983 2869755 3041666
16096 3041666 2957218 3203088 3026066 3027702 3132032 2924812 2896781 3025117 3011119 3163306
16086 3163306 3180455 3132099 3076928 3136576 3030598 2938591 3106764 2914438 2820907 2937855
16076 2937855 2880409 2896881 2958844 3027015 2938864 2720917 2694944 2520915 2750033 2960581
16066 2960581 2972898 2874004 2861216 3178197 3069615 2912177 2946042 2988985 2930109 3119740
$$ [...]
##END NTUPLES=NMR SPECTRUM
##END=
