##TITLE=1H_CG-1150-A
 CDCl3, 8 sc, 
 5.08.2021
##JCAMPDX= 6.0         $$ Bruker NMR JCAMP-DX V2.0
##DATA TYPE= NMR SPECTRUM
##DATA CLASS= NTUPLES
##ORIGIN= UXNMR, Bruker Analytische Messtechnik GmbH
##OWNER= root
$$ XWIN-NMR		Version 3.5
$$ Thu Aug  5 10:38:15 2021 Russian Standard Time (UT+4h)  she@DPX200
##.OBSERVE FREQUENCY= 200.131506
##.OBSERVE NUCLEUS= ^1H
##.ACQUISITION MODE= SIMULTANEOUS
##.ACQUISITION SCHEME= undefined
##.AVERAGES= 8
##.DIGITISER RES= 18
##SPECTROMETER/DATA SYSTEM= spect
##.PULSE SEQUENCE= zg30
##.SOLVENT NAME= CDCl3
##.SHIFT REFERENCE= (INTERNAL, CDCl3, 0, 17.4959)
##AUDIT TRAIL= $$ (NUMBER, WHEN, WHO, WHERE, WHAT)
$$ ##TITLE= Audit trail, XWIN-NMR		Version 3.5
$$ ##JCAMPDX= 5.01
$$ ##ORIGIN= Bruker BioSpin GmbH
$$ ##OWNER= she
$$ F:/spectra/data/she/nmr/H-F/1/pdata/1/auditp.txt
$$ ##AUDIT TRAIL=  $$ (NUMBER, WHEN, WHO, WHERE, WHAT)
(   1,<2021-08-05 10:36:44.07 +0400>,<she>,<DPX200>,
      <created by zg, POWCHK disabled, PULCHK disabled
       configuration hash MD5:
       00 E9 B6 7A A2 85 ED C7 34 08 36 98 17 FE 4E 26
       data hash MD5: 16K
       F9 71 9C 82 60 94 2D F2 0A B5 6D 44 56 E9 D5 07>)
(   2,<2021-08-05 10:36:46.96 +0400>,<she>,<DPX200>,
      <Start of raw data processing
       efp BC_mod = 2 LB = 0.24 FT_mod = 6 PKNL = 1 PHC0 = -13358.92 PHC1 = 15.201 SI = 16K 
       data hash MD5: 16K
       3A 78 BB F2 46 63 75 15 FF 06 75 4D 95 CD 96 72>)
(   3,<2021-08-05 10:37:16.28 +0400>,<she>,<DPX200>,
      <pk PHC0 = -5.430722 PHC1 = 7.999994 
       data hash MD5: 16K
       25 F3 53 B8 F3 F6 E8 97 46 31 70 84 EE C6 F1 B8>)
(   4,<2021-08-05 10:37:19.48 +0400>,<she>,<DPX200>,
      <abs ABSG = 5 
       data hash MD5: 16K
       72 E1 49 79 1E C1 04 37 9F 79 7A BA 09 56 F2 9B>)
$$ ##END=
$$ 
$$ hash MD5
$$ 06 41 EB CC 44 A3 42 18 87 74 EC 46 FD BA 93 D0
##$RELAX= 
##$RELAX= 
##$RELAX= 
##$RELAX= 
##$RELAX= 
##$RELAX= 
$$ Bruker specific parameters
$$ --------------------------
##$DU= <F:/spectra>
##$EXPNO= 1
##$NAME= <H-F>
##$PROCNO= 1
##$TYPE= <nmr>
##$USER= <she>
##$AMP= (0..31)
100 100 100 100 100 100 100 100 100 100 100 100 100 100 100 100 100 100 
100 100 100 100 100 100 100 100 100 100 100 100 100 100 
##$AQSEQ= 0
##$AQ_mod= 1
##$AUNM= <au_zg>
##$AUTOPOS= <>
##$BF1= 200.13
##$BF2= 200.13
##$BF3= 200.13
##$BF4= 200.13
##$BF5= 200.13
##$BF6= 200.13
##$BF7= 200.13
##$BF8= 200.13
##$BYTORDA= 1
##$CFDGTYP= 0
##$CFRGTYP= 5
##$CHEMSTR= <none>
##$CNST= (0..31)
1 1 145 1 1 1 1 1 1 1 1 1 1 1 1 1 1 1 1 1 1 1 1 1 1 1 1 1 1 1 1 1 
##$CPDPRG= <>
##$CPDPRG1= <>
##$CPDPRG2= <>
##$CPDPRG3= <>
##$CPDPRG4= <mlev>
##$CPDPRG5= <mlev>
##$CPDPRG6= <mlev>
##$CPDPRG7= <mlev>
##$CPDPRG8= <mlev>
##$CPDPRGB= <>
##$CPDPRGT= <>
##$D= (0..31)
0 1.2 0 0 0 0 0 0 0 0.06 0 0.03 0 0 0 0 0.0002 0 0 0 0 0 0 0 0 0 0 0 0 
0 0 0 
##$DATE= 1628145403
##$DBL= (0..7)
120 120 120 120 120 120 120 120 
##$DBP= (0..7)
150 150 150 150 150 150 150 150 
##$DBP07= 0
##$DBPNAM0= <>
##$DBPNAM1= <>
##$DBPNAM2= <>
##$DBPNAM3= <>
##$DBPNAM4= <>
$$ [...]
##$SUBNAM3= <"">
##$SUBNAM4= <"">
##$SUBNAM5= <"">
##$SUBNAM6= <"">
##$SUBNAM7= <"">
##$SUBNAM8= <"">
##$SUBNAM9= <"">
##$SW= 20.0188882624521
##$SWIBOX= (0..15)
0 0 2 0 0 0 0 0 0 0 0 0 0 0 0 0 
##$SW_h= 4006.41025641026
##$TD= 16384
##$TD0= 1
##$TE= 0
##$TE2= 300
##$TE3= 300
##$TEG= 300
##$TL= (0..7)
0 120 120 120 120 120 120 120 
##$TP= (0..7)
150 150 150 150 150 150 150 150 
##$TP07= 0
##$TPNAME0= <>
##$TPNAME1= <>
##$TPNAME2= <>
##$TPNAME3= <>
##$TPNAME4= <>
##$TPNAME5= <>
##$TPNAME6= <>
##$TPNAME7= <>
##$TPOAL= (0..7)
0.5 0.5 0.5 0.5 0.5 0.5 0.5 0.5 
##$TPOFFS= (0..7)
0 0 0 0 0 0 0 0 
##$TUNHIN= 0
##$TUNHOUT= 0
##$TUNXOUT= 0
##$USERA1= <user>
##$USERA2= <user>
##$USERA3= <user>
##$USERA4= <user>
##$USERA5= <user>
##$V9= 5
##$VALIST= <valist>
##$VCLIST= <CCCCCCCCCCCCCCC>
##$VD= 0
##$VDLIST= <DDDDDDDDDDDDDDD>
##$VPLIST= <PPPPPPPPPPPPPPP>
##$VTLIST= <TTTTTTTTTTTTTTT>
##$WBST= 1024
##$WBSW= 4
##$XGAIN= (0..3)
0 0 0 0 
##$XL= 0
##$YL= 0
##$YMAX_a= 86396
##$YMIN_a= -80938
##$ZGOPTNS= <>
##$ZL1= 120
##$ZL2= 120
##$ZL3= 120
##$ZL4= 120
##$ABSF1= 17.42746
##$ABSF2= -2.591578
##$ABSG= 5
##$ABSL= 3
##$ALPHA= 0
##$AQORDER= 0
##$ASSFAC= 0
##$ASSFACI= 0
##$ASSFACX= 0
##$ASSWID= 0
##$AUNMP= <proc_1d>
##$AZFE= 0.1
##$AZFW= 0.1
##$BCFW= 0
##$BC_mod= 2
##$BYTORDP= 0
##$COROFFS= 0
##$CY= -3
##$DATMOD= 1
##$DC= 0
##$DFILT= <>
##$DTYPP= 0
##$F1P= 0
##$F2P= 0
##$FCOR= 1
##$FTSIZE= 16384
##$FT_mod= 6
##$GAMMA= 0
##$GB= 0
##$INTBC= 1
##$INTSCL= 1.334414e-10
##$ISEN= 128
##$LB= 0.24
##$LEV0= 0
##$LPBIN= 0
##$MAXI= 10000
##$MC2= 0
##$MEAN= 0
##$ME_mod= 0
##$MI= 1.114404
##$NCOEF= 0
##$NC_proc= -8
##$NLEV= 6
##$NOISF1= 3.799351
##$NOISF2= 2.8
##$NSP= 0
##$NTH_PI= 0
##$NZP= 0
##$OFFSET= 17.49589
##$PC= 1
##$PHC0= -13364.35
##$PHC1= 23.20099
##$PH_mod= 1
##$PKNL= yes
##$PPARMOD= 0
##$PSCAL= 0
##$PSIGN= 0
##$REVERSE= no
##$SF= 200.13000775329
##$SI= 16384
##$SIGF1= 3
##$SIGF2= 2
##$SINO= 5.538805
##$SIOLD= 16384
##$SREGLST= <1H.CDCl3>
##$SSB= 0
##$STSI= 16384
##$STSR= 0
##$SW_p= 4006.41025641026
##$SYMM= 0
##$S_DEV= 0
##$TDeff= 16384
##$TDoff= 0
##$TI= <>
##$TILT= no
##$TM1= 0
##$TM2= 0
##$TOPLEV= 0
##$USERP1= <user>
##$USERP2= <user>
##$USERP3= <user>
##$USERP4= <user>
##$USERP5= <user>
##$WDW= 1
##$XDIM= 16384
##$YMAX_p= 369787368
##$YMIN_p= -1274029
$$ End of Bruker specific parameters
$$ ---------------------------------
##NTUPLES= NMR SPECTRUM
##VAR_NAME=  FREQUENCY,     SPECTRUM/REAL,   SPECTRUM/IMAG
##SYMBOL=    X,             R,               I
##VAR_TYPE=  INDEPENDENT,   DEPENDENT,       DEPENDENT
##VAR_FORM=  AFFN,          ASDF,            ASDF
##VAR_DIM=   16384,         16384,           16384
##UNITS=     HZ,            ARBITRARY UNITS, ARBITRARY UNITS
##FACTOR=    0.24454680195387, 1,            1
##FIRST=     3501.45253404624, 0,            0
##LAST=      -504.957722364015, 0,           0
##MIN=       -504.957722364015, -1274029,    0
##MAX=       3501.45253404624, 369787368,    0
$$ Real data points
##PAGE= N=1
##DATA TABLE= (X++(R..R)), XYDATA
$$ [...]
5677g187j74305k43300M06278J42595L4738q4604m96907R8804M40767k6579m06177
$$ -7187 -181492 -424792 -18514 124081 158819 74215 -422692 -323888 116879 90300 -315877
5666c15877K43691n0751o42813J64341j78133Q1815k0834o148L52980j44037J88800
$$ -315877 -72186 -122937 -765750 -601409 -779542 -697727 -718561 -724709 -371729 -515766 -326966
5655c26966L52814k57068j69378J79502N37133m49425j59715N44867k39783k10403
$$ -326966 25848 -231220 -400598 -221096 316037 -133388 -293103 251764 11981 -198422
5645a98422k12764j04896K06664J97942l52168J17589L37529l03932k88904K42582
$$ -198422 -411186 -516082 -309418 -111476 -463644 -346055 -8526 -312458 -601362 -358780
5635c58780o9762K27302n2686j09500m21681L67968M56995K42639k95929m0657
$$ -358780 -428542 -201240 -253926 -363426 -785107 -417139 39856 282495 -13434 -54091
5625e4091J29419m63381j83420J99362K35903j71356p9957K14506n33934N18465
$$ -54091 75328 -388053 -571473 -372111 -136208 -307564 -387521 -173015 -706949 -188484
5615a88484N69147k25010l28876o0534m07307K61133P08353j50773m8382K609
$$ -188484 380663 155653 -173223 -233757 -641064 -379931 328422 177649 129267 131876
5605A31876k36737J93057j60587K55034j34415k51915M66720K0077m70403k52147
$$ 131876 -104861 88196 -72391 182643 48228 -203687 263033 283110 -187293 -439440
5595d39440Q6718J37967K98162R7553J84876p0276l13139k31012j3738j35913
$$ -439440 -352722 -214755 83407 180960 365836 295560 -17579 -248591 -262329 -398242
5585c98242R0524K59453m9052q2234L01069M7954k00104O595J75501K61545m93002
$$ -398242 -307718 -48265 -97317 -179551 121518 169472 -30632 -24037 151464 413009 -79993
5574g9993n4046K19695j45028K58993p2465p2876J48088K49122n06051J09087
$$ -79993 -134039 85656 -59372 199621 127156 54280 202368 451490 -54561 54526
5564E4526K05888l66194J83107l14036j94916M90430r4866m5064k62756j18410
$$ 54526 260414 -105780 77327 -236709 -431625 58805 -36061 -81125 -343881 -462291
5554d62291K14576J47630Q4943m84722K72343K96371j93052J68281K48292k26044
$$ -462291 -247715 -100085 -15142 -499864 -227521 68850 -124202 44079 292371 66327
5544F6327k16465L58526k18763j12646n5619L57430K13616o2231j33744o61M7762
$$ 66327 -150138 208388 -10375 -123021 -178640 178790 392406 330175 196431 195770 243532
5533B43532j04844l77084M85611M12709k43563r0926l44160J14134M43940l09681
$$ 243532 138688 -238396 247215 659924 416361 325435 -18725 95409 539349 229668
5523B29668M1074n1909l1257j37115m56622M3915K85072j77808K78703R8045j36446
$$ 229668 270742 218833 187576 50461 -406161 -362246 -77174 -254982 23721 121766 -14680
5512a4680J34231k59599R6543L8447k5284m13851K15870r5956r3902L51798J28148
$$ -14680 119551 -140048 -43505 -5058 -30342 -444193 -228323 -324279 -418181 -66383 61765
5501F1765k2870K0054K68254J42535p11964J513J42106j59387K48868n42312L28311
$$ 61765 38895 58949 327203 469738 -242226 -240713 -98607 -257994 -9126 -551438 -223127
5490b23127J87101k62257L67173K28351l30025m9390J3675R7954J91701K00697
$$ -223127 -36026 -298283 68890 297241 -32784 -82174 -68499 29455 221156 421853
5480D21853k86552r7966J01232q33271K58196O21585k19637k70294N5743m2979
$$ 421853 135301 37335 138567 -694704 -436508 185077 -34560 -304854 -249111 -292090
5470b92090J58490L90775K13167m84457J86170J63481k56670L09406n12895J89336
$$ -292090 -133600 257175 470342 -14115 172055 335536 78866 388272 -124623 64713
5460F4713J39928j41761L71237k66232l76094J63804J39207O7248j77835J13148
$$ 64713 204641 62880 434117 167885 -208209 -44405 94802 162050 -15785 97363
5450I7363K12906k55826k45619K64552r9299j67770j915k40689K73783o2961p8658
$$ 97363 310269 54443 -191176 73376 -25923 -193693 -195608 -436297 -162514 -225475 -304133
5439c04133Q5586q5299J8539J61568k56226r9342j10375K33653K0002p9733L70727
$$ -304133 -218547 -303846 -285307 -123739 -379965 -479307 -589682 -356029 -336027 -415760 -45033
5428d5033r4676M627K48462l19137j98082l47195L51529N83708j67229J74089
$$ -45033 -139709 -135082 113380 -205757 -403839 -751034 -399505 184203 16974 191063
5418A91063o9013l69329J95650K43944L670j20008K96299M1557r413P0150J40930
$$ 191063 122050 -247279 -51629 192315 195985 75977 372276 413833 404420 474570 615500
5407F15500j56429l14156Q8298L00658k74562M6824j23814m57609K73395n7579
$$ 615500 459071 144915 233213 533871 259309 306133 182319 -275290 -1895 -59474
5397e9474k706k46229j02738L62486L41344k18656j61834J74005K41056m0745
$$ -59474 -62180 -308409 -411147 -48661 292683 74027 -87807 86198 327254 286509
5387B86509K0916l47087j19852l5438j84190p0967l59661l26693K44056J064865
$$ 286509 307425 -39662 -159514 -194952 -379142 -450109 -809770 -1136463 -892407 172458
5377A72458N6799j51459l18748K22294L95495J03874l51985k19883n3407n4318
$$ 172458 229257 77798 -240950 -18656 376839 480713 128728 -91155 -144562 -198880
5367a98880r2k46022K52941R9929j07588K75618P5956j21336K21307k59326K83052
$$ -198880 -198972 -444994 -192053 -92124 -199712 75906 151862 30526 251833 -7493 275559
5356B75559j15656q2907q9296K6666k944l22206L09549K71549k08219Q6188J67404
$$ 275559 159903 76996 -12300 14366 11422 -310784 -1235 270314 62095 148283 315687
5345C15687k82644k8535n38028m7760M06454j08476j43990J43263k42093k11971
$$ 315687 33043 4508 -533520 -581280 -174826 -283302 -427292 -284029 -526122 -738093
5335g38093N93095O25801k82054q27874Q2306j79969J12719M25414L82358l15001
$$ -738093 -144998 480803 198749 -629125 -546819 -726788 -614069 -188655 193703 -121298
5325a21298j55443o970L16738J17655l16336p1476k19937J63919L9771J76206
$$ -121298 -276741 -283711 33027 150682 -165654 -237130 -457067 -293148 -253377 -77171
5315g7171p2884j79028K81800K18074K77219J9962n98913J48991O05225n67174
$$ -77171 -150055 -329083 -47283 170791 448010 467972 -130941 18050 623275 56101
5305E6101j42596K42112J8846n93252o408L46346l91111L65462l04409o5912J09900
$$ 56101 -86495 155617 174463 -418789 -425197 -78851 -469962 -104500 -408909 -474821 -364921
5294c64921L4555l630K51957M06281l19829K71772p92391j29516M39400l34498
$$ -364921 -330366 -333996 -82039 324242 4413 276185 -516206 -645722 -206322 -540820
5284e40820j6753J02568J34881K44022m05261M08257k38619K11667J92389p04645
$$ -540820 -557573 -455005 -320124 -76102 -481363 -73106 -311725 -100058 92331 -612314
5274f12314L58809k42376m2181L35886L37959j05720k80319j0854j5020k65995
$$ -612314 -253505 -495881 -538062 -202176 135783 30063 -250256 -261110 -276130 -542125
5264e42125J53605J10104K11438K82854N52371l21236r8552M9090n4603o95611
$$ -542125 -388520 -278416 -66978 215876 768247 447011 348459 397549 342946 -352665
5254c52665l90448N8532M94540M10232L37842n61844J7970M4068j12607L92968
$$ -352665 -743113 -684581 -190041 220191 558033 -3811 14159 58227 -54380 338588
5244C38588j63626m22401L87058j90420n20251M51359l47681N8613O2189M34389
$$ 338588 174962 -247439 139619 -50801 -571052 -119693 -467374 -408761 -346572 87817
5234H7817l76399m2401J91188k5300j4110M14427j6236j12704J24324J28288K5159
$$ 87817 -288582 -330983 -139795 -165095 -179205 235222 218986 106282 230606 358894 384053
5223C84053K0347k94223k43846J21541r7786N9113j94967k00257J32736L93594
$$ 384053 404400 110177 -133669 -12128 -109914 -50801 -245768 -446025 -313289 80305
5213H0305j01378j95172J87857k6565M41829j73444K122j40931j9617K46114J50499
$$ 80305 -21073 -216245 -28388 -54953 386876 213432 215554 74623 55006 301120 451619
5202D51619m17138l142L98690p97763P2980K34555K87225k46786k60069l7670
$$ 451619 34481 31339 430029 -367734 -294754 -60199 227026 -19760 -279829 -317499
5192c17499K76407j7775j6453j3227P4377r7154l4364Q5740j77831N9567m7580
$$ -317499 -41092 -58867 -75320 -88547 -14170 -111324 -145688 -59948 -237779 -178212 -225792
5181b25792o954O620P8586L32762Q5298m12850J4759J38405J02032k0688J52155
$$ -225792 -232746 -226126 -147540 185222 270520 -142330 -127571 10834 112866 92178 244333
5170B44333J34506J322l41592K78734r9371r7167J01392n25024L61120J7110r5627
$$ 244333 378839 380161 38569 317303 217932 120765 222157 -302867 58253 75363 -20264
5159b0264J54537J29288J13638r889N887j64952k43884l78710M851L93227K02935
$$ -20264 134273 263561 377199 367310 373197 208245 -35639 -414349 -409498 -16271 186664
5148A86664m64933Q6118L98209r9711k57319k3064p6335L47165N50533j179215
$$ 186664 -278269 -192151 206058 106347 -150972 -174036 -250371 96794 647327 -531888
5138e31888K00037N60823J17495K47864p02782k0566J5943j38442P96416l90142
$$ -531888 -331851 228972 346467 594331 -108451 -129017 -113074 -251516 544900 154758
5128A54758J52887k43401l97844j75891L95111K85487j07614l6084j0069M6235
$$ 154758 307645 64244 -333600 -509491 -114380 171107 63493 27409 17340 63575
5118F3575k16736J09623j23940L77678N9444n83358K2628P9283K92975M35688
$$ 63575 -153161 -43538 -167478 210200 269644 -313714 -291086 -211803 81172 516860
5108E16860K8530o4387k62630K77903j12778m00480j55481K07431l6444M76198
$$ 516860 545390 481003 218373 496276 383498 -16982 -172463 34968 -1476 474722
5098D74722O3106l47095j90281L34093k232J734j23166L80219l0987j72461j25574
$$ 474722 537828 190733 452 334545 332313 334047 210881 591100 560113 387652 262078
5087B62078k17001M7588N41681k6059l60392k28869j27549L4390J25896J68178
$$ 262078 45077 92665 634346 608287 247895 19026 -108523 -74133 51763 219941
5077B19941k3315K75450J63134J00120l0285n52965K0729o3884K27360J94871
$$ 219941 196626 472076 635210 735330 705045 152080 172809 108925 336285 531156
5067E31156m88519Q9150L1747L34125J68926k85714K62577J66423n71553m19876
$$ 531156 42637 131787 163534 497659 666585 380871 643448 809871 238318 -181558
5057a81558L22289K7423k30639R4068P1048l16190j36253L2072L94630J50504
$$ -181558 140731 168154 -62485 31583 102631 -213559 -349812 -317740 76890 227394
5047B27394l21015J21405Q7979N4106j03109J14879r9488r6633N9017J49447J52560
$$ 227394 -93621 27784 115763 169869 66760 181639 82151 -14482 44535 193982 346542
5036C46542K29344j01465Q1068O71N3716o63086p0979N0727R4037L4490j76427
$$ 346542 575886 474421 555489 556160 609876 -53210 -124189 -73462 20575 55065 -121362
5025a21362M46369L44588l83759k9788q5903K48156q9911J32288M61114l77700
$$ -121362 325007 669595 285836 256048 170145 418301 328390 460678 921792 544092
5015E44092l41847L97912l90869j06357L17631P9141l988j36698j61958m18017
$$ 544092 202245 600157 209288 102931 420562 499703 495715 359017 197059 -220958
5005b20958L60164l5431K23331N28458l81623n40387j62458j60631Q97739M88473
$$ -220958 139206 103775 327106 855564 473941 -66446 -228904 -389535 508204 996677
4995I96677k3879k92321l44953m08664M24406R6523m27844K45900J81472L80363
$$ 996677 972798 680477 335524 -73140 351266 447789 19945 265845 447317 827680
4985H27680l75722j07119N0231m7894R845m484k66690j30320J85986q9710P47052
$$ 827680 451958 344839 395070 347176 357021 352537 85847 -44473 141513 51803 798855
4974G98855N33m30585R1368q182m23160L23245R6903k97327M15338L41218m1608
$$ 798855 799388 368803 460171 451989 28829 352074 448977 151650 566988 908206 866598
4963H66598m15053J6680R7979n78381N12329K55805J40035J31854l17966L62968
$$ 866598 451545 468225 566204 -12177 500152 755957 895992 1027846 709880 1072848
4953A072848n97529p2919j29178K35076M47368r499q69364m69923O3680L14920
$$ 1072848 475319 402400 273222 508298 955666 946167 76803 -393120 -329440 -14520
4943a4520M14451K07886k41518j07667o9311k2892J72002K08310j33927k19657
$$ -14520 399931 607817 366299 258632 189321 166429 338431 546741 412814 193157
4933A93157M09322l17376k65438j14860L15333M1660m7969l46525K1683J62241
$$ 193157 602479 285103 19665 -95195 220138 261798 213829 -132696 -111013 51228
4923E1228M15927m38386R2827j8110L87273M52767k30281m26935L21800K09661
$$ 51228 467155 28769 121596 103486 490759 943526 713245 286310 608110 817771
4913H17771K70936K58300k15077M44739m07067O19900Q3381p51704m23919J43492
$$ 817771 1088707 1347007 1131930 1576669 1169602 1789502 1872883 1121179 697260 840752
4903H40752M64830Q6683k72208J33462k31901K78499K32898o69806l1937l97114
$$ 840752 1305582 1392265 1120057 1253519 1021618 1300117 1533015 863209 831272 434158
4893D34158j68895k52187J21905K33193L09237j0513K08630M2332l6900K94101
$$ 434158 265263 13076 134981 368174 677411 666898 875528 917860 880960 1175061
4883A175061k27703m45577j36666m0276k88475J02053j2719K58360M46648p4519
$$ 1175061 947358 501781 365115 324839 36364 138417 125698 384058 830706 756187
4873G56187j95439j7291l75599L04739L22953k42817n05116L344L96109J09525
$$ 756187 560748 543457 167858 472597 795550 552733 47617 50961 447070 556595
4863E56595k39034k44731k08649M83165j99214J59517K82159L5934J5409J70969
$$ 556595 317561 72830 -135819 347346 148132 307649 589808 625742 641151 812120
4853H12120N1876j19161k45529k3069J01224L71534K92842l75397J01700m3518
$$ 812120 863996 744835 499306 476237 577461 948995 1241837 866440 968140 924622
4843I24622o36584J44301M46464m91690M29397N21043K48675J36433n73911k54154
$$ 924622 288038 432339 878803 387113 816510 1337553 1586228 1722661 1148750 894596
4833H94596J3955J18701L71851k21375o8948L28907r693l71211k75388J24687
$$ 894596 908551 1027252 1399103 1177728 1108780 1437687 1427994 1056783 781395 906082
4823I06082m75044j51207O70075j16697J29436l5774n02973L72361n676l48539
$$ 906082 431038 279831 949906 833209 962645 926871 423898 796259 790583 442044
4813D42044K62561r6445j90742k18372j13316P83944m12878k96970R350Q5222
$$ 442044 704605 608160 417418 199046 85730 869674 456796 159826 169176 254398
4803B54398K04127R4425M75850l58698l13374L82374K56215l21873K21265l8317
$$ 254398 458525 552950 1028800 670102 356728 739102 995317 673444 894709 856392
4793H56392j55288k9737j50284j51682m7009J52237p691R4489n9510J50969J84828
$$ 856392 701104 671367 521083 369401 322392 474629 466938 561427 501917 652886 837714
4782H37714J04306o1971j09208J60931k9122K40132k05384k25499J7973L54886
$$ 837714 942020 880049 770841 931772 902650 1142782 937398 711899 729872 1084758
4772A084758M119j55348j47526K41676J63415k10879m69018K06273J4601j85108
$$ 1084758 1088877 933529 786003 1027679 1191094 980215 511197 717470 732071 546963
4762E46963n3616O13915R661O7045l42132Q1217J33131n30588J36201r98J14235
$$ 546963 493347 1107262 1116923 1183968 841836 923053 1056184 525596 661797 660799 775034
4751G75034j40003M3513m454K39496j23989L04073n28273k06879m5036K65863
$$ 775034 635031 678544 674090 913586 789597 1093670 565397 358518 313482 579345
4741E79345R403j14855K34917j00518j35193L31702R9168l42487j90478L4250
$$ 579345 588748 473893 708810 608292 473099 804801 903969 561482 371004 405254
4731D05254L92947m52231k28538K24731l87946M598J957N65953n7510m51283J77073
$$ 405254 798201 345970 117432 342163 -45783 -41185 -39228 526725 469215 17932 195005
4720A95005M4493J33636j31760k051k84381O94088k82661J84389P5138k02200
$$ 195005 239498 373134 241374 239323 -45058 649030 366369 550758 625896 423696
4710D23696K90890o75042l12608J64616n2939p2943K21923M89469m19253l41405
$$ 423696 714586 39544 -273064 -108448 -161387 -234330 -12407 477062 57809 -283596
4700b83596O26355k61230Q4925O87403k71809l51405M77400J44106Q7393n33418
$$ -283596 342759 81529 166454 853857 582048 230643 708043 852149 939542 406124
4690D06124m32294m38002N63183K35275N5829L34400O2912K19217J19676J50361
$$ 406124 -26170 -464172 99011 334286 390115 724515 787427 1006644 1126320 1276681
4680A276681j9855O4051k69357J51518l3683q7856K1818J03190q252k10614M11693
$$ 1276681 1256826 1320877 1051520 1203038 1169355 1081499 1103317 1206507 1198255 987641 1399334
4669A399334K623j92924j12033j76535k72603l11672P0822J53730k27440K5721
$$ 1399334 1401957 1209033 1097000 920465 647862 336190 407012 560742 333302 359023
4659C59023N3436j288n1677j4049k9500J1220K54637p1331J19183K98792k26329
$$ 359023 412459 411171 359494 345445 315945 327165 581802 510471 629654 928446 702117
4648G02117j87086N1747J68244L52k34901J24623M7943n84979M3049K86850m1653
$$ 702117 515031 566778 735022 735374 500473 625096 673039 88060 131109 417959 376306
4637C76306n54008M22139L90127J48285j91849l61415J90110k23884q0763p713
$$ 376306 -177702 244437 634564 782849 591000 229585 419695 195811 115048 107335
4627A07335K23280L25890j43588K44446j6404l73755j76850J33999M88980p2975
$$ 107335 330615 656505 512917 757363 740959 367204 190354 324353 813333 740358
4617G40358k25147k50877J36497N02383L37000o0979r594o5659k11541P6732K39244
$$ 740358 515211 264334 400831 903214 1240214 1179235 1169641 1103982 892441 969173 1208417
4606A208417n96152O931O60940K55990j90227K80635l49229j24659p019j09581
$$ 1208417 612265 619196 1280136 1536126 1345899 1626534 1277305 1152646 1145627 1036046
4596A036046j45983J62699m00691j08419J32189k24629N5600M5612m9268K53458
$$ 1036046 890063 1052762 652071 543652 675841 451212 506812 552424 503156 756614
4586G56614j83514n46439N43262N79138l49657J67693l99269P6547K03471L34318
$$ 756614 573100 26661 569923 1149061 799404 967097 567828 644375 847846 1182164
4576A182164K5005m99985l54687K60599n2947J993p0621l91674o9061j20377O63090
$$ 1182164 1207169 707184 352497 613096 560149 562142 491521 99847 30786 -89591 573499
4565E73499k32702r8091J95126K31085k21066R2131K80633J10134j38625k38699
$$ 573499 340797 242706 437832 668917 447851 539982 820615 930749 792124 553425
4555E53425n1456K91832R8342M6692o021L25916k47811l27176L18402K29271K18704
$$ 553425 501969 793801 892143 938835 932814 1258730 1010919 683743 1002145 1231416 1450120
4544A450120l64938l57169M84718L58102k12821j91765j29819n1525N9951J11625
$$ 1450120 1085182 728013 1212731 1570833 1358012 1166247 1036428 984903 1044854 1156479
4534A156479J52477m35705k60874j0062l6399K14731k809l8459Q2776n156k3176
$$ 1156479 1308956 873251 612377 602315 565916 780647 777838 739379 822155 816999 793823
4523G93823l8360K49903k1094L24491K55342k54244q37083L28296L88507m91096
$$ 793823 755463 1005366 984272 1308763 1564105 1309861 472778 801074 1189581 698485
4513F98485k38149k40440L84800K23008k85560N78699q588k40014J34889m3243
$$ 698485 460336 219896 604696 827704 542144 1120843 1112255 872241 1007130 963887
4503I63887J54319k18367P2756J50673j17539J08842k84007J18367q9453R0083
$$ 963887 1118206 899839 972595 1123268 1005729 1114571 830564 948931 859478 949561
4493I49561r2376P2262Q961K45204l08019j98131P98058p36149r1424M16940L59123
$$ 949561 857185 929447 938408 1183612 875593 677462 1475520 739371 647947 1064887 1424010
4482A424010L03872m76330m28902M93489K93317l60322k44550O15795N16297N1475
$$ 1424010 1727882 1251552 822650 1316139 1609456 1249134 1004584 1620379 2136676 2188151
4472B188151l98993M08415K21091l83851m42170j08520j66286J15603J7238l40258
$$ 2188151 1789158 2197573 2418664 2034813 1592643 1484123 1317837 1433440 1450678 1110420
4462A110420l18555J54324L29484l8457M491L29440p391k51456j81692K21243
$$ 1110420 791865 946189 1275673 1237216 1241707 1571147 1563756 1312300 1130608 1351851
4452A351851J19082l12497R0597L03191J60452l91128N20444j96700l12123k27983
$$ 1351851 1470933 1158436 1249033 1552224 1712676 1321548 1841992 1645292 1333169 1105186
4442A105186P7360M20247m31972l44017R1143K21152J81122j70558o15551M58153
$$ 1105186 1182546 1602793 1170821 826804 917947 1139099 1320221 1149663 534112 992265
4432I92265L6798l24496L02972j78738J65712j87524j07248J10979M9779O0640
$$ 992265 1029063 704567 1007539 828801 994513 806989 699741 810720 860499 921139
4422I21139J51817j82453l9135k16859J68112L57496o4298q2214J91782n3134
$$ 921139 1072956 890503 851368 634509 802621 1160117 1095819 1013605 1205387 1152253
4412A152253m37702L25808m93673j15055P7227N3986M07101j21542O0804L88359
$$ 1152253 714551 1040359 546686 431631 508858 562844 969945 848403 909207 1297566
4402A297566k75693J05951L238K02114L26990R7764m08045j57231q8763n3704
$$ 1297566 1021873 1127824 1131062 1333176 1660166 1757930 1349885 1192654 1103891 1050187
4392A050187L58242l34623k05671K02314J85835l22205K21565l2866j15516J10591
$$ 1050187 1408429 1073806 868135 1070449 1256284 934079 1155644 1122778 1007262 1117853
4382A117853j44230L96688j20283J42797m88114k62539j23502J26941k4447n25063
$$ 1117853 973623 1370311 1250028 1392825 904711 642172 518670 645611 621164 96101
4372I6101O27615K19975l38326j07435K39304N39938j14162K83901m11624m9898
$$ 96101 723716 943691 605365 497930 737234 1277172 1163010 1446911 1035287 985389
4362I85389M77247k32314j13387K86735J18394m07104K63576l06178J68518R112
$$ 985389 1462636 1230322 1116935 1403670 1522064 1114960 1378536 1072358 1240876 1249988
4352A249988J1748n43196j02446L49270J76612m22503M24336k0654L1089r5386
$$ 1249988 1261736 718540 616094 965364 1141976 719473 1143809 1123155 1154244 1058858
4342A058858o6749K57612j06578j69992l1557J94365J61740P41459o73720L7927
$$ 1058858 992109 1249721 1143143 973151 941594 1135959 1297699 2039158 1365438 1403365
4332A403365j72431J59941J14815L32596K64190k42283j56960K09914j35023j1118
$$ 1403365 1230934 1390875 1505690 1838286 2102476 1860193 1703233 1913147 1778124 1767006
4322A767006k57719J35603O8030m92650j16902K1380P382K51777L50724k58108
$$ 1767006 1509287 1644890 1712920 1220270 1103368 1124748 1132130 1383907 1734631 1476523
4312A476523k09927k95050L13719K79181O2085k49960k73632M33885K78993l88007
$$ 1476523 1266596 971546 1285265 1564446 1626531 1376571 1102939 1536824 1815817 1427810
4302A427810o50755N11246L23928o46814O9636j20595J12760N48420N3396m55608
$$ 1427810 777055 1288301 1612229 965415 1035051 914456 1027216 1575636 1629032 1173424
4292A173424o3371n8353J55078K40451L25705j97877k65544L0106K99062j98577
$$ 1173424 1110053 1051700 1206778 1447229 1772934 1575057 1309513 1339619 1638681 1440104
4282A440104k21971J25741L30031m9121k65465j93316L60504N00948M145j22988
$$ 1440104 1218133 1343874 1673905 1624784 1359319 1166003 1526507 2027455 2031600 1908612
4272A908612Q5205l69389j66411L19670k43517M98978M1746j30189M15397k01940
$$ 1908612 1993817 1624428 1458017 1777687 1534170 2033148 2074894 1944705 2360102 2158162
4262B158162L13157k2834K06490o4109l9003L16965N727j67284K99403j63218
$$ 2158162 2471319 2448485 2654975 2590866 2551863 2868828 2874555 2707271 3006674 2843456
4252B843456k94875l77022J94676k4018m5443n20717j23041Q97L05469J55289
$$ 2843456 2548581 2171559 2366235 2342217 2296774 1776057 1653016 1653913 1959382 2114671
4242B114671l59842M03852J28550j89906m73384N94528K1012L81972l78378j58022
$$ 2114671 1754829 2158681 2287231 2097325 1623941 2218469 2239481 2621453 2243075 2085053
4232B085053L24909K62738n82174J32060J6311M71022O37146j62938o95362J17169
$$ 2085053 2409962 2672700 2090526 2222586 2238897 2709919 3347065 3184127 2488765 2605934
4222B605934M27016j69193o0627k64042K70934K2434l74719R8825J415K65771
$$ 2605934 3032950 2863757 2803130 2539088 2810022 2832456 2457737 2556562 2557977 2823748
4212B823748M9721k59457j18497M5571M05502p8753L6963k5092l05126j67400
$$ 2823748 2873469 2614012 2495515 2541086 2946588 2867835 2904798 2879706 2574580 2407180
4202B407180K49799P7952j78709n32740J72657R21954j25989m72879R1896K31919
$$ 2407180 2656979 2734931 2556222 2023482 2196139 3118093 2992104 2519225 2611121 2843040
4192B843040K90851m90399o210K25659n47433K52884k45835L39303m0349n908
$$ 2843040 3133891 2643492 2637282 2862941 2315508 2568392 2322557 2661860 2621511 2615603
4182B615603j1576J72952L4009j49941p5628j49010J38666j48696o890J1152O60325
$$ 2615603 2604027 2776979 2810988 2661047 2585419 2436409 2575075 2426379 2419489 2430641 3090966
4171C090966N0207l23249j13562p7370K54015k04160J33326M82199M2230J43234
$$ 3090966 3141173 2817924 2704362 2626992 2881007 2676847 2810173 3292372 3334602 3477836
4161C477836n13379n691R5347l79211j15587K57528j48198r7009n7338J89087
$$ 3477836 2964457 2958766 3054113 2674902 2559315 2816843 2668645 2571636 2514298 2703385
4151B703385J001910k32083K00637n0606L96346l29393J07955L5904p43787L06509
$$ 2703385 3705295 3473212 3673849 3623243 4019589 3690196 3798151 3834055 3090268 3396777
4141C396777j14727j1584o5749j08613k24746L27160J18796P7418l51490R7596
$$ 3396777 3282050 3270466 3204717 3096104 2871358 3198518 3317314 3394732 3043242 3140838
4131C140838J41272P4746j70398m0171J32887K9211K81682N2198J61104M37313
$$ 3140838 3282110 3356856 3186458 3146287 3279174 3308385 3590067 3642265 3803369 4240682
4121D240682n63026k90392k81973p3048P09666k59976j84014L20405j57815J11437
$$ 4240682 3677656 3387264 3105291 3032243 3741909 3481933 3297919 3618324 3460509 3571946
4111C571946L94975K86384r3137k17621K40633K79011K7005j45691j6940J01217
$$ 3571946 3966921 4253305 4160168 3942547 4183180 4462191 4489196 4343505 4326565 4427782
4101D427782L83955k5381R3001K44396k30411J02804K30489l0585j33299J44883
$$ 4427782 4811737 4786356 4879357 5123753 4893342 4996146 5226635 5196050 5062751 5207634
4091E207634j62670o16218j06718K53217J3797L25095j31704m11480m62783J91240
$$ 5207634 5044964 4428746 4322028 4575245 4589042 4914137 4782433 4370953 3908170 4099410
4081D099410M73014j997J04466L27126Q470Q9149j3241L80229q9959n31956o47432
$$ 4099410 4572424 4570427 4674893 5002019 5010489 5099638 5086397 5466626 5376667 4844711 4197279
4070D197279j04990M9554r6934J8551l03175K2061P7423j5894J28653j14292j32081
$$ 4197279 4092289 4141843 4044909 4063460 3760285 3782346 3859769 3843875 3972528 3858236 3726155
4059C726155J88786j24645L6638J11315M51199j83106l30654m2296M24017L11084
$$ 3726155 3914941 3790296 3826934 3938249 4389448 4206342 3875688 3833392 4257409 4568493
4049D568493L7380l89986r6639L76347J11544M89720K05537R5097j74532J8337
$$ 4568493 4605873 4215887 4119248 4495595 4607139 5096859 5302396 5397493 5222961 5241298
4039E241298K12298q4962K02092K97878K85785N67971P60004L75973N78514R65020
$$ 5241298 5453596 5368634 5570726 5868604 6154389 6722360 7482364 7858337 8436851 9401871
4029I401871J190816J461773J619632J948728K352280K363610L328653M175479
$$ 9401871 10592687 12054460 13674092 15622820 17975100 20338710 23667363 27842842
4021B7842842M155160J134957l440962m771361m419114l203624k697713j983178
$$ 27842842 31998002 33132959 29691997 24920636 20501522 17297898 14600185 12617007
4013A2617007j665695j344760l67366l37076r66901n60022M2692l62994l61542
$$ 12617007 10951312 9606552 9239186 8902110 7935209 7375187 7417879 7054885 6693343
4004F693343Q7682J35218J0182l65054J0174L96090L65895J060152O89246L54230
$$ 6693343 6781025 6916243 6926425 6561371 6571545 6967635 7333530 8393682 9082928 9437158
3994I437158r40543j067622j059236k18860p78293j57034o65278k6665O81353
$$ 9437158 8496615 7428993 6369757 6150897 5372604 5215570 4550292 4523627 5204980
3985E204980k89293n53346o2873L67845k08388r896M6912J43614n96533M3924
$$ 5204980 4915687 4362341 4299468 4667313 4458925 4449029 4495941 4639555 4043022 4086946
3975D086946L78031J13261N60411L22366M19747J1407n25828r3344m23796l06129
$$ 4086946 4464977 4578238 5138649 5461015 5880762 5892169 5366341 5272997 4849201 4543072
3965D543072N4996L9578o3623l2807M38904n00076K39785P1791m4696O2048K01598
$$ 4543072 4598068 4637646 4574023 4541216 4980120 4480044 4719829 4791620 4746924 4808972 5010570
3954E010570K70501p0550N75688k76490l36667J00661k81425M3542k6433n39749
$$ 5010570 5281071 5210521 5786209 5509719 5173052 5273713 4992288 5035830 5009397 4469648
3944D469648p9704j29907J96013J06810K81804M7001l50716p5286k27432K57072
$$ 4469648 4389944 4260037 4456050 4562860 4844664 4891665 4540949 4465663 4238231 4495303
3934D495303l7057M85108l22078M45530J71724j90860j29974j71880M7458l69920
$$ 4495303 4458246 4943354 4621276 5066806 5238530 5047670 4917696 4745816 4793274 4423354
3924D423354K93266l01365K8679o6333N20122j65935Q5023j89489j31899k08426
$$ 4423354 4716620 4415255 4443934 4377601 4897723 4731788 4816811 4627322 4495423 4286997
3914D286997P34138K86809l27728N4616M12409j9936J16648m0256O65096M5382
$$ 4286997 5021135 5307944 4980216 5034832 5447241 5427305 5543953 5503697 6168793 6214175
3904F214175j98437m76150J44818k97577J55589J83528l10632n18074j46527K78193
$$ 6214175 6015738 5539588 5684406 5386829 5542418 5725946 5415314 4897240 4750713 5028906
3894E028906K57764o8175q405j82289o8695J06929K81167j023k9973j92921J9421
$$ 5028906 5286670 5218495 5210090 5027801 4959106 5066035 5347202 5346179 5316206 5123285 5142706
3883E142706j36857M49351M42897k97862L63830N7107M23512n28292q6415J45252
$$ 5142706 5005849 5455200 5898097 5600235 5964065 6021172 6444684 5916392 5829977 5975229
3873E975229M83771K0772N0890K1742K67080R5372R23191M77386l3171q1545Q35101
$$ 5975229 6459000 6479772 6530662 6552404 6819484 6914856 7838047 8315433 8282262 8200717 9035818
3862I035818M92187J90046L66629P07893L24278M29883N44944K24843M97501L55820
$$ 9035818 9528005 9718051 10084680 10792573 11116851 11546734 12091678 12316521 12814022 13169842
3852A3169842J0097M33104M84559Q25078J071920J485465J365058P19818K59903
$$ 13169842 13179939 13613043 14097602 14922680 15994600 17480065 18845123 19564941 19824844
3843A9824844l67186m77930o67987m99921M06118K42782K36301J067668J321163
$$ 19824844 19457658 18979728 18311741 17811820 18217938 18460720 18697021 19764689 21085852
3834B1085852J193157J520332J081710N37075o51176k77891o38822o55016n69890
$$ 21085852 22279009 23799341 24881051 25418126 24766950 24489059 23850237 23195221 22625331
3825B2625331n66752L77268N30801J97929K35972N41635J76255j206756j232374
$$ 22625331 22058579 22435847 22966648 23164577 23400549 23942184 24118439 22911683 21679309
3816B1679309j712257j406675j570129j634718o79437p03852m47342L95999J92268
$$ 21679309 19967052 18560377 16990248 15355530 14676093 13972241 13524899 13920898 14113166
3807A4113166P0155R8682q79911l38330r18718o99314q06038o66808l81049n71164
$$ 14113166 14183321 14282003 13402092 13063762 12145044 11445730 10639692 9972884 9591835 9020671
3797I020671q30308J39045l38498k63677l88100q5924K39884k08996m94496k7636
$$ 9020671 8190363 8329408 7990910 7727233 7339133 7253209 7493093 7284097 6789601 6761965
3787F761965k22943j26674l01817P2801K73084l42003k99231k40652O117J54728
$$ 6761965 6539022 6412348 6110531 6183332 6456416 6114413 5815182 5574530 5580647 5735375
3777E735375J9752k62910m554o47543l08581J09704L46283K45392K1467m7929
$$ 5735375 5755127 5492217 5487663 4840120 4531539 4641243 4987526 5232918 5254385 5206456
3767E206456K46012m2394l01742k96681m38099p9055M07110n5508R96O6841o70073
$$ 5206456 5452468 5410074 5108332 4811651 4373552 4294497 4701607 4646099 4647095 4713936 4043863
3756D043863l17150M66051L85475o19239K24099J94348j13615j25688K1888k13739
$$ 4043863 3726713 4192764 4578239 3959000 4183099 4377447 4263832 4138144 4160032 3946293
3746C946293N8138N34758N52004l0665Q7197k76327m3837J78979k69402J78l7753
$$ 3946293 4004431 4539189 5091193 5060528 5147725 4871398 4827561 5006540 4737138 4737316 4699563
3735D699563r8388o1687k36786Q40706O07692L82579J70646P76083R28464Q95065
$$ 4699563 4601175 4539488 4302702 5143408 5751100 6133679 6304325 7080408 8008872 8903937
3725H903937J152737L74686R42667k69215j465660j791184j285732p6114k43568
$$ 8903937 10056674 10431360 11374027 11104812 9639152 7847968 6562236 6486122 6242554
3716F242554o57207k86675R032N6287J39893m36006j11140O32148M1431K73066
$$ 6242554 5585347 5298672 5307704 5363991 5503884 5067878 4956738 5588886 5630317 5903383
3706E903383J68661j70595k10855m99498k60011O52492j72491k72537J27816k62450
$$ 5903383 6072044 5901449 5690594 5191096 4931085 5583577 5411086 5138549 5266365 5003915
3696E003915j670k36219j93642J85135L06497N92191m524j8630n45444r4216Q9856
$$ 5003915 5002245 4766026 4572384 4757519 5064016 5656207 5651683 5633053 5087609 4993393 5083249
3685E083249O18824M45750N51688N22035L47315M80502P72100L59974k31073l11749
$$ 5083249 5702073 6147823 6699511 7221546 7568861 8049363 8821463 9181437 8950364 8638615
3675H638615q69649o42457n77792k42159k39162N3764M8760j01663l55444K23800
$$ 8638615 7768966 7126509 6548717 6306558 6067396 6121160 6169920 6068257 5712813 5936613
3665E936613K74609L77633K33646k15045K77348j50952j5569r1967k6860K58486
$$ 5936613 6211222 6588855 6822501 6607456 6884804 6733852 6718283 6626316 6599456 6857942
3655F857942j5741k7418q840J49819O9080J37457l389p97j54163l46227K12123
$$ 6857942 6842201 6814783 6805943 6955762 7024842 7162299 7158910 7158113 7003950 6657723 6869846
3644F869846L88431O55195K01714j98815P3687O457j29060N46347P8360K53871
$$ 6869846 7258277 7913472 8115186 7916371 7990058 7996515 7867455 8413802 8492162 8746033
3634H746033R5462P5190J98878K29533N22748Q50410L59635j3695R44205L29996
$$ 8746033 8841495 8916685 9115563 9345096 9867844 10718254 11077889 11064194 12008399 12338395
3624A2338395L59010J039724Q63673K71241J116139J273662J180317J698653J969538
$$ 12338395 12697405 13737129 14600802 14872043 15988182 17261844 18442161 20140814 22110352
3615B2110352K283730L155660L036245L583794L151515L636117L321837K808779
$$ 22110352 24394082 27549742 30585987 34169781 37321296 40957413 44279250 47088029
3607D7088029L616183J725670Q06192L47619j22935l95824m63749n41335p61122
$$ 47088029 50704212 52429882 53236074 53583693 53460758 53064934 52601185 52059850 51298728
3598E1298728l11559M50799L52371k53125J36037l75105j198596j119646j882185
$$ 51298728 50987169 51437968 51790339 51537214 51673251 51298146 50099550 48979904 47097719
3589D7097719k391351k780352l408436l409274l854154k633920k180425k288917
$$ 47097719 44706368 41926016 38517580 35108306 31254152 28620232 26439807 24150890
3581B4150890j513799j771669j237251q08399q60935q06820j198190n74751m16902
$$ 24150890 22637091 20865422 19628171 18819772 17958837 17152017 15953827 15379076 14962174
3572A4962174l56308m30647n13826J28153m11974j9558j85128j57598L4041m83139
$$ 14962174 14605866 14175219 13661393 13789546 13377572 13358014 13172886 13015288 13049329 12566190
3562A2566190q8566J07289k9746J33604n48361j50439K7781j90518r58326k29083
$$ 12566190 12477624 12584913 12555167 12688771 12140410 11989971 12017752 11827234 10868908 10639825
3552A0639825M37815L9735l9874j30693J03077L10182L57075o30318K88981J53968
$$ 10639825 11077640 11117375 11077501 10946808 11049885 11360067 11717142 11086824 11375805 11529773
3542A1529773J56159J20139j88945j47993L89407k65877j50890J46956J88276
$$ 11529773 11685932 11806071 11617126 11469133 11858540 11592663 11441773 11588729 11777005
3533A1777005o9015P6176k81455p5625J86945K61045K30489l81573r968K23111
$$ 11777005 11707990 11784166 11502711 11427086 11614031 11875076 12105565 11723992 11714024 11937135
3523A1937135k81843M6753M72742j51478L09399q23453J85119Q94073L76870K41701
$$ 11937135 11655292 11702045 12174787 12023309 12332708 11509255 11694374 12588447 12965317 13207018
3513A3207018k0128M05581M49815R7516J02387M6845J9932M98659O02198k04127
$$ 13207018 13186890 13592471 14042286 14139802 14242189 14289034 14308966 14807625 15409823 15205696
3503A5205696M33110K02820K75248j02375N29401L99653N85499J17336k62878
$$ 15205696 15638806 15841626 16116874 16014499 16543900 16943553 17529052 17646388 17383510
3494A7383510L9614j4474K08779L72612j02898l60269L23610K73525L38626J46081
$$ 17383510 17423124 17408650 17617429 17990041 17887143 17526874 17850484 18124009 18462635 18608716
3484A8608716O50429K06365M29353L21508N17936L17908Q67154M01145N72720
$$ 18608716 19259145 19465510 19894863 20216371 20734307 21052215 21919369 22320514 22893234
3475B2893234P41642P36518P22557J193076J992760J437074J181514J794505J978973
$$ 22893234 23634876 24371394 25093951 26287027 28279787 29716861 30898375 32692880 34671853
3466C4671853K882694K687931K840896L725017M106091M796422N785323P480736
$$ 34671853 37554547 40242478 43083374 46808391 50914482 55710904 61496227 68976963
3458F8976963P894216Q992443R897295J1475811J1897137J1158033J0146267Q326705
$$ 68976963 76871179 85863622 95760917 107236728 119133865 130291898 140438165 148764870
3450A48764870N617973K875645r07845m327536p475826r438456j1271462j1319327
$$ 148764870 154382843 157258488 156350643 152023107 144547281 135108825 123837363 112518036
3442A12518036j1150404j0443346q669305q420454o705654o001952n101606m297912
$$ 112518036 101367632 90924286 82254981 73834527 67128873 61126921 56025315 51727403
3434E1727403l510710k921627k862760k070716j482337j701292r36165n79475
$$ 51727403 48216693 45295066 42432306 40361590 38879253 37177961 36241796 35662321
3426C5662321p19467p90705n69502o8973J08616l02545k44534j13607K62629k47270
$$ 35662321 34942854 34152149 33582647 33513674 33622290 33319745 33075211 32961604 33224233 32976963
3416C2976963p8554m4274J16125j35775n90710l71345L6261Q5565p59058O6689
$$ 32976963 32898409 32854135 32970260 32834485 32243775 31872430 31908691 31994256 31235198 31301887
3406C1301887m0648M72753K25098o7203r7813J04456N61764N15490k29622Q8438
$$ 31301887 31261239 31733992 31959090 31891887 31794074 31898530 32460294 32975784 32746162 32834600
3396C2834600j49934j71001J06065J88738M4352m35102P44585k37543m9335j50722
$$ 32834600 32684666 32513665 32619730 32808468 32852820 32417718 33162303 32924760 32875425 32724703
3386C2724703j04062q0041n8612o9767j19369k28152n82192o55923j079512o48450
$$ 32724703 32620641 32540600 32481988 32412221 32292852 32064700 31482508 30826585 29747073 29098623
3376B9098623q89766n67088r70815p36393l30370q03870j28713m35334p78631
$$ 29098623 28208857 27641769 26670954 25934561 25604191 24800321 24671608 24236274 23457643
3367B3457643j72409q13017l56980m96189j01291l39565m64041r61807m22639
$$ 23457643 23285234 22472217 22115237 21619048 21517757 21178192 20714151 19752344 19329705
3358A9329705J40756M47574m01898o84003O2652k52563l65226m85651L9583l6428
$$ 19329705 19470461 19918035 19516137 18832134 18894786 18642223 18276997 17791346 17830929 17794501
3348A7794501n20009j13696M62203n03553k99013j82059Q0702L04408m20358l5245
$$ 17794501 17274492 17160796 17622999 17119446 16820433 16638374 16719076 17023484 16603126 16567881
3338A6567881r8695j40340o1557L02572m0384m6187Q8294p31892m27681R8739
$$ 16567881 16469186 16328846 16267289 16569861 16529477 16483290 16571584 15839692 15412011 15510750
3328A5510750j34036m33744q5555q7098J15815k19741m52951K41975O7326L839
$$ 15510750 15376714 14942970 14857415 14770317 14886132 14666391 14213440 14455415 14522741 14526580
3318A4526580k14499k83257l9703K20052k80359n09125J06388M6504K83222k987
$$ 14526580 14312081 14028824 13989121 14209173 13928814 13419689 13526077 13572581 13855803 13852816
3308A3852816l07349l28417N42096m27949o67341m14417M47528j53486M66627
$$ 13852816 13545467 13217050 13759146 13331197 12663856 12249439 12696967 12543481 13010108
3299A3010108p8239j97349l63842L25602j80342R4635O3157J77547J41741n7457
$$ 13010108 12931869 12734520 12370678 12696280 12515938 12610573 12673730 12851277 12993018 12935561
3289A2935561o7512J60867K94252l49376M85941r9310m22494P2224J02432J29308
$$ 12935561 12868049 13028916 13323168 12973792 13459733 13360423 12937929 13010153 13112585 13241893
3279A3241893N34762L28260p8751n8586p3734M36108N30847m14021n12630J46799
$$ 13241893 13776655 14104915 14026164 13967578 13893844 14329952 14860799 14446778 13934148 14080947
3269A4080947Q47395l66819j50129J45226M22898k37496J38256J4893J09120O94258
$$ 14080947 14928342 14561523 14411394 14556620 14979518 14742022 14880278 14895171 15004291 15698549
3259A5698549M87091J82566P53196M42830P06852P66713O37326O72845M10532
$$ 15698549 16185640 16368206 17121402 17564232 18271084 19037797 19675123 20347968 20758500
3250B0758500J130039N72294O85236N35758O21054R12982j55753O24606J15504
$$ 20758500 21888539 22460833 23146069 23681827 24302881 25215863 25060110 25684716 25800220
3241B5800220K38375K13877K40967J39807J27995Q8795K52286l89513l93037j10542
$$ 25800220 26038595 26252472 26493439 26633246 26761241 26850036 27102322 26712809 26319772 26209230
3231B6209230L45276k06729k35864l03265p10429l00452J660m16837n44951j34307
$$ 26209230 26554506 26347777 26111913 25808648 25098219 24797767 24799427 24382590 23837639 23703332
3221B3703332l22901M64138N2925K05498P03819L7267P12989N41675M17356N10773
$$ 23703332 23380431 23844569 23897494 24102992 24806811 24844078 25557067 26098742 26516098 27026871
3211B7026871O40039Q48849O85288J212157J178345J362019K172422K863245K032423
$$ 27026871 27666910 28515759 29201047 30413204 31591549 32953568 35125990 37989235 40021658
3202D0021658K471825K573572K445457K227450J770743J268989J629520J500599
$$ 40021658 42493483 45067055 47512512 49739962 51510705 52779694 54409214 55909813
3194E5909813J496741J595504R83477N66084O91565L50720M87144k61166n36682
$$ 55909813 57406554 59002058 59985535 60551619 61243184 61593904 62081048 61819882 61283200
3185F1283200l58526p56828o63554l24550l78026j39114n69760j644344j421324
$$ 61283200 60924674 60167846 59504292 59179742 58801716 58662602 58092842 56448498 55027174
3176E5027174j331385k023382j664815j150099j886915j351774M2054m6865M40463
$$ 55027174 53695789 51672407 50007592 48857493 46970578 45618804 45660858 45613993 46054456
3167D6054456R80756N61815J060032J604403K249254J928421K171015K469754
$$ 46054456 47035212 47597027 48657059 50261462 52510716 54439137 56610152 59079906
3159E9079906K055612J579339J256888J774336J057077R02706O28556Q52684O66351
$$ 59079906 61135518 62714857 63971745 65746081 66803158 67705864 68334420 69187104 69853455
3150F9853455m60560L78974M85245j31057k35062J04177n38892l13456o50465
$$ 69853455 69392895 69771869 70257114 70126057 69890995 69995172 69456280 69142824 68492359
3141F8492359j210115j331575j613807j826323k062291j761927k301952j491502
$$ 68492359 67282244 65950669 64336862 62510539 60448248 58686321 56384369 54892867
3133E4892867j284358j315374j394529j311578k88542n99965r90453L75445R2527
$$ 54892867 53608509 52293135 50898606 49587028 49298486 48698521 47708068 48083513 48176040
3124D8176040R7296M85607Q6779N9584Q35003P883Q27191J393635N87130R31208
$$ 48176040 48273336 48758943 48845722 48905306 49740309 49748192 50575383 51969018 52556148 53487356
3114E3487356J507933J658228Q40949J252911K156190J676934K574898K638148
$$ 53487356 54995289 56653517 57494466 58747377 60903567 62580501 65155399 67793547
3106F7793547K241977K546629L088592K862298K571644L155471L353297L317773
$$ 67793547 70035524 72582153 75670745 78533043 81104687 84260158 87613455 90931228
3098I0931228K680253K988511K134003K154829R40059j05453j653390k608796
$$ 90931228 93611481 96599992 98733995 100888824 101828883 101723430 100070040 97461244
3090I7461244l869628m132070l571693m141915m148174l587979k969435l267142
$$ 97461244 93591616 89459546 85887853 81745938 77597764 74009785 71040350 67773208
3082F7773208l262926k505206j649210j777340j804920j889163j337957j367620
$$ 67773208 64510282 62005076 60355866 58578526 56773606 54884443 53546486 52178866
3074E2178866j887408j300824o78297q03337m72720r59786j008763o33168j115146
$$ 52178866 50291458 48990634 48312337 47509000 47036280 46076494 45067731 44434563 43319417
3065D3319417o20691o80458m50948o50355j84467p11126n33330L5186n37310l67897
$$ 43319417 42698726 42018268 41567320 40916965 40732498 40021372 39488042 39523228 38985918 38618021
3055C8618021o68359n03314J54551n35398l66178L44661k1355J25527J0007M13805
$$ 38618021 37949662 37446348 37600899 37065501 36699323 37043984 37022629 37148156 37158163 37571968
3045C7571968R25746O72726J058592N91638J084624J406734J624375K067213K302938
$$ 37571968 38497714 39170440 40229032 40820670 41905294 43312028 44936403 47003616 49306554
3036D9306554K333417J462078J254739J523261J493627K312152K131809K564811
$$ 49306554 51639971 53102049 54356788 55880049 57373676 59685828 61817637 64382448
3028F4382448K124263P73107N04772p4055J21642Q96703J329452J411690P67825
$$ 64382448 66506711 67279818 67784590 67710535 67832177 68728880 70058332 71470022 72237847
3019G2237847k64666j051031j350486j209939k142700l066722k975480l304159
$$ 72237847 71973181 70922150 69571664 68361725 66219025 63152303 60176823 56872664
3011E6872664l719057l317428l068339l027058k779650k042577k118070j614437
$$ 56872664 53153607 49836179 46767840 43740782 40961132 38918555 36800485 35186048
3003C5186048q16323q82748j712362o08325j093477j071491n82883n33994j72746
$$ 35186048 34369725 33486977 31774615 31166290 30072813 29001322 28418439 27884445 27711699
2994B7711699o88924r47406n59844j76403m50799n82244l75871q57785l79583
$$ 27711699 27022775 26075369 25515525 25339122 24888323 24306079 23930208 23072423 22692840
2985B2692840o44022j10587j25847l04704m22186P273P3823o16033J13253m19917
$$ 22692840 22048818 21938231 21812384 21507680 21085494 21092767 21166590 20550557 20663810 20243893
2975B0243893j24421j4584L87829l58396j93879K70100j43780k38979M40394k22204
$$ 20243893 20119472 20104888 20492717 20134321 19940442 20210542 20066762 19827783 20268177 20045973
2965B0045973J27007m3605q92321M7009p83418m19320l4484o8958o07948j88613
$$ 20045973 20172980 20129375 19237054 19284063 18500645 18081325 18046841 17977883 17369935 17181322
2955A7181322l97939m34594K37529l37046p5164q1993n29548k11175J48968j1606
$$ 17181322 16783383 16348789 16586318 16249272 16174108 16092115 15562567 15351392 15500360 15488754
2945A5488754j50362o85219J38412J10638j61928r0131j44882n9661m61398k50126
$$ 15488754 15338392 14653173 14791585 14902223 14740295 14650164 14505282 14445621 13984223 13734097
2935A3734097P0747J87713k79957k48662K3914j97286M845j29092k45202l08178
$$ 13734097 13804844 13992557 13712600 13463938 13487852 13290566 13295411 13166319 12921117 12612939
2925A2612939k20556P56728L39361q97131Q6557l23479l39471j38733J42956L59354
$$ 12612939 12392383 13149111 13488472 12591341 12677898 12354419 12014948 11876215 12019171 12378525
2915A2378525l43527K94037K02784L02096l30076l26386m02402J23875N27951
$$ 12378525 12034998 12329035 12531819 12833915 12503839 12177453 11775051 11898926 12426877
2906A2426877o86876p3749l9002N7144O2028k18321K53102m74074N67613J08110
$$ 12426877 11740001 11666252 11627250 11684394 11746422 11528101 11781203 11307129 11874742 11982852
2896A1982852L0197M34642j74430K56717j47769l80205m27148K92099K53592R823
$$ 11982852 12013049 12447691 12273261 12529978 12382209 12002004 11574856 11866955 12120547 12130370
2886A2130370L72766L02353k14997j58248Q3180O20840J28283M38898j6097J8595
$$ 12130370 12503136 12805489 12590492 12432244 12515424 13136264 13264547 13703445 13687348 13705943
2876A3705943N7923n60556K11954J68617M33740j07661p2917M76543M56681l6692
$$ 13705943 13763866 13203310 13415264 13583881 14017621 13909960 13837043 14313586 14770267 14733575
2866A4733575j22678J3586O63145K56885l82848K61144p0213L75780K49089N58327
$$ 14733575 14610897 14624483 15287628 15544513 15161665 15422809 15352596 15728376 15977465 16535792
2856A6535792M92347K88663Q43878j61325L8697O65164l90399j52631K48615n7033
$$ 16535792 17028139 17316802 18160680 17999355 18038052 18703216 18312817 18160186 18408801 18351768
2846A8351768N44121P28635M76240K67919j83169N40915K70036j63193L48003
$$ 18351768 18895889 19624524 20100764 20368683 20185514 20726429 20996465 20833272 21181275
2837B1181275N73473P42004K75469Q50821K14016Q39359N78142M35241O92653
$$ 21181275 21754748 22496752 22772221 23623042 23837058 24676417 25254559 25689800 26382453
2828B6382453M62305O12170O63490O85420N68171K44807n1950M68279Q04052P36501
$$ 26382453 26844758 27456928 28120418 28805838 29374009 29618816 29566866 30035145 30839197 31575698
2818C1575698P36732P54661R29582N81622J050349P68792Q16274M89252N01804
$$ 31575698 32312430 33067091 33996673 34578295 35628644 36397436 37213710 37702962 38204766
2809C8204766O26214J57414P22865K28203L30088Q64062N52911J240118J349180
$$ 38204766 38830980 38988394 39711259 39939462 40269550 41133612 41686523 42926641 44275821
2800D4275821J450958J337469J387765J668306J630420K434654K765935K593859
$$ 44275821 45726779 47064248 48452013 50120319 51750739 54185393 56951328 59545187
2792E9545187J813067L239972L037046L375410L215646K364959K492235J879234
$$ 59545187 61358254 64598226 67635272 71010682 74226328 76591287 79083522 80962756
2784H0962756J354520J950505J372954K454801M120530N442711O692751Q811022
$$ 80962756 82317276 84267781 85640735 88095536 92216066 97658777 104351528 113162550
2776A13162550J0207861J1956252J3963085J5649599J9101319K3794956K9512674
$$ 113162550 123370411 135326663 149289748 164939347 184040666 207835622 237348296
2769B37348296L6368537M0814107L7741746J7514682j5055533l7843852m4492975
$$ 237348296 273716833 314530940 352272686 369787368 354731835 316887983 272395008
2762B72395008m0610044l1802014k3121300j6956151j2118512j0104155r398494
$$ 272395008 231784964 199982950 176861650 159905499 147786987 137682832 128284338
2755A28284338q910058q116072o371581n536311n307949m796538m868214m596077
$$ 128284338 119374280 111258208 104886627 99350316 94042367 89245829 84377615 79781538
2747G9781538l890120l257458l011722k128894k128680k360626j866850k117955
$$ 79781538 75891418 72633960 69622238 67493344 65364664 63004038 61137188 59019233
2739E9019233j909092k151214k385979k465172j589495j845664j744210j099329
$$ 59019233 57110141 54958927 52572948 50107776 48518281 46672617 44928407 43829078
2731D3829078j382578j109955k075335j609618j230278j465853j087706q47650
$$ 43829078 42446500 41336545 39261210 37651592 36421314 34955461 33867755 33020105
2723C3020105n82649r33005j112904k89635k56623k70225q38491j316184m76845
$$ 33020105 32437456 31504451 30391547 30101912 29845289 29575064 28736573 27420389 26943544
2714B6943544n41408q85768l48002n38353r81186j109924k18081N6814p55977
$$ 26943544 26402136 25516368 25168366 24630013 23648827 22538903 22320822 22377636 21621659
2705B1621659l35938k04728o83519m89067k68767k10809p30649k88371o89014
$$ 21621659 21285721 21080993 20397474 19908407 19639640 19428831 18698182 18409811 17720797
2696A7720797j59982m64108o70993o46221k06186l36595n90900k29833J83812
$$ 17720797 17560815 17096707 16425714 15779493 15573307 15236712 14645812 14415979 14599791
2687A4599791m80155k4525J01296n13918J52445k08060q13967n83728j65063m67173
$$ 14599791 14119636 14095111 14196407 13682489 13834934 13626874 12812907 12229179 12064116 11596943
2677A1596943j45421j26900j14108l91142M81317n21379n52070k58134l09906
$$ 11596943 11451522 11324622 11210514 10819372 11300689 10779310 10227240 9969106 9659200
2668I659200j75705j4705k84703l13127K79009p36532j89965l58821K01915m36405
$$ 9659200 9483495 9468790 9184087 8870960 9149969 8413437 8223472 7864651 8066566 7630161
2658G630161J9364j87268l5649L12899o33614L9734p8656j7795n8964K97523N6032
$$ 7630161 7649525 7462257 7426608 7739507 7105893 7145627 7066971 7049176 6990212 7287735 7343767
2647G343767k41357p7597l42543l43989K49566l02948O9592n24614l9239k45582
$$ 7343767 7102410 7024813 6682270 6338281 6587847 6284899 6354491 5829877 5790638 5545056
2637E545056l55055J56306K29078j77447L5559L75101K07112J26698p69868m31066
$$ 5545056 5190001 5346307 5575385 5397938 5433497 5808598 6015710 6142408 5372540 4941474
2627D941474k45824l21673K8872l69511J12993j38333K3514l14216L24378M15799
$$ 4941474 4695650 4373977 4402849 4033338 4146331 4007998 4031512 3717296 4041674 4457473
2617D457473j75802K44966n69994M31999K82473l48411o99437Q697J30178k47129
$$ 4457473 4281671 4526637 3956643 4388642 4671115 4322704 3623267 3631964 3762142 3515013
2607C515013m27899k19267L18347l3758j0817j93808L37437j8374K32367l05526
$$ 3515013 3087114 2867847 3186194 3152436 3141619 2947811 3285248 3266874 3499241 3193715
2597C193715l60137O76748m55654k82354O72993l92666m34503j61728J07024m8557
$$ 3193715 2833578 3510326 3054672 2772318 3445311 3052645 2618142 2456414 2563438 2514881
2587B514881N8645k1700j64947R744J66441l7563j0618k26697m38352J89790K45029
$$ 2514881 2573526 2551826 2386879 2396623 2563064 2525501 2514883 2288186 1849834 2039624 2284653
2576B284653k6035j2879j71963p2653R0167K99519k20558j98595n4652j84064
$$ 2284653 2258618 2245739 2073776 2001123 2091290 2390809 2170251 1971656 1917004 1732940
2566A732940n2906K15003k61603l3748L53562l9863l5344l19982j32976J62677
$$ 1732940 1680034 1895037 1633434 1599686 1953248 1913385 1878041 1558059 1425083 1587760
2556A587760L70935k39175K22411m65641R6711R9426O9135K47331L62338k75214
$$ 1587760 1958695 1719520 1941931 1476290 1573001 1672427 1741562 1988893 2351231 2076017
2546B076017m42398k71153L11295J01026J16016K29919k89048j01231M22098k59488
$$ 2076017 1633619 1362466 1673761 1774787 1890803 2120722 1831674 1730443 2152541 1893053
2536A893053n65703l73150O69699M27584r0724p26485m26605N12116L15333J99318
$$ 1893053 1327350 954200 1623899 2051483 1960759 1234274 807669 1319785 1635118 1834436
2526A834436l14696P23496k75566j84010Q5890l95389P6928L77437K81659n7013
$$ 1834436 1519740 2243236 1967670 1783660 1869550 1474161 1551089 1928526 2210185 2153172
2516B153172L60742j64411K49107J72609K24937q60O7447k66323K6213k78974
$$ 2153172 2513914 2349503 2598610 2771219 2996156 2995296 3062743 2796420 2822633 2543659
2506B543659M3605j48589l44321J52841m54480j5908o687J14672n111n4190J29234
$$ 2543659 2587264 2438675 2094354 2247195 1792715 1776807 1770120 1884792 1879681 1825491 1954725
2495A954725J24384m47442J83771m02638q3487m03130L59272N29611q8387m93353
$$ 1954725 2079109 1631667 1815438 1412800 1329313 926183 1285455 1815066 1726679 1233326
2485A233326l34011L29682O4266l8403j84110L05980J28013k35762l28511p9195
$$ 1233326 899315 1228997 1293263 1254860 1070750 1376730 1504743 1268981 940470 861275
2475H61275k06404k5440K18175j84220n0408L66662k63757k45259J55822M09182
$$ 861275 654871 629431 847606 663386 612978 979640 715883 470624 626446 1035628
2465A035628k9199l82710j24049N49186K49982p21588M62046j35816k25576k95866
$$ 1035628 1006429 623719 499670 1048856 1298838 577250 1039296 903480 677904 382038
2455C82038L64290J3956n77709K17580K67504j53598k05900m4305K05420k72461
$$ 382038 746328 760284 182575 400155 667659 514061 308161 263856 469276 196815
2445A96815L8303k68617K35316K4867K82167k27308l0919N07051m1245j23044
$$ 196815 235118 -33499 201817 226684 508851 281543 250624 757675 716430 593386
2435E93386J42881j5113l43323k57500J32643r218p8600o2889K71352J69985m96081
$$ 593386 736267 721154 377831 120331 252974 243756 165156 102267 373619 543604 47523
2424D7523K34021r0164Q6639O4544J99813k28954j12312r985L3056j55911J86419
$$ 47523 281544 191380 278019 342563 542376 313422 201110 191125 224181 68270 254689
2413B54689j59226K72275M07658k34786n22169L25868l99915J20845J21236K02191
$$ 254689 95463 367738 775396 540610 18441 344309 -55606 65239 186475 388666
2403C88666j44848k88385k4257L26736L3843k67070k0459j58891k6910O5634L36172
$$ 388666 243818 -44567 -68824 257912 291755 24685 4226 -154665 -181575 -115941 220231
2392B20231l99273M65495l19039m0718R490q3145N1826K68735M4936k15898N83773
$$ 220231 -179042 286453 -32586 -73304 -63814 -146959 -95133 173602 218538 2640 586413
2381E86413Q9903l24779k71629m7478K03511M4360P0902j30052p8327j81607J2476
$$ 586413 676316 351537 79908 32430 235941 280301 351203 221151 142824 -38783 -26307
2370b6307N84199p5893j3395k39995J8139k27764l45658K00743N35029K8415j92652
$$ -26307 557892 481999 468604 228609 246748 18984 -326674 -125931 409098 437513 244861
2359B44861j31841K61296j98602J23582J30303l57442N89351K33278m73024n59100
$$ 244861 113020 374316 175714 299296 429599 72157 661508 894786 421762 -137338
2349a37338L26774J27838N3907q6525l18961j49936J69814k15864m63378Q04013
$$ -137338 189436 317274 371181 284656 -34305 -184241 -14427 -230291 -693669 110344
2339A10344J52562j79514L13760J27426l80918k01071Q27583j67817j82845l62832
$$ 110344 262906 83392 397152 524578 143660 -57411 770172 602355 419510 56678
2329E6678j22069O8684j4718M54145k46587J08294k02786p1162K0740j59067j2359
$$ 56678 -65391 3293 -11425 442720 196133 304427 101641 30479 51219 -107848 -120207
2318a20207K72130M1233j60653R5149K02060Q0752p3873M50995M13346k55972
$$ -120207 151923 193156 32503 127652 329712 410464 336591 787586 1200932 944960
2308I44960L64451j26453R1311L66730k35658j37740n88159m70199m87861P56747
$$ 944960 1309411 1182958 1274269 1640999 1405341 1267601 679442 209243 -278618 478129
2298D78129L05757j95161k87043j88322J38355k07269l23954L98846K88963K61715
$$ 478129 783886 588725 301682 113360 251715 44446 -279508 119338 408301 670016
2288F70016m84012O3674k12034l49257J74902K01576J72018l06775o8149K26242
$$ 670016 186004 249678 37644 -311613 -136711 64865 236883 -69892 -138041 88201
2278H8201K14634k48468k29320j05092K63713N424q8756L51296L60888k58864
$$ 88201 302835 54367 -174953 -280045 -16332 -10908 -99664 251632 612520 353656
2268C53656l32257N2947K87836q8969j4314J65044k56128j17159P6084j90963
$$ 353656 21399 74346 362182 273213 258899 423943 167815 50656 126740 -64223
2258f4223J93321K88296J12101l68461n7558k63159M00910J82140j95896o13511
$$ -64223 129098 417394 529495 161034 103476 -159683 241227 423367 227471 -386040
2248c86040L1612K06492R8645K71893j48411L96593J18405j27642k28687L24050
$$ -386040 -354428 -147936 -49291 222602 74191 470784 589189 461547 232860 556910
2238E56910k65136k71222j55241k33707k1638N0572L63700k8797j00878M40751
$$ 556910 291774 20552 -134689 -368396 -390034 -339462 24238 -4559 -105437 335314
2228C35314j3239P0298q0861n43585N31048j67296j32751j16996N1575L04244
$$ 335314 322075 392373 311512 -232073 298975 131679 -1072 -118068 -66493 237751
2218B37751P4632l43941o53367M18260P9733L72384r2028j2816q6232K19948O36251
$$ 237751 312383 -31558 -684925 -266665 -186932 185452 93424 80608 -5624 214324 850575
2207H50575O3951l68032p0216J53895k43673L7602l58939l30496m1651k0608R09940
$$ 850575 914526 546494 476278 630173 386500 424102 65163 -265333 -306984 -327592 582348
2196E82348j63107n04592M63065J17154k56925l19425k5421R06862k50124m82490
$$ 582348 419241 -85351 377714 494868 237943 -81482 -106903 799959 549835 67345
2186F7345K31187j61000O44595L58706K70081K8308l16853j42153k48502l68280
$$ 67345 298532 137532 782127 1140833 1410914 1439222 1122369 980216 731714 363434
2176C63434Q919M72178l0052q9429m20104j51558N07471j80249J50423K94322
$$ 363434 372353 844531 814479 725050 304946 153388 660859 480610 631033 925355
2166I25355j59710l1922J59168k43010J30756l14190r7450O72521m470q8608J04365
$$ 925355 765645 733723 892891 649881 780637 466447 368997 1041518 1037048 948440 1052805
2155A052805r3371L09917m4013m10690N36855j10143L05599j78681K27898q7078
$$ 1052805 959434 1269351 1225338 814648 1351503 1241360 1546959 1368278 1596176 1509098
2145A509098k9667K87610k9274R0753K60625k67378J61317N33609m37928K01866
$$ 1509098 1479431 1767041 1737767 1828520 2089145 1821767 1983084 2516693 2078765 2280631
2135B280631J53625k72789K24532L59496L43598N2253l15180K00840N04151N33250
$$ 2280631 2434256 2161467 2385999 2745495 3089093 3141346 2826166 3027006 3531157 4064407
2125D064407k08107k60844j50655m8013K47510M27578N69963J96898m2165N63279
$$ 4064407 3856300 3595456 3444801 3396788 3644298 4071876 4641839 4838737 4796572 5359851
2115E359851l90759L32220M66909K13800m91830K28631N70867J82760j08328L82764
$$ 5359851 4969092 5301312 5768221 5982021 5490191 5718822 6289689 6472449 6364121 6746885
2105F746885j60330L87232M79884J67542M15996Q00366N48972L18207J34861M41049
$$ 6746885 6586555 6973787 7453671 7621213 8037209 8837575 9386547 9704754 9839615 10280664
2095A0280664O15022N13092P15942P75786Q01640J122777R14185J262881J386259
$$ 10280664 10895686 11408778 12124720 12900506 13702146 14824923 15739108 17001989 18388248
2086A8388248K177309K150445J969123J977065K314560K904485L772557L539002
$$ 18388248 20565557 22716002 24685125 26662190 28976750 31881235 35653792 39192794
2078C9192794K471004L117081N153047P155365Q823283J0165970J2870501J4768182
$$ 39192794 41663798 44780879 49933926 57089291 65912574 76078544 88949045 103717227
2070A03717227J8936301K4494777L1726589M3239944M4266316j165827m1819397
$$ 103717227 122653528 147148305 178874894 222114838 266381154 265215327 223395930
2063B23395930m1718513m1940003k8911780k0464954j3957879j0147814o982823
$$ 223395930 181677417 139737414 110825634 90360680 76402801 66254987 59272164
2056E9272164n359798m665361m336345k997801k302623l229801l219145k935804
$$ 59272164 53912366 49247005 44910660 41912859 39610236 36380435 33161290 30225486
2048C0225486k804668k411338k133583r39982p83200r54166l46928q82587p77821
$$ 30225486 27420818 25009480 22875897 21935915 21152715 20198549 19851621 18969034 18191213
2039A8191213r62547q18130j090745n12317j327381l58315j96960o69451K43589
$$ 18191213 17228666 16410536 15319791 14807474 13480093 13121778 12924818 12255367 12498956
2030A2498956o01361q14634l26233m09878n9897p70882m01939l8495j071716q0311
$$ 12498956 11897595 11082961 10756728 10346850 10286953 9516071 9114132 9075637 8003921 7923610
2020G923610k67265k88958m07457K72121m92718j50504j60608l68693L08910K7025
$$ 7923610 7656345 7367387 6959930 7232051 6739333 6588829 6428221 6059528 6368438 6395463
2010F395463m2103l63529j91211o3368J27302n5919n41742l24978L8608k62611
$$ 6395463 6353360 5989831 5798620 5735252 5862554 5806635 5264893 4939915 4978523 4715912
2000D715912L49816p02841M66422n80233J58033k39522n1339m41212J57110k62765
$$ 4715912 5065728 4362887 4829309 4249076 4407109 4167587 4116248 3675036 3832146 3569381
1990C569381R1881M37124l72279J73194J31091o27415M1741J69816l70733m80112
$$ 3569381 3661262 4098386 3726107 3899301 4030392 3402977 3444718 3614534 3243801 2763689
1980B763689n04547m68008j73019P70239N36059l84671P8701k56939j95074j80577
$$ 2763689 2259142 1791134 1618115 2388354 2924413 2539742 2618443 2361504 2166430 1985853
1970A985853r4942L88793L04803j03843o17461P1075K83999q1579j00454K760
$$ 1985853 1890911 2279704 2584507 2480664 1863203 1934278 2218277 2136698 2036244 2039004
1960B039004m22635J47171J89453k55146m8003M7411R376K29468k52601j09094
$$ 2039004 1616369 1763540 1952993 1697847 1649844 1697255 1706631 1936099 1683498 1574404
1950A574404j81681k89046M4817K4103J41158j2740l94005r3726M23968J6531
$$ 1574404 1392723 1103677 1148494 1172597 1313755 1301015 907010 813284 1237252 1253783
1940A253783J91556k07318k42467n4124L2063J31916j0775J91958j78761M65619
$$ 1253783 1445339 1238021 995554 941430 973493 1105409 1094634 1286592 1107831 1573450
1930A573450L95051o7803m59957j73158j99941J47879k53279K7126P3039q0989
$$ 1573450 1968501 1900698 1440741 1267583 1067642 1215521 962242 989368 1062407 981418
1920I81418k01452J20945q3000j63316N84791P33737k16973o39056K84559k11866
$$ 981418 779966 900911 817911 654595 1239386 1973123 1756150 1117094 1401653 1189787
1910A189787j56412k66302J7833l48384k02371k38360L9710M46668N65368j44743
$$ 1189787 1033375 767073 784906 436522 234151 -4209 35501 482169 1047537 902794
1900I02794j39720K13267k04148O5093j24473Q648l31262K2923k8074J81601K55907
$$ 902794 763074 976341 772193 837286 712813 721461 390199 413122 385048 566649 822556
1889H22556J10913k49736J53854J44332l89027l8820o48716J84685O9817K46461
$$ 822556 933469 683733 837587 981919 592892 554072 -94644 90041 159858 406319
1879D06319K46161P7150R6829k87996J14224R337n19535J8723o735P763L60773
$$ 406319 652480 729630 826459 538463 652687 662024 142489 161212 154477 162240 523013
1868E23013l29440L8581R2622j83195M17294N05386j89062j93730j54317m25662
$$ 523013 193573 232154 324776 141581 558875 1064261 875199 681469 527152 101490
1858A01490j3972M90574q0840n8669j29281k9858N4984k93305m5364M12284j4435
$$ 101490 87518 578092 497252 438583 309302 279444 334428 41123 -4241 408043 393608
1847C93608J80889J25219j84744l0077n0992p6062J18258j38598J36209l5380
$$ 393608 574497 699716 514972 484895 433903 357841 476099 337501 473710 438330
1837D38330O962R2090L90173l16458K57223J45174M0435l51247m68840O28180
$$ 438330 445292 537382 927555 611097 868320 1013494 1053929 702682 233842 862022
1827H62022J17727r2796Q39502J34466P0199k33919o26490j00049K35707p42031
$$ 862022 979749 886953 1726455 1860921 1931120 1697201 1070711 970662 1206369 464338
1817D64338J25894K47493m54806J55021L5804j07683m57156R1748J2321L723J72561
$$ 464338 590232 837725 382919 537940 573744 466061 8905 100653 112974 116697 289258
1806B89258q5584J59690m7074n30084L67274K19581n30942j88748K30183q3886
$$ 289258 203674 363364 316290 -213794 153480 373061 -157881 -346629 -116446 -200332
1796b00332N12792j86974L23387P0318n22528j81596N51087J138k49228k05918
$$ -200332 312460 125486 448873 519191 -3337 -184933 366154 367292 118064 -87854
1786h7854l00190K82105K60326j68335J58066l1542j90886J30935l50357J56277
$$ -87854 -388044 -105939 154387 -13948 144118 112576 -78310 52625 -297732 -141455
1776a41455j02636l43480J76685M87188N57189j35569j21527k64441j6600m64865
$$ -141455 -244091 -587571 -410886 76302 633491 497922 376395 111954 95354 -369511
1766c69511J79073Q9355L46899j1968k86995J15009j60761M67549j52989L20613
$$ -369511 -190438 -101083 245816 233848 -53147 61862 -98899 368650 215661 536274
1756E36274o48573q0916K40670P4609K21396m03771O25387l60010k40755K88306
$$ 536274 -112299 -193215 47455 122064 343460 -60311 565076 205066 -35689 252617
1746B52617J7330l99653j641k1066K98976Q73j55398l67938L22004L37731k49204
$$ 252617 269947 -129706 -131347 -152413 146563 147436 -7962 -375900 -53896 283835 34631
1735C4631L0796l8491l97798N42387k4309k70153L64430k89056j99850l04449
$$ 34631 65427 26936 -370862 171525 147216 -122937 241493 -47563 -247413 -551862
1725e51862l3257R5609L44306N0044K051j16857M51871m44689k46942M05975M5823
$$ -551862 -585119 -489510 -145204 -95160 -93109 -209966 241905 -202784 -449726 -43751 2072
1714B072j60371o6645j96774J44936L89356p4133k33535j5496J6857k85550K03110
$$ 2072 -158299 -224944 -421718 -276782 112574 38441 -195094 -210590 -193733 -479283 -276173
1703b76173j50338L14602O9562l11701M17425l9089K07514l00325K6992J61073
$$ -276173 -426511 -111909 -42347 -354048 63377 24288 231802 -68523 -41531 119542
1693A19542O4664M012l27634J18361K19806m52249K86767K03396J93460l96237
$$ 119542 184206 188218 -139416 -21055 198751 -253498 33269 236665 430125 33888
1683C3888k53270M38678m46472K15633J6075K20131m53294l0084K31201R5848
$$ 33888 -219382 219296 -227176 -11543 4532 224663 -228631 -258715 -27514 68334
1673F8334J36690n9282j52108j59958K87310R0344l0709L45502P06j16077m55115
$$ 68334 205024 145742 -6366 -166324 120986 211330 180621 526123 526829 410752 -44363
1662d4363j1334N05515m79374q4573N2213j30342k8751P2991r1966k15426J6264
$$ -44363 -55697 449818 -29556 -114129 -61916 -192258 -221009 -148018 -239984 -455410 -439146
1651d39146j08663l91737Q26603J45734m02042L96409L09311m18147m57516K93231
$$ -439146 -547809 -939546 -112943 32791 -369251 27158 336469 -81678 -539194 -245963
1641b45963J32536J93654K79877k85172j43580o4544K22217j87681K45005k00188
$$ -245963 -113427 80227 360104 74932 -68648 -133192 89025 -98656 146349 -53839
1631e3839j90962R4062j54849J783P2710J76784k60420M65694n00392K1148L11908
$$ -53839 -244801 -150739 -305588 -303805 -231095 -54311 -314731 150963 -349429 -328281 -16373
1620a6373o64334N91860N09943l55596k41348K53774L79245M7691m56002j18632
$$ -16373 -680707 -88847 421096 65500 -175848 77926 457171 504862 48860 -69772
1610f9772J22506J27126p36363J96674P8420j33796O5168K9561K84749M05023
$$ -69772 52734 179860 -556503 -359829 -281409 -415205 -350037 -320476 -35727 369296
1600C69296m96215L6459m7253J23074L61081l45581J46117L6778q1917K42731
$$ 369296 -126919 -90460 -137713 -14639 346442 861 146978 183756 101839 344570
1590C44570J9924l54533m4306k31128K98929l2126k72291Q4410K03838m3638r5346
$$ 344570 364494 9961 -34345 -265473 33456 1330 -270961 -186551 17287 -26351 -121697
1579a21697k5258k59888m1282L81291k61781P1006L72630K49233m07855k84472
$$ -121697 -146955 -406843 -448125 -66834 -328615 -257609 115021 364254 -43601 -328073
1569c28073j66343K77046J47774j3163o5621q2182J68465l72296J10553K74033
$$ -328073 -494416 -217370 -69596 -82759 -148380 -230562 -62097 -434393 -323840 -49807
1559d9807l2761K8745j65728K8343m22396J38941J94424M68862R4128m42041Q3825
$$ -49807 -82568 -53823 -219551 -191208 -613604 -474663 -280239 188623 282751 -159290 -75465
1548g5465m20071J61523M19462J87401J45300p19565M7945j79946O00508K99077
$$ -75465 -495536 -334013 85449 272850 418150 -301415 -253470 -433416 167092 466169
1538D66169j81190l30333J10140N1827l66963M71984j67366q5173K07701l80160
$$ 466169 284979 -45354 64786 116613 -250350 221634 54268 -30905 176796 -203364
1528b03364L07079K06954P5450O748k30749R3950J2572M2053L06553j67252q17625
$$ -203364 103715 310669 386119 392867 162118 256068 268640 310693 617246 449994 -367631
1517c67631j59687Q5626J17485L21345j92400j5477L28225l59848l77641R4117
$$ -367631 -527318 -441692 -324207 -2862 -195262 -210739 117486 -242362 -620003 -525886
1507e25886J10449L47421K46718l42107M1683n3474R4983n9593j32921k06879
$$ -525886 -415437 -68016 178702 -163405 -121722 -175196 -80213 -139806 -272727 -479606
1497d79606M7703J52705l1024l4953Q1856M66770k09341j6451O9015J16942J63914
$$ -479606 -431903 -279198 -310222 -345175 -263319 203451 -5890 -22341 46674 163616 327530
1486C27530l34963l89090L57290o9186m52092J64003K49888K43576O1524k1584
$$ 327530 -7433 -396523 -39233 -108419 -560511 -396508 -146620 96956 158480 136896
1476A36896L3299j78788N4857O9824J61123j14721l37063N22882l11587n22537
$$ 136896 170195 -8593 46264 116088 277211 162490 -174573 348309 36722 -485815
1466d85815P7857K09933M07248J81552m12492L30888m10332J38156j01467m0826
$$ -485815 -407958 -198025 209223 390775 -21717 309171 -101161 36995 -64472 -105298
1456a05298q9458R530J29194K25427l63869l17019L21696K11997j62516M21710
$$ -105298 -194756 -185226 -56032 169395 -194474 -511493 -189797 22200 -140316 281394
1446B81394l43293k92787J77907P0330N03098k79829q5473k29864k57008J44995
$$ 281394 -61899 -354686 -176779 -106449 396649 116820 31347 -198517 -455525 -310530
1436c10530K7j30772R4539L29941R6108m8417L21138J54873k92499o567j19665
$$ -310530 -310503 -441275 -346736 -16795 79313 30896 352034 506907 214408 207841 88176
1425H8176l21928J03964j47545K91828Q2377j15387K84402Q572n24216k82894
$$ 88176 -233752 -129788 -277333 14495 96872 -18515 265887 274459 -249757 -532651
1415e32651J54520k8177j11083J64585j23368l1605P78714o2156m53870m1897
$$ -532651 -378131 -406308 -517391 -352806 -476174 -507779 270935 208779 -245091 -286988
1405b86988n4488O6480K52474N68290j72016k98367k43237Q2234P0823L01627
$$ -286988 -341476 -274996 -22522 545768 373752 75385 -167852 -85618 -14795 286832
1395B86832n37883L77331K16172l8727j54099j13444M11501m46227J81377N5796
$$ 286832 -251051 126280 342452 303725 149626 36182 447683 1456 182833 238629
1385B38629l18875j32489L23182n09358j64778Q11045m1625L1936K07423j94261
$$ 238629 -80246 -212735 110447 -398911 -563689 247356 205731 237667 445090 250829
1375B50829k04860M41938M4715J41981j21216m79601J96254o64886K40679J30768
$$ 250829 45969 487907 532622 674603 553387 73786 270040 -394846 -154167 -23399
1365b3399j81912K5181M03169j44965K40648l87102n35728N14642k01620J91435
$$ -23399 -205311 -180130 223039 78074 318722 -68380 -604108 -89466 -291086 -99651
1355i9651K48127J99407K55484l58742n10558k10394L30015j32490k1894J3040
$$ -99651 148476 347883 603367 244625 -265933 -476327 -146312 -278802 -300696 -287656
1345b87656K14243J86092k70896J28624N2531M58186m04583m71435J96781N95710
$$ -287656 -73413 112679 -158217 -29593 22938 481124 76541 -394894 -198113 397597
1335C97597k58050k72766k02819j26995M74612J14944j26043m478J27757j79758
$$ 397597 139547 -133219 -336038 -463033 11579 126523 480 -3998 123759 -55999
1325e5999j01732J24346k13722N08818m22450L09938J17524l65654J86256Q9927
$$ -55999 -157731 -33385 -247107 261711 -160739 149199 266723 -98931 87325 177252
1315A77252J3454j43918o49456L6873K40450k9030k09817K0809L0202J57604J71602
$$ 177252 190706 46788 -602668 -565795 -325345 -354375 -564192 -543383 -513181 -355577 -183975
1304a83975k29441J38140K75713L63608M27918l7216k91238k97868n68329l67317
$$ -183975 -413416 -275276 437 364045 791963 754747 463509 165641 -402688 -770005
1294g70005m593O27588L25882m07312j16180R1404M71220L25755n66176l19103
$$ -770005 -774598 -147010 178872 -228440 -344620 -253216 218004 543759 -22417 -341520
1284c41520Q4802j46874k56702N27430K4638j751j68616M85811k88477M98437
$$ -341520 -256718 -403592 -660294 -132864 -108226 -109977 -278593 207218 -81259 417178
1274D17178n61203j82786L99862l1696l2802J41249l24186k64722L67275j87534
$$ 417178 -144025 -326811 73051 41355 8553 149802 -174384 -439106 -71831 -259365
1264b59365K78703J4361K48232k04738J25068m05703O70132M5627n29039j64843
$$ -259365 19338 33699 281931 77193 202261 -203442 466690 512317 -16722 -181565
1254a81565J42736L7029q6724J25573j42659Q5215m67936J64522P4191q8111j22859
$$ -181565 -38829 -1800 -88524 37049 -105610 -20395 -488331 -323809 -249618 -337729 -460588
1243d60588k5936R4346J17334L41540j30656n3906K63045m7610j86173q9488o4353
$$ -460588 -486524 -392178 -274844 66696 -63960 -117866 145179 97569 -88604 -178092 -242445
1232b42445j14820M39545n0131l0141p4741k56215K49123o1943k07399J00343
$$ -242445 -357265 82280 32149 2008 -72733 -328948 -79825 -141768 -349167 -248824
1222b48824L63902m7695k80067j65089L95545j18628j13588j77205M7374p8903
$$ -248824 115078 67383 -212684 -377773 17772 -100856 -214444 -391649 -344275 -423178
1212d23178K16319J26290j38765M31042k91679j3771q0093L23955J72081l83041
$$ -423178 -206859 -80569 -219334 211708 -79971 -93742 -173835 150120 322201 -60840
1202f0840l48222j24889O3817K45833L84442k58847P2543q571k26379p2146m23723
$$ -60840 -409062 -533951 -470134 -224301 160141 -98706 -26163 -34734 -261113 -333259 -756982
1191g56982O03467L83385j89409K0368M3445l50765n9065M87013l14323n13532
$$ -756982 -153515 229870 40461 60829 104274 -246491 -305556 181457 -132866 -646398
1181f46398K85095J92835M59135m69788m58969Q3667J36105M31555M32583j66414
$$ -646398 -361303 -168468 290667 -179121 -638090 -554423 -418318 13237 445820 279406
1171B79406l11778j24668j47135K86491j51535j47431j2641N35705l49369j57334
$$ 279406 -32372 -157040 -304175 -17684 -169219 -316650 -329291 206414 -142955 -300289
1161c00289P2132j57370K5463L54997k25302k83859M41223K94163m04202l24947
$$ -300289 -228157 -385527 -360064 -5067 -230369 -514228 -73005 221158 -183044 -507991
1151e07991o134l42940M25857M51897P5009m76966L16914k54765M81039j53314
$$ -507991 -514125 -857065 -431208 20689 95698 -381268 -64354 -319119 161920 8606
1141H606p5537L77402l64556l83987m34477K29842J96531J13213K21837k81020
$$ 8606 -66931 310471 -54085 -438072 -872549 -642707 -446176 -332963 -111126 -392146
1131c92146M08487K46365l92264J50445L5662M1130K18431R8170J19761J55075
$$ -392146 16341 262706 -129558 20887 56549 97679 316110 414280 534041 689116
1121F89116k18388J34943n99204J0344K28966m00303L027L71832N8870l70044
$$ 689116 470728 605671 6467 16811 245777 -154526 -151499 220333 279203 -90841
1111i0841l12518M45230N38683j37059j46628M3261p5482l747m08143J44379L08587
$$ -90841 -403359 41871 580554 443495 296867 340128 264646 260899 -147244 -2865 305722
1100C05722k34125m07306J26504j0977J76210k55917K41149m5519K01051N2364
$$ 305722 71597 -335709 -209205 -220182 -43972 -299889 -58740 -104259 96792 149156
1090A49156N46383l25363o4516O2931k55464J17376M4608l056m51266n09530O00873
$$ 149156 695539 370176 305660 368591 113127 230503 275111 272055 -179211 -688741 -87868
1079h7868n8019j94459o1697k65300M28906L43255J49736m27390L70964J3378
$$ -87868 -145887 -340346 -402043 -667343 -238437 104818 254554 -172836 198128 211506
1069B11506J52830M986L28969p17501K32642K19562m96199K37908l11047k86568
$$ 211506 364336 369322 698291 -19210 213432 432994 -63205 174703 -136344 -422912
1059d22912r1735N15539K92783n33665j83157q3718M83509R0691j79403j6234
$$ -422912 -514647 892 293675 -239990 -423147 -506865 -23356 67335 -112068 -128302
1049a28302J17266L19359l23212K48589l64872m4200j74788L83436j16425l21992
$$ -128302 -11036 308323 -14889 233700 -131172 -175372 -350160 33276 -83149 -405141
1039d05141Q4886L32542M93662k24012j25589l92458J28638l32934J49454K59533
$$ -405141 -320255 12287 505949 281937 156348 -236110 -107472 -440406 -290952 -31419
1029c1419J58467k38853k65859o5021K05801J16472k31458R9625J2774M64849
$$ -31419 127048 -111805 -377664 -442685 -236884 -120412 -351870 -252245 -239471 225378
1019B25378J23575p35716N09129L3540K04177j70646l22489N53157r6077j98540
$$ 225378 348953 -386763 122366 155906 360083 189437 -133052 420105 324028 125488
1009A25488k72197J42193L45510k15834J36400j05835r4837L6193K80653l33027
$$ 125488 -146709 -4516 340994 125160 261560 155725 60888 97081 377734 44707
999D4707J63869L4166m49260l56659L67743K86018q6534L18107l26248o1292Q7431
$$ 44707 208576 242742 -206518 -563177 -195434 90584 4050 322157 -4091 -65383 22048
988B2048J59227o2028K19821J60929k06562j66968l14911K76168j94273K69935
$$ 22048 181275 119247 339068 499997 293435 126467 -188444 87724 -106549 163386
978A63386n06262Q0562J10675j13071L26316R3392k81200M17891j23663k56806
$$ 163386 -342876 -262314 -151639 -264710 61606 154998 -126202 291689 168026 -88780
968h8780k10617K63885L1189k91363l75260K56355N21411n49828j37244O90382
$$ -88780 -299397 -35512 -4323 -295686 -670946 -414591 106820 -443008 -580252 110130
958A10130K28297o62002K57603J80574j28389j27018J25109l86954K43901L56895
$$ 110130 338427 -323575 -65972 114602 -13787 -140805 -15696 -402650 -158749 198146
948A98146j02140m75252j88838J56318P05383q8869j91714J03147M52305n25634
$$ 198146 96006 -379246 -568084 -411766 293617 204748 13034 116181 568486 42852
938D2852l9851k6285J37720k93006j76992j58351L61817J95067j47491j7512L14997
$$ 42852 3001 -23284 114436 -178570 -355562 -513913 -152096 42971 -104520 -122032 192965
927A92965k40573r2959k57270K60460j74365M02655K52580p1936K71122n58850
$$ 192965 -47608 -140567 -397837 -137377 -311742 90913 343493 271557 542679 -16171
917a6171P2824j2996P0591P3480j40667M34680k04123l91192j23399l2775n2046
$$ -16171 56653 43657 114248 187728 47061 481741 277618 -113574 -236973 -269748 -321794
906c21794k89493M66543O2174L5548j87220O5732o6486m3844k62837J67354M47961
$$ -321794 -611287 -144744 -82570 -47022 -234242 -168510 -234996 -278840 -541677 -374323 73638
895G3638J86829J4402r2072J20568j49724J08268k54745k39283J09372j65914
$$ 73638 260467 274869 182797 303365 153641 261909 7164 -232119 -122747 -288661
885b88661K72430j2697m6097m0790m08785l3396J51445O38090J02167o15774q3117
$$ -288661 -16231 -28928 -75025 -115815 -524600 -557996 -406551 231539 333706 -282068 -365185
874c65185L39549R1734k08808J27775M491K42467J56797l16026j82571l13408
$$ -365185 -25636 66098 -142710 -14935 -10444 232023 388820 72794 -109777 -423185
864d23185K26279K9121l6465M29650P0723o8420l27515K79672j34002R8723j06086
$$ -423185 -196906 -167785 -204250 225400 296123 227703 -99812 179860 45858 144581 38495
853C8495R8639Q8013r6034l37760k1563k3511K25012j60487M18159J03640l40769
$$ 38495 137134 225147 129113 -208647 -230210 -253721 -28709 -189196 228963 332603 -8166
842h166K41539N34343n83298l57405K93043K85697p7563l10285M7114l41340K42996
$$ -8166 233373 767716 184418 -172987 120056 405753 328190 17905 65019 -276321 -33325
831c3325L51961m10976k04177J49262L06763J1859j55135K40994L11649j92842
$$ -33325 318636 -92340 -296517 -147255 159508 171367 16232 257226 568875 376033
821C76033k77804l73640j8624R5658j49811L73526K34543K26228n63110J5120
$$ 376033 98229 -275411 -294035 -198377 -348188 25338 259881 486109 -77001 -61881
811f1881k9705k23418K03445M41218j40871k05865J07104k52103k16534k7394
$$ -61881 -91586 -315004 -111559 329659 188788 -17077 90027 -162076 -378610 -406004
801d06004J36418k1571J23018K49568J22233K62649N8957k14441k21473N3496
$$ -406004 -269586 -291157 -168139 81429 203662 466311 525268 310827 89354 142850
791A42850k89330L53971K776N7456k78030l19094J01454K81978m27377L45563
$$ 142850 -146480 207491 210267 267723 -10307 -329401 -227947 54031 -373346 -27783
781b7783L6565L39483L44583n59450P3302K7697n37512k30973P35125r1879P1828
$$ -27783 8782 348265 692848 133398 206700 234397 -303115 -534088 201037 109158 180986
770A80986l54418J07621M53798R17M6854j14314K60022k46728K8176L23641m32881
$$ 180986 -173432 -65811 387987 388904 435758 321444 581466 334738 362914 686555 253674
759B53674j57136k03306M5740J59196m5872O8288L00403l11304j03780l11977
$$ 253674 96538 -106768 -61028 98168 52296 120584 420987 109683 5903 -306074
749c06074j46310J80720J90029l52134p7126N46727r3262m2896K56552p137n77518
$$ -306074 -452384 -271664 -81635 -433769 -510895 35832 -57430 -100326 156226 149089 -428429
738d28429K66162L27656k05357k774J38640K07194K1955k07566j7482J81495l94341
$$ -428429 -162267 165389 -39968 -42742 95898 303092 325047 117481 99999 281494 -112847
727a12847M00302j92702J70653l1094n98405M59305J88980o84001N0859J06879
$$ -112847 287455 94753 265406 234312 -364093 95212 284192 -399809 -348950 -242071
717b42071Q9647m8878j22740q237j05726N5459k01015L67014l436J49494J02643
$$ -242071 -152424 -201302 -324042 -332279 -438005 -382546 -583561 -216547 -219983 -70489 32154
706C2154J82727K26113l25602r7890r5152o0753M53879k77758k33207L41675K72306
$$ 32154 214881 440994 115392 17502 -77650 -138403 315476 37718 -195489 146186 418492
695D18492j34060n5393r2581q5741j0872J02816q5743k22414j52804K58505K18582
$$ 418492 284432 229039 136458 50717 39845 142661 56918 -165496 -318300 -59795 158787
684A58787M12101k3991l35251k56450J6670R0514L69280o80768r8954L20139k6100
$$ 158787 570888 546897 211646 -44804 -28134 62380 431660 -249108 -348062 -27923 -54023
673e4023k46760J57077K84967n4836l10052j38813P83815l4365m79607L51484
$$ -54023 -300783 -143706 141261 86425 -223627 -362440 421375 387010 -92597 258887
663B58887l4571m02347k98458o8619N22065O0280k36272K9365L87127M59517J33772
$$ 258887 224316 -178031 -476489 -545108 -23043 37237 -199035 -169670 217457 676974 810746
652H10746k97640m59165J94453K82852m49510K18432m32981O7465K97998J11131
$$ 810746 513106 53941 248394 531246 81736 300168 -132813 -65348 232650 343781
642C43781j52086j6357K25651j20846l07261J19488n08933J05987L87440j99749
$$ 343781 191695 175338 400989 280143 -27118 92370 -416563 -310576 76864 -122885
632a22885O10564l43943J15285p0916m22664J35450k99792L12257j45840K39714
$$ -122885 487679 143736 259021 188105 -234559 -99109 -398901 -86644 -232484 7230
622G230M36394J89593m41975n6851n09857K5809O76869j60643n84697j37417N02698
$$ 7230 443624 633217 191242 134391 -375466 -349657 327212 166569 -418128 -555545 -52847
611e2847j13494L09872l2273j59969L5820p2067l04763P62792j37512j29404L57328
$$ -52847 -166341 143531 111258 -48711 -12891 -84958 -389721 373071 235559 106155 463483
600D63483k11610l04614k5327j44227K54166L60079m37639K49693m04632k08489
$$ 463483 251873 -52741 -78068 -222295 31871 391950 -45689 204004 -200628 -409117
590d09117K21567M295p676p0501J60341M01565o1191M27791m21925k1349j10651
$$ -409117 -187550 -183255 -190931 -261432 -101091 300474 239283 667074 245149 223800 113149
579A13149k96527L46849p4279n8819j60969J12300J54411O5838k99129j3519k93684
$$ 113149 -183378 163471 89192 30373 -130596 -18296 136115 201953 -97176 -110695 -404379
568d04379L00137j45505L96109J47446m58737L87981j34817J06376r0919K41012
$$ -404379 -104242 -249747 146362 293808 -164929 223052 88235 194611 103692 344704
558C44704O6329j50196q3729j25421M6540j69670j3313L33157K5783J59394P6054
$$ 344704 411033 260837 177108 51687 98227 -71443 -84756 248401 274184 433578 509632
547E09632j12424m49504K4080J61438m25876l14420Q4508N53010k2987k80691
$$ 509632 397208 -52296 -28216 133222 -292654 -607074 -522566 30444 7457 -273234
537b73234L516K87763O6966P5467l31721j01484K81503K12712q2632J71156M308
$$ -273234 -269718 18045 85011 160478 -171243 -272727 8776 221488 138856 310012 314320
526C14320l68939J54356p7505J74110m6358n2271q5891J08861L08463R3126K06133
$$ 314320 -54619 99737 22232 196342 149984 97713 11822 120683 429146 522272 728405
515G28405p09368l45827K71171K55794K04378J01776l87697r2750j53944m3694
$$ 728405 19037 -326790 -55619 200175 404553 506329 118632 25882 -128062 -171756
505a71756Q888J71576l12842r4887K69455K92720J730j89454j49249j69138L66578
$$ -171756 -162868 8708 -304134 -399021 -129566 163154 164884 -24570 -173819 -342957 23621
494B3621k22489l52112M23656l3450j13124P73209R4839m61160k07492k95480
$$ 23621 -198868 -550980 -127324 -160774 -273898 499311 594150 132990 -74502 -369982
484c69982K83510L30724K2792L04281l70430j59464J23668J75030j88083m78163
$$ -369982 -86472 244252 267044 571325 200895 41431 165099 340129 152046 -326117
474c26117n5314m5008O18603l575o9496J13209l82994j15074j77482K15742k96484
$$ -326117 -381431 -426439 192164 188589 119093 232302 -150692 -265766 -443248 -227506 -523990
463e23990O5755M71913j56519K6103K75857n0914o01988K27647l4149J31153J18982
$$ -523990 -458235 13678 -142841 -116738 159119 108205 -493783 -266136 -300285 -169132 -50150
452e0150L6948K31033m00041l8516L40067J25970j15506n12519M33082K55811
$$ -50150 -13202 217831 -182210 -220726 119341 245311 129805 -382714 50368 306179
442C06179j26544K28780m65641j28304O8365k80096J2138K38716J86715r3789
$$ 306179 179635 408415 -57226 -185530 -117165 -397261 -385123 -146407 40308 -53481
432e3481K34368J08327j77972L4648L4544N4981k81273p7198n9646L86036J70568
$$ -53481 180887 289214 111242 145890 180434 235415 -45858 -123056 -182702 203334 373902
421C73902O5118n74308j26442J15454L6138J61490L9192J84753k26026k87533
$$ 373902 439020 -135288 -261730 -146276 -110138 51352 90544 275297 49271 -238262
411b38262L74014k46524K60882j32309o359l84042N29232J83379j04235l02238
$$ -238262 135752 -110772 150110 17801 11442 -372600 156632 340011 235776 -66462
401f6462l00516j57666o8939Q45931k63861l63815N36026k6489k12220M1497L20547
$$ -66462 -366978 -524644 -593583 252348 -11513 -375328 160698 134209 -78011 -36514 284033
390B84033l5784l05972J72145j51068k31132J0816k3657j31908N8474k59103m5975
$$ 284033 248249 -57723 114422 -36646 -267778 -256962 -280619 -412527 -354053 -613156 -659131
379f59131p4428L67833K29867m2248k56250j56413N02003O01850k78093k76729
$$ -659131 -733559 -365726 -135859 -178107 -434357 -590770 -88767 513083 234990 -41739
369d1739J13051l03459j08580K88441l7149J55292J92087l3503m33345J05812
$$ -41739 71312 -232147 -340727 -52286 -89435 65857 257944 224441 -208904 -103092
359a03092J17475L32433j31503m52922j48391p4526L06469j37862L1314J64913
$$ -103092 14383 346816 215313 -237609 -386000 -460526 -154057 -291919 -260605 -95692
349i5692j04952k13417j25672J94519R6701J86992O2209L49059n33058l93666
$$ -95692 -200644 -414061 -539733 -345214 -248513 -61521 688 349747 -183311 -576977
339e76977K12293Q18157m44549l25149M29280J70539j94685O34384L3682m22923
$$ -576977 -364684 453473 8924 -316225 113055 283594 88909 723293 756975 334052
329C34052J90482j233j66082j26495k34960K38296L59103m53821l36035k18743
$$ 334052 524534 523301 357219 230724 -4236 234060 593163 139342 -196693 -415436
319d15436J898R6967j22463L90870O6361n45263Q1423K45394J17931n69585o7884
$$ -415436 -413538 -316571 -439034 -48164 18197 -527066 -445643 -200249 -82318 -651903 -719787
308g19787K19461J01701J37568K45236l1242j70814J22129J53099k20998K6642
$$ -719787 -500326 -398625 -261057 -15821 -47063 -217877 -95748 57351 -163647 -137005
298a37005j69954J29966J16776J69994K4542l26503J48186l07667l7264N17152
$$ -137005 -306959 -176993 -60217 109777 134319 -192184 -43998 -351665 -388929 128223
288A28223N1479l15938L12653K4994k33746L04616n14027k8310K46280L4071K69738
$$ 128223 179702 -136236 176417 201411 -32335 272281 -241746 -270056 -23776 10295 280033
277B80033l6963k93235L8581l18268n1985N42505J87989o32310n56657N60469
$$ 280033 243070 -50165 -11584 -329852 -381837 160668 348657 -283653 -840310 -279841
267b79841J32247k29178l9923J88579L42851n5747k20576j54979L82257l95005
$$ -279841 -147594 -376772 -416695 -228116 114735 58988 -161588 -316567 65690 -329315
257c29315K88156L90277K23545l36903l49752j01714J75674O817j26155K80903
$$ -329315 -41159 349118 572663 235760 -113992 -215706 -40032 -33215 -159370 121533
247A21533l6057l79756P6676L28508q1336l92059j85884L35016P3077P0776J47111
$$ 121533 85476 -294280 -217604 110904 29568 -362491 -548375 -213359 -140282 -69506 77605
236G7605k30089N6506j84673j78413N8744m9156N18348J47915k13507k12274J32402
$$ 77605 -152484 -95978 -280651 -459064 -400320 -449476 68872 216787 3280 -208994 -76592
225g6592p5161o7679R7826L80221J21576L96800m7970k90868m86339K5951l43920
$$ -76592 -151753 -219432 -121606 258615 380191 776991 729021 438153 -48186 -22235 -366155
214c66155O4689r3408L277k05853K2472J98227k79391k27675J32797M09756J26433
$$ -366155 -301466 -394874 -391597 -597450 -574978 -376751 -656142 -883817 -751020 -341264 -214831
203b14831J85645J04748m9407m87849K68285M1340m2118k68867R2077P9611q5870
$$ -214831 -29186 75562 26155 -461694 -193409 -152069 -194187 -463054 -370977 -291366 -377236
192c77236j29940O76726j91002k46062O9359J16268j95832J62128J50802j68961
$$ -377236 -507176 169550 -21452 -267514 -198155 -81887 -277719 -115591 35211 -133750
182a33750O4483k01249J08453l2942K20485L80455j79844j94732M01576J47042
$$ -133750 -69267 -270516 -162063 -195005 25480 405935 226091 31359 432935 579977
172E79977l74357n0416m1194m23494L74018J30843J23922n42299l03804J54692
$$ 579977 205620 155204 114010 -309484 64534 195377 319299 -223000 -526804 -372112
162c72112L51958k10277K21976J72012j79957j64527l46567L56737j79404J35002
$$ -372112 -20154 -230431 -8455 163557 -16400 -180927 -527494 -170757 -350161 -215159
152b15159R1827J71660K67835n28392J16089J86242L11607p0270j30476l74660
$$ -215159 -123332 48328 316163 -212229 -96140 90102 401709 331439 200963 -173697
142a73697J18364L37476m86437K02832k4465J05192p9305k39684j47401J77163
$$ -173697 -55333 282143 -204294 -1462 -25927 79265 -40 -239724 -387125 -209962
132b09962J57717k4228m91826R9836K357J48483L29011J14428k94334l59835K01424
$$ -209962 -52245 -76473 -568299 -468463 -466106 -317623 11388 125816 -168518 -528353 -326929
121c26929O7538J20652j90811m5342L80558L000O6250J68284k38408K92098j81456
$$ -326929 -259391 -138739 -329550 -374892 5666 8666 74916 243200 4792 296890 115434
110A15434l28276Q5207N52866k09272N6581o08049j05840j84992K14759K19403
$$ 115434 -212842 -127635 425231 215959 272540 -335509 -441349 -626341 -411582 -192179
100a92179o1204Q3911k00760L86204J19839r7165j06175Q2751k38620n8905K92502
$$ -192179 -253383 -169472 -370232 15972 135811 38646 -67529 15222 -223398 -282303 10199
89A0199M22865l47520k9491j39886m58936K97851K33738j74782j94200l52669
$$ 10199 433064 85544 56053 -83833 -542769 -244918 -11180 -185962 -380162 -732831
79g32831K99975J22705L5424K81567j73124k22788R1528L44929o0206j54355j29799
$$ -732831 -432856 -310151 -274727 6840 -166284 -389072 -297544 47385 -12821 -167176 -296975
68b96975J48438K1369J63773J18104j10604k22552j00612J90652r9009O7331J36319
$$ -296975 -148537 -127168 36605 154709 44105 -178447 -279059 -88407 -187416 -120085 16234
57A6234K17195J11780l25231l4075J00581j37902P3146l3414m9804k43195P5781
$$ 16234 233429 345209 19978 -14097 86484 -51418 21728 -11686 -61490 -304685 -228904
46b28904K54037P7720k6513j7289k5049l53335k67876J66705J50806L29981o161
$$ -228904 25133 102853 76340 59051 34002 -319333 -587209 -420504 -269698 60283 54122
35E4122j45190k9801J27236n89352L35496J18810q1726j48604p0685J24307J51776
$$ 54122 -91068 -120869 6367 -582985 -247489 -128679 -210405 -359009 -429694 -305387 -153611
24a53611k3888J48809R9308o5482O3728J2106k27202j28230j28840j545J65313
$$ -153611 -177499 -28690 70618 5136 68864 80970 -146232 -274462 -403302 -404847 -239534
13b39534N9681J62264l0688M0637l10433J81895J44906O31J5548q0867L3696J08744
$$ -239534 -179853 -17589 -48277 -7640 -318073 -136178 8728 9359 24907 -55960 -22264 86480
1H6480j99516
$$ 86480 -113036
0a13036
$$ -113036
$$ Imaginary data points
##PAGE= N=2
##DATA TABLE= (X++(I..I)), XYDATA
16383a963947j94435j14215L10892J08170n797q2668k05650K13846L03139J98516
$$ -1963947 -2158382 -2272597 -1961705 -1853535 -1859332 -1942000 -2147650 -1933804 -1630665 -1432149
16373a432149j03967J18342k31770K34482L17924j57097J76556k04567l84268
$$ -1432149 -1536116 -1417774 -1649544 -1415062 -1097138 -1254235 -1077679 -1282246 -1666514
16364a666514m4667J02577j60805J52185L35106J64788q1111k35237l59779L01159
$$ -1666514 -1711181 -1608604 -1769409 -1617224 -1282118 -1117330 -1198441 -1433678 -1793457 -1492298
16354a492298J34923J14261K52307K01177j79349k97802K15560r3231J00329M3770
$$ -1492298 -1357375 -1243114 -990807 -789630 -968979 -1266781 -1051221 -1144452 -1044123 -1000353
16344a000353n0339j34875J49552J12323l15980K63942J62660J40620N0573l24463
$$ -1000353 -1050692 -1185567 -1036015 -923692 -1239672 -975730 -813070 -672450 -621877 -946340
16334i46340k91684R7133L09715J10061r8355o276P8187K16353j78452J73792
$$ -946340 -1238024 -1140891 -831176 -721115 -819470 -825746 -747559 -531206 -709658 -535866
16324e35866j15447k33022L51217k34926k08094j33184Q8483P00689J32614l04450
$$ -535866 -651313 -884335 -533118 -768044 -976138 -1109322 -1020839 -320150 -187536 -491986
16314d91986k22520J92557J33085k78314L93851p9799j10407K62570K32164l31553
$$ -491986 -714506 -521949 -388864 -667178 -273327 -353126 -463533 -200963 31201 -300352
16304c00352l63929J25144N07309J50310r8405j02001n249L0114M70924j25203
$$ -300352 -664281 -539137 -31828 118482 20077 -81924 -87173 -57059 413865 288662
16294B88662K00313k12195k8981j00904j76202K6390l60624M89777J04702l67108
$$ 288662 488975 276780 247799 146895 -29307 -2917 -363541 126236 230938 -136170
16284a36170L9428L74420l36946L0950J38340k31556J49304p4466L08952m8033
$$ -136170 -96742 277678 -59268 -28318 110022 -121534 27770 -46696 262256 214223
16274B14223p4221K32891j34221M7279J73469j06641J43800j43647L278n0482
$$ 214223 140002 372893 238672 285951 459420 352779 496579 352932 356210 305728
16264C05728k643N2920n5150M57661l87135l66094L55162R8428K4725K29855n9482
$$ 305728 303085 356005 300855 758516 371381 5287 360449 458877 483602 713457 653975
16253F53975k00271j17833j57936L49067Q4426r8294J59689R3o02212M25538L91693
$$ 653975 453704 335871 177935 527002 611428 513134 672823 672916 70704 496242 887935
16242H87935J88033l53109k25652J74273m3264J80801J64433K22735q0380k81612
$$ 887935 1075968 722859 497207 671480 628216 809017 973450 1196185 1115805 834193
16232H34193k64731L2119M43532N2058k96649K61318k80376j56143j64055N04000
$$ 834193 569462 601581 1045113 1097171 800522 1061840 781464 625321 461266 965266
16222I65266J41460k05552L08686P7181p14180n5658M60601J87169k93906K05357
$$ 965266 1106726 901174 1209860 1287041 572861 517203 977804 1164973 871067 1076424
16212A076424r8468J07348k49483o2219L65822j03679p2659n67l7460J38832k42651
$$ 1076424 977956 1085304 835821 773602 1139424 1035745 963086 962519 925059 1063891 821240
16201H21240P05935M558j54959l1466Q3005k49015R3526M83753o4075j51991o3596
$$ 821240 1527175 1531733 1376774 1345308 1428313 1179298 1272824 1756577 1692502 1540511 1476915
16190A476915l16029k57596l7714J53797K88777l50831P8607k64871M40586J91022
$$ 1476915 1160886 903290 865576 1019373 1308150 957319 1035926 771055 1211641 1402663
16180A402663l0068l0807J35902L18851l32960k06257Q6829j45675l7404o4224
$$ 1402663 1372595 1341788 1477690 1796541 1463581 1257324 1344153 1198478 1161074 1096850
16170A096850J18868J27241q9979j38743J86636R4398L19039j4676j77730J30441
$$ 1096850 1215718 1342959 1252980 1114237 1300873 1395271 1714310 1699634 1521904 1652345
$$ [...]
##END NTUPLES=NMR SPECTRUM
##END=
