##TITLE=1H_CG-1150-A-2
 CDCl3, 8 sc, 
 5.08.2021
##JCAMPDX= 6.0         $$ Bruker NMR JCAMP-DX V2.0
##DATA TYPE= NMR SPECTRUM
##DATA CLASS= NTUPLES
##ORIGIN= UXNMR, Bruker Analytische Messtechnik GmbH
##OWNER= root
$$ XWIN-NMR		Version 3.5
$$ Thu Aug  5 10:59:10 2021 Russian Standard Time (UT+4h)  she@DPX200
##.OBSERVE FREQUENCY= 200.131506
##.OBSERVE NUCLEUS= ^1H
##.ACQUISITION MODE= SIMULTANEOUS
##.ACQUISITION SCHEME= undefined
##.AVERAGES= 8
##.DIGITISER RES= 18
##SPECTROMETER/DATA SYSTEM= spect
##.PULSE SEQUENCE= zg30
##.SOLVENT NAME= CDCl3
##.SHIFT REFERENCE= (INTERNAL, CDCl3, 0, 17.513)
##AUDIT TRAIL= $$ (NUMBER, WHEN, WHO, WHERE, WHAT)
$$ ##TITLE= Audit trail, XWIN-NMR		Version 3.5
$$ ##JCAMPDX= 5.01
$$ ##ORIGIN= Bruker BioSpin GmbH
$$ ##OWNER= she
$$ F:/spectra/data/she/nmr/H-F/1/pdata/1/auditp.txt
$$ ##AUDIT TRAIL=  $$ (NUMBER, WHEN, WHO, WHERE, WHAT)
(   1,<2021-08-05 10:57:52.06 +0400>,<she>,<DPX200>,
      <created by zg, POWCHK disabled, PULCHK disabled
       configuration hash MD5:
       00 E9 B6 7A A2 85 ED C7 34 08 36 98 17 FE 4E 26
       data hash MD5: 16K
       1D F2 4D 66 A5 B5 28 48 DE 80 74 3E DA 07 F8 E5>)
(   2,<2021-08-05 10:57:54.39 +0400>,<she>,<DPX200>,
      <Start of raw data processing
       efp BC_mod = 2 LB = 0.24 FT_mod = 6 PKNL = 1 PHC0 = -13357.01 PHC1 = 13.60099 SI = 16K 
       data hash MD5: 16K
       37 D0 78 D1 E3 B2 81 09 EE 64 DC 4F 5E 3E 68 24>)
(   3,<2021-08-05 10:58:13.50 +0400>,<she>,<DPX200>,
      <pk PHC0 = 0.2914951 PHC1 = -0.6000001 
       data hash MD5: 16K
       D1 82 46 3B 48 7D BB 38 15 EC FA 7E 8E E2 BE 74>)
(   4,<2021-08-05 10:58:16.53 +0400>,<she>,<DPX200>,
      <abs ABSG = 5 
       data hash MD5: 16K
       D9 01 C8 F6 0A AA DE 43 2A FA 41 32 14 89 EE 0A>)
(   5,<2021-08-05 10:58:48.35 +0400>,<she>,<DPX200>,
      <abs ABSG = 5 
       data hash MD5: 16K
       41 22 E8 68 60 4E 6E A2 DA F4 9A 65 6F 9D 8D 22>)
$$ ##END=
$$ 
$$ hash MD5
$$ A7 44 A4 8F 7D A5 E4 D9 1F 74 A4 37 FE 02 12 16
##$RELAX= 
##$RELAX= 
##$RELAX= 
##$RELAX= 
##$RELAX= 
##$RELAX= 
$$ Bruker specific parameters
$$ --------------------------
##$DU= <F:/spectra>
##$EXPNO= 1
##$NAME= <H-F>
##$PROCNO= 1
##$TYPE= <nmr>
##$USER= <she>
##$AMP= (0..31)
100 100 100 100 100 100 100 100 100 100 100 100 100 100 100 100 100 100 
100 100 100 100 100 100 100 100 100 100 100 100 100 100 
##$AQSEQ= 0
##$AQ_mod= 1
##$AUNM= <au_zg>
##$AUTOPOS= <>
##$BF1= 200.13
##$BF2= 200.13
##$BF3= 200.13
##$BF4= 200.13
##$BF5= 200.13
##$BF6= 200.13
##$BF7= 200.13
##$BF8= 200.13
##$BYTORDA= 1
##$CFDGTYP= 0
##$CFRGTYP= 5
##$CHEMSTR= <none>
##$CNST= (0..31)
1 1 145 1 1 1 1 1 1 1 1 1 1 1 1 1 1 1 1 1 1 1 1 1 1 1 1 1 1 1 1 1 
##$CPDPRG= <>
##$CPDPRG1= <>
##$CPDPRG2= <>
##$CPDPRG3= <>
##$CPDPRG4= <mlev>
##$CPDPRG5= <mlev>
##$CPDPRG6= <mlev>
##$CPDPRG7= <mlev>
##$CPDPRG8= <mlev>
##$CPDPRGB= <>
##$CPDPRGT= <>
##$D= (0..31)
0 1.2 0 0 0 0 0 0 0 0.06 0 0.03 0 0 0 0 0.0002 0 0 0 0 0 0 0 0 0 0 0 0 
0 0 0 
##$DATE= 1628146671
##$DBL= (0..7)
$$ [...]
##$SUBNAM3= <"">
##$SUBNAM4= <"">
##$SUBNAM5= <"">
##$SUBNAM6= <"">
##$SUBNAM7= <"">
##$SUBNAM8= <"">
##$SUBNAM9= <"">
##$SW= 20.0188882624521
##$SWIBOX= (0..15)
0 0 2 0 0 0 0 0 0 0 0 0 0 0 0 0 
##$SW_h= 4006.41025641026
##$TD= 16384
##$TD0= 1
##$TE= 0
##$TE2= 300
##$TE3= 300
##$TEG= 300
##$TL= (0..7)
0 120 120 120 120 120 120 120 
##$TP= (0..7)
150 150 150 150 150 150 150 150 
##$TP07= 0
##$TPNAME0= <>
##$TPNAME1= <>
##$TPNAME2= <>
##$TPNAME3= <>
##$TPNAME4= <>
##$TPNAME5= <>
##$TPNAME6= <>
##$TPNAME7= <>
##$TPOAL= (0..7)
0.5 0.5 0.5 0.5 0.5 0.5 0.5 0.5 
##$TPOFFS= (0..7)
0 0 0 0 0 0 0 0 
##$TUNHIN= 0
##$TUNHOUT= 0
##$TUNXOUT= 0
##$USERA1= <user>
##$USERA2= <user>
##$USERA3= <user>
##$USERA4= <user>
##$USERA5= <user>
##$V9= 5
##$VALIST= <valist>
##$VCLIST= <CCCCCCCCCCCCCCC>
##$VD= 0
##$VDLIST= <DDDDDDDDDDDDDDD>
##$VPLIST= <PPPPPPPPPPPPPPP>
##$VTLIST= <TTTTTTTTTTTTTTT>
##$WBST= 1024
##$WBSW= 4
##$XGAIN= (0..3)
0 0 0 0 
##$XL= 0
##$YL= 0
##$YMAX_a= 773047
##$YMIN_a= -706374
##$ZGOPTNS= <>
##$ZL1= 120
##$ZL2= 120
##$ZL3= 120
##$ZL4= 120
##$ABSF1= 17.51299
##$ABSF2= -2.506048
##$ABSG= 5
##$ABSL= 3
##$ALPHA= 0
##$AQORDER= 0
##$ASSFAC= 0
##$ASSFACI= 0
##$ASSFACX= 0
##$ASSWID= 0
##$AUNMP= <proc_1d>
##$AZFE= 0.1
##$AZFW= 0.1
##$BCFW= 0
##$BC_mod= 2
##$BYTORDP= 0
##$COROFFS= 0
##$CY= -3
##$DATMOD= 1
##$DC= 0
##$DFILT= <>
##$DTYPP= 0
##$F1P= 0
##$F2P= 0
##$FCOR= 1
##$FTSIZE= 16384
##$FT_mod= 6
##$GAMMA= 0
##$GB= 0
##$INTBC= 1
##$INTSCL= 1.334414e-10
##$ISEN= 128
##$LB= 0.24
##$LEV0= 0
##$LPBIN= 0
##$MAXI= 10000
##$MC2= 0
##$MEAN= 0
##$ME_mod= 0
##$MI= 1.114404
##$NCOEF= 0
##$NC_proc= -6
##$NLEV= 6
##$NOISF1= 3.799351
##$NOISF2= 2.8
##$NSP= 0
##$NTH_PI= 0
##$NZP= 0
##$OFFSET= 17.51299
##$PC= 1
##$PHC0= -13356.72
##$PHC1= 13.00099
##$PH_mod= 1
##$PKNL= yes
##$PPARMOD= 0
##$PSCAL= 0
##$PSIGN= 0
##$REVERSE= no
##$SF= 200.130004329531
##$SI= 16384
##$SIGF1= 3
##$SIGF2= 2
##$SINO= 5.538805
##$SIOLD= 16384
##$SREGLST= <1H.CDCl3>
##$SSB= 0
##$STSI= 16384
##$STSR= 0
##$SW_p= 4006.41025641026
##$SYMM= 0
##$S_DEV= 0
##$TDeff= 16384
##$TDoff= 0
##$TI= <>
##$TILT= no
##$TM1= 0
##$TM2= 0
##$TOPLEV= 0
##$USERP1= <user>
##$USERP2= <user>
##$USERP3= <user>
##$USERP4= <user>
##$USERP5= <user>
##$WDW= 1
##$XDIM= 16384
##$YMAX_p= 440490550
##$YMIN_p= -403155
$$ End of Bruker specific parameters
$$ ---------------------------------
##NTUPLES= NMR SPECTRUM
##VAR_NAME=  FREQUENCY,     SPECTRUM/REAL,   SPECTRUM/IMAG
##SYMBOL=    X,             R,               I
##VAR_TYPE=  INDEPENDENT,   DEPENDENT,       DEPENDENT
##VAR_FORM=  AFFN,          ASDF,            ASDF
##VAR_DIM=   16384,         16384,           16384
##UNITS=     HZ,            ARBITRARY UNITS, ARBITRARY UNITS
##FACTOR=    0.24454680195387, 1,            1
##FIRST=     3504.87495495435, 0,            0
##LAST=      -501.535301455905, 0,           0
##MIN=       -501.535301455905, -403155,     0
##MAX=       3504.87495495435, 440490550,    0
$$ Real data points
##PAGE= N=1
##DATA TABLE= (X++(R..R)), XYDATA
$$ [...]
5533A11616n495o6553Q7879K148j07397r5226n0743O6224P6784K421n5760J36782
$$ 111616 106121 39568 127447 129595 22198 -73028 -123771 -57547 19237 21658 -34102 102680
5521A02680j1616l9181m97J7549k4370P91k8666R5292k9261M6904k2066J39379
$$ 102680 91064 51883 51386 68935 44565 45356 16690 111982 82721 129625 107559 246938
5509B46938N7097k11009k0974o6088j7869K2446p3527R229j3152K0265L1283O1968
$$ 246938 304035 93026 72052 5964 -11905 10541 -62986 -53757 -66909 -46644 -15361 46607
5497D6607K8064o962n8411p665M9991j572N2861j40678J56373r422l3928K4862
$$ 46607 74671 67709 9298 1633 51624 50052 102913 -37765 118608 109186 75258 100120
5485A00120j0123m5285P322K3978p5715K4187j2530m4161P8524j6773Q2719P9581
$$ 100120 89997 44712 52034 76012 297 24484 11954 -32207 46317 29544 112263 191844
5473A91844n8980n0037P0697j3488q0191J26107m1298q7777Q135J14321J03059
$$ 191844 132864 82827 153524 140036 59845 185952 144654 56877 65012 179333 282392
5462B82392J794j03911J8472p4165J5075m4186L3020j776o6999J82463k3777n3390
$$ 282392 284186 180275 198747 124582 139657 95471 128491 126715 59716 242179 218402 165012
5450A65012L2215L887j37785R327P4066J3916J2710Q303j1156j5795N1643j01702
$$ 165012 197227 201114 63329 72656 146722 160638 173348 181651 170495 154700 206343 104641
5438A04641m611p640Q372N4779o1954J3696L5859L0959j248m2134j7735m4303
$$ 104641 100030 92390 100762 155541 93587 107283 143142 174101 172853 130719 112984 68681
5426F8681p246J5353O8356J7917J23875O1214n9406l2372k8933N8490M3824q588
$$ 68681 61435 76788 145144 163061 286936 348150 288744 256372 227439 285929 329753 321165
5414C21165j31887J9944j7825M4390q3460J0300L9595K9957J0956j01594m4600
$$ 321165 189278 209222 191397 235787 152327 162627 202222 232179 243135 141541 96941
5403I6941k9128J40894m6228L8626o2054M6291n8572k5078K5167l747J9763N8172
$$ 96941 67813 208707 162479 201105 139051 185342 126770 101692 126859 123112 142875 201047
5391B01047j0182k7748L1100K6768p296R5731L2158j34048o6975J07317m4202
$$ 201047 190865 163117 194217 220985 213689 309420 341578 207530 140555 247872 203670
5380B03670p6088Q8907N1268j22359n7624J28404o5498P7870L6710M2424r2724
$$ 203670 127582 216489 267757 145398 87774 216178 150680 228550 265260 307684 214960
5369B14960K2869j7244p98K8402N2242j07398K787K0023R9935r4169r3522J01824
$$ 214960 237829 220585 219787 248189 300431 193033 195820 215843 315778 221609 128087 229911
5357B29911O2186n3650p7394k9369M2472q2266k9922M8120n342J06136Q525l4532
$$ 229911 292097 238447 161053 131684 174156 91890 61968 110088 104746 210882 219407 184875
5345A84875O1220l9656M842k0766r3160k0401J71585p426j59459l7929J4774J2628
$$ 184875 246095 206439 211281 190515 97355 76954 248539 241113 81654 43725 58499 71127
5333G1127L5349M9239o4391p0198J1529J09838N1909k9831o3405n1753o4890R5834
$$ 71127 106476 155715 91324 21126 32655 142493 194402 164571 101166 49413 -15477 80357
5321H0357m8190R4631J9309k9787R9757j07110o0145L2959o4793N2503n3970J14227
$$ 80357 32167 126798 146107 116320 216077 108967 48822 81781 16988 69491 15521 129748
5309A29748L3343r1014o3136J04855l518j04486K7697M6318m5805K4962J28525
$$ 129748 163091 72077 8941 113796 110278 5792 33489 79807 34002 58964 187489
5298A87489J3219n816J25727n9176p880K1642l5211m0436M3896j16837Q3575P4837
$$ 187489 200708 194892 320619 261443 253563 275205 239994 199558 243454 126617 210192 285029
5286B85029J5150k1569M8462m4405L383J3810j45603K1356K668m7521Q3654R167
$$ 285029 300179 278610 327072 282667 286050 299860 154257 175613 178281 130760 214414 223581
5274B23581K161J36161j4322q9530k8765P4171l5375p705j7923q4181L466M685
$$ 223581 225742 361903 347581 258051 229286 303457 268082 260377 242454 158273 161739 166424
5262A66424k2126J11032n399l5242l9931j1821Q7576O0329r8805j3316K0148n9013
$$ 166424 144298 255330 249931 214689 174758 162937 250513 310842 212037 198721 218869 159856
5250A59856K4903l3087k3332J48971j39759k2237j6399M29Q9436l2587R3298m6168
$$ 159856 184759 151672 128340 277311 137552 115315 98916 99345 188781 156194 249492 203324
5238B03324j7461P4918o7632M6974L9686L2683p6294K1895P536m8789L6003N7131
$$ 203324 185863 260781 193149 240123 279809 312492 236198 258093 265629 216840 252843 309974
5226C09974j21644K6139m4073j1328R0585r571j42516J79927Q4376K4188j620
$$ 309974 188330 214469 170396 159068 249653 240082 97566 277493 361869 386057 384437
5215C84437M7696o5180j1284L5799p7902p588k1167J5180J04700P0640J2809j7879
$$ 384437 432133 366953 355669 391468 313566 305978 284811 299991 404691 475331 488140 470261
5203D70261L9647k1010l7252P0960J59916O6386M3624J14125j1087o1656J49252
$$ 470261 509908 488898 451646 522606 682522 748908 792532 906657 895570 833914 983166
5192I83166O6359r7283l6265L0697P7881q8746R1090j38781p9233j01950P3070
$$ 983166 1049525 952242 915977 946674 1024555 935809 1026899 888118 808885 706935 780005
5181G80005M7494l8508j33241P2373K218J381J17532J24056j56742m5836N7251
$$ 780005 827499 788991 655750 728123 730341 731722 849254 973310 816568 770732 827983
5170H27983P0694K72943Q6675P3261L8661Q8340J06021J8009K37753J75582K00186
$$ 827983 898677 1171620 1258295 1331556 1370217 1458557 1564578 1582587 1820340 1995922 2196108
5159B196108J35515K876k0518j08041k18372l67956j68410q4062j55621j44242
$$ 2196108 2331623 2334499 2313981 2205940 1987568 1619612 1451202 1367140 1211519 1067277
5149A067277r9916N6479k01625p3231J348k2475l3101l1728j6905K8625L8075
$$ 1067277 967361 1023840 822215 748984 750332 727857 694756 663028 646123 674748 712823
5138G12823q3764L6553k2811J6671j06228j31160M8869N4138l905J06845k8736
$$ 712823 629059 665612 642801 659472 553244 422084 470953 525091 521186 628031 599295
5127E99295p3548q75M5142Q0240j54646P2741J20803m3383Q2983o7930p8381K8392
$$ 599295 525747 524872 570014 650254 495608 568349 689152 645769 728752 660822 582441 610833
5115F10833k1840k4980k4596j60454J59635K4809P5371j4974Q7983r60n2070k3666
$$ 610833 588993 564013 539417 378963 538598 563407 638778 623804 711787 710827 658757 635091
5103F35091J80016R8486n7134M6978j98046r5917R7087M487r6734M6345p9652
$$ 635091 815107 913593 856459 903437 705391 609474 706561 711048 614314 660659 581007
5092E81007k2105P2999R0511K8572N0731M3320J8751j27890K430K5566P2585o352
$$ 581007 558902 631901 722412 750984 801715 845035 863786 735896 738326 763892 836477 830125
5080H30125R6095l7480K8659J50434P6206Q4776P7276N0291p6319k1448M5692
$$ 830125 926220 888740 917399 1067833 1144039 1228815 1306091 1356382 1280063 1258615 1304307
5069A304307k4935j09260m0437o1394j1178j4552n9452j25250r031J22738L9909
$$ 1304307 1279372 1170112 1129675 1068281 1057103 1042551 983099 857849 848818 971556 1011465
5058A011465j41K9544L4364J23415n7990M6759J67J05589R7904m5543Q0669R5774
$$ 1011465 1011324 1040868 1075232 1198647 1140657 1187416 1187583 1293172 1391076 1345533 1426202 1521976
5046A521976J06302P6503N2471l814j5886m435j30745r7241k13463L0165l0372
$$ 1521976 1628278 1704781 1757252 1753438 1737552 1733117 1602372 1505131 1291668 1321833 1291461
5035A291461n8621M6393j5493r1534q1265J11633m8620l0090j4774M254r608Q6898
$$ 1291461 1232840 1279233 1263740 1172206 1090941 1202574 1153954 1123864 1109090 1113344 1103736 1190634
5023A190634p19N375O3168K5575m582l872M354J43976j22918j4712R1086j08558
$$ 1190634 1189915 1195290 1258458 1284033 1279451 1275579 1279933 1423909 1300991 1286279 1377365 1268807
5011A268807p8728Q507k7166o2993r0863m5387N018j05653K5809j6441R9759o367
$$ 1268807 1190079 1198586 1171420 1108427 1017564 972177 977195 871542 897351 880910 980669 974302
4999I74302l584o2561j13725R9130j9688L0479L8072K4638P6287k5775m1705N3009
$$ 974302 970718 908157 794432 893562 873874 904353 942425 967063 1043350 1017575 975870 1028879
4987A028879L3842n8692r6215j31285K2123j4575m5966n183n7885J21798l0864
$$ 1028879 1062721 1004029 907814 776529 798652 784077 738111 732928 675043 796841 765977
4976G65977r0259o3225O8025N8977P5350M1499k6830N4300M0078q4278M7475K1417
$$ 765977 675718 612493 680518 739495 814845 856344 829514 883814 923892 839614 887089 908506
4964I08506l055J6928J4099k5509r822J2855k0211J75238r8946j17593J20312
$$ 908506 905451 922379 936478 910969 901147 914002 893791 1069029 970083 852490 972802
4953I72802J812l999N4128l8619J1293J6671J1092M6298K4442q7493K7959k4446
$$ 972802 974614 970615 1024743 986124 997417 1014088 1025180 1071478 1095920 1008427 1036386 1011940
4941A011940l6911R4636Q1934j6906K1607q5400j3285P6378r457j15261m3662
$$ 1011940 975029 1069665 1151599 1134693 1156300 1070900 1057615 1133993 1124536 1009275 965613
4930I65613K3098J14643k5093R7648j01962k0197J27810q0095j09874R6061P0347
$$ 965613 988711 1103354 1078261 1175909 1073947 1053750 1181560 1101465 991591 1087652 1157999
4919A157999j12091l3371l7516Q2996n7675R5737j09872L6985M7562J13476K9375
$$ 1157999 1045908 1012537 975021 1058017 1000342 1096079 986207 1023192 1070754 1184230 1213605
4908A213605q2537j3440j18028J11600R5593J11900l1667L0945j1564K0535k9096
$$ 1213605 1131068 1117628 999600 1111200 1206793 1318693 1287026 1317971 1306407 1326942 1297846
4897A297846j48296J46901L3739j39597j1771J01206M0282m2001r4616j10813
$$ 1297846 1149550 1296451 1330190 1190593 1178822 1280028 1320310 1278309 1183693 1072880
4887A072880M4882J58947j18015L3080L7528o9593r2140j06097P3456M6506l3118
$$ 1072880 1117762 1276709 1158694 1191774 1229302 1159709 1067569 961472 1034928 1081434 1048316
4876A048316R594N3564k3181J15939q030k2718j47408o5424P5746L7422K5154
$$ 1048316 1057910 1111474 1088293 1204232 1196202 1173484 1026076 960652 1036398 1073820 1098974
4865A098974r6154N5895J5121n5813m4119j3775L4939k6573M3955L6321J7076
$$ 1098974 1002820 1058715 1073836 1018023 973904 960129 995068 968495 1012450 1048771 1065847
4854A065847K0358q8307k4203Q8466R0155j02769q4073N2393o840J7825j7301
$$ 1065847 1086205 997898 973695 1062161 1152316 1049547 965474 1017867 1011027 1028852 1011551
4843A011551J4371l9944L2718Q9081l38j5956k9343O10q2106O9697L9739r1890
$$ 1011551 1025922 985978 1018696 1107777 1107439 1091483 1062140 1062750 980644 1050341 1090080 998190
4831I98190L2782J1358p8675n2511K4345R124k5078K5869m5321O8622J4865q5107
$$ 998190 1030972 1042330 963655 911144 935489 944613 919535 945404 900083 968705 983570 898463
4819H98463K1995M8208l5374L8475j27529J06199N6627N0656k3098Q4285n8944
$$ 898463 920458 968666 933292 971767 844238 950437 1007064 1057720 1034622 1118907 1059963
4808A059963j53378m35O73L5732M0721P9273j0227q7177j8859K0476l9393o704
$$ 1059963 906585 906150 906823 942555 983276 1062549 1052322 965145 946286 966762 927369 920665
4796I20665O8993M4985K1745J12428L189q8717P6420N1905Q2964K5854o3737R0183
$$ 920665 989658 1034643 1056388 1168816 1172005 1083288 1159708 1211613 1294577 1320431 1256694 1346877
4784A346877o0878K0244p165J53384J7904m8996k9319J50804P5267o8155Q9564
$$ 1346877 1285999 1306243 1299078 1452462 1470366 1421370 1392051 1542855 1618122 1549967 1639531
4773A639531J1185N2525M122K3747K13983J9927J21780R5478J08084K15844K53791
$$ 1639531 1650716 1703241 1707363 1731110 1945093 1965020 2086800 2182278 2290362 2506206 2759997
4762B759997N7862J497O8015N6979o7376j49298M9109N7784L9707r1529p4093
$$ 2759997 2817859 2819356 2887371 2944350 2876974 2727676 2776785 2834569 2874276 2782747 2708654
4751B708654J11720j1111J65929P1930Q0380J45903J76525J64748O989J32459
$$ 2708654 2820374 2809263 2975192 3047122 3127502 3273405 3449930 3614678 3621667 3754126
4741C754126L3472j4722M6967r845j27314n2689j06209p0134Q1319K2030J03200
$$ 3754126 3787598 3772876 3819843 3809998 3682684 3629995 3523786 3453652 3534971 3557001 3660201
4730C660201J90743J50308J63760K64116K87035K66683K03218K00712K01677K32642
$$ 3660201 3850944 4001252 4165012 4429128 4716163 4982846 5186064 5386776 5588453 5821095
4720E821095J02733M8541K4033J3987k55020k29287j17679r8449k47700l54020
$$ 5821095 5923828 5972369 5996402 6010389 5755369 5526082 5408403 5309954 5062254 4708234
4710D708234k43912j20526j16904k42662m517j34357p0417k84975j17040k25794
$$ 4708234 4464322 4343796 4226892 3984230 3979713 3845356 3774939 3489964 3372924 3147130
4700C147130r5572p1675j01431j40173k39818J7263j02353m6198k6169j5915M1401
$$ 3147130 3051558 2979883 2878452 2738279 2498461 2515724 2413371 2367173 2341004 2325089 2366490
4689B366490m7900j48564J32072o4631j02224l8143j15722k7541p3007j4985l0008
$$ 2366490 2318590 2170026 2302098 2237467 2135243 2097100 1981378 1953837 1880830 1865845 1835837
4678A835837o5243j65042j45806j287O7209J1719p116l4098L6555j7911K0076
$$ 1835837 1770594 1605552 1459746 1458459 1525668 1537387 1530271 1496173 1532728 1514817 1534893
4667A534893o2218m2259J19400M7797k6304L5420J41652O2916L4840l371p546
$$ 1534893 1472675 1430416 1549816 1597613 1571309 1606729 1748381 1811297 1846137 1842766 1835220
4656A835220L6881p1497q7739K5859j58518n2892K3908j4056Q515j2411q1158
$$ 1835220 1872101 1800604 1712865 1738724 1580206 1527314 1551222 1537166 1545681 1533270 1452112
4645A452112j4488N2374p0323m7831n2910J8198J1774l5781P730j9281n145R149
$$ 1452112 1437624 1489998 1419675 1371844 1318934 1337132 1348906 1313125 1320855 1301574 1296429 1305578
4633A305578M8451K3816p4105J3355N8416R4567p1088m2856k4585j3168o5302
$$ 1305578 1354029 1377845 1303740 1317095 1375511 1470078 1398990 1356134 1331549 1318381 1253079
4622A253079l5441Q6677J17349r6215L8317J22940J0122j6159k4215L2976n72
$$ 1253079 1217638 1304315 1421664 1325449 1363766 1486706 1496828 1480669 1456454 1489430 1488858
4611A488858M4170P6617q3389o0508J15991R0687j2920n2662J85069L5741j9594
$$ 1488858 1533028 1609645 1526256 1465748 1581739 1672426 1659506 1606844 1791913 1827654 1808060
4600A808060K6365M9410O622m2177J77455j6975m2828R9743J0940Q5384P0673
$$ 1808060 1834425 1883835 1890457 1848280 2025735 2008760 1965932 2065675 2076615 2161999 2232672
4589B232672M1711L4506M7489L5987m4817J1246J26362l930J22845O9063j27102
$$ 2232672 2274383 2308889 2356378 2392365 2347548 2358794 2485156 2481226 2604071 2673134 2546032
4578B546032L5747J79601J74316O3416L2259O7460J56052J21473L7019J23843
$$ 2546032 2581779 2761380 2935696 2999112 3031371 3098831 3254883 3376356 3413375 3537218
4568C537218J53275J28938L7183K6910k417J83970J31355J6204J23501n4395r0713
$$ 3537218 3690493 3819431 3856614 3883524 3881107 4065077 4196432 4212636 4336137 4281742 4191029
4557D191029Q650P9848L7211R7578M4759k1735M7925L5699N3160j15253J21365
$$ 4191029 4199679 4279527 4316738 4414316 4459075 4437340 4485265 4520964 4574124 4458871 4580236
4546D580236J41956M0004J0213L7918J88507J11528M517L6292J66282J07149K80506
$$ 4580236 4722192 4762196 4772409 4810327 4998834 5110362 5114879 5151171 5317453 5424602 5705108
4535E705108Q8407J23607J67093J85525L15290K13639K03068L02668K18140J85108
$$ 5705108 5793515 5917122 6084215 6269740 6585030 6798669 7001737 7304405 7522545 7707653
4525G707653K23102K49751J35786J61114J74262j60827k3203j0635J5344Q7969
$$ 7707653 7930755 8180506 8316292 8477406 8651668 8490841 8467638 8457003 8472347 8560316
4515H560316N1169L228J7937K0521M3851q1409o074Q7468R3334J61819M4938R8097
$$ 8560316 8611485 8614713 8632650 8653171 8697022 8615613 8609539 8697007 8790341 8952160 8997098 9095195
4503I095195M4860M9925L5888J44788J22437J9995J23570J17874J76139K10946
$$ 9095195 9140055 9189980 9225868 9370656 9493093 9513088 9636658 9754532 9930671 10141617
4493A0141617J49346K99771K23921J71512K54164J76610K62152J55533J70019
$$ 10141617 10290963 10590734 10814655 10986167 11240331 11416941 11679093 11834626 12004645
4484A2004645K939J81810R7319J27020J23879P8589J25402n5850n6053J60422
$$ 12004645 12007584 12189394 12286713 12413733 12537612 12616201 12741603 12685753 12629700 12790122
4474A2790122K73108K83487L30488J91524L73817K73192J85074M94343K69185
$$ 12790122 13063230 13346717 13677205 13868729 14242546 14515738 14700812 15195155 15464340
4465A5464340J74272M35544L67597M52013N18318O11205M64354O23181R07351
$$ 15464340 15638612 16074156 16441753 16893766 17412084 18023289 18487643 19110824 20018175
4456B0018175R58496J211210J500988J758873K098061K347045K803030L255804
$$ 20018175 20976671 22187881 23688869 25447742 27545803 29892848 32695878 35951682
4448C5951682L738507M426794N120652O263217P628205R181189J0514067J0806713
$$ 35951682 39690189 44116983 49237635 55500852 63129057 72310246 82824313 93631026
4440I3631026J0533434Q900409L630302k758872r185192j3227210j3228680j1563833
$$ 93631026 104164460 113064869 116695171 113936299 104751107 91523897 78295217 66731384
4432F6731384r299083p282139n695237m349658l582505l143357k640643k307609
$$ 66731384 57432301 50150162 44454925 40105267 36522762 33379405 30738762 28431153
4424B8431153j907942j644779j413874j161031r25468o16693o46648q24106l67208
$$ 28431153 26523211 24878432 23464558 22303527 21378059 20761366 20114718 19290612 18923404
4415A8923404l93942m19125k90354k74509j8577o5483q1008j40280k1460p6128
$$ 18923404 18529462 18110337 17819983 17545474 17526897 17461414 17380406 17240126 17218666 17142538
4405A7142538K6125Q7815Q2422K03041J09790J76260Q1207K26110L63993L29432
$$ 17142538 17168663 17256478 17338900 17541941 17651731 17827991 17909198 18135308 18499301 18828733
4395A8828733M44431O39402Q95320R73899J083821J333381J752776K190754K719403
$$ 18828733 19273164 19912566 20807886 21781785 22865606 24198987 25951763 28142517 30861920
4386C0861920L287682L471536M286753N159927O421940P734897R191014J0047013
$$ 30861920 34149602 37621138 41907891 47067818 53489758 61224655 70415669 80462682
4378H0462682R967318J0525589P213881N09194l027605q222074j2637981j2412884
$$ 80462682 90430000 100955589 108169470 108678664 105651059 97428985 84791004 72378120
4370G2378120j1077569r112074p246462n676217m501159l704661k950035k575153
$$ 72378120 61300551 52188477 44942015 39265798 34764639 31059978 28109943 25534790
4362B5534790k219809k015951j491112j357824j181861q27761q16396p31269o62741
$$ 25534790 23314981 21299030 19807918 18450094 17268233 16440472 15624076 14892807 14230066
4353A4230066o73769m27473m39888m81557k35164m34124m69161n46932l61184
$$ 14230066 13556297 13128824 12688936 12207379 11972215 11538091 11068930 10521998 10160814
4344A0160814k30478l90145k93130l69064k97577l09435k44904j57134j53900
$$ 10160814 9930336 9540191 9247061 8877997 8580420 8270985 8026081 7868947 7715047
4335G715047l47772l81241j28508k52542j75078j95985j10828k40531r7817q7506
$$ 7715047 7367275 6986034 6857526 6604984 6429906 6233921 6123093 5882562 5784745 5697239
4325E697239k53662K7847j21868j55876l0109j77022o4974o4815p5634k21981
$$ 5697239 5443577 5471424 5349556 5193680 5163571 4986549 4921575 4856760 4781126 4559145
4315D559145J3494k31430l6632j18747M9015p4701o7229m5644j93028K6722L2237
$$ 4559145 4572639 4341209 4304577 4185830 4234845 4160144 4092915 4047271 3854243 3880965 3913202
4304C913202j98567m5913o7411o7991M2710M503p5230o4846J51592r8370l4428
$$ 3913202 3714635 3668722 3601311 3533320 3576030 3580533 3505303 3440457 3592049 3493679 3459251
4293C459251p335j52570m6229m0396r4389L5007o8562m70J51251j13978n7591
$$ 3459251 3451916 3299346 3253117 3212721 3118332 3153339 3084777 3084307 3235558 3121580 3063989
4282C063989J02112p4986r8823J6647J5633q1720L263O7537j55697K3552M2044
$$ 3063989 3166101 3091115 2992292 3008939 3024572 2942852 2946115 3013652 2857955 2881507 2923551
4271B923551M3916L1969k2546j19294J34699j6227j75831j02150K3154j0809L897
$$ 2923551 2967467 2999436 2976890 2857596 2992295 2976068 2800237 2698087 2721241 2710432 2714329
4260B714329J8005r998M7238j2986K0033o1093J6182j9001Q6493m9451o0619J4166
$$ 2714329 2732334 2722336 2769574 2756588 2776621 2715528 2731710 2712709 2799202 2749751 2689132 2703298
4248B703298L2528L9366Q9246r8843p1701J22586K8375L8578L2477n4616o4142
$$ 2703298 2735826 2775192 2864438 2765595 2693894 2816480 2844855 2883433 2915910 2861294 2797152
4237B797152J0500J14596o7140M1870q7368J45808L9159j01955j8195j00778j78959
$$ 2797152 2807652 2922248 2855108 2896978 2809610 2955418 2994577 2892622 2874427 2773649 2594690
4226B594690N3470J53141J1338l58J9110j2611o1159m0648K6958l6733J40273
$$ 2594690 2648160 2801301 2812639 2812281 2831391 2818780 2757621 2716973 2743931 2707198 2847471
4215B847471Q5782j8848J17430J47379N3704r0977Q8363J07140j17470M4026J83009
$$ 2847471 2933253 2914405 3031835 3179214 3232918 3141941 3230304 3337444 3219974 3264000 3447009
4204C447009J03629J83748J06738J987q6729o5116J02469J23062J48069o0513
$$ 3447009 3550638 3734386 3841124 3843111 3756382 3691266 3793735 3916797 4064866 4004353
4194D004353N0944J54673M0480J35026J7306J47482J62970J34242R7018j03034
$$ 4004353 4055297 4209970 4250450 4385476 4402782 4550264 4713234 4847476 4944494 4841460
4184D841460K11954j8529J18840J15383R6112L7695J20876J12007L01108J95090
$$ 4841460 5053414 5034885 5153725 5269108 5365220 5402915 5523791 5635798 5936906 6131996
4174F131996j05673N0881K01797J57649K34993K18939J15949K10682J43708K60069
$$ 6131996 6026323 6077204 6279001 6436650 6671643 6890582 7006531 7217213 7360921 7620990
4164G620990K22153K65602K97818L13132K81476L42631M09707M85422N17671M77691
$$ 7620990 7843143 8108745 8406563 8719695 9001171 9343802 9753509 10238931 10756602 11234293
4154A1234293N40287N35995M87740P14274P00431Q24432Q58774R23365P25248
$$ 11234293 11774580 12310575 12798315 13512589 14213020 15037452 15896226 16819591 17544839
4145A7544839Q90261Q13249Q54578O34246L75774L21232M15065J80248K84008
$$ 17544839 18435100 19248349 20102927 20737173 21112947 21434179 21849244 22029492 22313500
4136B2313500K66040L05123M60328M40332M97678N58179N38784O30279P12423
$$ 22313500 22579540 22884663 23344991 23785323 24283001 24841180 25379964 26010243 26722666
4127B6722666N67533O13246M23185L69969L96564L75930P0628J44420l9047P4274
$$ 26722666 27290199 27903445 28326630 28696599 29093163 29469093 29539721 29684141 29645094 29719368
4117B9719368J09619N3805L9915P75J4231K3566J30324K77809M16632N36389N27559
$$ 29719368 29828987 29882792 29922707 29923482 29937713 29961279 30091603 30369412 30786044 31322433 31849992
4106C1849992M05880M93778M86557K28194K05483K00132R0495J27705J05907L3446
$$ 31849992 32255872 32749650 33236207 33464401 33669884 33870016 33960511 34088216 34194123 34227569
4096C4227569L3776J90405p0347k08049n24545m68784p62266j033782r99998j118926
$$ 34227569 34261345 34451750 34381403 34173354 33648809 33180025 32417759 31383977 30383979 29265053
4086B9265053j382626j417214j358947j346565j233240j038615r28753q99779
$$ 29265053 27882427 26465213 25106266 23759701 22526461 21487846 20559093 19659314
4078A9659314o31348o60640o74524n50304m55821l61880k20393l15144k55291
$$ 19659314 19027966 18367326 17692802 17142498 16686677 16324797 16104404 15789260 15533969
4069A5533969j92041j05273j43380p5737Q9104j75688j4999J7009j4012K9418
$$ 15533969 15341928 15236655 15093275 15017538 15106642 14930954 14915955 14932964 14918952 14948370
4059A4948370J26211K02899N3206J48449m3471R6754J20102J18869M2637K1458
$$ 14948370 15074581 15277480 15330686 15479135 15435664 15532418 15652520 15771389 15814026 15835484
4049A5835484K42268L03730K51696L35482K42329M16245N61279N04791O14309
$$ 15835484 16077752 16381482 16633178 16968660 17210989 17627234 18188513 18693304 19307613
4040A9307613M67878O45513Q05219P62451Q92546Q83426Q18690J019434R07343
$$ 19307613 19775491 20421004 21226223 21988674 22881220 23764646 24583336 25602770 26510113
4031B6510113Q98132J133349J023364R19887R04697P11265Q27216O90013M92451
$$ 26510113 27408245 28541594 29564958 30484845 31389542 32100807 32928023 33618036 34110487
4022C4110487N23182N41059K32442J98711J08736Q0352N0354m9629J34813M6934
$$ 34110487 34633669 35174728 35407170 35605881 35714617 35794969 35845323 35795694 35930507 35977441
4012C5977441J27867p6995j83783m06546m11884k93506k18916l83900k46181k72816
$$ 35977441 36105308 36028313 35844530 35437984 35026100 34732594 34513678 34129778 33883597 33610781
4002C3610781j32662K5319j11196q0592j28474r5343r5188j21439j86470j7206
$$ 33610781 33478119 33503438 33392242 33311650 33183176 33087833 32992645 32871206 32684736 32667530
3992C2667530k24804j88598l17307l26926n24901m75747n03085n85908o49326
$$ 32667530 32442726 32254128 31936821 31609895 31084994 30609247 30106162 29520254 28870928
3983B8870928n03682l06656m02248l32335l08452l04744l86365l86798m94446
$$ 28870928 28367246 28060590 27658342 27326007 27017555 26712811 26326446 25939648 25445202
3974B5445202m18258m51183m29051m97945m81946m47564m78116m24133l10552
$$ 25445202 25026944 24575761 24146710 23648765 23166819 22719255 22241139 21817006 21506454
3965B1506454k87859n25408n66524m22907o40811m40902j86575j46624j55988
$$ 21506454 21218595 20693187 20126663 19703756 19062945 18622043 18435468 18288844 18132856
3956A8132856j1319m6855K22768L13514J70890J86827M44669M19572K56094L83511
$$ 18132856 18121537 18074682 18297450 18610964 18781854 18968681 19413350 19832922 20089016 20472527
3946B0472527K96389K74347J28227M1851P5196J09204K68667M11000N88151P21278
$$ 20472527 20768916 21043263 21171490 21213341 21288537 21397741 21666408 22077408 22665559 23386837
3936B3386837P22997O36565O06606J59025l28650o85187p96033q23146o20974
$$ 23386837 24109834 24746399 25353005 25512030 25183380 24498193 23702160 22879014 22258040
3927B2258040m01309l86178j58735m9172k1603l6388l6899J16332J63674K17787
$$ 22258040 21856731 21470553 21311818 21262646 21241043 21204655 21167756 21284088 21447762 21665549
3917B1665549J65841J16063J50552J9627j30317j25968k21938k90888k14977l98234
$$ 21665549 21831390 21947453 22098005 22117632 21987315 21861347 21639409 21348521 21133544 20735310
3907B0735310k01485N983m4266p3048R7394J12529R7633R2507J61210J46142J77153
$$ 20735310 20533825 20539808 20495542 20422494 20519888 20632417 20730050 20822557 20983767 21129909 21307062
3896B1307062L40658K99153L35080L97347M19083N64379M97009P00004P41716
$$ 21307062 21647720 21946873 22281953 22679300 23098383 23662762 24159771 24859775 25601491
3887B5601491P79375J044014R23095Q81083R38375P42422M42554K42615K67888
$$ 25601491 26380866 27424880 28347975 29229058 30167433 30909855 31352409 31595024 31862912
3878C1862912K5667q5878j35237k13453k82470l49108k69482m53282m98663m52164
$$ 31862912 31888579 31802701 31667464 31454011 31171541 30822433 30552951 30099669 29601006 29148842
3868B9148842m99801n04665k26238j94181n8454K38363J35113L53567L14396M27488
$$ 29148842 28649041 28144376 27918138 27723957 27665503 27903866 28038979 28392546 28706942 29134430
3858B9134430L93926N28819O38460M73130N30437M13008M65890N77237M04510
$$ 29134430 29528356 30057175 30695635 31168765 31699202 32112210 32578100 33155337 33559847
3849C3559847L59292M29370M58189M71423M85711N20905O12866P21145Q36533
$$ 33559847 33919139 34348509 34806698 35278121 35763832 36284737 36897603 37618748 38455281
3840C8455281P25861J030547J253493J367434J439702J429280J458698J344976
$$ 38455281 39181142 40211689 41465182 42832616 44272318 45701598 47160296 48505272
3832D8505272J140128P52548L59776K85773L14257L10408N22997P99104R15095
$$ 48505272 49645400 50397948 50757724 51043497 51357754 51668162 52191159 52990263 53905358
3823E3905358J140169J255996J375076J499405J527000J924859K156915K379103
$$ 53905358 55045527 56301523 57676599 59176004 60703004 62627863 64784778 67163881
3815F7163881K648171K784980L291967L441606L158576K419122J618776P72427
$$ 67163881 69812052 72597032 75888999 79330605 82489181 84908303 86527079 87299506
3807H7299506P0207J25488L91620J058038J782986K634409L321643M042295M830059
$$ 87299506 87369713 87495201 87886821 88944859 90727845 93362254 96683897 100726192 105556251
3798A05556251N746921O652261P941461R218445J0675759J2334439J3929947J5039020
$$ 105556251 111303172 117955433 125896894 135115339 145791098 158125537 172055484 187094504
3790A87094504J4774057J3789541J1474952N850800l95519m212462o965963r269555
$$ 187094504 201868561 215658102 227133054 232983854 232588335 228375873 221409910 212140355
3782B12140355j0798749j1307834j0642677r787146q595948p396188o206349m914798
$$ 212140355 201341606 190033772 179391095 169603949 161008001 153611813 147405464 142490666
3774A42490666l655729k580327j614145n99959M41478J167327J834837J829973
$$ 142490666 138834937 136254610 134640465 134040506 134481984 135649311 137484148 139314121
3766A39314121J245251j27036k720695n215774o491898o634766o127875n221900
$$ 139314121 140559372 140432336 137711641 132495867 126003969 119369203 113241328 108019428
3758A08019428m340414l747500l371192l062834k723239k674977k294582k066468
$$ 108019428 103679014 99931514 96560322 93497488 90774249 88099272 85804690 83738222
3750H3738222k083272j771472j839505j716688j544948j721101j836925j568279
$$ 83738222 81654950 79883478 78043973 76327285 74782337 73061236 71224311 69656032
3742F9656032j488436j544062j467283j223843j175881j032396r89934r25544
$$ 69656032 68167596 66623534 65156251 63932408 62756527 61724131 60734197 59808653
3734E9808653q85586q90853j067585j257924j259938j343960j427105j535915
$$ 59808653 58923067 58032214 56964629 55706705 54446767 53102807 51675702 50139787
3726E0139787j454013j386510j140237j038810r87047q89287p34387o02025m06922
$$ 50139787 48685774 47299264 46159027 45120217 44133170 43243883 42509496 41907471 41500549
3717D1500549m59148n12586n09315l92857l49496m08341j36698q6204r6373j91125
$$ 41500549 41041401 40528815 40019500 39626643 39277147 38868806 38732108 38645904 38549531 38358406
3707C8358406j25183p0596j02547n7771n1148n6005Q5164j62957m39673m91227
$$ 38358406 38233223 38162627 38060080 38002309 37951161 37895156 37980320 37817363 37377690 36886463
3697C6886463n64691o77180q34419q49765r42064j074403r36028p86157p94718
$$ 36886463 36321772 35644592 34810173 33960408 33018344 31943941 31007913 30221756 29427038
3688B9427038p19566n72954m66249n29045n03992k91407k03324k10906j56684
$$ 29427038 28707472 28134518 27668269 27139224 26635232 26343825 26140501 25929595 25772911
3679B5772911j49364j99258j30410l33947k35141l39059l72518n02981k43024
$$ 25772911 25623547 25424289 25293879 24959932 24724791 24385732 24013214 23510233 23267209
3670B3267209l74250l76565j16995j57059j78030j33160J85370P549m5598J49521
$$ 23267209 22892959 22516394 22399399 22242340 22064310 21931150 22116520 22124069 22078471 22227992
3660B2227992R1475M5506K92650L57998J07482K828k9812j70557m9594k78244
$$ 22227992 22319467 22364973 22657623 23015621 23123103 23125931 23096119 22925562 22875968 22597724
3650B2597724k83589k56274k31998k32674k62458m0199J65186N2959J77869J39
$$ 22597724 22314135 22057861 21825863 21593189 21330731 21290532 21455718 21508677 21686546 21686685
3640B1686685M7978n981p4401P5710K11700P8533l3290K9934M8547K9427J11656
$$ 21686685 21734663 21728682 21654281 21729991 21941691 22020224 21986934 22016868 22065415 22094842 22206498
3629B2206498J64343K84591J53218J59995J71726K11058K78665J61115K26940
$$ 22206498 22370841 22655432 22808650 22968645 23140371 23351429 23630094 23791209 24018149
3620B4018149R2640N8565m2044k57706l69991n18193m36190l07310m13581m35950
$$ 24018149 24110789 24169354 24127310 23869604 23499613 22981420 22545230 22237920 21824339 21388389
3610B1388389j18955k76572k49197j2768J6771J20430J73939L45728L33434N63953
$$ 21388389 21269434 20992862 20743665 20730897 20747668 20868098 21042037 21387765 21721199 22285152
3600B2285152M99860O35801M77959O83366N21083L94051K96378R3436o7441q1400
$$ 22285152 22785012 23420813 23898772 24582138 25103221 25497272 25793650 25887086 25819645 25738245
3590B5738245j23584J65612J83210J67020K64142L48746L09354M76378M10239
$$ 25738245 25614661 25780273 25963483 26130503 26394645 26743391 27052745 27529123 27939362
3581B7939362M27329J88950K25223L76430L99788O23176O01833O10060O66944
$$ 27939362 28366691 28555641 28780864 29157294 29557082 30180258 30782091 31392151 32059095
3572C2059095P57549O48806N62690M46009L91619L44307J79418j97789l039q4875
$$ 32059095 32816644 33465450 34028140 34474149 34865768 35210075 35389493 35191704 35188665 35103790
3562C5103790L729l4926j45741j0752R9573K6920J03434O2212Q9851J77086J35141
$$ 35103790 35107519 35072593 34926852 34916100 35015673 35042593 35146027 35208239 35298090 35475176 35610317
3551C5610317K90895K77801M52346M34729N81509M84277N37574O68562P89512
$$ 35610317 35901212 36179013 36631359 37066088 37647597 38131874 38669448 39338010 40127522
3542D0127522J015426J036129J398548J587778J709615J674013J952425K013583
$$ 40127522 41142948 42179077 43577625 45165403 46875018 48549031 50501456 52515039
3534E2515039J936288J756557J521579J512892J341700J243052J208557J189895
$$ 52515039 54451327 56207884 57729463 59242355 60584055 61827107 63035664 64225559
3526F4225559J069377R56542J092549Q61514O19362N74843M14576L69781K76530
$$ 64225559 65294936 66251478 67344027 68205541 68824903 69399746 69814322 70184103 70460633
3517G0460633K45094K81844J96195J66181J06339J09575K3981R3881j55310j88185
$$ 70460633 70705727 70987571 71183766 71349947 71456286 71565861 71589842 71683723 71528413 71340228
3507G1340228j49581k3359l1227J50744M34942M16813N97769Q41989Q34459Q45844
$$ 71340228 71190647 71167288 71136061 71286805 71721747 72138560 72736329 73578318 74412777 75258621
3497G5258621Q88124J015882P21605N41663O59130L48972J51011J52999O1501
$$ 75258621 76146745 77162627 77884232 78425895 79085025 79433997 79585008 79738007 79799508
3488G9799508M5294M0820J85107J65636J98972J31033q847O3795j49285m69202
$$ 79799508 79844802 79885622 80070729 80236365 80435337 80566370 80557523 80621318 80472033 80002831
3478H0002831p89058r54173j013599j215335j240842j271240j237151j128149
$$ 80002831 79213773 78259600 77246001 76030666 74789824 73518584 72281433 71153284
3470G1153284o59858m15758k03917M7675J75920J38860Q4050K6272l52739n29456
$$ 71153284 70493426 70077668 69873751 69921426 70097346 70236206 70320256 70346528 69993789 69464333
3460F9464333q46251q82852r67870j007024j012036p97726n76311o65984o27536
$$ 69464333 68618082 67735230 66767360 65760336 64748300 63950574 63374263 62708279 62080743
3451F2080743o68922q64284j124638j411291j609775j802687j909406k014438
$$ 62080743 61411821 60547537 59422899 58011608 56401833 54599146 52689740 50675302
3443E0675302k010052j916922j948957j797146j649282j430929j224345j017429
$$ 50675302 48665250 46748328 44799371 43002225 41352943 39922014 38697669 37680240
3435C7680240q99654p58032q08356o27632m83658l93235j32203k41495j52157
$$ 37680240 36780586 36022554 35214198 34586566 34102908 33709673 33577470 33335975 33183818
3426C3183818j21120J83062J80595L04417K35096L99073M09379M22189L68875
$$ 33183818 33062698 33245760 33426355 33730772 33965868 34364941 34774320 35196509 35565384
3417C5565384M16364M09475M18658K56398K61489J09704m736P8412j63139k91293
$$ 35565384 35981748 36391223 36809881 37066279 37327768 37437472 37432736 37511148 37348009 37056716
3407C7056716j37290j49259j95348j85679j20257J7223J64212K94465O5816L01181
$$ 37056716 36919426 36770167 36574819 36389140 36268883 36286106 36450318 36744783 36810599 37111780
3397C7111780L91860M93360P93656O93018Q63842R30622J080732J430126J262252
$$ 37111780 37503640 37997000 38790656 39483674 40347516 41278138 42358870 43788996 45051248
3388D5051248J401911J773891K016116K207680K262756K437195K852985L189029
$$ 45051248 46453159 48227050 50243166 52450846 54713602 57150797 60003782 63192811
3380F3192811L232880L450652L723185L916618M142087M339928M322449M342061
$$ 63192811 66425691 69876343 73599528 77516146 81658233 85998161 90320610 94662671
3372I4662671M682637M655915M345690M141224L836862L210646K384947J656817
$$ 94662671 99345308 104001223 108346913 112488137 116324999 119535645 121920592 123577409
3364A23577409O79234k95925j058804j860191k496252k918437l443444l684528
$$ 123577409 124256643 123960718 122901914 121041723 118545471 115627034 112183590 108499062
3356A08499062m024676l796300l703187l475977l254414k887721k649519k299135
$$ 108499062 104474386 100678086 96974899 93498922 90244508 87356787 84707268 82408133
3348H2408133j520537j257477p13437l98480J709M95716Q59418J242700J961102
$$ 82408133 80887596 79630119 78916682 78518202 78519911 79015627 79875045 81117745 83078847
3339H3078847K120342K367781K796243L042281L306872L530569L527428L264203
$$ 83078847 85199189 87566970 90363213 93405494 96712366 100242935 103770363 107034566
3331A07034566L226897K922921K484533K124266J680529J266156P95415L78055
$$ 107034566 110261463 113184384 115668917 117793183 119473712 120739868 121535283 121913338
3323A21913338Q817o2795k02072l00678l79996l11070l39010j42561r0776J58544
$$ 121913338 121922155 121859360 121657288 121356610 120976614 120665544 120326534 120183973 120093197 120251741
3313A20251741M51258P17247J155321J429382J553640K045511K216912K145553
$$ 120251741 120702999 121420246 122575567 124004949 125558589 127604100 129821012 131966565
3305A31966565J986331J639200J024845K15191r57389k173704l341042m541747
$$ 131966565 133952896 135592096 136616941 136832132 135874743 133701039 130359997 125818250
3297A25818250n466495n969452o351661o519764o551381o170914n811551n354638
$$ 125818250 120351755 114382303 108030642 101510878 94959497 88788583 82977032 77622394
3289G7622394m942538m416950l957496l451145k997617k695167k410480k115790
$$ 77622394 72679856 68262906 64305410 60854265 57856648 55161481 52751001 50635211
3281E0635211j952418j658261j233419j187454j126431j027777q86736p75162
$$ 50635211 48682793 47024532 45791113 44603659 43477228 42449451 41562715 40787553
3273D0787553o30329q07711n82369n92129o10164n86483o03255o67015q16897
$$ 40787553 40157224 39349513 38767144 38175015 37564851 36978368 36375113 35708098 34891201
3264C4891201n86549o77772p26274o89380o36728o94847o26607m80368n70217
$$ 34891201 34304652 33626880 32900606 32211226 31574498 30879651 30253044 29772676 29202459
3255B9202459n20865o53845m55096m59674m01933l37431l55409l51580m56940
$$ 29202459 28681594 28027749 27572653 27112979 26711046 26373615 26018206 25666626 25209686
3246B5209686n20258m25976m03012l06764k59066l23521l80961k23249j51973
$$ 25209686 24689428 24263452 23860440 23553676 23294610 22971089 22590128 22366879 22214906
3237B2214906l93401k85165m5734j63228K730q2682k16428n9548j01799k933J42902
$$ 22214906 21821505 21536340 21490606 21327378 21330108 21247426 21030998 20971450 20869651 20866718 21009620
3226B1009620o2812j6854P0164l4896J11821J28438J14811K22026J77896J77540
$$ 21009620 20946808 20929954 21000118 20965222 21077043 21205481 21320292 21542318 21720214 21897754
3216B1897754K42947J66395L27488K52396K41520L34949L55165M76827M33508
$$ 21897754 22140701 22307096 22634584 22886980 23128500 23463449 23818614 24295441 24728949
3207B4728949N04978N21607O69552N32876O27428P66985N94803O12854P32570
$$ 24728949 25233927 25755534 26425086 26957962 27585390 28352375 28947178 29560032 30292602
3198C0292602O36024N76394M84841O83444N40172L12482N41199L33478M56764
$$ 30292602 30928626 31505020 31989861 32673305 33213477 33525959 34067158 34400636 34857400
3189C4857400M04292L68342O88349M06730M71150M99196N97615M69086M97553
$$ 34857400 35261692 35630034 36318383 36725113 37196263 37695459 38293074 38762160 39259713
3180C9259713O38728O55843O66690Q68980Q85331Q50994P86513J000898J151520
$$ 39259713 39898441 40554284 41220974 42089954 42975285 43826279 44612792 45613690 46765210
3171D6765210J114796Q85241R58202J049974Q31623R18020R25239Q88606J087153
$$ 46765210 47880006 48765247 49723449 50773423 51605046 52523066 53448305 54336911 55424064
3162E5424064R70907R45948J208191J250826J489438J354772J502099J579477
$$ 55424064 56394971 57340919 58549110 59799936 61289374 62644146 64146245 65725722
3154F5725722J626332J633840J676375J902978J867537J734791J967809J837878
$$ 65725722 67352054 68985894 70662269 72565247 74432784 76167575 78135384 79973262
3146G9973262J684838J663320J602351J673022J494805J420084J501347J355165
$$ 79973262 81658100 83321420 84923771 86596793 88091598 89511682 91013029 92368194
3138I2368194J578800J574788J633475J628391J943827K002918K174229K301074
$$ 92368194 93946994 95521782 97155257 98783648 100727475 102730393 104904622 107205696
3130A07205696K450372K692197K672540L067623L395450L623978L926104M121862
$$ 107205696 109656068 112348265 115020805 118088428 121483878 125107856 129033960 133155822
3122A33155822M150060M173102M021204L699823L435966K910023K594189K296624
$$ 133155822 137305882 141478984 145500188 149200011 152635977 155546000 158140189 160436813
3114A60436813K093314J877497J831562J641464J642510J580113J494066J435406
$$ 160436813 162530127 164407624 166239186 167880650 169523160 171103273 172597339 174032745
3106A74032745J085949O58001K24909j96871o98025j025866j232061j381182j533878
$$ 174032745 175118694 175776695 176001604 175804733 175106708 174080842 172848781 171467599 169933721
3097A69933721j642843j676762j449784j485928j508425j289276j186079j114656
$$ 169933721 168290878 166614116 165164332 163678404 162169979 160880703 159694624 158579968
3089A58579968p93152n86492k91070j45412J56117K70416L50653M20167K52712
$$ 158579968 157786816 157200324 156909254 156763842 156919959 157190375 157541028 157961195 158213907
3080A58213907J59541l60149j277937k496097l862438n564515o585989p393874
$$ 158213907 158373448 158013299 156735362 154239265 150376827 144812312 138226323 130832449
3072A30832449p846706p546972o992585o339458n637250m888283m183901l734180
$$ 130832449 122985743 115438771 108446186 102106728 96469478 91581195 87397294 83663114
3064H3663114l456794l081280k798950k413572k124355j749158j619888j457672
$$ 83663114 80206320 77125040 74326090 71912518 69788163 68039005 66419117 64961445
3056F4961445j286540q67740q28243q80477n90595n67750n05038l42890l48282
$$ 64961445 63674905 62807165 61978922 61098445 60507850 59940100 59435062 59092172 58743890
3047E8743890k95366j27927p2954k58457j81114j62692j55402j76778k82946k77769
$$ 58743890 58448524 58320597 58247643 57989186 57808072 57645380 57489978 57313200 57030254 56752485
3037E6752485k16934l74160n79133n21763q36200p15981p42129r17263r07636
$$ 56752485 56535551 56161391 55582258 55060495 54224295 53508314 52766185 51848922 50941286
3028E0941286j090480j071836j258684j065775j021409j066223q09638p44299
$$ 50941286 49850806 48778970 47520286 46454511 45433102 44366879 43557241 42812942
3020D2812942q53399n83391o74602n88152m41694k89665j41692q5099p0353L0847
$$ 42812942 41959543 41376152 40701550 40113398 39671704 39382039 39240347 39155248 39084895 39115742
3010C9115742J78525J82319K66997K57228K72028J30677L82405N45210M83393
$$ 39115742 39294267 39476586 39743583 40000811 40272839 40403516 40785921 41331131 41814524
3001D1814524M56659Q46588R45255R33398J160017J253806J459376J598695J870876
$$ 41814524 42271183 43117771 44063026 44996424 46156441 47410247 48869623 50468318 52339194
2992E2339194K031683K135814K350227K645381K792517K706567K867340K956515
$$ 52339194 54370877 56506691 58856918 61502299 64294816 67001383 69868723 72825238
2984G2825238K902516K752999K582900K416855K104783J752164J289145Q16759
$$ 72825238 75727754 78480753 81063653 83480508 85585291 87337455 88626600 89443359
2976H9443359N86157R5275P1202m13359j67295J22151J52734M67406Q57685J346310
$$ 89443359 90029516 90124791 90195993 89782634 89615339 89737490 89890224 90357630 91215315 92561625
2966I2561625J727177K184377K498330L063050L230827L335854L602717L407073
$$ 92561625 94288802 96473179 98971509 102034559 105265386 108601240 112203957 115611030
2958A15611030L198405K604912J926733J088197K09204p69899j835674k755698
$$ 115611030 118809435 121414347 123341080 124429277 124638481 123868582 122032908 119277210
2950A19277210l885500m800338n290186n686992n989422o041295n751471n326129
$$ 119277210 115391710 110591372 105301186 99614194 93624772 87583477 81832006 76505877
2942G6505877n177149m565843m212640l840834l322911k786091k683404k451157
$$ 76505877 71328728 66762885 62550245 58709411 55386500 52600409 49917005 47465848
2934D7465848k177404j759152j699902j661312j495613j180341j273462j339713
$$ 47465848 45288444 43529292 41829390 40168078 38672465 37492124 36218662 34878949
2926C4878949j115389j029860j108414r54767r18963q99138q50572p31827p59762
$$ 34878949 33763560 32733700 31625286 30670519 29751556 28852418 28001846 27270019 26510257
2917B6510257n86440p18672o88658o49949o29626l31164n88910m12876n29707
$$ 26510257 25923817 25205145 24516487 23866538 23236912 22905748 22316838 21903962 21374255
2908B1374255n17467m17496k94696l51335k58185k45607k06837k41334k60485
$$ 21374255 20856788 20439292 20144596 19793261 19535076 19289469 19082632 18841298 18580813
2899A8580813j90513j48991l54799k35226j93695j94036n3019j30599j21622j93173
$$ 18580813 18390300 18241309 17886510 17651284 17457589 17263553 17210534 17079935 16958313 16765140
2889A6765140j27304o4877k61803j27772j44698p1027j40608j55159k70789k53787
$$ 16765140 16637836 16572959 16311156 16183384 16038686 15967659 15827051 15671892 15401103 15147316
2879A5147316j17289o7621j69448k35941j18914j23202n7543k22735o2290r4035
$$ 15147316 15030027 14962406 14792958 14557017 14438103 14314901 14257358 14034623 13972333 13878298
2869A3878298j83049j61571m8815j8744r2960o2291j24976j98665N7443o4087
$$ 13878298 13695249 13533678 13484863 13466119 13373159 13310868 13185892 12987227 13044670 12980583
2859A2980583j64618o0627N411m3082l009n9035k42804n5291L9232l7035p5184
$$ 12980583 12815965 12755338 12760749 12717667 12714658 12655623 12412819 12357528 12396760 12359725 12284541
2848A2284541M9580k0297p5400P5153O4011o5216N1866j08934n7141M9614J02037
$$ 12284541 12334121 12313824 12238424 12313577 12377588 12312372 12364238 12255304 12198163 12247777 12349814
2837A2349814J01689k3315R2030M3546r1093J24163J40951K8703J05713N8949
$$ 12349814 12451503 12428188 12520218 12563764 12472671 12596834 12737785 12766488 12872201 12931150
2827A2931150L16228J21014o1144N4680Q8851J77274J19869M7766J52380J55961
$$ 12931150 13247378 13368392 13307248 13361928 13450779 13628053 13747922 13795688 13948068 14104029
2817A4104029J96068L35921K43356K44763L15516L46091N54204N14085L70500
$$ 14104029 14300097 14636018 14879374 15124137 15439653 15785744 16339948 16854033 17224533
2808A7224533M61371N62633N05351O28399O16190N92617O71006O74456Q03655
$$ 17224533 17685904 18248537 18753888 19382287 19998477 20591094 21262100 21936556 22740211
2799B2740211P23426P67711Q12554R38794R99035Q94113J084722J066190J146300
$$ 22740211 23463637 24231348 25043902 25982696 26981731 27875844 28960566 30026756 31173056
2790C1173056J291943J381657J585808J836049K025690K121111K432053K503859
$$ 31173056 32464999 33846656 35432464 37268513 39294203 41415314 43847367 46351226
2782D6351226K600816K416464K004035J480932P66144l738l22543k29792k60271
$$ 46351226 48952042 51368506 53372541 54853473 55619617 55615879 55293336 55063544 54803273
2773E4803273j19299J14174L71136O15505O01325M72565N08978O64064O28584
$$ 54803273 54683974 54798148 55169284 55784789 56386114 56858679 57367657 58031721 58660305
2764E8660305P96309J221147J521244J669487J924123K161713K396342K661907
$$ 58660305 59456614 60677761 62199005 63868492 65792615 67954328 70350670 73012577
2756G3012577K895265L064211L378213L917225M289191M503002M893469N390116
$$ 73012577 75907842 78972053 82350266 86267491 90556682 95059684 99953153 105343269
2748A05343269N792554O341635P239310Q180931R159595J0395477J1651135J3026766
$$ 105343269 111135823 117477458 124716768 132897699 142057294 152452771 164103906 177130672
2740A77130672J4546512J6140622J7211469J6737600J4268141R745998L619592
$$ 177130672 191677184 207817806 225029275 241766875 256035016 265781014 269400606
2733B69400606k107333n848280o819218n378826k692681m50787J048743J374794
$$ 269400606 267293273 261444993 254625775 249246949 246554268 246103481 247152224 248527018
2725B48527018R92467Q08530J608521L421369N804783Q920593J2109407J5690472
$$ 248527018 249519485 250328015 251936536 255357905 261162688 270083281 282192688 297883160
2717B97883160J8977033K1790954K3920709K4730602K3264992J8643751J1077738
$$ 297883160 316860193 338651147 362571856 387302458 410567450 429211201 440288939
2710D40288939K01611j2143657k3235428l1153588l4675598l4060684l0666427
$$ 440288939 440490550 428346893 405111465 373957877 339282279 305221595 274555168
2703B74555168k6436053k2331645j9064214j6375548j4495774j2777691j1298149
$$ 274555168 248119115 225787470 206723256 190347708 175851934 163074243 151776094
2696A51776094j0140771q984365q004800o987593o147607n483324n016466m485295
$$ 151776094 141635323 132650958 124646158 117658565 111510958 106027634 101011168 96525873
2688I6525873m197072l936260l669948l618345l523642l153975k942924k770783
$$ 96525873 92328801 88392541 84722593 81104248 77580606 74426631 71483707 68712924
2680F8712924k642854k220762k209262k030528j900068j820099j757108j822866
$$ 68712924 66070070 63849308 61640046 59609518 57709450 55889351 54132243 52309377
2672E2309377j738462j551012j392975j485793j372217j047576j038246j038033
$$ 52309377 50570915 49019903 47626928 46141135 44768918 43721342 42683096 41645063
2664D1645063p31539o78450o92111o53702m25097l41765l03182m51245k79667
$$ 41645063 40913524 40235074 39542963 38889261 38464164 38122399 37819217 37367972 37088305
2655C7088305l34556m55748k43401m48154o12819p18494p93449r28325r71616
$$ 37088305 36753749 36298001 36054600 35606446 34993627 34275133 33481684 32553359 31581743
2646C1581743q12255o95615q43706o39118n44062o28774n62326o78167l78496
$$ 31581743 30769488 30073873 29230167 28591049 28046987 27418213 26855887 26177720 25799224
2637B5799224m75003n24914l89362l55394l89744n22379m04668m64451n07490
$$ 25799224 25324221 24799307 24409945 24054551 23664807 23142428 22737760 22273309 21765819
2628B1765819m11864l90333k76456l12956k63048k39538l32920l72782j57226
$$ 21765819 21353955 20963622 20687166 20374210 20111162 19871624 19538704 19165922 19008696
2619A9008696j73579k47005l77356k17519m29477k49784k31503k00376k37943
$$ 19008696 18835117 18588112 18210756 17993237 17563760 17313976 17082473 16882097 16644154
2610A6644154k34844j00369l22797r4283k44584m09816k31174k71527l51554k68909
$$ 16644154 16409310 16308941 15986144 15891861 15647277 15237461 15006287 14734760 14383206 14114297
2600A4114297m06936l03180k43496k68879k70051l20485j13383k25705k32738
$$ 14114297 13707361 13404181 13160685 12891806 12621755 12301270 12187887 11962182 11729444
2591A1729444j15316k37113j11722j64250r1935j72932q1052j38833j46996n5053
$$ 11729444 11614128 11377015 11265293 11101043 11009108 10836176 10755124 10616291 10469295 10414242
2581A0414242P372j42178L7827N3314j04839J4771m0893N1004L0758l8930K8149
$$ 10414242 10421614 10279436 10317263 10370577 10265738 10280509 10239616 10290620 10321378 10282448 10310597
2570A0310597N5022P4078R5233M2739k2528J0209j64759k02576k09045p1125k33422
$$ 10310597 10365619 10439697 10534930 10577669 10555141 10565350 10400591 10198015 9988970 9917845 9684423
2559I684423k27986k20748j89054j84124k59620r5669k13915j09234q3563j53891
$$ 9684423 9456437 9235689 9046635 8862511 8602891 8507222 8293307 8184073 8100510 7946619
2549G946619j30774j37990j53178j71275l04386j10894j37820p5469j01848j96364
$$ 7946619 7815845 7677855 7524677 7353402 7049016 6938122 6800302 6724833 6622985 6426621
2539F426621J18568j08429j07230n1316p9682j97414j13304r2931k43411j48192
$$ 6426621 6545189 6436760 6329530 6278214 6198532 6001118 5887814 5794883 5551472 5403280
2529E403280K8074r29j61711p7029j34237o6468q6310j22421m3012l0431k51826
$$ 5403280 5431354 5430425 5268714 5191685 5057448 4990980 4904670 4782249 4739237 4708806 4456980
2518D456980j08109j8552L050r4567M9436j65620j86085j05765j16135n7699q5141
$$ 4456980 4348871 4330319 4333369 4238802 4288238 4122618 3936533 3830768 3714633 3656934 3571793
2507C571793M8803P3434K0194q8506j62055q1505K1874l5872J4372m109l8170
$$ 3571793 3620596 3694030 3714224 3625718 3463663 3382158 3404032 3368160 3382532 3378423 3340253
2496C340253p5468o600l2422k1378Q8934m5613m8738R141j41004Q8026J53475
$$ 3340253 3264785 3258185 3225763 3204385 3293319 3247706 3198968 3208109 3067105 3155131 3308606
2485C308606N934Q7694j6628L9188J7645J01049J9795M2349q4909K4085n8863
$$ 3308606 3314540 3402234 3385606 3424794 3442439 3543488 3563283 3605632 3520723 3544808 3485945
2474C485945K3562j6849n7827j9767J5416J11787p9480j24302n1793J15309n1525
$$ 3485945 3509507 3492658 3434831 3415064 3430480 3542267 3462787 3338485 3286692 3402001 3350476
2463C350476L2380J49342R6224N5584k718P036Q5939J16691p7308m0114N4357
$$ 3350476 3382856 3532198 3628422 3684006 3681288 3688324 3774263 3890954 3813646 3773532 3827889
2452C827889j61719N097k44313k09840m5478k94975j00896L4772k40914j60835
$$ 3827889 3666170 3671267 3426954 3217114 3171636 2876661 2775765 2810537 2569623 2408788
2442B408788K84k8993p9574o0332m6099K5076n8445n0850J5079q3387l4357m5640
$$ 2408788 2409072 2380079 2300505 2240173 2194074 2219150 2160705 2109855 2124934 2041547 2007190 1961550
2430A961550j75735k2585n4380l8349j03944J26592o6707n7650k7032p4697M8588
$$ 1961550 1785815 1763230 1708850 1670501 1566557 1693149 1626442 1568792 1541760 1467063 1515651
2419A515651J34016p4550r2680K3600R9248l3541k7602j34594p1668J28553j28042
$$ 1515651 1649667 1575117 1482437 1506037 1605285 1571744 1544142 1409548 1337880 1466433 1338391
2408A338391j53618P708o6951k0372O103j5431K0876j04532J34337m1295l9758
$$ 1338391 1184773 1192481 1125530 1105158 1111261 1095830 1116706 1012174 1146511 1105216 1065458
2397A065458N1595j10356k1902k3269M3903N6970J12817l9064p2591q7523N2416
$$ 1065458 1117053 1006697 984795 961526 1005429 1062399 1175216 1136152 1063561 976038 1028454
2386A028454K4640q6753J4155k3444n1256Q535O3847j00659L7659J8706o324o2662
$$ 1028454 1053094 966341 980496 957052 905796 914331 978178 877519 915178 933884 927560 864898
2374H64898L5861J40751l2169p8296k5310N1353N8058m8440p0177M5421J7021
$$ 864898 900759 1041510 1009341 931045 905735 957088 1015146 966706 896529 941950 958971
2363I58971j50517J26161r465j41745p5358J48338p5433j58k596m9251K809L3448
$$ 958971 808454 934615 925150 783405 708047 856385 780952 780794 778198 728947 731756 765204
2351G65204l9874j3927J06557j3350l8038k0132q6322M0363o22o233j6038N7383
$$ 765204 725330 711403 817960 804610 766572 746440 660118 700481 699859 693626 677588 734971
2339G34971K7879o6493j19370n2246M5168J16865L594j6147p1968j15083j6928
$$ 734971 762850 696357 576987 524741 569909 686774 690368 674221 602253 487170 470242
2328D70242o1836M4570N7065J1259L1512L704L7654m2856N4472m8560r0109r2891
$$ 470242 408406 452976 510041 521300 552812 556516 594170 551314 605786 557226 467117 374226
2316C74226m9778O7771R5749Q8350M2067j03465Q3412N2147j59273J8225q828
$$ 374226 324448 392219 487968 576318 618385 514920 598332 650479 491206 509431 500603
2305E00603p6890J52330m5097l6163Q9304q2329N2737J7417k18k7271K1182P76
$$ 500603 423713 576043 530946 494783 584087 501758 554495 571912 571694 544423 565605 566381
2293E66381l112R6522n4810K2955Q4172j80403p7739l5643J5165k9978J0871K2426
$$ 566381 563269 659791 604981 627936 712108 531705 453966 418323 433488 403510 414381 436807
2281D36807J3178J0266k304m7499J28103p4018j53714K9621k0736N5190L8250
$$ 436807 449985 460251 457947 410448 538551 464533 310819 340440 319704 374894 413144
2270D13144q9019O758K02052M8217j80980l8483j34123N5107k828J27659M1996
$$ 413144 324125 330883 532935 581152 400172 361689 227566 282673 279845 407504 449500
2259D49500j04166J07156n849m9683L2816l5716l4633o6901j3802k6889J7807
$$ 449500 345334 452490 446641 396958 429774 394058 359425 292524 278722 251833 269640
2248B69640J9383M9056n5193R2043n3972j0871j0941j3698Q9104J9553l4041J51098
$$ 269640 289023 338079 282886 374929 320957 310086 299145 285447 374551 394104 360063 511161
2236E11161o4286M4263n741n7523n4553m2876q0953m6776R1296J40804K6576n6418
$$ 511161 446875 491138 485397 427874 373321 330445 249492 202716 294012 434816 461392 404974
2224D04974j4498L1453R8479j36730J04779m7148J9898j30994P7201p2555m9852
$$ 404974 390476 421929 520408 383678 488457 441309 461207 330213 407414 334859 285007
2213B85007K7918p7809J95102l5340m4852J75J7258O1571l4414L8232p1492J18865
$$ 285007 312925 235116 430218 394878 350026 350201 367459 429030 394616 432848 361356 480221
2201D80221k6020k0419m45j1540j34107o0340J44351M0064j08826l3781J63860
$$ 480221 454201 433782 433337 421797 287690 227350 371701 411765 302939 269158 433018
2190D33018k0758p6584j8880M1876J14853O9482m8240L0116L913o0651o2550l4221
$$ 433018 412260 335676 316796 358672 473525 543007 494767 524883 528796 468145 405595 371374
2178C71374l785j0478K0914p3300J37108k5059J5823N5625p5201p912k4466q0037
$$ 371374 367589 357111 378025 304725 441833 416774 432597 488222 413021 405109 380643 300606
2166C00606o8634J15206L7142n96J8912k6346p1408P1669m4678N5572O8505k2732
$$ 300606 231972 347178 384320 383724 402636 376290 304882 376551 331873 387445 455950 433218
2154D33218K9886m9471n423o5539o5101O1745M300J0435M9441j7890L0864K8085
$$ 433218 463104 413633 408210 342671 277570 339315 343615 354050 403491 385601 416465 444550
2142D44550K6716K9690O7241n4391r3103L2830K0189N4759L0769r4622j191N4672
$$ 444550 471266 500956 568197 513806 420703 453533 473722 528481 559250 464628 463437 518109
2130E18109R3484L4591P1825K3089M798k28J63900R3232M8857o1581q7262Q1513
$$ 518109 611593 646184 718009 741098 745896 745668 909568 1002800 1051657 990076 902814 984327
2118I84327J01161Q1134N9197k9764J41880L483m2882j34721p1521o64J0124J83675
$$ 984327 1085488 1166622 1225819 1196055 1337935 1341418 1298536 1163815 1092294 1091630 1101754 1285429
2106A285429J59871P2091n2031K1953J06915P1625K6939J01642Q6244N9400J37539
$$ 1285429 1445300 1517391 1465360 1487313 1594228 1665853 1692792 1794434 1880678 1940078 2077617
2095B077617k726J073N6963Q1911p6950M4260J09467J25952J11613J59743O6338
$$ 2077617 2074891 2075964 2132927 2214838 2137888 2182148 2291615 2417567 2529180 2688923 2755261
2084B755261J29945J56360J24922K76229K39585K27261K01196K10011R9158K99400
$$ 2755261 2885206 3041566 3166488 3442717 3682302 3909563 4110759 4320770 4419928 4719328
2074D719328L05265K03018K40895L79838M03630M16225N73890P94899O97518R24955
$$ 4719328 5024593 5227611 5468506 5848344 6251974 6668199 7242089 8036988 8734506 9659461
2064I659461R99386R64071R27096J082197J581143J924400K335337K782876L242300
$$ 9659461 10658847 11622918 12550014 13632211 15213354 17137754 19473091 22255967 25498267
2055B5498267M290415N547273P018907R002807P265549j134113m948840q786233
$$ 25498267 29788682 35335955 42354862 51357669 58623218 57489105 52540265 43754032
2047D3754032r844179o598185m590207l009758k406450j759663j665034j179116
$$ 43754032 33909853 27311668 22721461 19711703 17305253 15545590 13880556 12701440
2039A2701440r00703p87674q76271q25458q52363p79720o93372m74827m19518
$$ 12701440 11800737 11013063 10136792 9311334 8458971 7679251 6985879 6511052 6091534
2030F091534k96825l60418l35794l36134k91409k75323q7549k63255p5047j7462
$$ 6091534 5794709 5434291 5098497 4762363 4470954 4195631 4108082 3844827 3769780 3752318
2020C752318j25288o6083J7167j62626k40844j55443j18095j9897j08584k13850
$$ 3752318 3627030 3560947 3578114 3415488 3174644 3019201 2901106 2881209 2772625 2558775
2010B558775j61883j31304j27111q2905M2882j12865P883j38667m4949L2670j24253
$$ 2558775 2396892 2265588 2138477 2055572 2098454 1985589 1993472 1854805 1809856 1842526 1718273
1999A718273l5285K5807k7868j8747j01277p1890k368J6082m9198j27954j25890
$$ 1718273 1682988 1708795 1680927 1662180 1560903 1489013 1486645 1502727 1453529 1325575 1199685
1988A199685j21980J3830j61503O5317O9873o4879Q7432o1385l5134O3061P9677
$$ 1199685 1077705 1091535 930032 995349 1065222 1000343 1087775 1026390 991256 1054317 1133994
1977A133994q6235j7648J5481J9112L5472o3216m0890l238j4126j17067k7118
$$ 1133994 1047759 1030111 1045592 1064704 1100176 1036960 996070 992832 978706 861639 834521
1966H34521m5235J6055Q2936k8658l9625m0400m3291l2529M7258m9508k1423K3778
$$ 834521 789286 805341 888277 859619 819994 779594 736303 703774 751032 701524 680101 703879
1954G03879k5287j40907p5914J32651N2292q537P1981k0327q9152J4934j7427
$$ 703879 678592 537685 461771 594422 646714 638177 710158 689831 600679 615613 598186
1943E98186J4167p2338M875N7583j5271k5958n500j94759M9868n6074m8200J27407
$$ 598186 612353 540015 544890 602473 587202 561244 555744 360985 410853 354779 306579 433986
1931D33986m3621O4565l1742n2857O306k7566o6634M2264k5618k0217k38R0641
$$ 433986 390365 454930 423188 370331 376637 349071 282437 324701 299083 278866 278628 369269
1919C69269K9464l4535m2972l3161J03961K689o9675Q5285O633o9623O6505n2781
$$ 369269 398733 364198 321226 288065 392026 394715 325040 410325 416958 347335 413840 361059
1907C61059l8234K8424p9281l2553j2403n9406P9972o2899P1970k2912l4078K7475
$$ 361059 322825 351249 271968 239415 227012 167606 247578 184679 256649 233737 199659 227134
1895B27134L1942M1798k8883q271O533o1744L9798P7728m3342n673j5411q290
$$ 227134 259076 300874 271991 263720 270253 208509 248307 326035 282693 277020 261609 253319
1883B53319M0342J8656j62818M759O4207N4786j33311p642k0862j7267M8034L5380
$$ 253319 293661 312317 149499 154258 218465 273251 139940 132298 111436 94169 142203 177583
1871A77583K266M8880L9945J08809l0518j18088l5104J2985L1155L0266j12342
$$ 177583 179849 228729 268674 377483 346965 228877 193773 206758 237913 268179 155837
1860A55837q873K4170k3434K2481J09075O1476k16892R559J3425L4902J5825j1766
$$ 155837 146964 171134 147700 170181 279256 340732 123840 133399 146824 181726 197551 185785
1848A85785o7619L5401m8419q9573O2906Q9693N0360r4261m2167N276J5209n1681
$$ 185785 118166 153567 105148 15575 78481 168174 218534 124273 82106 87382 102591 50910
1836E0910O4789M4342n9526l7461Q3202N1228k2887K775n5635p1588p9035J95526
$$ 50910 115699 160041 100515 63054 146256 197484 174597 177372 121737 50149 -28886 166640
1824A66640N2937o2666p2352L5988m1685J15j3466M4476K7729N8844n7905j8061
$$ 166640 219577 156911 84559 120547 78862 78977 65511 109987 137716 196560 138655 120594
1812A20594M0657O0632L4590P9974J48497j07004O1700k18690q5793J26768j1855
$$ 120594 161251 221883 256473 336447 484944 377940 439640 220950 135157 261925 250070
1801B50070j783n8826k9023M1972m4826j25810M8075L3285L201k00091k8187P8989
$$ 250070 248287 189461 160438 202410 157584 31774 79849 113134 116335 -83756 -111943 -32954
1789c2954M4488J24305J7254m4498k8579R5341P2971J4847j67317j2188n5495
$$ -32954 11534 135839 153093 108595 80016 175357 248328 263175 95858 83670 28175
1778B8175M5524N907K7837K5320m8960Q95O7866J26324j31947j3704M153N7239
$$ 28175 73699 79606 107443 132763 83803 84698 152564 278888 146941 133237 137390 194629
1766A94629J6642o9181R3043k05382j2675J33124j49840J26666O4573k4931q6697
$$ 194629 211271 142090 235133 29751 17076 150200 360 127026 191599 166668 79971
1755G9971K0119O0064r2651m294L6324o1943l466R9073n9249m0193j9730o3645
$$ 79971 100090 160154 67503 63209 99533 37590 34124 133197 73948 33755 14025 -49620
1743d9620L1230J34778k5077j11380q8712R4805M8359k2K5363L433J09703r006
$$ -49620 -18390 116388 91311 -20069 -108781 -13976 34383 34361 59724 63157 172860 163854
1731A63854l7100n8908p3642p3307J20359R3279m8725K1807L0420l6844q0524
$$ 163854 126754 67846 -5796 -79103 41256 134535 85810 107617 138037 101193 20669
1720B0669O8842l2177J7657J3149j6233R5619l1995r8520M6381K1184j37919P2600
$$ 20669 89511 57334 74991 88140 71907 167526 135531 37011 83392 104576 -33343 39257
1708C9257j3926N8056j4175M0319P6860j55663j917j2105M9709K7022O2674j6564
$$ 39257 25331 83387 69212 109531 186391 30728 28811 16706 66415 93437 156111 139547
1696A39547j02037K3299j69679J96085L2837j76669N9887N3886M8947k5416L9501
$$ 139547 37510 60809 -108870 87215 120052 -56617 3270 57156 106103 80687 120188
1685A20188r6760p6844J49944K8837j5222N5294p2320Q3791j5215l2125j21552
$$ 120188 23428 -53416 96528 125365 110143 165437 93117 176908 161693 129568 8016
1674H016p1031J2702J19229J6399r2673P572k6370N1654M1743j06022J55837N2911
$$ 8016 -63015 -50313 68916 85315 -7358 214 -26156 25498 67241 -38781 117056 169967
1662A69967k48972M8183J13929J0495N2956q9888J028j8351P9896j6895L4711
$$ 169967 -79005 -30822 83107 93602 146558 56670 57698 39347 119243 102348 137059
1651A37059j04270p1824R521o4387Q2518j280N9024m456P020k3376K1670L5573
$$ 137059 32789 -39035 -29514 -93901 -11383 -12663 46361 41905 48925 25549 47219 82792
1639H2792l423P6131l2393o8563k237r2020n5399P7091R7518m5457N977P103j7400
$$ 82792 79369 155500 123107 54544 52307 -39713 -95112 -18021 79497 34040 40017 47120 29720
1626B9720M7487m6596q7415N1718j8286j0256P86J9583K6840Q2589p9606j05031
$$ 29720 77207 30611 -56804 -5086 -23372 -33628 -32842 -13259 13581 96170 16564 -88467
1614h8467Q4945J18058r5907p8840J5982O6963m1346l075J14563K5806J5881j30190
$$ -88467 -3522 114536 18629 -60211 -44229 22734 -18612 -21687 92876 118682 134563 4373
1602D373n9409J832J15866L1079p8881n16L7370q211k5536K5690j7036J27927
$$ 4373 -55036 -53204 62662 93741 14860 14344 51714 43503 17967 43657 26621 154548
1590A54548k1107q5867k4288q6558R0722n5823O0271q8679p3396M5679M3205N9371
$$ 154548 133441 47574 23286 -63272 27450 -28373 31898 -56781 -130177 -84498 -41293 18078
1578A8078q1712J15656k0176K7201l8747Q4529m4231n0097n680J7164j07139n5395
$$ 18078 -63634 52022 31846 59047 20300 104829 60598 10501 4821 21985 -85154 -140549
1566a40549O2323O3063K1984j77486K86857P2697n4952q905K238Q8895m1603k04071
$$ -140549 -78226 -15163 6821 -170665 116192 188889 133937 125032 127270 216165 174562 -29509
1554b9509N6303M6533p5359m5787k6306J67369r4973k2126Q6362k6602Q785J8620
$$ -29509 26794 73327 -2032 -47819 -74125 93244 -1729 -23855 62507 35905 44690 63310
1542F3310m7750J48085J17237j95068j12302p932R6529K5714r5807J93292k4390
$$ 63310 15560 163645 280882 85814 -26488 -34420 62109 87823 -7984 185308 160918
1531A60918q1494j6532N7915j2157o215j3001m5900q8527J7105M7080Q573p250
$$ 160918 79424 62892 120807 108650 102435 89434 43534 -44993 -27888 19192 27765 20515
1519B0515n3535J48847j24600q522L8940R2842j79138q779N5107l2208p435N910
$$ 20515 -33020 115827 -8773 -17295 21645 114487 -64651 -73430 -18323 -50531 -57966 -52056
1507e2056Q3247M6471P6046n5349l507q9122L9381L5076M7311l8480q2584L6537
$$ -52056 31191 77662 153708 98359 94852 5730 45111 80187 127498 89018 6434 42971
1495D2971j18476K5320P6384R312o272K9091K7265p0742P9727q4150k5565Q2056
$$ 42971 -75505 -50185 26199 35511 29239 58330 85595 14853 94580 10430 -15135 66921
1483F6921J0960r8721J1729R0902j1023m6791l8328k7765K5826k7617J36906J4650
$$ 66921 77881 -20840 -9111 81791 70768 23977 -14351 -42116 -16290 -43907 92999 107649
1471A07649q2099p8099J1557K8313Q6502J4947j17552R2676k8317p9617p4009
$$ 107649 25550 -52549 -40992 -12679 73823 88770 -28782 63894 35577 -44040 -118049
1460a18049L3947Q1076J0542J0793N0635k2936M7713N2004j8964o9199n4616p8855
$$ -118049 -84102 -3026 7516 18309 68944 46008 93721 145725 126761 57562 2946 -75909
1448g5909O7867j41813R942J94847n226M1526J7664j70234M6485l0584Q1968J43951
$$ -75909 -8042 -149855 -139913 54934 49708 91234 108898 -61336 -14851 -45435 36533 180484
1436A80484m1512n6049N1094q9782K3720j6159p1008N3643P120M6513n9838m8975
$$ 180484 138972 82923 134017 44235 67955 51796 -19212 34431 41551 88064 28226 -20749
1424b0749l5911p000N4397N2037n1248k8393O1914p0167k4594J93980j10804j64216
$$ -20749 -56660 -63660 -9263 42774 -8474 -36867 25047 -45120 -69714 124266 13462 -150754
1412a50754Q4858K0480J9011Q6638k5269l4081M8501q0471m4951K7075p2335k0700
$$ -150754 -65896 -45416 -26405 60233 34964 883 49384 -31087 -76038 -48963 -121298 -141998
1400a41998J11304j3216l0602J17569p7123m283J23013q5209j29306P0335N3425
$$ -141998 -30694 -43910 -74512 43057 -34066 -38349 84664 -545 -129851 -59516 -6091
1389f091j00077P1858r5092m045J03411K5110L5852R793j6055j11872K7095O5221
$$ -6091 -106168 -34310 -129402 -133447 -30036 -4926 30926 40719 24664 -87208 -60113 5108
1377E108k6739N5387m8812L334l5393J04677j9742r3300M3589l8001M0235n5567
$$ 5108 -21631 33756 -15056 -11722 -47115 57562 37820 -55480 -11891 -49892 -9657 -65224
1365f5224N8588l7380J09560P2987n3712j57516l133O2417R6429j12607K9493
$$ -65224 -6636 -44016 65544 138531 84819 -72697 -75830 -13413 83016 -29591 -98
1354i8M0530j39868O1152r104M4335K5873J3873r5885J0824J61085n7533n7938
$$ -98 40432 -99436 -38284 -47388 -3053 22820 36693 -59192 -48368 112717 55184 -2754
1342b754l7564r1738M3669N5207J3555J5268q2326m2238n673J60329K3428n7256
$$ -2754 -40318 -132056 -88387 -33180 -19625 -4357 -86683 -128921 -134594 25735 49163 -8093
1330h093l085l7655N4886n2225k4699P8586M331Q042K7471N0839k4400P0913j4175
$$ -8093 -11178 -48833 6053 -46172 -70871 7715 12046 20088 47559 98398 73998 144911 130736
1317A30736m5319j63346O1870j9674O7186J30p9140P9040j17224K8754J00060
$$ 130736 85417 -77929 -16059 -35733 31453 31583 -47557 31483 -85741 -56987 43073
1306D3073q3628j3998J6542J11983l4029M8029o4028n6399r3136N0911J35422
$$ 43073 -40555 -54553 -38011 73972 39943 87972 23944 -32455 -125591 -74680 60742
1295F0742N7461L3365j29800k9277m2852n9955J26235M1838l6697J0312j4022
$$ 60742 118203 151568 21768 -7509 -50361 -110316 15919 57757 21060 31372 17350
1284A7350n1720k1749J87502q1705J8114K9831l3350l7365o010p1012J7173p3531
$$ 17350 -34370 -56119 131383 49678 67792 97623 64273 26908 20898 -50114 -32941 -106472
1272a06472K5690L2623Q8185l5961l2335m9609O1520J23533j29756o5144J58994
$$ -106472 -80782 -48159 40026 4065 -28270 -77879 -16359 107174 -22582 -87726 71268
1261G1268K423n1750p2687j6275p0177M4015k9289J00427N6220k1614j9671J02511
$$ 71268 73691 21941 -50746 -67021 -137198 -93183 -122472 -22045 34175 12561 -7110 95401
1249I5401J2193o3340q2785k5126K8843k079O7762o1919J08730L3716j25672p1974
$$ 95401 107594 44254 -38531 -63657 -34814 -36893 30869 -31050 77680 111396 -14276 -86250
1237h6250J5085J54215n5707j25761m2430J9507M6436m035o207n7425N4829R303
$$ -86250 -71165 83050 27343 -98418 -140848 -121341 -74905 -78940 -85147 -142572 -87743 -78440
1225g8440J25166O584j07859J0645P0431p0956j06541J46365J9407J4910k1547
$$ -78440 46726 53310 -54549 -43904 26527 -44429 -150970 -4605 14802 29712 8165
1214H165q9164K2594J7238j2867j0226J9087M1830J5723q1836q6253J1027R9241
$$ 8165 -80999 -58405 -41167 -54034 -64260 -45173 -3343 12380 -69456 -155709 -144682 -45441
1202d5441p029K2505R0067q9958k8216J01343r571J913M9892p0201n1721m3508
$$ -45441 -52470 -29965 60102 -29856 -58072 43271 33700 35613 85505 15304 -36417 -79925
1190g9925M464j7621J12165Q1282j51525Q9045J39698M146j11278n2214L2408
$$ -79925 -75461 -93082 19083 100365 -51160 37885 177583 181729 70451 18237 50645
1179E0645L3095p5475m3220R7673J14073n8385j32263j10175J94253k8906p9065
$$ 50645 83740 8265 -34955 62718 176791 118406 -13857 -124032 70221 41315 -37750
1168c7750q5540P1630J68561r1450K2143l6805j707J31506o3111l2347q5008n2305
$$ -37750 -123290 -51660 116901 25451 47594 10789 9082 140588 77477 45130 -39878 -92183
1156i2183N3146M4630o3178q5555k0721K6943j2928O9494P6937q5423N8480K8333
$$ -92183 -39037 5593 -57585 -143140 -163861 -136918 -149846 -80352 -3415 -88838 -30358 -2025
1144b025J5831m0545p6870J24781o3631j4031Q27J02076R4726o5863j7646m4038
$$ -2025 13806 -26739 -103609 21172 -42459 -56490 -55663 46413 141139 75276 57630 13592
1132A3592M4178n1287r4788J32662m9830m3950R346k6223J82688n0158j04117
$$ 13592 57770 6483 -88305 44357 -5473 -49423 -40077 -66300 116388 66230 -37887
1121c7887O15R2086J9913m7831j24454l3291J18184l9023L1962k6543l2086m805
$$ -37887 -37272 54814 74727 26896 -97558 -130849 -12665 -51688 -19726 -46269 -78355 -83160
1109h3160K1887R0479K027k3466j6131j7538J4791n7450o9865J32997j00090N2261
$$ -83160 -61273 29206 31233 7767 -8364 -25902 -11111 -68561 -138426 -5429 -105519 -53258
1097e3258P4914o836j21191k5891J14986k8530k5164M5830L7239J2119O7087o606
$$ -53258 21656 14820 -106371 -132262 -17276 -45806 -70970 -25140 12099 24218 91305 84699
1085H4699m6132N5594l2175m4328l4054N2314J6282q6991m4011L0113m6121K495
$$ 84699 38567 94161 61986 17658 -16396 35918 52200 -34791 -78802 -48689 -94810 -92315
1073i2315J00903J04141m7960m759L5054p8375J3590k3610k0133L9992k2235n3520
$$ -92315 8588 112729 64769 60010 95064 16689 30279 6669 -13464 26528 4293 -49227
1061d9227K01558j0450j46272k1565l8690L3312Q8966j24376l5675K24719M9243
$$ -49227 152331 141881 -4391 -25956 -64646 -31334 57632 -66744 -102419 122300 171543
1050A71543m5319j02137m9080J46630n0055j8386p7960o4757P8264k3512J0499
$$ 171543 126224 24087 -24993 121637 71582 53196 -24764 -89521 -11257 -34769 -24270
1039b4270R2275r727p2669j8943r019o8605n065m5716J7685J40308O5942l7738
$$ -24270 68005 58278 -14391 -33334 -42353 -110958 -116023 -161739 -144054 -3746 62196 24458
1027B4458m6008m6429M2363j1820l9166r420m7523R9979M845m5968l7042j5348
$$ 24458 -21550 -67979 -25616 -37436 -76602 -86022 -133545 -33566 -28721 -74689 -111731 -127079
1015a27079p7774J34840J35947n2685j6658o3369m1929O8901J635O332q434O7268
$$ -127079 -204853 -70013 65934 13249 -3409 -66778 -108707 -39806 -38171 -31839 -40273 26995
1003B6995P5049r1888J6438p1318N902R905K4287k4998K4643R121P9829n5970
$$ 26995 102044 10156 26594 -44724 -38822 -28917 -4630 -29628 -4985 4136 83965 27995
991B7995r5780k9720l8704p7489o6024J68390M2003l8871J7329J37270r3010J19201
$$ 27995 -67785 -97505 -136209 -213698 -279722 -111332 -69329 -108200 -90871 46399 -46611 72590
979G2590k3179q6993m7488j7312L9920J02987l0488q9383j4224J18868p9311J6696
$$ 72590 49411 -37582 -85070 -102382 -62462 40525 10037 -79346 -93570 25298 -54013 -37317
967c7317M3044q9727j5000K6853O0540L317M8649q3099L0190q5201o4032J38189
$$ -37317 5727 -84000 -99000 -72147 -11607 -8290 40359 -42740 -12550 -97751 -161783 -23594
955b3594K2923O3965n4720o4708P5759J1742R6473r7335p7009P0196o526j06813
$$ -23594 -671 63294 8574 -56134 19625 31367 127840 30505 -46504 23692 17166 -89647
943h9647j6517n0864K6613O9996O0911M1820p1209M7544Q14K4901n1346m3088
$$ -89647 -106164 -157028 -130415 -60419 492 42312 -28897 18647 19461 44362 -6984 -50072
931e0072k7216j9844Q7372J6536J1598Q6055j37923M0311k7851P7466q69o3785
$$ -50072 -77288 -97132 -9760 6776 18374 104429 -33494 6817 -21034 56432 55563 -8222
919h222J00459l5192K098Q861l3652r3216J04290J350L8141L143n0137m1295K7910
$$ -8222 92237 57045 59143 68004 34352 -58864 45426 46776 84917 88060 37923 -3372 24538
906B4538R268Q2770j03841M2590r8433J5842J28462l5328o4603R1925r1243L0627
$$ 24538 33806 116576 12735 55325 -43108 -27266 101196 65868 1265 93190 1947 32574
894C2574L2381o911k7517o6311m5995k2164P7397J5768L7672M6460r9798r378
$$ 32574 64955 58044 30527 -35784 -81779 -103943 -26546 -10778 26894 73354 -26444 -35822
882c5822l2629L6350J00987k1633l86p185q7474o6013K20336n2893p2703m694
$$ -35822 -68451 -32101 68886 47253 46867 39682 -47792 -113805 106531 53638 -19065 -23759
870b3759M5674q4894K5853N5680k2750k3805N8797O3725k3352J086J06912j03000
$$ -23759 21915 -62979 -37126 18554 -4196 -28001 30796 94521 71169 72255 179167 76167
858G6167o6099J3291Q2617k1610j16816j3658j2961M0840q7821k7533R6934n0853
$$ 76167 10068 23359 105976 84366 -32450 -46108 -59069 -18229 -106050 -133583 -36649 -87502
846h7502l7834P9672L7182J1954P5904P9671l5282q4957j58359J391l5471N5585
$$ -87502 -125336 -45664 -8482 3472 79376 159047 123765 38808 -119551 -118160 -153631 -98046
834i8046N0157m4489O9130O322j9747L1993N1733j02313l5940K16613K5290m469
$$ -98046 -47889 -92378 -23248 -16926 -36673 -4680 47053 -55260 -91200 125413 150703 146234
822A46234o9717j59077p160L9242J27827j13782p4110J16482L3159L6399n4443
$$ 146234 76517 -82560 -89720 -50478 77349 -36433 -110543 5939 39098 75497 21054
811B1054k8537Q0713r9199j1275l9943Q448l9154Q4622J35331n9496p2185j2293
$$ 21054 -7483 73230 -25969 -37244 -77187 -68739 -107893 -23271 112060 52564 -19621 -31914
799c1914p2725m1958J25859R240M9989p3864L9828n4749O7979l1510q1376J28684
$$ -31914 -104639 -146597 -20738 -11498 38491 -35373 4455 -50294 17685 -13825 -95201 33483
787C3483m4621K8967m6053J12577O4442r5633q0224o4281p4826K21291l732l0015
$$ 33483 -11138 17829 -28224 84353 148795 53162 -27062 -91343 -166169 55122 51390 21375
775B1375k8732R4043j3323p0353k2907M2479L2870L448p2403m2935J02634q0174
$$ 21375 -7357 86686 73363 3010 -19897 22582 55452 58900 -13503 -56438 46196 -33978
763c3978M0899Q5719k7307n1138J05034o8180R0703k9366n9509l9746j6155p4485
$$ -33978 6921 92640 65333 14195 119229 51049 141752 112386 52877 13131 -3024 -77509
751g7509M840n0385m4690n5418M0891L6207L3576J5359j3024J49433J00760p2035
$$ -77509 -72669 -123054 -167744 -223162 -182271 -146064 -112488 -97129 -110153 39280 140040 68005
739F8005r5618L647J344j02687J19147N4284n0988Q5181o4132P1044l7444j36071
$$ 68005 -27613 -23966 -22622 -125309 -6162 48122 -2866 82315 18183 89227 51783 -84288
727h4288l3514K7011M893k2779J06517k2540l3063k9063K1767O4171m7642J3740
$$ -84288 -117802 -90791 -85898 -108677 -2160 -24700 -57763 -86826 -65059 -888 -48530 -34790
715c4790P1003j7834j2797O3813M5674j13784q5578R061L0074M9116p0033J04640
$$ -34790 36213 18379 5582 69395 115069 1285 -84293 -75232 -45158 3958 -66075 38565
703C8565m242P939m4403k7544m0222J5481l9053N2475m301J3938K044q7723k5480
$$ 38565 34323 42262 -2141 -29685 -69907 -54426 -93479 -41004 -45305 -31367 -29323 -117046 -142526
690a42526J13180M6855K0519K4265p061p0349M0338Q673o6757r6434M9628Q7545
$$ -142526 -29346 17509 38028 62293 55232 -15117 25221 33894 -32863 -129297 -79669 7876
678G876k952k6964k7462m8837J4125O1959q3306N2190k6006O5012k3822n4021
$$ 7876 4924 -22040 -49502 -98339 -84214 -22255 -105561 -53371 -79377 -14365 -38187 -92208
666i2208J16067k7308M1801R209j57828J26854q298Q6421r5745j48307J66217
$$ -92208 23859 -3449 38352 47561 -110267 16587 8289 94710 -1035 -149342 16875
655A6875O4386j69378N9167K6692m4087L612L2619Q694M980k0818P9836o4280
$$ 16875 81261 -88117 -28950 -2258 -46345 -42733 -10114 -1420 3560 -17258 62578 -1702
643a702R6408k572q2481m1627Q3100K617L0523j20186j21483J22923J3000J7723
$$ -1702 94706 92134 9653 -31974 51126 53743 84266 -35920 -157403 -34480 -21480 -3757
631c757r51k4555o7679N49O2634J10050L9524n026l1918n13j5033j761K4105R8709
$$ -3757 -4708 -29263 -96942 -96393 -33759 76291 115815 110789 78871 78358 63325 61564 85669 184378
617A84378n8198j19128J577m7084l8300J12636k3235N2944q5252j4054J4624M544
$$ 184378 126180 7052 8629 -38455 -76755 35881 12646 65590 -19662 -33716 -19092 -14548
605a4548l3947R095o384O3985q6938O6313m9142p0154O4083m2395R731q9870O7929
$$ -14548 -48495 -39400 -45784 18201 -68737 -2424 -51566 -121720 -57637 -100032 -90301 -180171 -112242
592a12242R4769j3700P5906P4113l44j06153p0785L9080K5704O4296m1124j21279
$$ -112242 -17473 -31173 44733 118846 118502 12349 -58436 -19356 6348 70644 29520 -91759
580i1759l1861O208j8722L9455L1342k0703P3382N752O3092j1232K8501K3830
$$ -91759 -123620 -117412 -136134 -96679 -65337 -86040 -12658 -6906 56186 44954 73455 97285
568I7285q3342J35802K8959q6723j31663J6963N1994N3827j3646J07072j18504
$$ 97285 13943 149745 178704 91981 -39682 -22719 29275 83102 69456 176528 58024
557E8024r3894j4219q160M3595j844j05478J43929Q0805J1748o762j00089o9417
$$ 58024 -35870 -50089 -58249 -14654 -16498 -121976 21953 102758 114506 107744 7655 -61762
545f1762R6702m7649n5609J50046l3299O099K3932l8419R817j450j2463n9163
$$ -61762 34940 -12709 -68318 81728 48429 54528 78460 40041 49858 48408 35945 -23218
533b3218p9926Q1575o2677p541k9560m8386P6232O2588r3989R0568P2344P6242
$$ -23218 -103144 -21569 -84246 -91787 -121347 -169733 -93501 -30913 -124902 -34334 38010 114252
521A14252m2255l9059M2069P9906j03639p1090Q140k1545r8015M7165L3021p0214
$$ 114252 71997 32938 75007 154913 51274 -19816 -11676 -33221 -131236 -84071 -51050 -121264
509a21264L4922J2706M8460o0812P5588r226p3647J5101N8586M3546N8276j19512
$$ -121264 -86342 -73636 -25176 -85988 -10400 -19626 -93273 -78172 -19586 23960 82236 -37276
497c7276j85747Q4685P8914k4257l6259J27065m2247j32043L3522M1988P0584
$$ -37276 -223023 -138338 -59424 -83681 -119940 7125 -35122 -167165 -133643 -91655 -21071
486b1071l2917L4759n3184o416Q1144p1819J62025k3828m0212J9246o9167j03142
$$ -21071 -53988 -19229 -72413 -78829 2315 -69504 92521 68693 28481 47727 -21440 -124582
474a24582Q4789l4283K8114o3603J4309P8913k4670N9202r3831j19295L0226J24033
$$ -124582 -39793 -74076 -45962 -109565 -95256 -16343 -41013 18189 -75642 -194937 -164711 -40678
462d0678k0727O6610j1580m8483N3792m1908O0220J01900j35368K344P962Q740
$$ -40678 -61405 5205 -6375 -54858 -1066 -42974 17246 119146 -16222 -13878 -5916 2824
450B824j554Q2816J1491k6147q4881j4025P6861p470m5793L8552Q203j59520m6176
$$ 2824 1270 84086 95577 69430 -15451 -29476 47385 39915 -5878 32674 40877 -118643 -164819
437a64819M5617k8544J32623k0262q4144m9800l9213J02026R5068p781L0519O1781
$$ -164819 -119202 -147746 -15123 -35385 -119529 -169329 -208542 -106516 -11448 -19229 11290 73071
425G3071j9264k9875m0426K4761n460j41558M2063l8321J03023P9391k7407n5515
$$ 73071 53807 23932 -16494 8267 2807 -138751 -96688 -135009 -31986 47405 19998 -35517
413c5517j6280Q7287n9745l0447J446o7891L7945P6616j11831M9574J59487l8627
$$ -35517 -51797 35490 -24255 -54702 -53256 -121147 -83202 -6586 -118417 -68843 90644 52017
401E2017j03875J2977M6252n6065k0315K0572J49777j07181n6964O272m5835k677
$$ 52017 -51858 -38881 7371 -48694 -69009 -48437 101340 -5841 -62805 -56533 -102368 -105045
389a05045N7986R565l8742M4888N6944P5422o4179n381q7840n4094Q2301O3216
$$ -105045 -47059 -37494 -76236 -31348 25596 101018 36839 31458 -56382 -110476 -28175 35041
377C5041q9417J803n8658k6693Q4735O1994l5308q4418L1060O9477n6893K1689
$$ 35041 -54376 -52573 -111231 -137924 -53189 8805 -26503 -110921 -79861 -10384 -67277 -45588
365d5588L5940q8136m0747P9854P7411R368N5712m9181l3208l5399k7093O1978
$$ -45588 -9648 -97784 -138531 -58677 18734 28102 83814 34633 1425 -33974 -61067 911
353I11j9297Q5321K7024j56769J32154K0062q5465q6303p8900J89179m3878m8941
$$ 911 -18386 66935 93959 -62810 69344 89406 3941 -82362 -161262 27917 -15961 -64902
341f4902J40185m2806m3823m0995K0198L0308q8069j9640J2344J07888q9062m6386
$$ -64902 75283 32477 -11346 -52341 -32143 -1835 -89904 -109544 -97200 10688 -78374 -124760
329a24760J08244m1447P026n9513R3839M4462j15757Q065p4523J09625j0462J4279
$$ -124760 -16516 -57963 -50937 -110450 -16611 27851 -87906 -79841 -154364 -44739 -55201 -40922
317d0922j5684M9241l546k4564j4079j3571l5747k7970n8978K6264m0374P9695
$$ -40922 -56606 -7365 -10911 -35475 -49554 -63125 -98872 -126842 -185820 -159556 -199930 -120235
305a20235J56969o3802J7535n7892l0124J78113O802j04855m1048O0866N7531
$$ -120235 36734 -27068 -9533 -67425 -97549 80564 87366 -17489 -58537 2329 59860
294E9860p3734K2792O2427j02372k3893j45588M6621J44063p6321k0172N7872
$$ 59860 -13874 8918 71345 -31027 -54920 -200508 -153887 -9824 -86145 -106317 -48445
283d8445O0779M7047q4908m4354j4928n6529R9082K628m6114K2867O3610o1194
$$ -48445 12334 59381 -25527 -69881 -84809 -141338 -42256 -39628 -85742 -62875 735 -60459
271f0459J7934J826P953k5593P184l5197L5692j0814k3333J02840j02580M2252
$$ -60459 -42525 -40699 -32746 -58339 -51155 -86352 -50660 -61474 -84807 18033 -84547 -42295
259d2295k6142j5518k4281O0786O5387q8713M2837j0901O4086L6767J08160j08349
$$ -42295 -68437 -83955 -108236 -47450 17937 -70776 -27939 -38840 25246 62013 170173 61824
247F1824j58974Q186L7013m6870O0837p0523M2730o0235l4171o703l6355J22593
$$ 61824 -97150 -88964 -51951 -98821 -37984 -108507 -65777 -126012 -160183 -166886 -203241 -80648
235h0648J57725M8381j04032k7169n8255K0247J14497j1225j13666O4171Q018
$$ -80648 77077 125458 21426 -5743 -63998 -43751 70746 59521 -54145 10026 18044
224A8044Q186l5948j2812M1347o6045L2570j12929R2102P368j9422m5536j033
$$ 18044 26230 -9718 -22530 18817 -47228 -14658 -127587 -35485 -28117 -47539 -93075 -94108
212i4108N2367J319j579N6433K6245j5103l3548j33373j8247L1645Q2721Q6064
$$ -94108 -41741 -40422 -42001 14432 40677 25574 -7974 -141347 -159594 -127949 -45228 40836
200D0836k8179m9796k0294l6925L8236N4136j3324r1901N6000L5491l4415p2247
$$ 40836 12657 -37139 -57433 -94358 -56122 -1986 -15310 -107211 -51211 -15720 -50135 -122382
188a22382N6619J65325m3932k9877k246m9986o982P4592o0879j5917K7820M0358
$$ -122382 -65763 99562 55630 25753 23507 -26479 -33461 41131 -19748 -35665 -7845 32513
176C2513j00659P1882J33933j73234K1284J1811j58438l2000N6713j9601N5398
$$ 32513 -68146 3736 137669 -35565 -14281 -2470 -160908 -192908 -136195 -155796 -100398
165a00398p778l9987o1104J55392K7579O6595o8321Q6846n7600k1225n6614L2712
$$ -100398 -108176 -148163 -209267 -53875 -26296 40299 -28022 58824 1224 -20001 -76615 -43903
153d3903L2819o9703L4390J3943Q4940j45703p3698k423Q317J4746N2673k89R8221
$$ -43903 -11084 -80787 -46397 -32454 52486 -93217 -166915 -169338 -161021 -146275 -93602 -93891 4330
140D330k5732j02794Q598j102L1630M7682l9667J13833r487p1757P2825j07098
$$ 4330 -21402 -124196 -115598 -116700 -85070 -37388 -77055 36778 27291 -44466 28359 -78739
128g8739k6444K7540o3706j6884O7679L4540r71Q528l1324N3777q1260N7404K3390
$$ -78739 -105183 -77643 -141349 -158233 -90554 -56014 -56985 -48457 -79781 -26004 -107264 -49860 -26470
115b6470j0007P3251k4500j26411j1924L2446L3883O1572J931j6263j05243l037
$$ -26470 -36477 36774 12274 -114137 -126061 -93615 -59732 1840 3771 -12492 -117735 -120772
103a20772O0397L7933J3056M7557Q667k5976o9866l9197q6566K6796J8363N73
$$ -120772 -60375 -22442 -9386 38171 46838 20862 -49004 -88201 -174767 -147971 -129608 -129035
91a29035J4566P5202J9422K8032l7477K7356j4677r7821O4560k2783L5585K4432
$$ -129035 -114469 -39267 -19845 8187 -29290 -1934 -16611 -114432 -49872 -72655 -37070 -12638
79a2638n9245k2065m3252R0078N6649M7580n4002q587r2816O6497M6215o9081
$$ -12638 -71883 -93948 -137200 -47122 9527 57107 3105 -5482 -98298 -31801 14414 -54667
67e4667P5603p6493J3499j4111n8466k3870J25537j1659l8633J237P0554N6K753
$$ -54667 20936 -55557 -42058 -56169 -114635 -138505 -12968 -24627 -63260 -62023 8531 8587 11340
54A1340n8069j6308L3273P2876J08405j28636q0648M2495k6595p6361K340L1504
$$ 11340 -46729 -63037 -29764 43112 151517 22881 -57767 -15272 -41867 -118228 -115888 -84384
42h4384K0211M50O7992n7110q6070P217l1641M7496m5005N5274Q2326n128l8348
$$ -84384 -64173 -63723 4269 -52841 -138911 -131694 -163335 -115839 -160844 -105570 -23244 -28372 -66720
29f6720k9305J5751M2252m9926N7301P638j8M7401j35980j1692j1832N3245o785
$$ -66720 -96025 -80274 -38022 -87948 -30647 -23009 -23027 24374 -111606 -123298 -135130 -81885 -88670
16h8670M2574Q4304o6949r662o183n2392L3965J8843p3290O7698Q852k7111M3767
$$ -88670 -46096 38208 -28741 -38403 -44586 -96978 -63013 -44170 -117460 -49762 -40910 -68021 -24254
3b4254n2974P860N4147
$$ -24254 -77228 -69368 -15221
0a5221
$$ -15221
$$ Imaginary data points
##PAGE= N=2
##DATA TABLE= (X++(I..I)), XYDATA
16383c407630L6906J559N1177N8113m9353R3124O7487M1195J47563R7309P260
$$ -3407630 -3370724 -3369165 -3317988 -3259875 -3309228 -3216104 -3148617 -3107422 -2959859 -2862550 -2855290
16372b855290K5100J5780K8383K9422O9548J01280L6846k9112L9725K2520j323
$$ -2855290 -2830190 -2814410 -2786027 -2756605 -2687057 -2585777 -2548931 -2578043 -2538318 -2515798 -2517121
16361b517121p791J10740R4951M8455P5537Q7805K4111K3757N7210r9501J48526
$$ -2517121 -2524912 -2414172 -2319221 -2270766 -2195229 -2107424 -2083313 -2059556 -2002346 -2101847 -1953321
16350a953321L1198J41528N1377K2995j22586O5579N5281J11836N5686p796N8445
$$ -1953321 -1922123 -1780595 -1729218 -1706223 -1828809 -1763230 -1707949 -1596113 -1540427 -1548223 -1489778
16339a489778R1398m987k5740K3675Q1607J11773N6500P669M0148P8154p0821
$$ -1489778 -1398380 -1403367 -1429107 -1405432 -1323825 -1212052 -1155552 -1147883 -1107735 -1029581 -1100402
16328a100402J11501J7650j1724L4586J01920O5665L87n4685J30721N0810P9886
$$ -1100402 -988901 -971251 -982975 -948389 -846469 -780804 -780417 -835102 -704381 -653571 -573685
16317e73685L9607K3101N6673P3254n379R2337P1829L954j3513N0954N4844k101
$$ -573685 -534078 -510977 -454304 -381050 -386429 -294092 -222263 -218309 -231822 -180868 -126024 -128125
16305a28125k0967L5027K5517L4510K1355r480R5814P7603J59061n783J0395j10831
$$ -128125 -149092 -114065 -88548 -54038 -32683 -42163 53651 131254 290315 284532 294927 184096
16293A84096L3355J58645k8832J41497M7224P722L6598J02426L7143j8257L8496
$$ 184096 217451 376096 347264 488761 535985 543707 580305 682731 719874 701617 740113
16282G40113q8286J05791j7355J02038O9520Q400p930j3557j042j7118Q8057Q0853
$$ 740113 651827 757618 740263 842301 911821 920221 912291 898734 897692 880574 968631 1049484
16270A049484j3792L1310Q7845K2775N2217p1608K7273J22134n1672J1169J15857
$$ 1049484 1035692 1067002 1154847 1177622 1229839 1158231 1185504 1307638 1255966 1267135 1382992
16259A382992L1959K7648K8183j6961j9115O9132N2469J0043J021J04314K4724
$$ 1382992 1414951 1442599 1470782 1453821 1434706 1503838 1556307 1566350 1567371 1671685 1696409
16248A696409J6398M3082m2090j24041J12682O8863M5533m0976J20424k3240R223
$$ 1696409 1712807 1755889 1713799 1589758 1702440 1771303 1816836 1775860 1896284 1873044 1882267
16237A882267J13949n7390J44877K9994k1498j5739j39856K3522J23467J3927
$$ 1882267 1996216 1938826 2083703 2113697 2092199 2076460 1936604 1960126 2083593 2097520
16227B097520N4156R1622P0378j51175J53117l301Q8345l4582k8165K0366M2881
$$ 2097520 2151676 2243298 2313676 2162501 2315618 2312317 2400662 2366080 2337915 2358281 2401162
16216B401162N3121k9493N5722O1798m6241K5723L9694M92J16568m3992J1140
$$ 2401162 2454283 2424790 2480512 2542310 2496069 2521792 2561486 2561978 2678546 2634554 2645694
16205B645694R8132j8391j29277M5789j2503Q7665J12846q500L6517O3727r8879
$$ 2645694 2743826 2725435 2596158 2641947 2629444 2717109 2829955 2821455 2857972 2921699 2822820
16194B822820m258R2808l8023k1446J1307N5582M6636k682q2095p553k1448l7428
$$ 2822820 2818562 2911370 2873347 2851901 2863208 2918790 2965426 2962744 2880649 2873096 2851648 2814220
16182B814220J83769m4382Q365N401k8516Q3699O1621J5835n2828Q184K7783m4532
$$ 2814220 2997989 2953607 2961972 2967373 2938857 3022556 3084177 3100012 3047184 3055368 3083151 3038619
16170C038619N79O4502K4207Q2114J04429q8222j21585M5080o0724n0439R3681
$$ 3038619 3039198 3103700 3127907 3210021 3314450 3226228 3104643 3149723 3088999 3038560 3132241
16159C132241R0680o266M9696N220k7570P0453O0604q058j69277O7908J09708
$$ 3132241 3222921 3216655 3266351 3271571 3244001 3314454 3375058 3367000 3197723 3265631 3375339
16148C375339L2375K1675j10147n1279J40949K3678Q087L833k19422M9589J13156
$$ 3375339 3407714 3429389 3319242 3267963 3408912 3432590 3440677 3444510 3225088 3274677 3387833
16137C387833l0913R3475j7545k1447k292q3712m011Q8385K9511j6918J32192
$$ 3387833 3356920 3450395 3432850 3411403 3409111 3325399 3321388 3409773 3439284 3422366 3554558
16126C554558J21298n4140p0079O2108N8121r3723j6492j02846r4495Q3764N5662
$$ 3554558 3675856 3621716 3551637 3613745 3671866 3578143 3561651 3458805 3364310 3448074 3503736
16115C503736J8018n5701r6922O3243J03411J6167k478j545J0046N8284l686r2568
$$ 3503736 3521754 3466053 3369131 3432374 3535785 3551952 3549474 3547929 3557975 3616259 3612573 3520005
16103C520005P2700n9735J6289O144P06k1450N5584o816j40396J08191k5851k5427
$$ 3520005 3592705 3532970 3549259 3555403 3556109 3534659 3590243 3583427 3443031 3551222 3525371 3499944
16091C499944N6602L6455J5285n6056J21972M3234j04955m9773J7560J08441j00083
$$ 3499944 3556546 3593001 3608286 3552230 3674202 3717436 3612481 3562708 3580268 3688709 3588626
16080C588626r5943J42035P440l8460K4670n8596j5674Q6338L9090J2644j8586
$$ 3588626 3492683 3634718 3642158 3603698 3628368 3569772 3554098 3640436 3679526 3692170 3673584
16069C673584J47971j53095k2134J0393N3286O0416m5762k0126k6219J08390j6845
$$ 3673584 3821555 3668460 3646326 3656719 3710005 3770421 3724659 3704533 3678314 3786704 3769859
16058C769859l1385q391n2768k5351R4775K5815j6763l9671k5275K3025M1575
$$ 3769859 3738474 3730083 3677315 3651964 3746739 3772554 3755791 3716120 3690845 3713870 3755445
16047C755445r2994M0618o3232j7181J10781m3370n524j2249j5506Q6224l0186
$$ 3755445 3662451 3703069 3639837 3622656 3733437 3690067 3684543 3672294 3656788 3743012 3712826
16036C712826p6658m8267R2213R5312j12245P6088K296k2671K2385K27Q6383j361
$$ 3712826 3636168 3587901 3680114 3775426 3663181 3739269 3741565 3718894 3741279 3741506 3827889 3826528
16024C826528r6991n9907J16000k83k5479K1508j82p1467M8660O1791l6720k1243
$$ 3826528 3729537 3669630 3785630 3785347 3759868 3781376 3781194 3709727 3758387 3820178 3783458 3762215
16012C762215O5998j7025k0896j46818K8463N2835j9155o176R9013r6454n4987
$$ 3762215 3828213 3811188 3790292 3643474 3671937 3724772 3705617 3699441 3798454 3702000 3647013
16001C647013J17999k2900j7148n2200M9980r1896j17021J07889J25809q8916
$$ 3647013 3765012 3742112 3724964 3672764 3722744 3630848 3513827 3621716 3747525 3658609
15991C658609m3919K1725J47370j7006m7443k4422P052m8919O5661j8706P8155
$$ 3658609 3614690 3636415 3783785 3766779 3719336 3694914 3701966 3653047 3718708 3700002 3778157
15980C778157o5399l0920n144j05720K9297O7344J08953L8133O0965M2153m2399
$$ 3778157 3712758 3681838 3676694 3570974 3600271 3667615 3776568 3814701 3875666 3917819 3875420
15969C875420k209o5547l1902o2375q1275R7578N6352K8374M3549O0556r4760
$$ 3875420 3873211 3807664 3775762 3713387 3632112 3729690 3786042 3814416 3857965 3918521 3823761
15958C823761p7259q1184N2609J4567R806K30363j76573r1481m0797j9762O0847
$$ 3823761 3746502 3665318 3717927 3732494 3742300 3972663 3796090 3704609 3663812 3644050 3704897
15947C704897Q1367R990j0908q999p133n2158O958j8603p8758R0195n4941M5253
$$ 3704897 3786264 3796254 3785346 3776347 3769214 3717056 3724014 3705411 3626653 3716848 3661907 3707160
15935C707160K9521j8540l150n29P887J7735J7524m4190j10918O3274N1268j2069
$$ 3707160 3736681 3718141 3714991 3714462 3722349 3740084 3757608 3713418 3602500 3665774 3717042 3704973
15923C704973K0197R9365o2981K3988p1069N3548q1578J7082l2596O8858q8769
$$ 3704973 3725170 3824535 3761554 3785542 3714473 3768021 3686443 3703525 3670929 3739787 3651018
15912C651018O5930R0002q1239K3867j456o6496J40538l5687p7989M7109p879
$$ 3651018 3716948 3806950 3725711 3749578 3748122 3681626 3822164 3786477 3708488 3755597 3747718
15901C747718P6384q6285p3678k9950J75429r0372M2342M1896N6276n2688N6505
$$ 3747718 3824102 3737817 3664139 3634189 3809618 3719246 3761588 3803484 3859760 3807072 3863577
15890C863577r3419N163R7895k1880M3922k5373m4967l0411j6589M7946j45980
$$ 3863577 3770158 3775321 3873216 3851336 3895258 3869885 3824918 3794507 3777918 3825864 3679884
15879C679884Q7676J04650j09105j2914M1388k6122k5203J15810p224r7167m1951
$$ 3679884 3767560 3872210 3763105 3750191 3791579 3765457 3740254 3856064 3848840 3751673 3709722
15868C709722j07697M0556J21956K1051K1880j1595r6859K6115Q6413j8201M9842
$$ 3709722 3602025 3642581 3764537 3785588 3807468 3795873 3699014 3725129 3811542 3793341 3843183
15857C843183q3296N983j2094k8443M4379J45637o4508L0063l3095j00544N6146
$$ 3843183 3759887 3765870 3753776 3725333 3769712 3915349 3850841 3880904 3847809 3747265 3803411
$$ [...]
##END NTUPLES=NMR SPECTRUM
##END=
