##TITLE=1H_CG-1150-8a
 CDCl3
 8 sc, 
 24.9.2023
##JCAMPDX= 6.0         $$ Bruker NMR JCAMP-DX V2.0
##DATA TYPE= NMR SPECTRUM
##DATA CLASS= NTUPLES
##ORIGIN= UXNMR, Bruker Analytische Messtechnik GmbH
##OWNER= root
$$ XWIN-NMR		Version 3.5
$$ Mon Sep 25 13:53:08 2023 Russian Standard Time (UT+4h)  she@DPX200
##.OBSERVE FREQUENCY= 200.13135
##.OBSERVE NUCLEUS= ^1H
##.ACQUISITION MODE= SIMULTANEOUS
##.ACQUISITION SCHEME= undefined
##.AVERAGES= 8
##.DIGITISER RES= 18
##SPECTROMETER/DATA SYSTEM= spect
##.PULSE SEQUENCE= zg30
##.SOLVENT NAME= CDCl3
##.SHIFT REFERENCE= (INTERNAL, CDCl3, 0, 15.7337)
##AUDIT TRAIL= $$ (NUMBER, WHEN, WHO, WHERE, WHAT)
$$ ##TITLE= Audit trail, XWIN-NMR		Version 3.5
$$ ##JCAMPDX= 5.01
$$ ##ORIGIN= Bruker BioSpin GmbH
$$ ##OWNER= she
$$ F:/spectra/data/she/nmr/H-F/1/pdata/1/auditp.txt
$$ ##AUDIT TRAIL=  $$ (NUMBER, WHEN, WHO, WHERE, WHAT)
(   1,<2023-09-25 13:51:47.04 +0400>,<she>,<DPX200>,
      <created by zg, POWCHK disabled, PULCHK disabled
       configuration hash MD5:
       00 E9 B6 7A A2 85 ED C7 34 08 36 98 17 FE 4E 26
       data hash MD5: 16K
       DD 81 52 DC 14 4E 6F 0E C6 96 41 71 E8 44 23 89>)
(   2,<2023-09-25 13:51:49.50 +0400>,<she>,<DPX200>,
      <Start of raw data processing
       efp BC_mod = 2 LB = 0.24 FT_mod = 6 PKNL = 1 PHC0 = -21568.41 PHC1 = 14.05271 SI = 16K 
       data hash MD5: 16K
       B2 2B 2C 7F BC C8 18 80 D6 79 44 E0 1C 40 59 C0>)
(   3,<2023-09-25 13:52:11.40 +0400>,<she>,<DPX200>,
      <pk PHC0 = -159.7693 PHC1 = 20.6 
       data hash MD5: 16K
       05 59 5E B2 E4 18 E6 62 C7 CE 46 A5 05 75 E0 3A>)
(   4,<2023-09-25 13:52:14.92 +0400>,<she>,<DPX200>,
      <abs ABSG = 5 
       data hash MD5: 16K
       24 9B 3C 3A E1 0F DF 0A 9D 0E 1F 31 79 C0 61 9F>)
$$ ##END=
$$ 
$$ hash MD5
$$ 4F BB C3 2D 30 9F D8 D3 77 36 EC 2E 29 F6 19 44
##$RELAX= 
##$RELAX= 
##$RELAX= 
##$RELAX= 
##$RELAX= 
##$RELAX= 
$$ Bruker specific parameters
$$ --------------------------
##$DU= <F:/spectra>
##$EXPNO= 1
##$NAME= <H-F>
##$PROCNO= 1
##$TYPE= <nmr>
##$USER= <she>
##$AMP= (0..31)
100 100 100 100 100 100 100 100 100 100 100 100 100 100 100 100 100 100 
100 100 100 100 100 100 100 100 100 100 100 100 100 100 
##$AQSEQ= 0
##$AQ_mod= 1
##$AUNM= <au_zg>
##$AUTOPOS= <>
##$BF1= 200.13
##$BF2= 200.13
##$BF3= 200.13
##$BF4= 200.13
##$BF5= 200.13
##$BF6= 200.13
##$BF7= 200.13
##$BF8= 200.13
##$BYTORDA= 1
##$CFDGTYP= 0
##$CFRGTYP= 5
##$CHEMSTR= <none>
##$CNST= (0..31)
1 1 145 1 1 1 1 1 1 1 1 1 1 1 1 1 1 1 1 1 1 1 1 1 1 1 1 1 1 1 1 1 
##$CPDPRG= <>
##$CPDPRG1= <>
##$CPDPRG2= <>
##$CPDPRG3= <>
##$CPDPRG4= <mlev>
##$CPDPRG5= <mlev>
##$CPDPRG6= <mlev>
##$CPDPRG7= <mlev>
##$CPDPRG8= <mlev>
##$CPDPRGB= <>
##$CPDPRGT= <>
##$D= (0..31)
0 1.2 0 0 0 0 0 0 0 0.06 0 0.03 0 0 0 0 0.0002 0 0 0 0 0 0 0 0 0 0 0 0 
0 0 0 
##$DATE= 1695635506
##$DBL= (0..7)
120 120 120 120 120 120 120 120 
##$DBP= (0..7)
150 150 150 150 150 150 150 150 
##$DBP07= 0
##$DBPNAM0= <>
##$DBPNAM1= <>
##$DBPNAM2= <>
##$DBPNAM3= <>
##$DBPNAM4= <>
$$ [...]
##$SUBNAM3= <"">
##$SUBNAM4= <"">
##$SUBNAM5= <"">
##$SUBNAM6= <"">
##$SUBNAM7= <"">
##$SUBNAM8= <"">
##$SUBNAM9= <"">
##$SW= 18.05172834244
##$SWIBOX= (0..15)
0 0 2 0 0 0 0 0 0 0 0 0 0 0 0 0 
##$SW_h= 3612.71676300578
##$TD= 16384
##$TD0= 1
##$TE= 0
##$TE2= 300
##$TE3= 300
##$TEG= 300
##$TL= (0..7)
0 120 120 120 120 120 120 120 
##$TP= (0..7)
150 150 150 150 150 150 150 150 
##$TP07= 0
##$TPNAME0= <>
##$TPNAME1= <>
##$TPNAME2= <>
##$TPNAME3= <>
##$TPNAME4= <>
##$TPNAME5= <>
##$TPNAME6= <>
##$TPNAME7= <>
##$TPOAL= (0..7)
0.5 0.5 0.5 0.5 0.5 0.5 0.5 0.5 
##$TPOFFS= (0..7)
0 0 0 0 0 0 0 0 
##$TUNHIN= 0
##$TUNHOUT= 0
##$TUNXOUT= 0
##$USERA1= <user>
##$USERA2= <user>
##$USERA3= <user>
##$USERA4= <user>
##$USERA5= <user>
##$V9= 5
##$VALIST= <valist>
##$VCLIST= <CCCCCCCCCCCCCCC>
##$VD= 0
##$VDLIST= <DDDDDDDDDDDDDDD>
##$VPLIST= <PPPPPPPPPPPPPPP>
##$VTLIST= <TTTTTTTTTTTTTTT>
##$WBST= 1024
##$WBSW= 4
##$XGAIN= (0..3)
0 0 0 0 
##$XL= 0
##$YL= 0
##$YMAX_a= 74350
##$YMIN_a= -125719
##$ZGOPTNS= <>
##$ZL1= 120
##$ZL2= 120
##$ZL3= 120
##$ZL4= 120
##$ABSF1= 15.73698
##$ABSF2= -2.314869
##$ABSG= 5
##$ABSL= 3
##$ALPHA= 0
##$AQORDER= 0
##$ASSFAC= 0
##$ASSFACI= 0
##$ASSFACX= 0
##$ASSWID= 0
##$AUNMP= <proc_1d>
##$AZFE= 0.1
##$AZFW= 0.1
##$BCFW= 0
##$BC_mod= 2
##$BYTORDP= 0
##$COROFFS= 0
##$CY= -3
##$DATMOD= 1
##$DC= 0
##$DFILT= <>
##$DTYPP= 0
##$F1P= 0
##$F2P= 0
##$FCOR= 1
##$FTSIZE= 16384
##$FT_mod= 6
##$GAMMA= 0
##$GB= 0
##$INTBC= 1
##$INTSCL= 3.70164e-10
##$ISEN= 128
##$LB= 0.24
##$LEV0= 0
##$LPBIN= 0
##$MAXI= 10000
##$MC2= 0
##$MEAN= 0
##$ME_mod= 0
##$MI= 1.114404
##$NCOEF= 0
##$NC_proc= -9
##$NLEV= 6
##$NOISF1= 3.799351
##$NOISF2= 2.8
##$NSP= 0
##$NTH_PI= 0
##$NZP= 0
##$OFFSET= 15.73367
##$PC= 1
##$PHC0= -21728.18
##$PHC1= 34.65271
##$PH_mod= 1
##$PKNL= yes
##$PPARMOD= 0
##$PSCAL= 0
##$PSIGN= 0
##$REVERSE= no
##$SF= 200.130007579956
##$SI= 16384
##$SIGF1= 3
##$SIGF2= 2
##$SINO= 5.538805
##$SIOLD= 16384
##$SREGLST= <1H.CDCl3>
##$SSB= 0
##$STSI= 16384
##$STSR= 0
##$SW_p= 3612.71676300578
##$SYMM= 0
##$S_DEV= 0
##$TDeff= 16384
##$TDoff= 0
##$TI= <>
##$TILT= no
##$TM1= 0
##$TM2= 0
##$TOPLEV= 0
##$USERP1= <user>
##$USERP2= <user>
##$USERP3= <user>
##$USERP4= <user>
##$USERP5= <user>
##$WDW= 1
##$XDIM= 16384
##$YMAX_p= 402441451
##$YMIN_p= -2658430
$$ End of Bruker specific parameters
$$ ---------------------------------
##NTUPLES= NMR SPECTRUM
##VAR_NAME=  FREQUENCY,     SPECTRUM/REAL,   SPECTRUM/IMAG
##SYMBOL=    X,             R,               I
##VAR_TYPE=  INDEPENDENT,   DEPENDENT,       DEPENDENT
##VAR_FORM=  AFFN,          ASDF,            ASDF
##VAR_DIM=   16384,         16384,           16384
##UNITS=     HZ,            ARBITRARY UNITS, ARBITRARY UNITS
##FACTOR=    0.220516191357247, 1,           1
##FIRST=     3148.77954332707, 0,            0
##LAST=      -463.937219678709, 0,           0
##MIN=       -463.937219678709, -2658430,    0
##MAX=       3148.77954332707, 402441451,    0
$$ Real data points
##PAGE= N=1
##DATA TABLE= (X++(R..R)), XYDATA
$$ [...]
$$ plain form
4814 12886957 12677809 12572048 12721478 11828598 11456109 11736788 12153507 12671894 13141770
4805 13141770 13250063 13024836 13638108 13488619 13066078 13214383 12556565 12532251 13439327 13703952
4795 13703952 13698528 13347085 13936103 14932680 14503256 13739565 13492021 13921980 13539313 13643843
4785 13643843 14392573 14567733 14206425 14398277 14121615 13143308 13295153 13600705 13922582
4776 13922582 14424793 15097612 14260080 13413516 13281063 12927817 13065265 12851060 12567787
4767 12567787 12339868 13555439 13932494 13270810 13211845 13726636 13089553 12364639 12946452
4758 12946452 13385658 14207327 13215030 12835503 13118047 13738410 13871817 14202882 13555660
4749 13555660 13197803 13470065 13545127 13509581 13379226 13733667 14426168 13814233 13320954 12887074
$$ packed form
4814A2886957k09148j05761J49430q92880l72489K80679M16719N18387M69876
4805A3141770J08293k25227O13272j49489m22541J48305o57818k4314R07076K64625
4795A3703952n424l51443N89018R96577m29424p63691k47544M29959l82667J04530
4785A3643843P48730J75160l61308J91852k76662r78307J51845L05552L21877
4776A3922582N02211O72819q37532q46564j32453l53246J37448k14205k83273
4767A2567787k27919J215571L77055o61684n8965N14791o37083p24914N81813
4758A2946452M39206Q21669r92297l79527K82544O20363J33407L31065o47222
4749A3555660l57857K72262P5062l5546j30355L54441O92501o11935m93279m33880
$$ plain form
4739 12887074 13282079 13931599 13923589 14214144 12678342 13303904 13016073 13203456 14734587
4730 14734587 14656795 13840080 13875926 13480830 13273970 13703360 13399149 13262401 13864742 13312177
4720 13312177 12133604 12830448 13203812 13123520 11903580 11893746 11775660 11628766 11975882 12728237
4710 12728237 12688539 11942913 11994612 12325966 11907253 11565173 12071602 11326096 10963803 11589503
4700 11589503 11960622 11676353 11092135 10658972 11082136 11043474 11197416 11556081 11683511 11756821
4690 11756821 11684748 11533999 11105252 10856023 11329754 11068173 11188935 12352567 12788788
4681 12788788 12090738 12124399 11538891 11361492 11716184 10835211 10935594 11740073 11915122 12506767
4671 12506767 12853334 10989608 11348374 11466654 11258690 11317306 12168117 12196293 11695046 11541254
$$ packed form
4739A2887074L95005O49520q010K90555j535802O25562k87831J87383J531131
4730A4734587p7792q16715L5846l95096k06860M29390l04211j36748O02341n52565
4720A3312177j178573O96844L73364q0292j219940r834j18086j46894L47116P52355
4710A2728237l9698p45626N1699L31354m18713l42080N06429p45506l62293O25700
4700A1589503L71119k84269n84218m33163M23164l8662J53942L58665J27430P3310
4690A1756821p2073j50749m28747k49229M73731k61581J20762J163632M36221
4681A2788788o98050L3661n85508j77399L54692q80973J00383Q04479J75049N91645
4671A2506767L46567j863726L58766J18280k07964N8616Q50811K8176n01247j53792
$$ plain form
4661 11541254 10791096 10453536 11254191 11968223 11696778 11372086 11401992 11579476 11384937 12259365
4651 12259365 12401331 12197716 12178210 11247042 11679315 11489640 11658951 11686910 11319712 12127166
4641 12127166 12015922 11354313 11948441 11478923 11603337 11684954 10749631 10942244 11851187 11687384
4631 11687384 11329924 12488982 12134908 11799380 11981981 12895985 13132120 13845939 13120543
4622 13120543 12260236 11786128 12066530 11457516 11661360 11976166 12278548 12008345 11758240
4613 11758240 12345214 13446904 13648400 13131887 12921149 13055661 12537096 12115653 12813124
4604 12813124 13916754 13150309 12679070 13078644 12811544 14089345 14459389 13784730 13583173
4595 13583173 14474438 14668527 14201429 13255278 13662741 14181158 14407080 14049299 13732306
$$ packed form
4661A1541254p50158l37560Q00655P14032k71445l24692K9906J77484j94539Q74428
4651A2259365J41966k03615j9506r31168M32273j89675J69311K7959l67198Q07454
4641A2127166j11244o61609N94128m69518J24414Q1617r35323J92613R08943j63803
4631A1687384l57460J159058l54074l35528J82601R14004K36135P13819p25396
4622A3120543q60307m74108K80402o09014K03844L14806L02382k70203k50105
4613A1758240N86974J101690K01496n16513k10738J34512n18565m21443O97471
4604A2813124J103630p66445m71239L99574k67100J277801L70044o74659k01557
4595A3583173Q91265J94089m67098r46151M07463N18417K25922l57781l16993
$$ plain form
4586 13732306 14017065 13983891 13812641 13157502 12843168 12765117 13201017 13544828 13275619 13497109
4576 13497109 13699870 14099548 13800196 13122163 13218814 13529830 13753824 13563778 13441488 14445264
4566 14445264 15678492 15005535 14275998 14312115 13853565 14211925 13877780 13832825 14530383 14580725
4556 14580725 14394694 14263143 13393339 13618684 13884546 14897660 15171783 14999703 14726383
4547 14726383 14308575 14620272 15257984 15570094 15050516 14689591 14594386 14953428 14766643 14876814
4537 14876814 14369760 14800014 15186583 15193090 15114782 14594265 14946413 14840969 15770184 16294931
4527 16294931 15503105 15592595 15412109 15810499 16714510 15850845 15037175 15285485 15083113 15801971
4517 15801971 15868531 15707333 16171841 16217251 16828972 17631903 17475765 17637544 17958470 17580236
$$ packed form
4586A3732306K84759l3174j71250o55139l14334p8051M35900L43811k69209K21490
4576A3497109K02761L99678k99352o78033R6651L11016K23994j90046j22290J003776
4566A4445264J233228o72957p29537L6117m58550L58360l34145m4955O97558N0342
4556A4580725j86031j31551q69804K25345K65862J013114K74123j72080k73320
4547A4726383m17808L11697O37712L12110n19578l60925r5205L59042j86785J10171
4537A4876814n07054M30254L86569O507p8308n20517L52148j05444R29215N24747
4527A6294931p91826Q9490j80486L98390R04011q63665q13670K48310k02372P18858
4517A5801971O6560j61198M64508M5410O11721Q02931j56138J61779L20926l78234
$$ plain form
4507 17580236 17373900 18057070 18543832 19364865 20220509 20322477 20995659 21578493 22766907
4498 22766907 24221520 25645628 27008615 28890573 30229099 32172880 33752072 34449437
4490 34449437 36040625 35600369 35194711 34294152 32224108 31173987 29137429 27513788 26242599
4481 26242599 24505916 23036996 22393958 21790106 20899690 19914873 18615621 18220500 17650329
4472 17650329 17039410 16659386 16607764 16441765 15076115 15654037 15766716 14519535 14182107
4463 14182107 14652406 15387584 15885594 15576678 15849710 14967635 15080232 15360007 15280600 15218786
4453 15218786 15191001 15341467 15719888 15578940 14098291 14605062 15122403 15029834 14878962 15071063
4443 15071063 14707070 15132391 15294488 15696474 15593637 15129657 14654637 14740298 15545578 15428688
$$ packed form
4507A7580236k06336O83170M86762Q21033Q55644J01968O73182N82834J188414
4498B2766907J454613J424108J362987J881958J338526J943781J579192O97365
4490C4449437J591188m40256m05658r00559k070044j050121k036558j623641j271189
4481B6242599j736683j468920o43038o03852q90416r84817j299252l95121n70171
4472A7650329o10919l80024n1622j65999j365650N77922J12679j247181l37428
4463A4182107M70299P35178M98010l08916K73032q82075J12597K79775p9407o1814
4453A5218786k7785J50466L78421j40948j480649N06771N17341r2569j50872J92101
4443A5071063l63993M25321J62097M01986j02837m63980m75020Q5661Q05280j16890
$$ plain form
4433 15428688 15156889 15104300 14997844 14271160 13902850 14586358 15332916 15796807 15861633 15762705
4423 15762705 15411859 15525536 15573363 15580797 15298013 14979137 15063833 15437485 14619930 14174065
4413 14174065 15024909 15132173 16086619 15926210 14908518 15142647 15605219 15476426 15517295
4404 15517295 15571463 14895539 15545556 15935064 15116848 15300457 14761351 15608885 15883213 15022005
4394 15022005 15314429 15052632 15246661 15131438 15121280 14789553 15433704 16174772 15880018 15251646
4384 15251646 15443575 15174054 14529209 14415809 15423290 16344623 16097398 15047963 15199635
4375 15199635 15620622 15758441 15576230 15451862 16061780 15858673 15610853 16043584 15825574
4366 15825574 15758942 16074554 16836230 16150732 16537415 16216673 15014829 16008929 15834015
$$ packed form
4433A5428688k71799n2589j06456p26684l68310O83508P46558M63891O4826r8928
4423A5762705l50846J13677M7827P434k82784l18876Q4696L73652q17555m45865
4413A4174065Q50844J07264R54446j60409j017692K34129M62572j28793M0869
4404A5517295N4168o75924O50017L89508q18216J83609n39106Q47534K74328q61208
4394A5022005K92424k61797J94029j15223j0158l31727O44151P41068k94754o28372
4384A5251646J91929k69521o44845j13400J007481R21333k47225j049435J51672
4375A5199635M20987J37819j82211j24368O09918k03107k47820M32731k18010
4366A5825574o6632L15612P61676o85498L86683l20742j201844R94100j74914
$$ plain form
4357 15834015 16844115 16952965 16112480 15699769 16317591 16123969 15960402 16624743 15590527
4348 15590527 15379504 15898678 15893230 16098829 16545325 17210876 16536356 16218341 16837230 16887499
4338 16887499 17024648 17192298 16735460 16552404 16333977 16829788 17066920 17580109 18206622
4329 18206622 17678283 17278259 17057392 18367622 18633968 17473751 17033772 17291233 16576235
4320 16576235 17323873 17793372 17883820 18447720 18175531 19169331 17829952 18242222 18861788
4311 18861788 18781106 18644051 17984988 18179945 18437343 19167100 19830207 19460221 20200047 20291412
4301 20291412 20225280 19871804 19855859 20552606 20736272 20537588 20049761 20305948 19920726 20414691
4291 20414691 21114181 20531039 20503419 19876127 20732839 21518427 21019675 20807942 20621549 20055886
$$ packed form
4357A5834015J010100J08850q40485m12711O17822j93622j63567O64341j034216
4348A5590527k11023N19174n448K05599M46496O65551o74520l18015O18889N0269
4338A6887499J37149J67650m56838j83056k18427M95811K37132N13189O26513
4329A8206622n28339m00024k20867J310230K66346j160217m39979K57461p14998
4320A6576235P47638M69499R0448N63900k72189R93800j339379M12270O19566
4311A8861788q0682j37055o59063J94957K57398P29757O63107l69986P39826R1365
4301B0291412o6132l53476j5945O96747J83666j98684m87827K56187l85222M93965
4291B0414691O99490n83142k7620o27292Q56712P85588m98752k11733j86393n65663
$$ plain form
4281 20055886 20338652 21266993 21716620 21008592 21321937 21991298 22117114 22196015 21871535 22062451
4271 22062451 22242438 22249641 22706176 21531820 22132251 23373591 23264810 23511088 23577097 23788860
4261 23788860 23663704 22979641 23473718 24107525 23552757 24148248 24390051 24490733 24279486
4252 24279486 23775486 23763941 24310774 23836818 23835247 24222097 24621247 24761715 25388826 25016779
4242 25016779 25448664 25979081 25919069 24672258 25052340 25732359 25560434 25107876 24712351
4233 24712351 24747594 24996672 25138330 24799028 24092753 24223599 25227107 25876018 25539682
4224 25539682 25246945 25254110 25411187 25836570 25775253 25937003 25293536 25767270 26064274 26343305
4214 26343305 26825048 26589957 26437727 27028373 26852034 27200352 27576326 27587306 28205775 27907367
$$ packed form
4281B0055886K82766R28341M49627p08028L13345O69361J25816P8901l24480J90916
4271B2062451J79987P203M56535j174356O00431J241340j08781K46278O6009K11763
4261B3788860j25156o84063M94077O33807n54768N95491K41803J00682k11247
4252B4279486n04000j1545N46833m73956j571L86850L99150J40468O27111l72047
4242B5016779M31885N30417o0012j246811L80082O80019j71925m52558l95525
4233B4712351L5243K49078J41658l39302p06275J30846J003508O48911l36336
4224B5539682k92737P165J57077M25383o1317J61750o43467M73734K97004K79031
4214B6343305M81743k35091j52230N90646j76339L48318L75974J0980O18469k98408
$$ plain form
4204 27907367 27632858 27679723 28475653 27929679 29012647 29292801 28564657 29177814 30535736
4195 30535736 30104914 29761052 29316023 29986062 30035580 29787011 30573555 30932749 30610420 30341753
4185 30341753 30704848 31707761 32288345 31853276 32293259 32796407 33313496 34108511 33485192
4176 33485192 33732162 35061641 34938549 35053507 36276117 36725953 36707634 37578874 38077046
4167 38077046 38870045 40494899 41868561 42957359 45814817 48827492 51025469 51751078
4159 51751078 49774674 46296455 43382116 41837544 41292636 40312046 39626339 38674598 38501479
4150 38501479 39378944 39226273 38323766 38744141 39051979 39358369 38992675 39660632 39269740
4141 39269740 39091248 38962911 39972523 41245469 41220255 40802574 41022268 41966371 42289656
$$ packed form
4204B7907367k74509M6865P95930n45974J082968K80154p28144O13157J357922
4195C0535736m30822l43862m45029O70039M9518k48569P86544L59194l22329k68667
4185C0341753L63095J002913N80584m35069M39983N03148N17089P95015o23319
4176C3485192K46970J329479j23092J14958J222610M49836j8319Q71240M98172
4167C8077046P92999J624854J373662J088798K857458L012675K197977P25609
4159E1751078j976404l478219k914339j544572n44908r80590o85707r51741j73119
4150C8501479Q77465j52671r02507M20375L07838L06390l65694O67957l90892
4141C9269740j78492j28337J009612J272946k5214m17681K19694R44103L23285
$$ plain form
4132 42289656 42464964 41884212 41744532 42518935 42555815 43541316 44186031 43670709 42784386 43469992
4122 43469992 43918886 44890990 44272375 45188964 45081060 45183697 46904293 47892608 48052487
4113 48052487 47815043 48328624 49210110 49787693 49045201 50277431 51675712 51576218 51813868
4104 51813868 52724109 53080490 53552248 53795747 55216615 56645368 57271984 57471283 58308004
4095 58308004 59346954 60062799 60804876 62727816 65328037 66790420 68964168 71328295
4087 71328295 73572809 76495115 79834356 84023052 89142181 94621183 101399210 108501363
4079 108501363 114855931 121789597 125306287 124739985 120460140 112688312 103987297 97430245
4071 97430245 91799374 87977508 84429170 81820630 80715788 79377083 77700349 78045005
$$ packed form
4132D2289656J75308n80752j39680P74403L6880R85501O44715n15322q86323O85606
4122D3469992M48894R72104o18615R16589j07904J02637J720596R88315J59879
4113D8052487k37444N13581Q81486N77583p42492J232230J398281r9494K37650
4104E1813868R10241L56381M71758K43499J420868J428753O26616J99299Q36721
4095E8308004J038950P15845P42077J922940K600221J462383K173748K364127
4087G1328295K244514K922306L339241M188696N119129N479002O778027P102153
4079A08501363O354568O933666L516690n66302m279845p771828q701015o557052
4071I7430245n630871l821866l548338k608540j104842j338705j676734L44656
$$ plain form
4063 78045005 76904088 76465142 77078570 76972845 76366550 76415034 77301618 77094001 78152131
4054 78152131 78218115 78159823 78315680 79128982 79474407 80028677 79645595 78922447 79467958 79919764
4044 79919764 80334436 79658459 78836279 78807076 78372217 78645473 77897482 76372552 76769039
4035 76769039 76205173 76128258 75921895 75701451 74705681 74723295 74705197 74711635 74568592 74758930
4025 74758930 74639089 74662199 73926127 72980614 74102242 73075129 72036617 72598118 71830698
4016 71830698 71804021 72335391 71688304 71312269 71800351 70344069 70131148 70138572 70936080 70441697
4006 70441697 70637980 71182874 70679532 70544290 70946352 70597854 70335873 69991271 71244972
3997 71244972 71447862 70171346 70870428 71693898 72472567 72504629 72344281 72874637 73679011
$$ packed form
4063G8045005j140917m38946O13428j05725o06295M8484Q86584k07617J058130
4054G8152131O5984n8292J55857Q13302L45425N54270l83082p23148N45511M51806
4044G9919764M14672o75977q22180k9203m34859K73256p47991j524930L96487
4035G6769039n63866p6915k06363k20444r95770J7614j8098O438j43043J90338
4025G4758930j19841K3110p36072r45513J121628j027113j038512N61501p67420
4016G1830698k6677N31370o47087l76035M88082j456282k12921P424P97508m94383
4006G0441697J96283N44894n03342j35242M02062l48498k61981l44602J253701
3997G1244972K02890j276516O99082Q23470P78669L2062j60348N30356Q04374
$$ plain form
3988 73679011 73999968 74592880 74905322 75544547 74732588 75495844 76332121 77235405 78482487
3979 78482487 79487942 79930375 80828541 81276060 83570924 85277419 87901493 90792048 93399737
3970 93399737 96650751 102530820 108120987 116490882 127040954 140120982 156204531 174710959
3962 174710959 191139072 197268540 184975567 162232415 139778885 123172555 111391660
3955 111391660 102496772 96286023 91663205 88142014 84724133 82757135 80558800 79578048
3947 79578048 78702476 77706327 76538299 75908971 75176066 74650538 74627176 73564002 71855224
3938 71855224 71166243 72351020 72544930 72194016 72201338 71456955 71051099 70200537 70516936 70013867
3928 70013867 69338218 68657560 67851629 67275429 66201130 66189558 66178456 65658065 64386941
$$ packed form
3988G3679011L20957N92912L12442O39225q11959P63256Q36277R03284J247082
3979G8482487J005455M42433Q98166M47519K294864J706495K624074K890555K607689
3970I3399737L251014N880069N590167Q369895J0550072J3080028J6083549J8506428
3962A74710959J6428113O129468j2292973k2743152k2453530j6606330j1780895
3955A11391660q894888o210749m622818l521191l417881j966998k198335r80752
3947G9578048q75572r96149j168028o29328p32905n25528k3362j063174j708778
3938G1855224o88981J184777J93910l50914P322p44383m05856q50562L16399n03069
3928G0013867o75649o80658q05931n76200j074299j1572j1102n20391j271124
$$ plain form
3919 64386941 64083369 63281652 63346378 63977612 63071939 62061902 61583941 61586352 60297680 60839977
3909 60839977 60618035 59853518 59540720 59629334 59877527 58881401 58415507 58826277 58550737 58811184
3899 58811184 58225376 58211832 57765071 57306009 55863555 55852495 56082334 55956864 55375856 55708362
3889 55708362 55240639 54613923 54713697 54789038 54899247 54496919 54873259 54661471 54350961 54513697
3879 54513697 53675135 52771323 52863118 52976137 52607374 52523310 52116913 51744142 52172109 52259706
3869 52259706 51911541 51591133 50818307 51803386 52270523 50824759 50319026 51194494 52280576
3860 52280576 51008420 50393194 50412501 50397931 50130649 50135063 49945487 49985902 50033808 50517628
3850 50517628 50151804 49400202 49095333 49238760 49651586 49747250 49664895 50634050 50240695 49602344
$$ packed form
3919F4386941l03572q01717O4726O31234r05673j010037m77961K411j288672N42297
3909F0839977k21942p64517l12798Q8614K48193r96126m65894M10770k75540K60447
3899E8811184n85808j3544m46761m59062j442454j1060K29839j25470n81008L32506
3889E5708362m67723o26716R9774P5341J10209m02328L76340k11788l10510J62736
3879E4513697q38562r03812R1795J13019l68763q4064m06397l72771M27967Q7597
3869E2259706l48165l20408p72826R85079M67137j445764n05733Q75468J086082
3860E2280576j272156o15226J9307j4570k67282M414j89576M0415M7906M83820
3850E0517628l65824p51602l04869J43427M12826R5664q2355R69155l93355o38351
$$ plain form
3840 49602344 49433033 49720311 49282314 49778423 49879642 49176394 48836403 49578431 50670287
3831 50670287 50548404 49780349 49811794 50427598 49876721 48620495 48108722 49303142 49405859
3822 49405859 49060821 49951181 51324138 51063278 49758011 49546213 50593782 51047218 51221986
3813 51221986 51538987 51560383 52008730 51474418 50749525 50662461 50855465 52331566 52259491 51393035
3803 51393035 50924670 51086656 51294292 51409406 51262283 51575293 51535558 51491523 52119411 52704587
3793 52704587 52316933 51973867 52046966 52145353 52551115 51849271 52151224 52244635 52056356 52408567
3783 52408567 52712612 53277532 52593132 52603989 53037945 52877250 52927560 52987513 53208531 53584177
3773 53584177 54102513 54285497 54079775 53631960 53227478 53883235 53861517 53782019 53720986 53383336
$$ packed form
3840D9602344j69311K87278m37997M96109J01219p03248l39991P42028J091856
3831E0670287j21883p68055L1445O15804n50877j256226n11773J194420J02717
3822D9405859l45038Q90360J372957k60860j305267k11798J047569M53436J74768
3813E1221986L17001K1396M48347n34312p24893q7064J93004J476101p2075q66456
3803E1393035m68365J61986K07636J15114j47123L13010l9735m4035O27888N85176
3793E2704587l87654l43066P3099R8387M05762p01844L01953R3411j88279L52211
3783E2408567L04045N64920o84400J0857M33956j60695N0310N9953K21018L75646
3773E3584177N18336J82984k05722m47815m04482O55757k1718p9498o1033l37650
$$ plain form
3763 53383336 54520340 53993676 54110038 54939451 55273251 55584934 56137973 56697430 55963349
3754 55963349 55933424 55947702 55839103 55252934 55479726 55516124 55330815 55554066 55805592 55804591
3744 55804591 55073630 55559823 55968015 56554455 56346863 55916961 56386017 55810033 56057423
3735 56057423 55267818 54870295 55293014 55232356 55321498 54385163 54358794 54961139 54149692 53652786
3725 53652786 53604941 53553148 54262031 54703473 54186826 53474493 53151192 53549556 53236661 52766979
3715 52766979 52974061 53041476 52902581 52854510 53071331 53341883 53717836 52685698 52314686 52783764
3705 52783764 52929033 52621949 51763055 51245614 52131564 51587397 51714504 52590847 52311911
3696 52311911 52031111 51852207 52018111 51843128 52258669 53018771 53426608 52601294 52498324
$$ packed form
3763E3383336J137004n26664J16362Q29413L33800L11683N53039N59457p34081
3754E5963349k9925J4278j08599n86169K26792L6398j85309K23251K51526j001
3744E5804591p30961M86193M08192N86440k07592m29902M69056n75984K47390
3735E6057423p89605l97523M22719o0658Q9142r36335k6369O02345q11447m96906
3725E3652786m7845n1793P08883M41442n16647p12333l23301L98364l12895m69682
3715E2766979K07082O7415j38895m8071K16821K70552L75953j032138l71012M69078
3705E2783764J45269l07084q58894n17441Q85950n44167J27107Q76343k78936
3696E2311911k80800j78904J65904j74983M15541P60102M07837q25314j02970
$$ plain form
3687 52498324 53526584 53039106 53079974 52819194 53630779 53564371 53998948 54006415 52945896 53217166
3677 53217166 53889635 53571709 53534779 53716296 53559588 53582015 55110560 55282275 54908462 54760637
3667 54760637 53961931 54720128 54585757 55616647 56121882 55387740 56061038 55666479 55147819
3658 55147819 55836759 55218422 55316530 55675713 54675221 54266201 54800928 55463132 54861352
3649 54861352 55367363 56009046 55189898 56341821 56787997 56380161 56496833 55639040 55694236
3640 55694236 56256748 56252911 56208049 55981540 56788804 56614423 57185036 56554382 57094184 57588673
3630 57588673 56959004 57060452 57702727 57607868 56817080 57150960 57571365 57342896 57764719 58509593
3620 58509593 58818150 58788539 59223639 58896691 59684972 60073740 60184116 60321265 61465679
$$ packed form
3687E2498324J028260m87478M0868k60780Q11585o6408M34577P467j060519K71270
3677E3217166O72469l17926l6930J81517j56708K2427J528545J71715l73813j47825
3667E4760637p98706P58197j34371J030890N05235p34142O73298l94559n18660
3658E5147819O88940o18337R8108L59183j000492m09020N34727O62204o01780
3649E4861352N06011O41683q19148J151923M46176m07836J16672q57793N5196
3640E5694236N62512l837m4862k26509Q07264j74381N70613o30654N39802M94489
3630E7588673o29669J01448O42275r4859p90788L33880M20405k28469M21823P44874
3620E8509593L08557k9611M35100l26948P88281L88768J10376J37149J144414
$$ plain form
3611 61465679 61774820 61850591 62804365 62707042 61679237 61635591 62406465 62797216 62545788 62073408
3601 62073408 62281121 62187432 63812582 64516828 64401655 64535562 65234979 65586530 65623653 65212130
3591 65212130 65737599 65746756 66205051 67144093 66795212 66568152 67503328 67251187 67980777 68526778
3581 68526778 68649710 68684918 68713817 69031756 68025550 69425877 69716483 69532924 69903648
3572 69903648 69667846 69870492 69676373 69710882 70578266 69656602 69221036 69407738 69765919 69871807
3562 69871807 68727589 68883866 69412851 69333414 68476649 68235301 68380697 68287715 67928026 68003380
3552 68003380 68459313 68836383 68246078 67939196 67795133 68191880 67792351 67477990 67721120
3543 67721120 68519276 68466330 68477312 66797010 65458993 66051027 66254372 66632995 66502028
$$ packed form
3611F1465679L09141P5771R53774r7323j027805m3646P70874L90751k51428m72380
3601F2073408K07713r3689J625150P04246j15173J33907O99417L51551L7123m11523
3591F5212130N25469R157M58295R39042l48881k27060R35176k52141P29590N46001
3581F8526778J22932L5208K8899L17939j006206J400327K90606j83559L70724
3572F9903648k35802K02646j94119L4509Q67384r21664m35566J86702L58181J05888
3562F9871807j144218J56277N28985p9437q56765k41348J45396r2982l59689P5354
3552F8003380M55933L77070n90305l06882j44063L96747l99529l14361K43130
3543F7721120P98156n2946J0982j680302j338017N92034K03345L78623j30967
$$ plain form
3534 66502028 66318252 66283799 65819340 66069119 66045825 65773717 66009142 66184650 66620560 66193458
3524 66193458 66614610 67133086 66768180 66443237 66659665 66953207 66681739 65594770 65958319
3515 65958319 66986859 67382451 66801560 66968215 67855823 67911357 67408922 67470068 67531688 67448292
3505 67448292 67434733 67815742 67961704 68661147 69081837 68330748 68030246 68063285 68057452 68223269
3495 68223269 68198070 67781973 67213728 67167822 67051719 65940682 65396247 65333234 65288377 65262857
3485 65262857 65327339 64655780 64118148 64434521 63791595 63134293 62182729 61850613 61927956 61960494
3475 61960494 61790408 60851617 60435984 60286320 59456986 59848128 58950471 58155977 58352351
3466 58352351 57625846 57163598 56675382 56661736 56676149 56996134 56769490 56090463 55740050 55836148
$$ packed form
3534F6502028j83776l4453m64459K49779k3294k72108K35425J75508M35910m27102
3524F6193458M21152N18476l64906l24943K16428K93542k71468j086969L63549
3515F5958319J028540L95592n80891J66655Q87608N5534n02435O1146O1620q3396
3505F7448292j3559L81009J45962O99443M20690p51089l00502L3039n833J65817
3495F8223269k5199m16097n68245m5906j16103j111037n44435o3013m4857k5520
3485F5262857O4482o71559n37632L16373o42926o57302r51564l32116P7343L2538
3475F1960494j70086r38791m15633j49664q29334L91142q97657p94494J96374
3466E8352351p26505m62248m88216j3646J4413L19985k26644o79027l50413R6098
$$ plain form
3456 55836148 55743387 55406411 55519050 55669295 55435062 54761764 54007320 54454008 53954989 54164851
3446 54164851 53909306 53953349 55050076 54773196 54106090 54054227 52906052 53319799 53189893
3437 53189893 53584882 53712265 53237661 53772323 53851383 54161672 54277694 54403391 54566054 54531136
3427 54531136 54520361 55154207 55853930 55933635 55960048 56373291 56215901 55985460 56527411 57390160
3417 57390160 57168041 57010176 57791372 58102158 58020596 58391641 58469960 58267871 59168218 59823027
3407 59823027 59635706 58953425 60107467 60663107 60926772 61583093 61999076 62167571 62312386
3398 62312386 62935007 62602587 63297537 63482100 63338475 63360168 64053837 63914953 64930949
3389 64930949 65334686 65316687 65105724 64790951 64549799 64905857 65124629 65377798 65330605 65686300
$$ packed form
3456E5836148r2761l36976J12639J50245k34233o73298p54444M46688m99019K09862
3446E4164851k55545M4043J096727k76880o67106n1863j148175M13747j29906
3437E3189893L94989J27383m74604N34662P9060L10289J16022J25697J62663l4918
3427E4531136j0775O33846O99723P9705K6413M13243j57390k30441N41951Q62749
3417E7390160k22119j57865P81196L10786q1562L71045P8319k02089R00347O54809
3407E9823027j87321o82281J154042N55640K63665O56321M15983J68495J44815
3398F2312386O22621l32420O94950J84563j43625K1693O93669j38884J015996
3389F4930949M03737j7999k10963l14773k41152L56058K18772K53169m7193L55695
$$ plain form
3379 65686300 66310745 65777381 65081024 65112706 65108622 65718551 66091327 65376474 64814750 65646075
3369 65646075 66381973 66383751 66774067 67495142 67846797 67366094 68014532 69075569 69785766 70931278
3359 70931278 71415799 71545705 71159346 72482842 72830239 74106075 75088118 75942049 76985819
3350 76985819 76925879 78482714 80006129 81042726 82032398 83550222 84287955 84946731 87081563
3341 87081563 87606985 88219027 89452430 90714331 90804724 91571347 92890185 93907619 94820889
3332 94820889 95357652 96560567 97320627 98930657 98626916 98945190 99350447 101120691 101725882
3323 101725882 102223187 102778604 102886508 102396879 102854497 103876128 104192838 104003079 104138279
3314 104138279 104434413 105074405 105613454 106325541 106619685 106704031 107041225 108123529 107953411
$$ packed form
3379F5686300O24445n33364o96357L1682m084O09929L72776p14853n61724Q31325
3369F5646075P35898J778L90316P21075L51655m80703O48438J061037P10197J145512
3359G0931278M84521J29906l86359J323496L47397J275836R82043Q53931J043770
3350G6985819n9940J556835J523415J036597R89672J517824P37733O58776K134832
3341H7081563N25422O12042J233403J261901R0393P66623J318838J017434R13270
3332I4820889N36763J202915P60060J610030l03741L18274M05257J770244O05191
3323A01725882M97305N55417J07904m89629M57618J021631L16710j89759J35200
3314A04138279K96134O39992N39049P12087K94144Q4346L37194J082304j70118
$$ plain form
3305 107953411 107977082 109174920 110459451 111447676 111288000 111863749 112837757 113437276 113834572
3296 113834572 115021473 116562605 117839326 117916002 118619613 119020247 120543523 122014657 123046610
3287 123046610 124404212 125629621 126697027 129549306 132684647 136902641 141661482 145950236
3279 145950236 147282143 144133966 139047551 134417061 130870804 127046756 125165734 124345318
3271 124345318 123119910 121387410 121112245 119625978 119486275 119765472 119745686 119403134 120317616
3262 120317616 120716797 122016278 123033000 123652186 125432333 128106926 131476438 134452894
3254 134452894 137115189 141745803 148938656 156375502 165536425 176330224 186663639 195844465
3246 195844465 195972194 189385353 182731961 177900664 177736074 180485806 183512299 186254210
$$ packed form
3305A07953411K3671J197838J284531R88225j59676N75749R74008N99519L97296
3296A13834572J186901J541132J276721P6676P03611M00634J523276J471134J031953
3287A23046610J357602J225409J067406K852279L135341M217994M758841M288754
3279A45950236J331907l148177n086415m630490l546257l824048j881022q20416
3271A24345318j225408j732500k75165j486267j39703K79197j9786l42552R14482
3262A20317616L99181J299481J016722O19186J780147K674593L369512K976456
3254A34452894K662295M630614P192853P436846R160923J0793799J0333415R180826
3246A95844465J27729o586841o653392m831297j64590K749732L026493K741911
$$ plain form
3238 186254210 188187648 187832992 183946211 175980689 166763692 157371836 149386898 142900530
3230 142900530 136002228 131106601 127738683 124010913 121592493 118671204 116761059 116018985
3222 116018985 115038673 114716517 114803254 115635866 118027004 120545730 123572858 125206602 123864716
3213 123864716 119371426 112887184 107224451 102554081 98663148 96489278 94623298 93525986
3205 93525986 90955907 89523852 88000697 87714490 87144473 85786584 85283903 84796229 83659506
3196 83659506 83579234 83697003 83554374 83419557 83134973 83342917 83663207 83336742 84169288 84977659
3186 84977659 85653925 85235752 84883851 84056374 85175733 85793872 86238770 86234450 86482898 86888485
3176 86888485 87587993 88048986 88074054 89003807 89445799 90038980 90412972 91595897 91605657 92140890
$$ packed form
3238A86254210J933438l54656l886781p965522r216997r391856p984938o486368
3230A42900530o898302m895627l367918l727770k418420k921289j910145p42074
3222A16018985r80312l22156Q6737Q32612K391138K518726L027128J633744j341886
3213A23864716m493290o484242n662733m670370l890933k173870j865980j097312
3205I3525986k570079j432055j523155k86207n70017j357889n02681m87674j136723
3196H3659506q0272J17769j42629j34817k84584K07944L20290l26465Q32546Q08371
3186H4977659O76266m18173l51901q27477J119359O18139M44898m320K48448M05587
3176H6888485O99508M60993K5068R29753M41992N93181L73992J182925R760N35233
$$ plain form
3166 92140890 93436897 93759461 94645674 94980936 95244882 95927119 96868197 97562189 97211802
3157 97211802 97378802 96260080 96618109 97914421 99379591 99812334 99225063 99750249 99862283
3148 99862283 99539625 100569069 100155527 99981467 98761034 98377901 97817154 97334524 96377059
3139 96377059 96593558 95901021 94461874 93463980 92262266 90493002 89398919 88979997 87901479
3130 87901479 86699337 85093512 83477895 82860310 82180000 80979636 79362217 78809061 78010544
3121 78010544 77427271 76523335 75825419 74969697 74000349 73132806 71724797 71830912 70701360
3112 70701360 69970788 69271253 68548665 68137431 68508014 68267282 67051788 66418621 65428783
3103 65428783 64825596 63714097 62967355 62666369 61912792 62201093 61671303 61696159 61572978
$$ packed form
3166I2140890J296007L22564Q86213L35262K63946O82237R41078O93992l50387
3157I7211802J67000j118722L58029J296312J465170M32743n87271N25186J12034
3148I9862283l22658J029444m13542j74060j220433l83133n60747m82630r57465
3139I6377059K16499o92537j439147r97894j201714j769264j094083m18922j078518
3130H7901479j202142j605825j615617o17585o80310j200364j617419n53156p98517
3121G8010544n83273r03936o97916q55722r69348q67543j408009J06115j129552
3112G0701360p30572o99535p22588m11234L70583k40732j215494o33167r89838
3103F5428783o03187j111499p46742l00986p53577K88301n29790K4856j23181
$$ plain form
3094 61572978 61510690 60978103 61148250 59589657 59161290 58923116 59035464 58881476 57338256
3085 57338256 56853520 57042246 56888360 56157258 56535422 55977601 56036891 55149265 55749472 55481131
3075 55481131 54287904 54462571 55081509 54553600 54655267 54082951 52649195 52610629 52051849
3066 52051849 51407791 50376503 49757442 49195803 49076856 48965255 48586396 48452445 48598707
3057 48598707 48363583 46193294 46134813 45931749 45454195 44806906 44179926 43856104 44063154
3048 44063154 43827282 43411313 43064764 42554184 42018337 41413273 40794824 40968908 41507424
3039 41507424 41273261 41040655 40187490 38939454 39324086 39765157 40251844 40166853 39893740
3030 39893740 40166414 41027214 40607178 40457633 40551849 41071932 41048453 40534402 40639544 40551098
$$ packed form
3094F1572978o2288n32587J70147j558593m28367k38174J12348j53988j543220
3085E7338256m84736J88726j53886p31102L78164n57821N9290q87626O00207k68341
3075E5481131j193227J74667O18938n27909J01667n72316j433756l8566n58780
3066E2051849o44058j031288o19061n61639j18947j11601l78859j33951J46262
3057D8598707k35124k170289n8481k03064m77554o47289o26980l23822K07050
3048D4063154k35872m15969l46549n10580n35847o05064o18449J74084N38516
3039D1507424k34163k32606q53165j248036L84632M41071M86687q4991k73113
3030C9893740K72674Q60800m20036j49545R4216N20083k3479n14051J05142q8446
$$ plain form
3020 40551098 41496966 41368249 40850740 40717412 41953148 41526580 41383026 41043798 42806949
3011 42806949 42003708 41896248 41243557 41536298 41267090 40856861 41287412 39946162 39374167
3002 39374167 39235809 40005950 39871854 39056642 38831627 38715439 38273864 38450308 38356660 38308966
2992 38308966 37546559 37292667 37532628 36775436 36581299 37112944 36530159 36181992 37269263
2983 37269263 36836375 37250090 37204258 36581793 36665622 36913121 36252226 36846282 37006124 37171400
2973 37171400 37404608 37780322 38179960 38011112 38254880 38395192 38475588 38138770 38490455 38584716
2963 38584716 39347685 39679044 39223465 39971012 40705267 40961358 41356113 41183612 40924271
2954 40924271 41537407 41650253 41908690 42226565 42557507 43131060 42857488 43806410 44286690
$$ packed form
3020D0551098R45868j28717n17509j33328J235736m26568j43554l39228J763151
3011D2806949q03241j07460o52691K92741k69208m10229M30551j341250n71995
3002C9374167j38358P70141j34096q15212k25015j16188m41575J76444r3648m7694
2992C8308966p62407k53892K39961p57192j94137N31645n82785l48167J087271
2983C7269263m32888M13715m5832o22465Q3829K47499o60895N94056J59842J65276
2973C7171400K33208L75714L99638j68848K43768J40312Q0396l36818L51685R4261
2963C8584716P62969L31359m55579P47547P34255K56091L94755j72501k59341
2954D0924271O13136J12846K58437L17875L30942N73553k73572R48922M80280
$$ plain form
2945 44286690 44989553 44515726 45627435 46392535 46656355 47284212 47989803 48597847 48961943
2936 48961943 49835318 50629616 51366822 51924769 53402507 53630768 54003471 55552926 55934834
2927 55934834 55545966 56565100 58519184 59947042 61707029 62868272 64210917 65462639
2919 65462639 66331769 67219014 68953592 70446171 71811737 74147417 75953416 78668235
2911 78668235 80152053 80885203 82821126 85540854 87813383 89607060 92723637 96007490
2903 96007490 98708761 101789322 105157193 108906069 112334885 116148489 120178558 123464817
2895 123464817 128458417 133643369 138210699 142893814 147384187 152474430 157349127 162492123
2887 162492123 167374871 172479989 177187127 181087732 184359886 187664442 191526605 193507382
$$ packed form
2945D4286690P02863m73827J111709P65100K63820O27857P05591O08044L64096
2936D8961943Q73375P94298P37206N57947J477738K28261L72703J549455L81908
2927E5934834l88868J019134J954084J427858J759987J161243J342645J251722
2919F5462639Q69130Q87245J734578J492579J365566K335680J805999K714819
2911G8668235J483818P33150J935923K719728K272529J793677L116577L283853
2903I6007490K701271L080561L367871L748876L428816L813604M030069L286259
2895A23464817M993600N184952M567330M683115M490373N090243M874697N142996
2887A62492123M882748N105118M707138L900605L272154L304556L862163J980777
$$ plain form
2879 193507382 196658044 199057083 200791783 201860450 202264562 203016695 203579218 202846046 201791786
2870 201791786 200142944 197436064 195603272 193085832 189474964 187049971 183621287 180345971
2862 180345971 176210515 171613973 167757759 164328576 160613064 157247585 153989337 150582844
2854 150582844 147616306 145028365 143082255 141007914 137570860 135916262 134428706 131973672
2846 131973672 130429423 128176364 126347117 125624177 124076060 122629674 120314307 118819381
2838 118819381 116624745 114588643 112959815 110606522 109536756 108102319 105808410 104282705
2830 104282705 104023688 102431040 101122008 100608737 100645472 99142969 97517506 96632846 96926078
2821 96926078 95702836 95584819 94582688 94068299 93909365 93470596 93488307 92635199 92707083
$$ packed form
2879A93507382L150662K399039J734700J068667M04112P52133N62523p33172j054260
2870B01791786j648842k706880j832792k517440l610868k424993l428684l275316
2862A80345971m135456m596542l856214l429183l715512l365479l258248l406493
2854A50582844k966538k587941j946110k074341l437054j654598j487556k455034
2846A31973672j544249k253059j829247p22940j548117j446386k315367j494926
2838A18819381k194636k036102j628828k353293j069766j434437k293909j525705
2830A04282705k59017j592648j309032n13271L6735j502503j625463q84660K93232
2821I6926078j223242j18017j002131n14389j58934m38769J7711q53108P1884
$$ plain form
2812 92707083 91935722 92202943 91840570 90851034 89426909 87472274 86930132 86194270 84520844
2803 84520844 82842698 81755139 79840936 78095877 76872776 76055307 74020116 72702688
2795 72702688 70588011 69900701 69312225 67416356 66898863 66904457 66145434 65569278 64730636
2786 64730636 62899245 62264445 62595176 62471388 62425749 62158399 61624558 61489474 61317797
2777 61317797 61027582 62043583 63166968 63620765 63871505 64332675 64832998 65853281 65172007
2768 65172007 65864229 67511290 68346948 69613029 70257934 71551780 72946868 73880307 75559725
2759 75559725 76805242 78171841 78305822 78682465 78607148 78568582 77491122 76197619 75189073
2750 75189073 73376565 71482270 70235696 68511023 66553198 64553786 62758739 61202901
$$ packed form
2812I2707083p71361K67221l62373r89536j424125j954635n42142p35862j673426
2803H4520844j678146j087559j914203j745059j223101q17469k035191j317428
2795G2702688k114677o87310n88476j895869n17493N594p59023n76156q38642
2786F4730636j831391o34800L30731j23788m5639k67350n33841j35084j71677
2777F1317797k90215J016001J123385M53797K50740M61170N00323J020283o81274
2768F5172007O92222J647061Q35658J266081O44905J293846J395088R33439J679418
2759G5559725J245517J366599J33981L76643p5317l8566j077460j293503j008546
2750G5189073j812508j894295j246574j724673j957825j999412j795047j555838
$$ plain form
2742 61202901 59281725 57912254 55952602 55079960 54039879 51991194 50059632 49984042 48549581
2733 48549581 48197385 46603218 44547383 43567671 43438725 42183879 41411021 39986763 40008530
2724 40008530 39842832 39033659 38599665 38038211 37185228 36173957 36149314 35598656 34921294
2715 34921294 33746019 32610063 32593622 32997901 32175079 31667887 32201302 32558100 31239229
2706 31239229 30428314 29307500 28276601 28527484 28154062 27554764 26498776 27047738 26565778
2697 26565778 25939574 25479562 25491851 25580498 25413806 24746310 24378552 24204729 24343114 24235968
2687 24235968 24265777 23437813 23031758 22574710 22392213 22177266 21845424 21512276 21380345 21387501
2677 21387501 21184180 21640078 21457482 20932423 20800698 21143749 21895949 21850839 21568757 21227222
$$ packed form
2742F1202901j921176j369471j959652q72642j040081k048685j931562p5590j434461
2733D8549581l52196j594167k055835r79712j28946j254846p72858j424258K1767
2724D0008530j65698q09173m33994n61454q52983j011271k4643n50658o77362
2715C4921294j175275j135956j6441M04279q22822n07192N33415L56798j318871
2706C1239229q10915j120814j030899K50883l73422n99298j055988N48962m81960
2697B6565778o26204m60012J2289Q8647j66692o67496l67758j73823J38385j07146
2687B4235968K9809q27964m06055m57048j82497k14947l31842l33148j31931P156
2677B1387501k03321M55898j82596n25059j31725L43051P52200m5110k82082l41535
$$ plain form
2667 21227222 20187738 19948562 19325693 19086840 18885948 19653013 18638832 18099091 18723916
2658 18723916 18450145 18225139 18074049 17522877 18043846 17364896 17323933 16414693 16466278 16547513
2648 16547513 16150945 16521516 15809924 15388728 15509906 15814910 15478113 15230078 15496452
2639 15496452 14990978 14975253 15615519 16043365 16018518 15353668 14852068 14934964 14157459 14073575
2629 14073575 14643852 13957906 13934300 13330835 13394961 13007304 12741438 12832899 13319228 13575200
2619 13575200 13397290 12898490 12157992 12375399 12253709 12867436 13140790 12803212 12839516 12686882
2609 12686882 13131636 12764400 11973061 12084034 11611154 11678579 12602115 12356075 11949775 11675756
2599 11675756 11547482 11094284 11584738 11066437 10335306 10572695 11351536 11532973 10818536
$$ packed form
2667B1227222j039484k39176o22869k38853k00892P67065j014181n39741O24825
2658A8723916k73771k25006j51090n51172N20969o78950m0963r09240N1585Q1235
2648A6547513l96568L70571p11592m21196J21178L05004l36797k48035K66374
2639A5496452n05474j5725O40266M27846k4847o64850n01600Q2896p77505q3884
2629A4073575N70277o85946k3606o03465O4126l87657k65866R1461M86329K55972
2619A3575200j77910m98800p40498K17407j21690O13727K73354l37578L6304j52634
2609A2686882M44754l67236p91339J10973m72880O7425R23536k46040m06300k74019
2599A1675756j28274m53198M90454n18301p31131K37389P78841J81437p14437
$$ plain form
2590 10818536 11201160 9941377 10112001 10524874 9958132 10232996 11024816 10501669 10396810
2581 10396810 10897907 10859869 10201638 10621530 11002254 10829669 11215008 11220016 10381311 9576506
2571 9576506 10056597 9324702 8757064 8648551 9521318 10110727 9867005 9436605 9686696 9175811
2561 9175811 9279377 8982868 9248083 10330576 9865703 9253593 8892058 9480589 9654948
2552 9654948 9842974 9985915 10178417 8592855 8447673 8610624 8666757 7468376 7431203 7199847
2542 7199847 6488459 7112299 7546720 7809471 7907902 7685129 7737205 7602267 7326525 7640990
2532 7640990 7595298 8111538 8409417 8187341 7667641 7565342 7788496 7675894 8033128 8265062
2522 8265062 8743237 8852536 8545588 7735879 7577428 7882549 7240945 7439513 7211120 7155290
$$ packed form
2590A0818536L82624j259783J70624M12873n66742K74864P91820n23147j04859
2581A0396810N01097l8038o58231M19892L80724j72585L85339N008q38705q04805
2571I576506M80091p31895n67638j08513Q72767N89409k43722m30400K50091n10885
2561I175811J03566k96509K65215J082493m64873o12110l61535N88531J74359
2552I654948J88026J42941J92502j585562j45182J62951N6133j198381l7173k31356
2542G199847p11388O23840M34421K62751R8431k22773N2076j34938k75742L14465
2532G640990m5692N16240K97879k22076n19700j02299K23154j12602L57234K31934
2522H265062M78175J09299l06948q09709j58451L05121o41604J98568k28393n5830
$$ plain form
2512 7155290 6852785 7020525 6598022 6405074 6506112 6421594 6692402 6375193 6071949 6680467
2502 6680467 6805917 6437208 6797949 7880424 7015231 6665762 6846206 6614472 6477598
2493 6477598 6409794 6142369 5664172 6463788 6710433 6741496 5852205 6368722 6839534 6413950
2483 6413950 6567727 6225278 5826030 5672779 6103642 5993843 6321054 6891947 6704599 6375090
2473 6375090 6521413 6112508 5833836 5976375 6404071 6507519 6913203 6395167 6350020 6654732
2463 6654732 6503131 6005641 5880242 5872022 4790829 5166515 5423978 6052636 5816899 5464790
2453 5464790 5317676 5101337 5203036 4464816 4136280 4327125 5130059 5604058 5617895 5118244
2443 5118244 4927107 5433940 5578052 4857074 4373211 5069623 5777130 6179648 5887567 4885935
$$ packed form
2512G155290l02505J67740m22503j92948J01038q4518K70808l17209l03244O08518
2502F680467J25450l68709L60741J082475q65193l49469J80444k31734j36874
2493F477598o7804k67425m78197P99616K46645L1063q89291N16517M70812m25584
2483F413950J53777l42449l99248j53251M30863j09799L27211N70893j87348l29509
2473F375090J46323m08905k78672J42539M27696J03448M05684n18036m5147L04712
2463F654732j51601m97490j25399q220j081193L75686K57463O28658k35737l52109
2453E464790j47114k16339J01699p38220l28536J90845Q02934M73999J3837m99651
2443E118244j91137N06833J44112p20978m83863O96412P07507M02518k92081j001632
$$ plain form
2433 4885935 5436814 5343649 5696262 4692370 3759132 4348317 4932902 4583775 4544216 5396019
2423 5396019 5592688 4843152 4957102 5009147 5286961 4850307 4228631 3948642 4617137 4532483
2413 4532483 4160029 4439821 4268743 4189185 4035961 4613592 4193648 4637328 4500905 4476246
2403 4476246 4726346 4443624 4459440 4472924 4096228 4718785 4113837 4613896 4716828 4633694
2393 4633694 4863587 4616614 5263721 5065644 4370527 4477334 3834503 4362656 5256779 5160967
2383 5160967 4911616 5061072 5076672 5049132 5349346 4984466 5106915 5420209 4850626 5294336
2373 5294336 5988021 5394110 5318660 5119749 4532517 5048198 4873216 4221521 3892010 4740231
2363 4740231 4300001 3961014 4768656 4672769 4793666 4768537 4827693 4395691 4606505 3734398
$$ packed form
2433D885935N50879r3165L52613j003892r33238N89185N84585l49127l9559Q51803
2423E396019J96669p49536J13950N2045K77814m36654o21676k79989O68495q4654
2413D532483l72454K79792j71078p9558j53224N77631m19944M43680j36423k4659
2403D476246K50100k82722J5816J3484l76696O22557o04948N00059J02932q3134
2393D633694K29893k46973O47107j98077o95117J06807o42831N28153Q94123r5812
2383E160967k49351J49456J5600k7540L00214l64880J22449L13294n69583M43710
2373E294336O93685n93911p5450j98911n87232N15681j74982o51695l29511Q48221
2363D740231m40230l38987Q07642r5887J20897k5129N9156m32002K10814q72107
$$ plain form
2353 3734398 3951822 4837005 4194934 3590067 3715615 4425876 4292026 3789950 3695171 4507160
2343 4507160 4138108 4575222 4251521 3337836 4933846 5229260 5207373 4676403 3990335 4181194
2333 4181194 4239510 3987526 3491975 2993778 3084268 3298644 3530218 3701771 3046370 3367087
2323 3367087 3646341 4055904 4399846 4709121 3378512 2735497 3502707 3746940 3389403
2314 3389403 3370040 3153260 3274278 3858957 4928296 4510572 3763901 2911354 3689500 4628311
2304 4628311 3500344 4290195 3638425 2713060 2865375 2708573 3553900 3129572 3413147
2295 3413147 4209106 3803729 4019544 3484205 3805935 4350461 3340573 2716399 2992244
2286 2992244 3828849 3863539 3808228 3770396 3416431 3646556 3663352 3455344 3386950 2980536
$$ packed form
2353C734398K17424Q85183o42071o04867J25548P10261j33850n02076r4779Q11989
2343D507160l69052M37114l23701r13685J596010K95414k1887n30970o86068J90859
2333D181194N8316k51984m95551m98197R0490K14376K31574J71553o55401L20717
2323C367087K79254M09563L43942L09275j330609o43015P67210K44233l57537
2314C389403j9363k16780J21018N84679J069339m17724p46671q52547P78146R38811
2304D628311j127967P89851o51770r25365J52315j56802Q45327m24328K83575
2295C413147P95959m05377K15815n35339L21730N44526j009888o24174K75845
2286B992244Q36605L4690n5311l7832l53965K30125J6796k08008o8394m06414
$$ plain form
2276 2980536 2586297 2665225 2216288 2339111 2813237 3016122 3219449 3621412 4062805 4055544
2266 4055544 3900687 4550624 3510081 3198709 4176742 4641416 4008106 4045962 3611642 3532240
2256 3532240 3066889 3037074 3843293 4414809 3704189 4524332 4353988 3822168 3535151 3707635
2246 3707635 2838166 3495272 4693765 3985267 3559022 3572958 3656020 3308984 4259165 4953874
2236 4953874 5123093 4613962 5019656 4212736 3948783 4488571 4750458 4627867 4980814 5646953
2226 5646953 5693361 5896971 5478083 4812261 5094088 6501081 5593562 5487780 5577208 5427785
2216 5427785 5679612 5657553 6302045 5917972 5937010 6351429 6373059 6349303 6606629 7067270
2206 7067270 7035491 6918648 6992297 6350937 6439601 6265621 6229888 6044489 5527015 6021374
$$ packed form
2276B980536l94239P8928m48937J22823M74126K02885K03327M01963M41393p261
2266D055544j54857O49937j040543l11372R78033M64674o33310L7856m34320p9402
2256C532240m65351k9815Q06219N71516p10620Q20143j70344n31820k87017J72484
2246C707635q69469O57106J198493p08498m26245J3936Q3062l47036R50181O94709
2236D953874J69219n09131M05694q06920k63953N39788K61887j22591L52947O66139
2226E646953M6408K03610m18888o65822K81827J406993r07519j05782Q9428j49423
2216E427785K51827k2059O44492l84073J9038M14419K1630k3756K57326M60641
2206G067270l1779j16843P3649o41360Q8664j73980l5733j85399n17474M94359
$$ plain form
2196 6021374 6323905 6944772 7338483 7287039 6873287 7250487 7233677 7469096 7470555 6693720
2186 6693720 6599328 6824980 7170232 7704496 7324912 7255746 7565688 6631222 7022487 8022007
2176 8022007 7968684 8275168 8964471 7603356 7742125 8011704 8012320 8603503 8647052 8378838
2166 8378838 8341611 8229236 8879317 9256714 9375432 9935494 9877997 9988294 10598967 10704204
2156 10704204 10616699 11223387 11762358 12800447 13301435 13467220 13483748 13229086 14355801
2147 14355801 14989137 15764569 16015374 16481191 17679745 18266058 18545600 19131089 20022024
2138 20022024 21293908 22254127 22678813 23304486 25008765 25864513 25373732 26585266 28654094
2129 28654094 29081393 30470257 31409671 33929932 35091883 37204549 39679532 42934055
$$ packed form
2196F021374L02531O20867L93711n1444m13752L77200j6810K35419J459p76835
2186F693720r4392K25652L45252N34264l79584o9166L09942r34466L91265R99520
2176H022007n3323L06484O89303j361115J38769K69579O16N91183M3549k68214
2166H378838l7227j12375O50081L77397J18718N60062n7497J10297O10673J05237
2156A0704204q7505O06688N38971J038089N00988J65785J6528k54662J126715
2147A4355801O33336P75432K50805M65817J198554N86313K79542N85489Q90935
2138B0022024J271884R60219M24686O25673J704279Q55748m90781J211534K068828
2129B8654094M27299J388864R39414K520261J161951K112666K474983L254523
$$ plain form
2121 42934055 47235209 51834918 55485976 57905764 60259852 64904006 70290198 77494416
2113 77494416 85891287 97160545 111395820 132253883 159849765 196251136 240881331
2106 240881331 307282717 380686228 402441451 338572229 245602502 185552527 146473227
2099 146473227 121073667 101583286 85869852 73855321 66026748 58843003 53848471
2092 53848471 50720094 49730552 47970088 46183204 42479439 38134853 34370190 31511549
2084 31511549 28561720 26636306 24435058 23706249 22373441 22296906 21774518 20771215 19391142
2075 19391142 18218862 17236078 17017347 16362764 15161892 14826838 14187546 13931763 14108993
2066 14108993 13729109 13399190 13244438 12498166 11808065 11679934 10741391 10639408 10833941
$$ packed form
2121D2934055M301154M599709L651058K419788K354088M644154N386192P204218
2113G7494416Q396871J1269258J4235275K0858063K7595882L6401371M4630195
2106B40881331O6401386P3403511K1755223o3869222r2969727o0049975l9079300
2099A46473227k5399560j9490381j5713434j2014531p828573p183745m994532
2092E3848471l128377r89542j760464j786884l703765m344586l764663k858641
2084C1511549k949829j925414k201248p28809j332808p6535n22388j003303j380073
2075A9391142j172280r82784k18731o54583j200872l35054o39292k55783J77230
2066A4108993l79884l29919j54752p46272o90101j28131r38543j01983J94533
$$ plain form
2057 10833941 10329084 9512946 9754928 10894452 10238504 9161050 8822212 9211855 8668064
2048 8668064 8353428 8580271 8252175 6673675 6659937 6436518 6816769 7973238 7276082
2039 7276082 6319863 5504382 6423655 6444571 5542100 6075133 6581228 6239721 6686897 5890291
2029 5890291 5744967 6258047 5298535 5672846 5150799 4597380 4647168 4375905 4022193 4281644
2019 4281644 3984148 4410113 4598677 4701401 4566570 3887553 3442577 4175070 4478366 3756444
2009 3756444 3304788 3535345 3670952 3616143 3807662 2865074 2363699 2651028 3435671 3768490
1999 3768490 3731938 3886298 4676865 4488553 3748927 3876577 3212973 2700395 2200258 2726857
1989 2726857 3574891 2876722 1934976 2143468 1787823 2115608 2336886 3235892 3651995 3649891
$$ packed form
2057A0833941n04857q16138K41982J139524o55948j077454l38838L89643n43791
2048H668064l14636K26843l28096j578500j3738k23419L80251J156469o97156
2039G276082r56219q15481R19273K0916r02471N33033N06095l41507M47176p96606
2029E890291j45324N13080r59512L74311n22047n53419M9788k71263l53712K59451
2019D281644k97496M25965J88564J02724j34831o79017m44976P32493L03296p21922
2009C756444m51656K30557J35607n4809J91519r42588n01375K87329P84643L32819
1999C768490l6552J54360P90567j88312p39626J27650o63604n12578n00137N26599
1989B726857Q48034o98169r41746K08492l55645L27785K21278Q99006M16103k104
$$ plain form
1979 3649891 2882655 3149796 2859592 2637517 2928062 2857620 2683801 2254430 2452075 2993324
1969 2993324 2832940 1981237 2317057 3148211 2662616 2531009 2595553 2213009 2091927 2432201
1959 2432201 1712891 2071869 2480366 3007718 2823594 2113548 1440333 1350175 1767632 1246033
1949 1246033 1858892 2054130 1957971 2276569 1816397 1759511 2249680 2083117 2194558 2290890
1939 2290890 1967498 2381732 2325629 2323661 2206624 1024152 1595730 1791062 1489126 2062578
1929 2062578 1495378 1353727 2264441 1153393 1243436 1297572 1311368 1837099 1261411 260906
1919 260906 733687 1691193 2717142 1913491 1406899 974749 1341441 900252 1378885 1122935
1909 1122935 1796748 1782223 1290680 1789145 1216216 1352334 2257575 1639322 799857 1092749
$$ packed form
1979C649891p67236K67141k90204k22075K90545p0442j73819m29371J97645N41249
1969B993324j60384q51703L35820Q31154m85595j31607O4544l82544j21082L40274
1959B432201p19310L58978M08497N27352j84124p10046o73215r0158M17457n21599
1949A246033O12859J95238r6159L18598m60172n6886M90169j66563J11441R6332
1939B290890l23392M14234n6103j968j17037j182472N71578J95332l01936N73452
1929B062578n67200j41651R10714j111048R0043N4136J3796N25731n75688j000505
1919B60906M72781R57506J025949q03651n06592m32150L66692m41189M78633k55950
1909A122935O73813j4525m91543M98465n72929J36118R05241o18253q39465K92892
$$ plain form
1899 1092749 1199474 1178093 854050 1212783 1088249 2232986 2646394 2650193 1786399 1840809
1889 1840809 2047204 1652209 1138543 1450792 705636 1015536 1088945 949663 1152483 1501720
1879 1501720 1179386 939209 1067921 672034 692926 738935 1036191 1004642 934778 494942
1869 494942 907699 425800 449576 1238868 1153248 1575545 1768523 2223901 1873577 563666
1859 563666 747734 1145933 1277348 1043590 1613693 2536992 2311601 1313275 1525620 1372805
1849 1372805 1316752 1710558 2019775 2008837 1843326 1484105 1173229 1415252 1267913 1658389
1839 1658389 2324560 2474042 2644665 2737116 2184039 2854711 2348220 623375 742686 2539914
1829 2539914 2880223 1525568 1381634 1429102 1134555 1690336 1499006 1505828 1328531 467210
$$ packed form
1899A092749J06725k1381l24043L58733j24534J144737M13408L799q63794N4410
1889A840809K06395l94995n13666L12249p45156L09900P3409j39282K02820L49237
1879A501720l22334k40177J28712l95887K0892M6009K97256l1549o9864m39836
1869D94942M12757m81899K3776P89292q5620M22297J92978M55378l50324j309911
1859E63666J84068L98199J31415k33758N70103R23299k25391r98326K12345j52815
1849A372805n6053L93806L09217j0938j65511l59221l10876K42023j47339L90476
1839A658389O66171J49482J70623R2451n53077O70672n06491j724845J19311J797228
1829B539914L40309j354655j43934M7468k94547N55781j91330O822j77297q61321
$$ plain form
1819 467210 662920 1227835 1409745 1056759 1126552 470436 445118 1083482 1369165 1485361
1809 1485361 788846 716385 1430035 552140 1180467 1092045 1161574 1626226 869313 175246
1799 175246 1536544 2194634 1381007 1779729 1776509 1714629 1108357 941048 1716264 1825141
1789 1825141 591756 778469 435534 321850 49027 -368060 1046737 382719 -287413
1780 -287413 -41059 316089 220701 394614 1041296 322999 946498 254737 -339083 -106923
1770 -106923 424557 402200 108748 838113 1504876 1091003 745548 669356 -462387 171424
1760 171424 808495 545862 140507 -341241 -123791 -210751 279449 1136488 755597 392945
1750 392945 20519 147336 476858 103617 526812 672097 957315 1136968 335977 831415
$$ packed form
1819D67210J95710N64915J81910l52986O9793o56116k5318O38364K85683J16196
1809A485361o96515p2461P13650q77895O28327q8422O9529M64652p56913o94067
1799A75246J361298O58090q13627L98722l220o1880o06272j67309P75216J08877
1789A825141j233385J86713l42935j13684k72823m17087J414797o64018o70132
1780b87413K46354L57148r5388J73913O46682p18297O23499o91761n93820K32160
1770a06923N31480k2357k93452P29365O66763m13873l45455p6192j131743O33811
1760A71424O37071k62633m05355m81748K17450q6960M90200Q57039l80891l62652
1750C92945l72426J26817L29522l73241M23195J45285K85218J79653q00991M95438
$$ plain form
1740 831415 1111242 923040 1598173 1147129 767525 381975 98776 556449 756115 1342940
1730 1342940 896981 712037 908365 1281240 902588 557930 797692 497596 294105 -442253
1720 -442253 -356867 373019 901559 870426 819701 600247 492064 219443 880996 1215495
1710 1215495 552537 696935 681067 567601 1190111 367597 207582 644314 366434 633329
1700 633329 469091 675597 1307825 364039 -41269 136545 586614 1144353 1176649 1415081
1690 1415081 31953 550119 599347 -15059 -263460 -686533 98500 911119 956055 -36174
1680 -36174 -100870 559797 1008354 551346 599084 801552 951298 998276 226874 166986 517181
1669 517181 789404 701834 1467769 1823305 1456012 1154022 1245456 1123790 1200241 912194
$$ packed form
1740H31415K79827j88202O75133m51044l79604l85550k83199M57673J99666N86825
1730A342940m45959j84944J96328L72875l78652l44658K39762l00096k03491p36358
1720d42253Q5386P29886N28540l1133n0725k19454j08183k72621O61553L34499
1710A215495o62958J44398j5868j13466O22510q22514j60015M36732k77880K66895
1700F33329j64238K06506O32228r43786m05308J77814M50069N57739L2296K38432
1690A415081j383128N18166M9228o14406k48401m23073P85033Q12619M4936r92229
1680c6174o4696O60667M48557m57008M7738K02468J49746M6978p71402n9888L50195
1669E17181K72223q7570P65935L55536l67293l01990R1434j21666P6451k88047
$$ plain form
1659 912194 926598 1054497 795922 170089 -530398 221487 221564 -56859 -190326 -134186 -215427
1648 -215427 220604 -684915 257411 232706 139756 464465 400120 777851 205040 923978
1638 923978 734991 902508 -12301 -206755 430104 996820 1253964 596045 791041 1318900
1628 1318900 467059 -645391 -590092 -155947 771228 509620 962207 743604 829357 1101589
1618 1101589 1115111 1234332 1622718 1915550 1062110 774970 61154 -871227 -659807 -327050
1608 -327050 -206087 -4868 366082 536734 -321482 -1645 -443258 -231357 771679 1033020
1598 1033020 1474767 1309330 670748 562176 537980 922536 946353 205071 90656 256028
1588 256028 266462 903373 687648 993656 265072 1034639 710549 234046 145559 -154529
$$ packed form
1659I12194J4404J27899k58575o25833p00487P51885P7k78423j33467N6140q1241
1648b15427M36031r05519R42326k4705r2950L24709o4345L77731n72811P18938
1638I23978j88987J67517r14809j94454O36859N66716K57144o57919J94996N27859
1628A318900q51841j112450N5299M34145R27175k61608M52587k18603Q5753K72232
1618A101589J3522J19221L88386K92832q53440k87140p13816r32381K11420L32757
1608c27050J20963K01219L70950J70652q58216L19837m41613K11901J003036K61341
1598A033020M41747j65437o38582j08572k4196L84556K3817p41282j14415J65372
1588B56028J0434O36911k15725L06008p28584P69567l24090m76503q8487l00088
$$ plain form
1578 -154529 -91224 -423195 55360 449659 1189825 367855 681272 673634 255129 566098
1568 566098 1241 71708 -229498 640438 758189 281361 -142940 -179600 63627 5350
1558 5350 90980 -536970 -200129 837512 1837688 1262973 -303191 -422233 -87658 55836
1548 55836 377702 -117777 54694 -136994 34164 248722 540275 871152 272903 244522
1538 244522 -108997 210256 -383295 -467833 -433477 -183679 102 -610317 -539574 -519575
1528 -519575 147984 571069 -233011 -641743 -265808 -34320 -99841 -686785 314522 413460
1518 413460 958700 964592 -665393 402884 933047 1016120 691616 117269 434301 466548
1508 466548 1066933 777950 316181 -429809 -697387 -509932 671435 1067051 543450 238358
$$ packed form
1578a54529O3305l31971M78555L94299P40166q21970L13417p638m18505L10969
1568E66098n64857P0467l01206Q69936J17751m76828m24301l6660K43227n8277
1558E350Q5630o27950L36841J037641J000176n74715j566164j19042L34575J43494
1548E5836L21866m95479J72471j91688J71158K14558K91553L30877n98249k8381
1538B44522l53519L19253n93551q4538L4356K49798J83781o10419P0743J9999
1528e19575O67559M23085q04080m08732L75935K31488o5521n86944J001307R8938
1518D13460N45240N892j629985J068277N30163Q3073l24504n74347L17032L2247
1508D66548O00385k88983m61769p45990k67578J87455J181367L95616n23601l05092
$$ plain form
1498 238358 283140 -248008 -41170 -195246 12916 634473 602342 423220 389081 -397521
1488 -397521 -405305 -157294 661062 1017941 1304342 1040263 234790 -283194 560602 602515
1478 602515 305771 -2599 -734060 -518672 728482 475891 266071 74447 -201655 -52494
1468 -52494 -722069 -127035 -358060 176294 488835 -107966 464986 585085 158290 357081
1458 357081 -157451 -203161 169372 -21627 10425 -95266 -362278 148834 378644 173415
1448 173415 249508 1135026 1230639 1326302 357920 -40031 -286061 97813 523978 141213
1438 141213 64740 651753 495153 352274 650055 523072 1024079 1123588 263374 484135
1428 484135 225469 -210756 -70580 376105 735419 810945 15065 514312 267667 -134911
$$ packed form
1498B38358M4782n31148K06838j54076K08162O21557l2131j79122l4139p86602
1488c97521p784K48011Q18356L56879K86401k64079q05473n17984Q43796M1913
1478F02515k96744l08370p31461K15388J247154k52591k09820j91624k76102J49161
1468e2494o69575N95034k31025N34354L12541n96801N72952J20099m26795J98791
1458C57081n14532m5710L72533j90999L2052j05691k67012N11112K29810k05229
1448A73415P6093Q85518R5613R5663r68382l97951k46030L83874M26165l82765
1438A41213p6473N87013j56600j42879K97781j26983N01007R9509q60214K20761
1428D84135k58666m36225J40176M46685L59314P5526p95880M99247k46645m02578
$$ plain form
1418 -134911 168691 802379 274291 -93796 368794 234585 -40758 -488985 888019 2004393
1408 2004393 1440155 1347997 1110758 565377 59727 143040 221586 -63475 366870 -111673
1398 -111673 36979 358275 779698 -134989 428005 6664 114613 1066931 524612 555513
1388 555513 1000877 166404 195978 990738 635637 901262 977949 -25156 118157 1027651
1378 1027651 1182833 485985 130160 703668 86287 293619 549374 1301669 810862 610400
1368 610400 778363 1177411 669848 974240 911895 427668 754121 66252 -212436 -226350
1358 -226350 229617 45359 291920 683861 244385 -490263 -1477444 -609205 196262 95044
1348 95044 220752 -58432 -398331 422178 699920 100164 735595 -147404 -93027 322791
$$ packed form
1418a34911L03602O33688n28088l68087M62590j34209k75343m48227J377004J116374
1408B004393n64238r2158k37239n45381n05650Q3313P8546k85061M30345m78543
1398a11673J48652L21296M21423r14687N62994m21341J07949R52318n42319L0901
1388E55513M45364q34473K9574P94760l55101K65625P6687j003105J43313R09494
1378A027651J55182o96848l55825N73508o17381K07332K55755P52295m90807k00462
1368F10400J67963L99048n07563L04392o2345m84227L26453o87869k78688j3914
1358b26350M55967j84258K46561L91941m39476p34648r87181Q68239Q05467j01218
1348I5044J25708k79184l39899Q20509K77742n99756O35431q82999N4377M15818
$$ plain form
1338 322791 -249344 300508 181676 433332 356047 558118 786187 563079 -24096 -701657
1328 -701657 -53191 -300730 -463518 -254901 -837640 -736065 180737 507186 722499 851348
1318 851348 772356 355791 -49758 -379547 -356601 -850554 -942962 -278742 11626 497546
1308 497546 33101 62515 364117 -326316 36063 81765 231859 499941 241097 292902
1298 292902 -36746 202764 1099239 20435 -234376 13908 321492 69745 -363614 -271487
1288 -271487 523625 364969 497468 482765 220980 -305085 504525 1167927 62540 -434621
1278 -434621 247939 218161 574988 566909 -542311 -1256377 -166740 279648 -78288 -292005
1268 -292005 -554741 30811 7809 -496511 -19921 -73987 -217755 -273069 678131 862964
$$ packed form
1338C22791n72135N49852j18832K51656p7285K02071K28069k23108n87175o77561
1328g01657O48466k47539j62788K08617n82739J01575R16802L26449K15313J28849
1318H51348p8992m16565m05549l29789K2946m93953r2408O64220K90368M85920
1308D97546m64445K9414L01602o90433L62379M5702J50094K68082k58844N1805
1298B92902l29648K39510Q96475j078804k54811K48284L07584k51747m33359R2127
1288b71487P95112j58656J32499j4703k61785n26065Q09610O63402j105387m97161
1278d34621O82560k9778L56827q079j109220p14066J089637M46388l57936k13717
1268b92005k62736N85552k3002n04320M76590n4066j43768n5314R51200J84833
$$ plain form
1258 862964 534051 -81223 -252820 200113 -180777 145934 -623969 -1008034 -451890 -648176
1248 -648176 -1100987 -229822 -40794 394971 290489 459478 -51661 343672 305450 22717
1238 22717 659401 263359 672784 1347349 -154038 358330 381837 -547011 -1737090 -1124816
1228 -1124816 -731070 -899103 -1144847 -660982 164893 -384425 -164456 262891 -420547 6137
1218 6137 -197350 69883 413308 -33509 -513894 620934 1258518 -50300 -61586 715364
1208 715364 -98899 -902689 -42418 -83093 53166 404819 -326273 -492646 -902612 -503511
1198 -503511 558732 -15288 38136 659430 167281 -175331 -692642 -1378454 -1376754 -841538
1188 -841538 449192 -24752 -598168 -518347 -796524 -940909 51747 249686 -73700 -381573
$$ packed form
1258H62964l28913o15274j71597M52933l80890L26711p69903l84065N56144j96286
1248f48176m52811Q71165J89028M35765j04482J68989n11139L95333l8222k82733
1238B2717O36684l96042M09425O74565j501387N12368K3507r28848j190079O12274
1228a124816L93746j68033k45744M83865Q25875n49318K19969M27347o83438M26684
1218F137k03487K67233L43425m46817m80385J134828O37584j308818j1286P76950
1208G15364q14263q03790Q60271m0675J36259L51653p31092j66373m09966L99101
1198e03511J062243n74020N3424O21294m92149l42612n17311o85812J700N35216
1188h41538J290730m73944n73416P9821k78177j44385R92656J97939l23386l07873
$$ plain form
1178 -381573 -954675 -101199 239033 -354001 -493660 -648135 -147550 212389 879439 245997
1168 245997 112895 -61923 482346 471073 945501 763833 -163651 -397504 -1068655 -462030
1158 -462030 -151105 320826 593148 318250 34320 -579308 -263253 -132693 -624781 -763335
1148 -763335 -285771 -491801 -208970 278696 440674 228251 -443726 -219332 344138 -307989
1138 -307989 -442871 -700217 -1055725 -665261 -62320 -350107 216422 1006645 -73106 -561658
1128 -561658 -194890 -99199 -589052 -565741 407858 659932 235122 -1098304 -541135 -73943
1118 -73943 388858 796719 -445996 -1106546 -1167087 -864255 -942497 -110216 -271177 -286599
1108 -286599 -272537 -540592 -187178 893850 696374 469523 -323929 -1301808 -969489 -584198
$$ packed form
1178c81573n73102Q53476L40232n93034j39659j54475N00585L59939O67050o33442
1168B45997j33102j74818N44269j1273M74428j81668r27484k33853o71151O06625
1158d62030L10925M71931K72322k74898k83930o13628L16055J30560m92088j38554
1148g63335M77564k06030K82831M87666J61978k12423o71977K24394N63470o52127
1138c07989j34882k57346l55508L90464O02941k87787N66529P90223j079751m88552
1128e61658L66768R5691m89853K3311R73599K52074m24810j333426N57169M67192
1118g3943M62801M07861j242715o60550o0541L02832p8242Q32281j60961j5422
1108b86599J4062k68055L53414J081028j97476k26851p93452r77879L32319L85291
$$ plain form
1098 -584198 210853 295259 -5895 568373 292575 -682282 -170138 234928 -604218 -223526
1088 -223526 -383992 -364245 -1289074 -967900 -97248 70699 -448115 419213 210748 81643
1078 81643 143639 -68891 353694 402514 230113 -485356 -808432 -846724 -481158 -464415 147038
1067 147038 135001 25888 -156290 -189587 -611777 -914147 -453182 -76312 38102 166457
1057 166457 -82033 -295732 165330 472555 -210531 -364867 -611737 147740 489227 47132
1047 47132 240793 567482 850722 267845 -116053 -15414 -103226 228439 783854 611391
1037 611391 488141 -90019 532495 287866 555714 473799 652156 1052078 331070 718149
1027 718149 310748 -40779 -584134 -270243 -120309 704435 374129 273160 -832573 -273123
$$ packed form
1098e84198P95051Q4406l01154N74268k75798r74857N12144M05066q39146L80692
1088b23526j60466J9747r24829L21174Q70652J67947n18814Q67328k08465j29105
1078H1643O1996k12530M22585M8820j72401p15469l23076l8292L65566J6743O11453
1067A47038j2037j09113j82178l3297m22190l02370M60965L76870J14414J28355
1057A66457k48490k13699M61062L07225o83086j54336k46870P59477L41487m42095
1047D7132J93661L26689K83240n82877l83898J00639q7812L31665N55415j72463
1037F11391j23250n78160O22514k44629K67848q1915J78357L99922p21008L87079
1027G18149m07401l51527n43355L13891J49934Q24744l30306j00969j105733N59450
$$ plain form
1017 -273123 -155754 16434 298177 257630 242293 301925 24774 -462368 -768846 -656823
1007 -656823 -240725 -368439 63722 374670 433205 646180 847397 411046 456325 -323291
997 -323291 -422791 -571680 -659831 -64760 -891493 -641308 377748 228671 200628 44356
987 44356 -25313 -901976 -542294 -45923 123200 233573 -246199 -1310187 -825633 100004
977 100004 90224 416057 473095 467015 260986 -467473 -1095438 -485837 427047 434393 809074
966 809074 267492 595817 239275 -517301 734343 618535 -483411 -275221 -621566 -177756
956 -177756 61678 1132033 1312429 792789 875952 509172 -247708 -214061 -239920 412773
946 412773 701074 194983 256225 556489 908551 746081 747892 -288064 74972 277791
$$ packed form
1017b73123J17369J72188K81743m0547j5337N9632k77151m87142l06478J12023
1007f56823M16098j27714M32161L10948N8535K12975K01217m36351M5279p79616
997c23291r9500j48889q8151N95071q26733K50185J019056j49077k8043j56272
987D4356o9669q76663L59682M96371J69123J10373m79772j063988M84554R25637
977A00004r780L25833N7038o080k06029p28459o27965O09601R12884P346L74681
966H09074n41582L28325l56542p56576J251644j15808j101946K08190l46345M43810
956a77756K39434J070355J80396n19640Q3163l66780p56880L3647k5859O52693
946D12773K88301n06091O1242L00264L52062j62470J811j035956L63036K02819
$$ plain form
936 277791 -308290 55617 487574 766347 553973 -256268 251861 493420 397279 -151770
926 -151770 245669 333174 -496366 154278 368182 10661 410178 532883 669782 880228
916 880228 67285 -984293 -1142399 -1634651 -470063 368981 236398 564668 279067 -630247
906 -630247 -824737 -769041 -901215 -385639 -8705 -593731 -162589 863726 1542268 946958
896 946958 123135 165545 -415585 -595467 -448093 383532 118645 -64299 -151833 230786
886 230786 626545 701800 176631 240142 542619 -91861 -155973 427055 324482 558187
876 558187 716908 983369 782146 -37051 825928 416610 153801 215059 584132 -46376
866 -46376 -270172 -907916 -701356 -149328 -443020 185138 337315 -435703 -143693 569399
$$ packed form
936B77791n86081L63907M31957K78773k12374q10241N08129K41559r6141n49049
926a51770L97439Q7505q29540O50644K13904l57521L99517J22705J36899K10446
916H80228q12943j051578j58106m92252J164588Q39044j32583L28270k85601r09314
906f30247j94490N5696j32174N15576L76934n85026M31142J026315O78542n95310
896I46958q23823M2410n81130j79882J47374Q31625k64887j82944q7534L82619
886B30786L95759P5255n25169O3511L02477o34480o4112N83028j02573K33705
876E58187J58721K66461k01223q19197Q62979m09318k62809O1258L69073o30508
866d6376k23796o37744K06560N52028k93692O28158J52177p73018K92010P13092
$$ plain form
856 569399 -9597 -775927 -333566 338745 266177 289399 191085 -97157 -369527 -315973 -107028
845 -107028 -9792 -13170 536862 -407918 -110096 -98714 463002 927032 994626 -73342 -700962
834 -700962 1382 275512 -113088 72786 167992 -76131 415916 -189823 -65684 -164193
824 -164193 -341648 -382070 -586545 -637068 -267402 -176098 -240282 -418594 -798391 -677565 -631764
813 -631764 -1295389 -1018337 -799174 -1013858 -853255 -138287 357759 109148 279605 318578
803 318578 -74035 -212931 -760329 -967787 -102848 -46878 -440333 -301397 -640289 -185018
793 -185018 124351 341615 1021110 185925 -52578 590598 936393 347026 42609 -710771
783 -710771 -45330 553891 154916 60599 369072 619194 217255 371561 230757 -15301
$$ packed form
856E69399n78996p66330M42361O72311p2568K3222r8314k88242k72370N3554K08945
845a07028R7236l378N50032r44780K97822J1382N61716M64030O7594j067968o27620
834g00962P02344K74130l88600J85874R5206k44123M92047o05739J24139r8509
824a64193j77455m0422k04475n0523L69666R1304o4184j78312l79797J20826M5801
813f31764o63625K77052K19163k14684J60603P14968M96046k48611J70457L8973
803C18578l92613j38896n47398k07458Q64939N5970l93455J38936l38892M55271
793a85018L09369K17264O79495q35185k38503O43176L45795n89367l04417p53380
783g10771O65441N99221l98975r4317L08473K50122m01939J54306j40804k46058
$$ plain form
773 -15301 -496931 67165 294746 450826 325714 -283298 -527961 132391 941609 576797
763 576797 -277596 103014 130650 -131262 267387 538895 -463240 -781357 -1010854 -282171
753 -282171 120867 -64048 -1035072 -832404 -222341 -412418 -1187843 -860451 -536640 -1096555
743 -1096555 -169725 -264939 -215546 -524170 -385450 362954 203562 -15573 158212 -115522
733 -115522 -518735 -1207492 -1707076 -1067432 -266914 -90926 149829 -548449 1765 430592
723 430592 -67275 -938205 -877929 -326451 -155145 -530773 272893 409457 498907 -165051
713 -165051 -65792 235286 471706 788889 601458 663369 -108784 -761417 317373 784197
703 784197 -320074 113699 1068950 798378 430750 -98325 -26849 -111240 -205270 101017
$$ packed form
773a5301m81630N64096K27581J56080j25112o09012k44663O60352Q09218l64812
763E76797q54393L80610K7636k61912L98649K71508j002135l18117k29497P28683
753b82171M03038j84915r71024K02668O10063j90077p75425L27392L23811n59915
743a096555R26830r5214M9393l08624J38720P48404j59392k19135J73785k73734
733a15522m03213o88757m99584O39644Q00518J75988K40755o98278N50214M28827
723D30592m97867q70930O0276N51478J71306l75628Q03666J36564Q9450o63958
713a65051R9259L01078K36420L17183j87431O1911p72153o52633J078790M66824
703G84197j104271M33773R55251k70572l67628n29075P1476q4391r4030L06287
$$ plain form
693 101017 587324 184267 -496299 -82433 -400950 -82996 -976815 -1078858 -1068443 -1108526
683 -1108526 -955719 -1386530 -996325 -632867 131298 349461 480421 168761 -134540 -369427
673 -369427 -741774 -361853 491391 276389 -638328 -285970 483314 -135867 526736 104806
663 104806 -1057633 -379080 591488 980015 -269573 98762 -207220 -360091 -250274 241445
653 241445 -98100 -478031 -966887 -1043997 -83924 -80393 -768640 171009 4387 316187
643 316187 -471984 -1501658 -1183180 -276459 -200030 -661450 -483443 -529610 -1224039 -961131
633 -961131 -892202 -2017587 -1379361 -667054 65661 -278244 -311913 34367 -425711 -471940
623 -471940 -405580 106984 -339575 -603925 -1320855 -852517 -260436 -331601 365818 154192
$$ packed form
693A01017M86307m03057o80566M13866l18517L17954q93819j02043J0415m0083
683a108526J52807m30811L90205L63458P64165K18163J30960l11660l03301k34887
673c69427l72347L79921Q53244k15002r14717L52358P69284o19181O62603m21930
663A04806j162439O78553R70568L88527j249588L68335l05982j52871J09817M91719
653B41445l39545l79931m88856p7110R60073L531o88247R39649j66622L11800
643C16187p88171j029674L18478R06721P6429m61420J78007m6167o94429K62908
633i61131O8929j125385O38226P12307P32715l43905l3669L46280m60078m6229
623d71940O6360N12564m46559k64350p16930M68338N92081p1165O97419k11626
$$ plain form
613 154192 -261804 -270454 472759 121858 798916 -256560 -581858 202537 143291 318542
603 318542 6607 -531250 -246863 -359850 -574048 -1106794 -1182051 -915745 -552157 -877483
593 -877483 -593359 -296366 462052 120782 -181554 211066 -643094 -443654 -304188 -239387
583 -239387 -799501 -899007 -872743 -21802 -291035 -292408 70798 -239688 59325 -948296
573 -948296 -191234 -114745 -799953 -908214 -334629 -316740 -595207 -97503 417309 -465523
563 -465523 -1280513 -504607 597702 590540 137736 62498 -743874 -365364 -499703 41385
553 41385 546852 604909 212065 -23436 84854 -189782 214521 502110 320203 104642
543 104642 -170622 -495004 -604500 -262506 -350471 -322344 -257534 323909 -557606 -847393
$$ packed form
613A54192m15996q650P43213l50901O77058j055476l25298P84395n9246J75251
603C18542l11935n37857K84387j12987k14198n32746p5257K66306L63588l25326
593h77483K84124K96993P58418l41270l02336L92620q54160J99440J39466O4801
583b39387n60114r9506K6264Q50941k69233j373L63206l10486K99013j007621
573i48296P57062P6489o85208j08261N73585J7889k78467M97704N14812q82832
563d65523q14990P75906J102309p162m52804p5238q06372L78510j34339N41088
553D1385N05467N8057l92844k35501J08290k74636M04303K87589j81907k15561
543A04642k75264l24382j09496L41994q7965K8127O4810N81443q81515k89787
$$ plain form
533 -847393 -275331 -739090 -696366 -179646 -226042 -1246729 -1211022 -539392 -45020 -101084
523 -101084 -233723 -398885 -132263 -43866 918118 65469 -860410 -1490760 -835960 -261173
513 -261173 -997654 -1387719 -671575 -155865 -1435954 -979792 490871 361068 281917 720715
503 720715 -81889 -211784 -501991 -418224 48142 233614 114741 265472 -290664 -282588
493 -282588 -261767 -209865 592356 -622463 -1013043 -458784 -690068 -93595 122200 -34364
483 -34364 35221 -1085769 -1163407 -926010 -724866 -472948 -979763 -493883 85531 -1114218
473 -1114218 -1857077 -648750 -903488 -509473 -365431 -406000 -266232 -309454 -13337 670385
463 670385 276659 -179713 -86657 -653982 -287634 249379 -344276 137558 -276758 -528894
$$ packed form
533h47393N72062m63759M2724N16720m6396j020687L5707O71630M94372n6064
523a01084j32639j65162K66622Q8397R61984q52649r25879o30350O54800N74787
513b61173p36481l90065P16144N15710j280089M56162J470663j29803p9151M38798
503G20715q02604j29895k90207Q3767M66366J85472j18873J50731n56136Q076
493b82588K0821N1902Q02221j214819l90580N54259k31284N96473K15795j56564
483c4364O9585j120990p7638K37397K01144K51918n06815M85880N79414j199749
473a114218p42859J208327k54738L94015J44042m0569J39768m3222K96117O83722
463F70385l93726m56372R3056n67325L66348N37013n93655M81834m14316k52136
$$ plain form
453 -528894 122432 64241 -207086 -329747 -552497 -284251 -629240 -667779 -82918 -324804
443 -324804 -108545 -368326 -281755 -178995 -59226 -265724 -1066867 -622093 -435250 -315627
433 -315627 -92879 4591 -671432 -1339624 -810189 -1000199 -551272 -471631 -584211 -1097293
423 -1097293 -1119093 -864348 -690039 -407161 -803246 -322798 -54846 -608357 -1002315 -836414
413 -836414 -166818 -78872 -799003 -1092134 -457179 -129535 -1263678 -813381 -455082 -701612
403 -701612 -508539 350602 774744 115195 -151135 -1080345 -233494 788347 1272522 1040669
393 1040669 630640 772438 424334 39962 150669 310709 32344 -351301 5549 -440747
383 -440747 597510 161515 100946 315009 185497 8080 -312568 -204051 -111118 -498046
$$ packed form
453e28894O51326n8191k71327j22661k22750K68246l44989l8539N84861k41886
443c24804K16259k59781Q6571J02760J19769k06498q01143M44774J86843J19623
433c15627K22748R7470o76023o68192N29435j90010M48927P9641j12580n13082
423a097293k1800K54745J74309K82878l96085M80448K67952n53511l93958J65901
413h36414O69596Q7946p20131k93131O34955L27644j134143M50297L58299k46530
403g01612J93073Q59141M24142o59549k66330r29210Q46851J021841M84175k31853
393A040669m10029J41798l48104l84372J10707J60040k78365l83645L56850m46296
383d40747J038257m35995o0569K14063j29512j77417l20648J08517R2933l86928
$$ plain form
373 -498046 -528832 -127656 45340 -544868 -447135 -407454 -542733 -306273 279951 321771 -77059
362 -77059 -501425 109316 -120531 -634783 -226061 170628 497126 -35047 -288528 -436575
352 -436575 -351141 -157160 -381506 -316625 447419 -300190 -746115 -1105001 -493970 432640
342 432640 -19339 175761 133719 -32789 -605580 -449732 -59119 559706 -13972 -1213239
332 -1213239 -23715 -900801 -1029534 -943438 -533527 -185467 342297 -540153 -801451 432011
322 432011 835264 52992 -198779 -219801 150046 -110799 -93680 -493671 -92395 955749
312 955749 791576 164986 219470 -323841 134381 11081 -478805 -618269 -675024 -508533
302 -508533 -361027 -55605 -133226 -138508 -269254 -395999 -1321965 -1305534 -1328783 -587124 -400928
$$ packed form
373d98046l0786M01176J72996n90208R7733L9681j35279K36460N86224M1820l98830
362g7059m24366O10741k29847n14252M08722L96689L26498n32173k53481j48047
352d36575Q5434J93981k24346O4881P64044p47609m45925l58886O11031R26610
342D32640m51979J95100m2042j66508n72791J55848L90613O18825n73678j199267
332a213239J189524q77086j28733Q6096M09911L48060N27764q82450k61298J233462
322D32011M03253p82272k51771k1022L69847k60845J7119l99991M01276J048144
312I55749j64173o26590N4484n43311M58222j23300m89886j39464n6755J66491
302e08533J47506L05422p7621n282j30746j26745r25966J6431k3249P41659J86196
$$ plain form
291 -400928 -60576 298133 -16642 -920373 -868534 36032 -331100 -507285 -194961 490429
281 490429 860069 882027 -251124 -363113 -13509 510944 -512463 -474720 -561489 -395078
271 -395078 -118836 284527 578019 -129004 -310065 -143150 30831 -200349 132182 1044541
261 1044541 985766 508958 846603 542196 -75038 -136221 172991 -429681 -253469 519565
251 519565 520907 -490309 26812 -628375 -1392332 -741267 -61011 -1079087 -407945 -772942
241 -772942 -105817 35047 -478720 -165275 489291 545525 -357662 -503674 -652338 -763522
231 -763522 -378999 -161018 -283656 -818042 -1278361 -51175 86588 -455811 -166274 363487
221 363487 553347 226680 336664 -617659 -20275 -35232 -714701 -1342820 -446211 -250402
$$ packed form
291d00928L40352L58709l14775r03731N1839R04566l67132j76185L12324O85390
281D90429L69640K1958j133151j11989L49604N24453j023407L7743q6769J66411
271c95078K76242M03363K93492p07023j81061J66915J73981k31180L32531R12359
261A044541n8775m76808L37645l04407o17234o1183L09212o02672J76212P73034
251E19565J342j011216N17121o55187p63957O51065O80256j018076O71142l64997
241g72942O67125J40864n13767L13445O54566N6234r03187j46012j48664j11184
231g63522L84523K17981j22638n34386m60319J227186J37763n42399K89537N29761
221C63487J89860l26667J09984r54323N97384j4957o79469o28119Q96609J95809
$$ plain form
211 -250402 -531490 143474 622433 213140 -77007 400170 843187 31254 -231395 -673680
201 -673680 -856458 -682009 -796963 -283168 -84448 -227966 -144597 -8006 -467542 -304353
191 -304353 -7929 549208 110058 153345 514968 363810 397982 60385 -611723 -554701
181 -554701 -541451 -578993 -479200 -63429 -852714 -572738 -327666 -284373 -572659 112002 661669
170 661669 705417 -297866 -1067210 -466508 -97661 -61906 -466301 -694483 -104810 -270777
160 -270777 -420129 -779401 -540590 -57922 447369 49856 201654 404377 59183 -1022190
150 -1022190 -1151931 -379726 -395017 -436549 -919573 -927696 -568172 -530871 -871405 -1498608 -1027520
139 -1027520 -638953 -835224 -739562 -534979 -583672 -471446 -661009 -583107 -713989 -609383
$$ packed form
211b50402k81088O74964M78959m09293k90147M77177M43017q11933k62649m42285
201f73680j82778J74449j14954N13795J98720j43518Q3369J36591m59536J63189
191c04353K96424N57137m39150M3287L61623j51158L4172l37597o72108N7022
181e54701J3250l7542R9793M15771p89285K79976K45072M3293k88286O84661N49667
170F61669M3748j003283p69344O00702L68847L5755m04395k28182N89673j65967
160b70777j49352l59272K38811M82668N05291l97513J51798K02723l45194j081373
150a022190j29741P72205j5291m1532m83024q123L59524L7301l40534o27203M71088
139a027520L88567j96271R5662K04583m8693J12226j89563P7902j30882J04606
$$ plain form
129 -609383 -587248 -974131 -1328593 -360485 -213369 -973443 -897209 -142208 -314563 16601
119 16601 238779 345506 -277290 -937459 -222800 -117288 286021 302834 58796 -405879
109 -405879 -281467 -81061 200428 -560477 -275980 -154465 -318764 -593729 -471622 -631418
99 -631418 -714926 -360350 253057 -376966 -187498 197855 -83207 213965 -507043 -758310
89 -758310 -804659 -354072 401377 833739 -192788 -679724 135707 14125 296758 72818
79 72818 16318 -461570 -826993 -657626 -344944 -386745 -313531 -482454 -281124 -653239 -822383
68 -822383 -630039 135322 216830 -363831 -100284 -137582 -862582 -583248 -307171 -417104
58 -417104 -780332 -583960 -483571 -891668 -650954 -615534 -154245 449714 249087 603580
$$ packed form
129f09383K2135l86883l54462R68108J47116p60074P6234P55001j72355L31164
119A6601K22178J06727o22796o60169P14659J05512M03309J6813k44038m64675
109d05879J24412K00406K81489p60905K84497J21515j64299k74965J22107j59796
99f31418q3508L54576O13407o30023J89468L85353k81062K97172p21008k51267
89g58310m6349M50587P55449M32362j026527m86936Q15431j21582K82633k23940
79G2818n6500m77888l65423J69367L12682m1801P3214j68923K01330l72115j69144
68h22383J92344P65361Q1508n80661K63547l7298p25000K79334K76077j09933
58d17104l63228J96372J00389m08097K40714L5420M61289O03959k00627L54493
$$ plain form
48 603580 71309 157654 130213 55662 -386451 -645216 -235865 -118321 -63503 -392045 -634273
37 -634273 -678946 -329291 -173456 -68765 -240524 -216604 -815410 -1141721 -1120920 -1102250 -1063675
26 -1063675 -583237 -731851 -420760 -181014 154825 118509 -385581 -141445 -191326 -587250
16 -587250 -208007 -128916 335156 -44887 -478607 -746255 -794442 -917344 -645055 -895672
6 -895672 -569612 -80452 -369649 -277592 -618426 -615798
0 -615798
$$ packed form
48F03580n32271Q6345k7441p4551m42113k58765M09351J17544N4818l28542k42228
37f34273m4673L49655J55835J04691j71759K3920n98806l26311K0801J8670L8575
26a063675M80438j48614L11091K39746L35839l6316n04090K44136m9881l95924
16e87250L79243P9091M64072l80043m33720k67648m8187j22902K72289k50617
6h95672L26060M89160k89197R2057l40834K628
0f15798
$$ Imaginary data points
##PAGE= N=2
##DATA TABLE= (X++(I..I)), XYDATA
$$ plain form
16383 -3275860 -3353175 -4114999 -3794949 -4196692 -4448512 -3820118 -3379178 -3314573 -3528116 -3277576
16373 -3277576 -3306063 -3206322 -3507216 -3636894 -3529435 -3105810 -2676605 -2582631 -2621550 -2666302
16363 -2666302 -2786171 -2826391 -2790042 -2918388 -2622996 -2876575 -2264376 -1732420 -1873167 -2012529
16353 -2012529 -1523237 -1642610 -2033622 -2204737 -2233513 -1440369 -1735283 -1621420 -1184847 -1450980
16343 -1450980 -1369947 -869501 -1589176 -1736465 -1345064 -1118664 -734449 -832807 -587845 -640536
16333 -640536 -655935 -558909 -622817 -406654 -734961 -1062242 -827370 -736156 -349083 -462733
16323 -462733 -1043128 -1375592 -546196 -523669 -752031 -243152 -95152 321941 -306733 -233378
16313 -233378 -288477 -302630 7174 167400 497796 742388 324660 556990 610748 635812
$$ packed form
16383c275860p7315p61824L20050m01743k51820O28394M40940O4605k13543K50540
16373c277576k8487R9741l00894j29678J07459M23625M29205R3974l8919m4752
16363b666302j19869m0220L6349j28346K95392k53579O12199N31956j40747j39362
16353b012529M89292j19373l91012j71115k8776P93144k94914J13863M36573k66133
16343a450980Q1033N00446p19675j47289L91401K26400L84215r8358K44962n2691
16333f40536j5399R7026o3908K16163l28307l27281K34872R1214L87073j13650
16323d62733n80395l32464Q29396K2527k28362N08879J48000M17093o28674P3355
16313b33378n5099j4153L09804J60226L30396K44592m17728K32330N3758K5064
$$ plain form
16303 635812 725194 910921 712479 -111808 -142165 332187 444335 1192324 1333483 873895
16293 873895 381918 161760 77297 875056 1760794 1996016 1326356 871363 862270 1213663
16283 1213663 1893920 2387767 1830003 1501055 2426512 2209926 1930007 2251466 2394594
16274 2394594 2430800 2967943 2221112 2127123 2789289 2980711 2778470 2608729 2626307 2379606
16264 2379606 1961562 1865092 2529767 2739752 2418101 1624217 1421686 1785543 2221603 3240692
16254 3240692 3072315 2468092 2470514 2319757 2875999 2821130 2845154 2899515 2301949 2670067
16244 2670067 3366789 3094039 2635843 2490113 2388554 3520834 3307812 3749532 3508744
16235 3508744 3130175 3270150 2735643 3106677 3737376 4153773 3964262 4046934 4009441 4678224
$$ packed form
16303F35812Q9382J85727j98442q24287l0357M74352J12148P47989J41159m59588
16293H73895m91977k20158q4463P97759Q85738K35222o69660m54993r093L51393
16283A213663O80257M93847n57764l28948R25457k16586k79919L21459J43128
16274B394594L6206N37143p46831r3989O62166J91422k02241j69741J7578k46701
16264B379606m18044r6470O64675K09985l21651p93884k02531L63857M36060J019089
16254C240692j68377o04223K422j50757N56242n4869K4024N4361n97566L68118
16244B670067O96722k72750m58196j45730j01559J132280k13022M41720k40788
16235C508744l78569J39975n34507L71034O30699M16397j89511Q2672l7493O68783
$$ plain form
16225 4678224 4186225 4498212 4068276 3507157 4074651 4431621 4518553 4252130 4772177 4638249
16215 4638249 4375330 4265332 4690384 4095902 3641598 3287997 4104175 4687379 4481765
16206 4481765 3831439 3753309 4315194 4229755 3114066 2898173 3628766 3702250 3482195 3337686
16196 3337686 3862289 4518851 4949745 5157342 5651013 5473578 5442836 4995064 4566937 4638666
16186 4638666 3857346 4244384 4219795 4677101 5018311 4517278 4817126 4366324 3530716 4429208
16176 4429208 4526179 4065569 5151867 5051390 4155302 4230961 4658713 5080024 5154101 5059381
16166 5059381 4759936 5031579 5527663 5490923 5922139 5064947 4565259 4515323 5396737 6172382
16156 6172382 4846746 4880732 5432567 5239680 4912099 5549980 5204249 5256585 5923425 5662903
$$ packed form
16225D678224m91999L11987m29936n61119N67494L56970Q6932k66423N20047j33928
16215D638249k62919j09998M25052n94482m54304l53601Q16178N83204k05614
16206D481765o50326p8130N61885q5439j115689k15893P30593P3484k20055j44509
16196C337686N24603O56562M30894K07597M93671j77435l0742m47772m28127P1729
16186D638666p81320L87038k4589M57306L41210n01033K99848m50802q35608Q98492
16176D429208R6971m60610J086298j00477q96088P5659M27752M21311P4077r4720
16166E059381k99445K71643M96084l6740M31216q57192m99688m9936Q81414P75645
16156F172382j325636L3986N51835j92887l27581O37881l45731N2336O66840k60522
$$ plain form
16146 5662903 5487596 5080177 4956883 4554578 4426244 4339198 4935364 5281730 5579528 5518848
16136 5518848 5465817 5489489 5575415 6024572 6415389 5776682 5484317 5814085 5983713 6144213
16126 6144213 6471605 6244521 5256554 5277417 4912857 5703754 6236079 5593273 5615994 5648651
16116 5648651 5579489 5086663 5544470 5730909 5435100 5431783 5437183 5507784 5295587 4910218
16106 4910218 5717008 6164946 5519961 5287958 5144210 5150191 4921406 4676619 4846356 4941978
16096 4941978 6075987 6221635 5792667 5697489 4789262 4900630 5823845 5989349 5887555
16087 5887555 6009641 5657661 5499914 5655170 5268419 5199163 4985778 5001778 5542381 5426876
16077 5426876 5412632 5418808 5862570 6364170 5838478 5717802 5788571 5478374 5465420 5741075
$$ packed form
16146E662903j75307m07419j23294m02305j28334q7046N96166L46366K97798o0680
16136E518848n3031K3672Q5926M49157L90817o38707k92365L29768J69628J60500
16126F144213L27392k27084r87967K0863l64560P90897N32325o42806K2721L2657
16116E648651o9162m92826M57807J86439k95809l317N400P0601k12197l85369
16106D910218Q06790M47938o44985k32003j43748N981k28785k44787J69737R5622
16096D941978J134009J45648m28968r5178r08227J11368R23215J65504j01794
16087E887555J22086l51980j57747J55256l86751o9256k13385J6000N40603j15505
16077E426876j4244O176M43762N01600n25692j20676P0769l10197j2954K75655
$$ plain form
16067 5741075 5662318 5711244 5639058 5296612 5398297 5775715 5225078 5926542 5666201 6036785
16057 6036785 6173988 6292526 6294080 6502426 6340266 6226461 5748254 6344660 6503170 5802770
16047 5802770 6180067 5207917 5445128 5089831 4730757 3927075 4405369 5699455 6120544
16038 6120544 6470647 6919947 6818146 5236305 5340722 5714707 4792495 5840678 6119077
16029 6119077 5751775 5123767 5808222 6171864 5964547 5248815 4893831 4461812 5361589
16020 5361589 5626527 4930631 5319742 5583690 5367197 5600450 5517515 5305397 4762202 5100405
16010 5100405 5316391 4978410 5462471 5617017 5231649 5234541 5403445 5798339 6353702 6632863
16000 6632863 6057824 5897694 6505243 5808165 5159704 4982744 5269507 6023211 6269674
$$ packed form
16067E741075p8757M8926p2186l42446J01685L77418n50637P01464k60341L70584
16057F036785J37203J18538J554K08346j62160j13805m78207N96406J58510p00400
16047E802770L77297r72150K37211l55297l59074q03682M78294J294086M21089
16038F120544L50103M49300j01801j581841J04417L73985r22212J048183K78399
16029F119077l67302o28008O84455L63642k07317p15732l54984m32019Q99777
16020E361589K64938o95896L89111K63948k16493K33253q2935k12118n43195L38203
16010E100405K15986l37981M84061J54546l85368K892J68904L94894N55363K79161
16000F632863n75039j60130O07549o97078o48461j76960K86763P53704K46463
$$ plain form
15991 6269674 4984700 5650061 5942259 6227371 5827693 6197314 6632838 6440825 5886324
15982 5886324 5083332 6109475 6274666 6487970 6804570 6943180 5915460 5901803 5684671
15973 5684671 6402107 5857844 6025255 6056564 5795276 6052788 5287258 6054752 6220430 6621746
15963 6621746 6028050 6152492 6165321 5747351 6377784 6318280 5784415 5932240 5873541 6055229
15953 6055229 6327129 6415955 6009703 6436431 6449819 6351924 6940829 5967248 5243692 5494069
15943 5494069 6267022 5137345 5140505 5843797 6631027 5959722 5955103 6193357 5134483 4489443
15933 4489443 4719881 5659418 5795744 6182535 5906311 5995049 5954451 5419088 5146199 5521337
15923 5521337 5128539 5606193 5433076 5533125 5282319 5392198 6378181 7165738 6417848
$$ packed form
15991F269674j284974O65361K92198K85112l99678L69621M35524j92013n54501
15982E886324q02992J026143J65191K13304L16600J38610j027720j3657k17132
15973E684671P17436n44263J67411L1309k61288K57512p65530P67494J65678M01316
15963F621746n93696J24442J2829m17970O30433n9504n33865J47825n8699J81688
15953F055229K71900Q8826m06252M26728J3388r7895N88905r73581p23556K50377
15943E494069P72953j129677L160P03292P87230o71305m619K38254j058874o45040
15933D489443K30438R39537J36326L86791k76224Q8738m0598n35363k72889L75138
15923E521337l92798M77654j73117J00049k50806J09879R85983P87557p47890
$$ plain form
15914 6417848 6085934 6395344 6244753 6390466 5432747 6601395 6422289 5660749 5320890
15905 5320890 4592840 4498680 4611535 5324737 6095307 6300069 5801034 5804637 5638743 6521484
15895 6521484 6269820 5971635 5969977 5547793 5333616 5880165 5768704 5018821 4885316 4527862
15885 4527862 5625553 6201751 5477712 5141965 5719256 6025654 5748394 5561647 5196161
15876 5196161 5482754 5442170 6027611 5947725 5221573 5158538 5335566 5695716 5468254 5706645
15866 5706645 5164120 4688166 5391205 5443283 6394534 6187243 5927701 5744739 6238193 6231815
15856 6231815 6033155 5737437 5599190 5375288 5240779 5574846 5244272 5015651 5442170
15847 5442170 6151349 6542202 6479549 6286590 5870816 5642438 5205435 5566662 5588150 5249186
$$ packed form
15914F417848l31914L09410j50591J45713r57719J168648j79106p61540l39859
15905E320890p28050r4160J12855P13202P70570K04762m99035L603j65894Q82741
15895F521484k51664k98185j658m22184k14177N46549j11461p49883j33505l57454
15885D527862J097691N76198p24039l35747N77291L06398k77260j86747l65486
15876E196161K86593m0584N85441p9886p26152o3035J77028L60150k27462K38391
15866E706645n42525m75954P03039N2078R51251k07291k59542j82962M93454o378
15856F231815j98660k95718j38247k23902j34509L34067l30574k28621M26519
15847E442170P09179L90853o2653j92959m15774k28378m37003L61227K1488l38964
$$ plain form
15837 5249186 4834566 5061182 5253644 5435642 5550277 5658322 6362596 6019481 5563811
15828 5563811 5242761 6188597 6319211 6549524 6173209 6296106 5372227 5525795 5271394
15819 5271394 5762612 5838854 6665228 6570185 5828959 5382134 5029768 5657570 5745873 6359601
15809 6359601 5576873 5422667 5806740 5631796 5698806 6109520 5516307 5862953 6623850 6040339
15799 6040339 5872108 5756066 5957257 5859014 5674511 5717359 6129433 6642355 5662715 6362120
15789 6362120 6177742 5719483 6394580 6955449 6783545 6456989 7157590 6314514 6350477 6288771
15779 6288771 5747060 5334282 6445318 6459042 5719807 5460265 5871280 5690463 5842868
15770 5842868 4910755 5302102 5607611 5830506 5453653 5691330 6171621 5930043 6530112
$$ packed form
15837E249186m14620K26616J92462J81998J14635J08045P04274l43115m55670
15828E563811l21050R45836J30614K30313l76315J22897r23879J53568k54401
15819E271394M91218P6242Q26374r5043p41226m46825l52366O27802Q8303O13728
15809F359601p82728j54206L84073j74944O7010M10714n93213L46646P60897n83511
15799F040339j68231j16042K01191r8243j84503M2848M12074N12922r79640O99405
15789F362120j84378m58259O75097N60869j71904l26556P00601q43076L5963o1706
15779F288771n41711m12778J111036J3724p39235k59542M11015j80817J52405
15770E842868r32113L91347L05509K22895l76853K37677M80291k41578O00069
$$ plain form
15761 6530112 6806077 6654060 6462151 6245429 5510407 5121327 4766221 5218428 5913407
15752 5913407 5139011 5337833 6002572 6226339 6321871 6138578 6541121 6038271 5028068
15743 5028068 5234278 6099548 6643080 6906699 7055188 7207217 7279337 6707155 6100445 5027289
15733 5027289 4731138 5838719 5903569 6848399 5657326 4941489 5169321 5438324 6160673
15724 6160673 6796917 6116817 6376672 5419049 4668367 4284759 5325437 5614402 5519021
15715 5519021 5862877 5543666 5966310 5914858 6010521 5989065 5174618 5897367 5285822 5059458
15705 5059458 5807227 5414029 5493964 5377030 5783401 5842785 6302310 5878088 5184480 5680223
15695 5680223 5911837 5172708 5310461 5436368 5551273 5761787 5797162 5685418 6228410 5769139
$$ packed form
15761F530112K75965j52017j91909k16722p35022l89080l55106M52207O94979
15752E913407p74396J98822O64739K23767R5532j83293M02543n02850j010203
15743E028068K06210Q65270N43532K63619J48489J52029P2120n72182o06710j073156
15733E027289k96151J107581O4850R44830j191073p15837K27832K69003P22349
15724F160673O36244o80100K59855r57623p50682l83608J040678K88965r5381
15715E519021L43856l19211M22644n1452R5663k1456q14447P22749o11545k26364
15705E059458P47769l93198P9935j16934M06371N9384M59525m24222o93608M95743
15695E680223K31614p39129J37753J25907J14905K10514L5375j11744N42992m59271
$$ plain form
15685 5769139 5082868 5797539 5900420 6061624 5483771 5890324 5437565 6114702 6604971
15676 6604971 6485226 6194821 6037571 6228001 7561638 6863727 6275681 6086581 6610737
15667 6610737 6443758 6782236 6779097 6154261 6287754 6223633 5977538 5473455 5245506 5010782
15657 5010782 4891177 4640699 5196102 5747691 5533033 5670773 5643970 5543337 4775473 5429555
15647 5429555 6327037 5948516 5946127 5624478 5359738 5738630 6542035 6228336 6191240 5802130
$$ packed form
15685E769139o86271P14671J02881J61204n77853M06553m52759O77137M90269
15676F604971j19745k90405j57250J90430J333637o97911n88046j89100N24156
15667F610737j66979L38478l139o24836J33493o4121k46095n04083k27949k34724
15657E010782j19605k50478N55403N51589k14658J37740k6803j00633p67864O54082
15647E429555Q97482l78521k389l21649k64740L78892Q03405l13699l7096l89110
$$ [...]
##END NTUPLES=NMR SPECTRUM
##END=
