##TITLE=1H_CG-1150-5
 CDCl3, 8 sc, 
 3.08.2021
##JCAMPDX= 6.0         $$ Bruker NMR JCAMP-DX V2.0
##DATA TYPE= NMR SPECTRUM
##DATA CLASS= NTUPLES
##ORIGIN= UXNMR, Bruker Analytische Messtechnik GmbH
##OWNER= root
$$ XWIN-NMR		Version 3.5
$$ Tue Aug  3 12:18:57 2021 Russian Standard Time (UT+4h)  she@DPX200
##.OBSERVE FREQUENCY= 200.131506
##.OBSERVE NUCLEUS= ^1H
##.ACQUISITION MODE= SIMULTANEOUS
##.ACQUISITION SCHEME= undefined
##.AVERAGES= 8
##.DIGITISER RES= 18
##SPECTROMETER/DATA SYSTEM= spect
##.PULSE SEQUENCE= zg30
##.SOLVENT NAME= CDCl3
##.SHIFT REFERENCE= (INTERNAL, CDCl3, 0, 17.5008)
##AUDIT TRAIL= $$ (NUMBER, WHEN, WHO, WHERE, WHAT)
$$ ##TITLE= Audit trail, XWIN-NMR		Version 3.5
$$ ##JCAMPDX= 5.01
$$ ##ORIGIN= Bruker BioSpin GmbH
$$ ##OWNER= she
$$ F:/spectra/data/she/nmr/H-F/1/pdata/1/auditp.txt
$$ ##AUDIT TRAIL=  $$ (NUMBER, WHEN, WHO, WHERE, WHAT)
(   1,<2021-08-03 12:17:29.60 +0400>,<she>,<DPX200>,
      <created by zg, POWCHK disabled, PULCHK disabled
       configuration hash MD5:
       00 E9 B6 7A A2 85 ED C7 34 08 36 98 17 FE 4E 26
       data hash MD5: 16K
       D7 EA 2C 4C 2E EF E8 65 60 A9 A4 49 1C F8 A1 11>)
(   2,<2021-08-03 12:17:32.04 +0400>,<she>,<DPX200>,
      <Start of raw data processing
       efp BC_mod = 2 LB = 0.24 FT_mod = 6 PKNL = 1 PHC0 = -13356.17 PHC1 = 12.20099 SI = 16K 
       data hash MD5: 16K
       4B FD 71 8B 35 20 3F 66 B8 1B CA B6 28 3C 5D B1>)
(   3,<2021-08-03 12:18:00.71 +0400>,<she>,<DPX200>,
      <pk PHC0 = 2.582483 PHC1 = -1.8 
       data hash MD5: 16K
       32 A3 EC BA 4C 35 F2 4A 95 14 04 C3 34 D1 65 D8>)
(   4,<2021-08-03 12:18:03.87 +0400>,<she>,<DPX200>,
      <abs ABSG = 5 
       data hash MD5: 16K
       71 12 7D FA 00 A3 4A 2F 28 8D 44 53 47 80 69 6D>)
$$ ##END=
$$ 
$$ hash MD5
$$ 17 B4 9B 39 2D 26 18 3C 77 90 11 0B 74 E2 85 8A
##$RELAX= 
##$RELAX= 
##$RELAX= 
##$RELAX= 
##$RELAX= 
##$RELAX= 
$$ Bruker specific parameters
$$ --------------------------
##$DU= <F:/spectra>
##$EXPNO= 1
##$NAME= <H-F>
##$PROCNO= 1
##$TYPE= <nmr>
##$USER= <she>
##$AMP= (0..31)
100 100 100 100 100 100 100 100 100 100 100 100 100 100 100 100 100 100 
100 100 100 100 100 100 100 100 100 100 100 100 100 100 
##$AQSEQ= 0
##$AQ_mod= 1
##$AUNM= <au_zg>
##$AUTOPOS= <>
##$BF1= 200.13
##$BF2= 200.13
##$BF3= 200.13
##$BF4= 200.13
##$BF5= 200.13
##$BF6= 200.13
##$BF7= 200.13
##$BF8= 200.13
##$BYTORDA= 1
##$CFDGTYP= 0
##$CFRGTYP= 5
##$CHEMSTR= <none>
##$CNST= (0..31)
1 1 145 1 1 1 1 1 1 1 1 1 1 1 1 1 1 1 1 1 1 1 1 1 1 1 1 1 1 1 1 1 
##$CPDPRG= <>
##$CPDPRG1= <>
##$CPDPRG2= <>
##$CPDPRG3= <>
##$CPDPRG4= <mlev>
##$CPDPRG5= <mlev>
##$CPDPRG6= <mlev>
##$CPDPRG7= <mlev>
##$CPDPRG8= <mlev>
##$CPDPRGB= <>
##$CPDPRGT= <>
##$D= (0..31)
0 1.2 0 0 0 0 0 0 0 0.06 0 0.03 0 0 0 0 0.0002 0 0 0 0 0 0 0 0 0 0 0 0 
0 0 0 
##$DATE= 1627978649
##$DBL= (0..7)
120 120 120 120 120 120 120 120 
##$DBP= (0..7)
150 150 150 150 150 150 150 150 
##$DBP07= 0
##$DBPNAM0= <>
##$DBPNAM1= <>
##$DBPNAM2= <>
##$DBPNAM3= <>
##$DBPNAM4= <>
$$ [...]
##$SUBNAM3= <"">
##$SUBNAM4= <"">
##$SUBNAM5= <"">
##$SUBNAM6= <"">
##$SUBNAM7= <"">
##$SUBNAM8= <"">
##$SUBNAM9= <"">
##$SW= 20.0188882624521
##$SWIBOX= (0..15)
0 0 2 0 0 0 0 0 0 0 0 0 0 0 0 0 
##$SW_h= 4006.41025641026
##$TD= 16384
##$TD0= 1
##$TE= 0
##$TE2= 300
##$TE3= 300
##$TEG= 300
##$TL= (0..7)
0 120 120 120 120 120 120 120 
##$TP= (0..7)
150 150 150 150 150 150 150 150 
##$TP07= 0
##$TPNAME0= <>
##$TPNAME1= <>
##$TPNAME2= <>
##$TPNAME3= <>
##$TPNAME4= <>
##$TPNAME5= <>
##$TPNAME6= <>
##$TPNAME7= <>
##$TPOAL= (0..7)
0.5 0.5 0.5 0.5 0.5 0.5 0.5 0.5 
##$TPOFFS= (0..7)
0 0 0 0 0 0 0 0 
##$TUNHIN= 0
##$TUNHOUT= 0
##$TUNXOUT= 0
##$USERA1= <user>
##$USERA2= <user>
##$USERA3= <user>
##$USERA4= <user>
##$USERA5= <user>
##$V9= 5
##$VALIST= <valist>
##$VCLIST= <CCCCCCCCCCCCCCC>
##$VD= 0
##$VDLIST= <DDDDDDDDDDDDDDD>
##$VPLIST= <PPPPPPPPPPPPPPP>
##$VTLIST= <TTTTTTTTTTTTTTT>
##$WBST= 1024
##$WBSW= 4
##$XGAIN= (0..3)
0 0 0 0 
##$XL= 0
##$YL= 0
##$YMAX_a= 437122
##$YMIN_a= -399284
##$ZGOPTNS= <>
##$ZL1= 120
##$ZL2= 120
##$ZL3= 120
##$ZL4= 120
##$ABSF1= 17.49344
##$ABSF2= -2.525597
##$ABSG= 5
##$ABSL= 3
##$ALPHA= 0
##$AQORDER= 0
##$ASSFAC= 0
##$ASSFACI= 0
##$ASSFACX= 0
##$ASSWID= 0
##$AUNMP= <proc_1d>
##$AZFE= 0.1
##$AZFW= 0.1
##$BCFW= 0
##$BC_mod= 2
##$BYTORDP= 0
##$COROFFS= 0
##$CY= -3
##$DATMOD= 1
##$DC= 0
##$DFILT= <>
##$DTYPP= 0
##$F1P= 0
##$F2P= 0
##$FCOR= 1
##$FTSIZE= 16384
##$FT_mod= 6
##$GAMMA= 0
##$GB= 0
##$INTBC= 1
##$INTSCL= 1.334414e-10
##$ISEN= 128
##$LB= 0.24
##$LEV0= 0
##$LPBIN= 0
##$MAXI= 10000
##$MC2= 0
##$MEAN= 0
##$ME_mod= 0
##$MI= 1.114404
##$NCOEF= 0
##$NC_proc= -6
##$NLEV= 6
##$NOISF1= 3.799351
##$NOISF2= 2.8
##$NSP= 0
##$NTH_PI= 0
##$NZP= 0
##$OFFSET= 17.50077
##$PC= 1
##$PHC0= -13353.59
##$PHC1= 10.40099
##$PH_mod= 1
##$PKNL= yes
##$PPARMOD= 0
##$PSCAL= 0
##$PSIGN= 0
##$REVERSE= no
##$SF= 200.130006775006
##$SI= 16384
##$SIGF1= 3
##$SIGF2= 2
##$SINO= 5.538805
##$SIOLD= 16384
##$SREGLST= <1H.CDCl3>
##$SSB= 0
##$STSI= 16384
##$STSR= 0
##$SW_p= 4006.41025641026
##$SYMM= 0
##$S_DEV= 0
##$TDeff= 16384
##$TDoff= 0
##$TI= <>
##$TILT= no
##$TM1= 0
##$TM2= 0
##$TOPLEV= 0
##$USERP1= <user>
##$USERP2= <user>
##$USERP3= <user>
##$USERP4= <user>
##$USERP5= <user>
##$WDW= 1
##$XDIM= 16384
##$YMAX_p= 308995724
##$YMIN_p= -381737
$$ End of Bruker specific parameters
$$ ---------------------------------
##NTUPLES= NMR SPECTRUM
##VAR_NAME=  FREQUENCY,     SPECTRUM/REAL,   SPECTRUM/IMAG
##SYMBOL=    X,             R,               I
##VAR_TYPE=  INDEPENDENT,   DEPENDENT,       DEPENDENT
##VAR_FORM=  AFFN,          ASDF,            ASDF
##VAR_DIM=   16384,         16384,           16384
##UNITS=     HZ,            ARBITRARY UNITS, ARBITRARY UNITS
##FACTOR=    0.24454680195387, 1,            1
##FIRST=     3502.42933251131, 0,            0
##LAST=      -503.980923898953, 0,           0
##MIN=       -503.980923898953, -381737,     0
##MAX=       3502.42933251131, 308995724,    0
$$ Real data points
##PAGE= N=1
##DATA TABLE= (X++(R..R)), XYDATA
$$ [...]
5648B3530j2852J2740K3481j10270J0413N4451l8778N3535l2030p4510L936N6038
5636c0316k2242r3969J06681m5359l0169R6703r2542n8843N6202J12206p5048
5625g6696J5110J15426k6124m6442M14J6696L0846k4754k7016K1106k0167k3115
5613d4716R0073P4890n9989N5228L8551m9192j201k2302N9231l3881j6283m3974
5601D6435j04549J41695M0714l6652O4697k3499o1002m9779R8474K3710l851J5406
5589A51799L444j7906l2523N7738r517L2651p9158o4782j2690p0906Q8467Q3788
5577A30405K7098p5179j0451m518l5555O630k8295n2141L1067Q5602M569O8130
5565A47362o283j10458N1434Q7129k2173m5530j3200J692m3301K3925Q3488o0811
$$ y = [23530, 10678, 23418, 46899, -63371, -52958, 1493, -37285, 16250, -15780, -90290, -86354, -30316, -52558, -146527, -39846, -85205, -115374, -18671, -111213, -170056, -113854, -1648, -76696, -61586, 53840, 27716, -18726, -18312, -1616, 29230, 4476, -22540, -1434, -21601, -44716, 45357, 120247, 60258, 115486, 154037, 104845, 103644, 81342, 140573, 106692, 90409, 46435, -58114, 83581, 124295, 87643, 152340, 128841, 67839, 18060, 116534, 140244, 136393, 151799, 155243, 137337, 104814, 162552, 153035, 185686, 106528, 41746, 29056, -41850, 46617, 130405, 157503, 82324, 71873, 67355, 31800, 38430, 10135, -42006, -10939, 74663, 79232, 147362, 141079, 30621, 82055, 169184, 147011, 101481, 88281, 89973, 46672, 70597, 154085, 93274]
5553I3274P8768p9312O4556n4108l4209L5480j4177j2488J2525l2641N4328J25648
5541B37644l2061O5231n7740j03039k6986J3090j09085k3449M078K1432M4887
5530C4002N3952j1879K2805P0358m317j12742p2187J5230N4269Q2804P4939o5051
5518A42183m0913L1995Q6568J5610j21685L8261j7652l2062o8198M7401J10892
5507A92400m2059M7300J8008P0723k6039J2483q9861k4718J1561L3824k9561o253
5495A67808R880p2778j18240J9215J41509M3428l6919M0223j6555j22048k6046
5484B9477N3454j6094R6665L4273n3920k5660N4322p1156M8577l002n7606M0184
5472A29514O6398R9251j24271N581m1412m2005O7532J15295p8020J9815p9666
$$ y = [93274, 172042, 92730, 157286, 103178, 68969, 104449, 90272, 77784, 90309, 57668, 111996, 237644, 205583, 270814, 213074, 110035, 83049, 96139, -12946, -36395, -32317, -10885, 34002, 87954, 76075, 98880, 169238, 164921, 52179, -20008, -4778, 49491, 132295, 207234, 142183, 101270, 133265, 219833, 235443, 113758, 152019, 134367, 102305, 34107, 81508, 192400, 150341, 197641, 215649, 286372, 260333, 272816, 182955, 158237, 169798, 203622, 174061, 167808, 177688, 104910, -13330, 5885, 147394, 190822, 153903, 194126, 177571, 55523, 29477, 82931, 66837, 163502, 197775, 143855, 118195, 172517, 101361, 149938, 146936, 89330, 129514, 195912, 295163, 170892, 176473, 135061, 93056, 160588, 275883, 197863, 217678, 138012]
5461A38012j01781R1525Q8152m5792n1715O4731o744P3227j4279r3430M2736r2737
5449I1905N9831J8519o8431P5409N8497q275r6846Q7114k2302L2734Q1586p7289
5437B32452N457r669M7019r8814o841P246M1589m2584k5394r94M317k434N6179
5424B07529N0155n9447q0123M1706R4541Q6997m5733K253L8907J1358J0492q4130
5412B74505m324R7258n8937p3833j2040j5557J52294j24791l5946J39011N4394
5401C92034j16253o9412Q0219j2652l428K9786r1740J3688J54780J05014l008
5390D79028q4178m1154r6600M9162J44056j27018P7103P1867j5968k5171M812
5379D35939R723j01611j2389j0830N5513n4489P3031q0551K7975J53448j01552
$$ y = [138012, 36231, 127756, 215908, 170116, 118401, 183132, 176388, 249615, 235336, 141906, 184642, 91905, 151736, 170255, 101824, 177233, 235730, 227455, 130609, 217723, 195421, 228155, 309741, 232452, 237909, 228240, 275259, 176445, 169604, 176850, 218439, 175855, 150461, 149467, 153784, 151350, 207529, 257684, 198237, 118114, 159820, 254361, 341358, 295625, 297878, 336785, 348143, 358635, 274505, 270181, 367439, 308502, 234669, 222629, 207072, 359366, 234575, 198629, 337640, 392034, 275781, 206369, 286588, 273936, 270508, 300294, 208554, 222242, 377022, 482036, 479028, 394850, 353696, 257096, 306258, 450314, 323296, 400399, 472266, 456298, 431127, 435939, 445662, 344051, 331662, 320832, 376345, 321856, 394887, 314336, 342311, 495759, 394207]
5368C94207p1338k9541J1472j0777J39948J4554l7295J6653r643M1132O075M0995
5356E06442q2387M8681P918J7269j5145k8619l9288P5558M324r8349M2863O0698
5344D99965N5308J24527L0611L8335j02982o3216Q2896J06421k5201k4734J00115
5333H22045j5107R1230M3501P4043p8563j5537N3238Q6573p2077J44180O0374
5322A193900M0407J55009R0991j560J99301J45629J47676J67358J03373N6223
5312B298307J53560J07271r2512n3876m3212m8609m8347k52653q8225R9461j25103
5301A906062n7651O2452J4450o7889j04711J95618K2539M1388O1319P5608L8564
5290B187749J57812J98540Q2673P4699J91854K19493R6427L10232K11142K95338
$$ y = [394207, 322869, 293328, 304800, 294023, 433971, 448525, 411230, 427883, 418240, 459372, 465447, 506442, 424055, 472736, 480654, 497923, 482778, 454159, 414871, 490429, 494753, 396404, 439267, 499965, 555273, 679800, 710411, 748746, 645764, 582548, 665444, 771865, 746664, 721930, 822045, 806938, 898168, 941669, 1015712, 937149, 921612, 974850, 1061423, 989346, 1133526, 1193900, 1234307, 1389316, 1480307, 1478747, 1678048, 1823677, 1971353, 2138711, 2242084, 2298307, 2451867, 2559138, 2466626, 2412750, 2369538, 2320929, 2272582, 2019929, 1931704, 2031165, 1906062, 1848411, 1910863, 1925313, 1857424, 1752713, 1948331, 1970870, 2012258, 2073577, 2149185, 2187749, 2345561, 2544101, 2626774, 2701473, 2893327, 3112820, 3209247, 3519479, 3730621, 4025959]
5280D025959K83831L20150K59129Q0765J00397k0029j29546k62017m76397l69132
5270C813110m08175k83602j67509j60681j06030j44719j24986l069j37951j32614
5260B143774k1899p7318j37450N8815N7379P1207M1568R9774m8895L1946K3965
5249B242866Q1183R0523N5064n749R0090K12854j37189l0853N5109n4630j37988
5238B461280j84349r1943q4267k03438j92011j19864o1891N2980k31029m0796
5228A304672n36l5995o5303p928j20244r1221m5218K6329M5666m5960P2054l3867
5216A002449L9935j63416R9453J8706j27486Q9258j282K0083k6167k2614Q2508
5205A011427k3033j7253p3299q8767M616j3008O4874j04951O2662J4674l6443
$$ y = [4025959, 4309790, 4629940, 4889069, 4969834, 5070231, 5050202, 4920656, 4658639, 4182242, 3813110, 3404935, 3121333, 2953824, 2793143, 2687113, 2542394, 2417408, 2414339, 2276388, 2143774, 2121875, 2044557, 1907107, 1965922, 2023301, 2094508, 2136076, 2235850, 2186955, 2218901, 2242866, 2324049, 2414572, 2469636, 2463887, 2553977, 2766831, 2629642, 2598789, 2653898, 2599268, 2461280, 2276931, 2184988, 2100721, 1897283, 1705272, 1585408, 1523517, 1576497, 1345468, 1304672, 1304136, 1268141, 1202838, 1194910, 1074666, 983445, 938227, 964556, 1010222, 964262, 1036316, 1002449, 1042384, 878968, 978421, 997127, 869641, 958899, 957617, 977700, 951533, 928919, 1011427, 988394, 971141, 897842, 809075, 813691, 800683, 865557, 760606, 823268, 837942, 801499]
5194H01499L1192m5073j1478O7718J15208J9204j17259q068J42160o3337l189
5183I28577J31063N636P574J24166N7204J06003J48003N4711J9642M9569J60900
5172A793048L04047J23267J31577J30703J65750J5266J28229P9038M7255l5874
5162B882306j56959n6009r8100j81936M9252p0024P3665L7836N6389J67402J7924
5151B721746J9420K24952K85290J85215K12279L58082J60972M9254O2983r2099
5141D188094j05304n9294j55740l94439k59407l67399j75863q3353q2479R5862
5131B600678o4298j27727K0032J35161k534j2571J21118J12789J62371J16666
5121C061685M3519j27529r298o1536q6726j25355j11907k83716l21482j60697
$$ y = [801499, 832691, 787618, 776140, 843858, 959066, 978270, 861011, 852943, 995103, 931766, 928577, 1059640, 1065276, 1072850, 1197016, 1254220, 1360223, 1508226, 1562937, 1582579, 1632148, 1793048, 2097095, 2220362, 2351939, 2482642, 2648392, 2663658, 2791887, 2870925, 2918180, 2882306, 2725347, 2669338, 2571238, 2389302, 2438554, 2368530, 2442195, 2480031, 2536420, 2703822, 2721746, 2741166, 2966118, 3251408, 3436623, 3648902, 4006984, 4167956, 4217210, 4280193, 4188094, 4082790, 4023496, 3867756, 3473317, 3213910, 2846511, 2670648, 2587295, 2504816, 2600678, 2536380, 2408653, 2428685, 2563846, 2561312, 2548741, 2669859, 2782648, 2945019, 3061685, 3105204, 2977675, 2968377, 2906841, 2820115, 2694760, 2582853, 2299137, 1977655, 1816958]
5111A816958k08395l9367j18699j19976o6381l5852K83J7691p0538l4749N4334
5100A195309J0807p6068O0296L9391j59091N5348M9407J47112R1984J03384R5075
5089A612954j01267q2586J10787N4292N1673j2203j27893k06984j63372J4879
5079A150280r2071r8047q310O0824j39112o326K3824J0390J5675l545L3148M4467
5067I91197M0657M6502j7422R9110K55132K2617K4855J49067J38898n6935J3267
5056A706945k7500j64950k27893j56066l4382m8876j75549j15773l2441R1667
5046H15182p0231J7322l6284P8151P3211m9512N0480j16766j2675K5663N109q2793
5034F96857o4131Q1673K14288N8669o5720k159L3296j4701j48951j2854L0603
$$ y = [1816958, 1608563, 1569196, 1450497, 1330521, 1264140, 1228288, 1228571, 1246262, 1175724, 1140975, 1195309, 1206116, 1130048, 1190344, 1229735, 1070644, 1125992, 1175399, 1322511, 1414495, 1517879, 1612954, 1511687, 1429101, 1539888, 1594180, 1645853, 1633650, 1505757, 1298773, 1135401, 1150280, 1058209, 960162, 951852, 1012676, 873564, 867238, 891062, 901452, 917127, 913582, 946730, 991197, 1031854, 1078356, 1060934, 1160044, 1415176, 1437793, 1462648, 1611715, 1750613, 1693678, 1706945, 1679445, 1514495, 1286602, 1130536, 1096154, 1047278, 871729, 755956, 723515, 815182, 744951, 762273, 725989, 804140, 877351, 827839, 878319, 761553, 748878, 774541, 779650, 696857, 632726, 714399, 928687, 987356, 921636, 919477, 952773, 938072, 789121, 776267, 806870]
5023H06870j7056K4117j0512j4815q8955K284L1888J26071M111j6268o1461j49820
5011F36454P0054K8580J03410J38482q3790o0780N8903N0255n5518p3309R634
5000H22375l4212j45662n2479J01863L0590L6198P643K9234q9732j32056R4494
4989F68256j1435L3931m7447M0092Q7985o9192P4622O120o1432O1774j9284p6454
4977F87536O5012L6417Q4605P2204l0557O2138J2968N8027n9338K7479K0750p7848
4965I59393j14945k7295k8046J1495N2549q2685j4294P5034N5013k4924k0563
4954H40732N8547J44467j11032M1897L3022j845K22793j6781j22286N9631N2582
4943A201727p0712K0372L440Q6045M942k22481K6775o5038r639k0757L8287J5280
$$ y = [806870, 789814, 813931, 803419, 788604, 699649, 701933, 733821, 859892, 864003, 847735, 786274, 636454, 706508, 735088, 838498, 976980, 893190, 832410, 891313, 941568, 886050, 812741, 822375, 788163, 642501, 590022, 691885, 722475, 758673, 766316, 795550, 705818, 573762, 668256, 656821, 690752, 643305, 683397, 771382, 702190, 776812, 782932, 721500, 783274, 763990, 687536, 752548, 788965, 873570, 945774, 915217, 977355, 990323, 1048350, 989012, 1016491, 1037241, 959393, 844448, 817153, 789107, 800602, 853151, 770466, 756172, 831206, 886219, 861295, 840732, 899279, 1043746, 932714, 974611, 1007633, 1005788, 1228581, 1211800, 1089514, 1149145, 1201727, 1131015, 1151387, 1154827, 1240872, 1245814, 1023333, 1050108, 985070, 975431, 954674, 992961, 1008241]
4931A008241L1695N7954m1516L1963P178J20771L9021j5450p7291j54675R1876
4920A099767n7808j12543M3951K2851M4835j87287M2751J23488j13142j12919
4910G93944k6597p8083J7415M0835m6341q501P1954P1226m9438k0922K4396P137
4898G97025m9445Q3615O6572k8203j90509o2833J09088o0593p215l2048L1913
4887F57367P03k8738M82j9887M2868p4858n4173R5626L8490o8074r8467O5781
4875E57120J34240L2754m4895j2984P136J61530m3189K5189N8042J67748N4464
4864A097155q890J00143q9673k61613k2517r4265j80125J8144J5149L7402M6852
4853F57762q9915J2441O0233j02408P8327j28569M3397O8627j31123Q3598k3395
$$ y = [1008241, 1039936, 1097890, 1056374, 1088337, 1095515, 1216286, 1255307, 1239857, 1162566, 1007891, 1099767, 1041959, 929416, 973367, 996218, 1041053, 853766, 896517, 1020005, 906863, 793944, 767347, 689264, 706679, 747514, 701173, 692672, 764626, 835852, 786414, 765492, 789888, 797025, 747580, 831195, 897767, 869564, 679055, 616222, 725310, 664717, 657502, 625454, 657367, 658070, 629332, 629814, 609927, 652795, 577937, 523764, 619390, 657880, 589806, 491339, 557120, 691360, 724114, 679219, 666235, 673371, 834901, 791712, 816901, 874943, 1042691, 1097155, 1088265, 1188408, 1098735, 837122, 814605, 720340, 540215, 558359, 573508, 610910, 657762, 567847, 580288, 640521, 538113, 616440, 487871, 531268, 599895, 468772, 552370, 528975]
4842E28975n9793j4435R4734J2231j08721M5923J4692L5636l3570J0637m5461
4831D80848J72494r8635p318r2253l0829q0530J66441j3140n290O4398P695q311
4819E55570k5084k140O2776K3115K2006j5160n4967L4740l2369O3220n3416l4013
4807E44278M5860J2542L2646M0656k24955R4927K1611J4423M7445Q8392L6626
4796G54451r5300q1659J43124O1981k5890J7421J3483k3064j62516J31794Q6593
4785H20418J01749K0953o562Q3079O4861N0027P2298J25327R6791P0745J22301
4774A621987K37223J60429J99390J56642J87700K8651N9061N5595n9893M3835
4764B690620M5710j71829k00082j31472r1615N8209n057L8957J28865J04396J06988
$$ y = [528975, 469182, 454747, 549481, 561712, 452991, 498914, 513606, 549242, 515672, 526309, 480848, 653342, 554707, 547389, 455136, 424307, 343777, 510218, 497078, 491788, 556186, 563881, 555570, 530486, 528346, 591122, 614237, 636243, 621083, 566116, 600856, 568487, 631707, 578291, 544278, 590138, 602680, 635326, 675982, 451027, 545954, 567565, 581988, 629433, 717825, 754451, 659151, 577492, 720616, 782597, 756707, 774128, 787611, 764547, 602031, 733825, 820418, 922167, 943120, 936558, 1019637, 1084498, 1134525, 1206823, 1332150, 1428941, 1499686, 1621987, 1859210, 2019639, 2219029, 2375671, 2563371, 2592022, 2651083, 2706678, 2646785, 2690620, 2736330, 2564501, 2364419, 2232947, 2141332, 2199541, 2194484, 2233441, 2362306, 2466702, 2573690]
4753B573690R1293K03525O8250J54110K662J2780L0759k5586j24446r6462r7565
4742B793010m0944k36434q7299N6448n1798l1656J18071M7522K151K19805K60216
4731C049092j3393N1014P3225j05277K3820j40534j69844J4860r7951r9799L6525
4720B621738k3909m9790k614N7720M0740l1732k7810K2162K5816P0484r3008j3607
4708B596190o4840j92428k16212j57902k06305k25816j39716j27003r3264k009
4698A170695j662n1092L32n9141j92411M8327q447j05528m9432O3491n9447m1982
4686G13703R263P9158j27061m5174o3387K9065k8149J745O973L1677m3104p043
4674E57666N0482K5947l2369q7684R5318L2128l5657K9577l237j04282L4066Q1383
$$ y = [2573690, 2664983, 2868508, 2936758, 3090868, 3093530, 3106310, 3137069, 3111483, 2987037, 2890575, 2793010, 2752066, 2515632, 2428333, 2484781, 2432983, 2401327, 2519398, 2566920, 2569071, 2788876, 3049092, 3035699, 3086713, 3159938, 3054661, 3078481, 2937947, 2768103, 2782963, 2685012, 2585213, 2621738, 2597829, 2548039, 2545425, 2603145, 2643885, 2612153, 2584343, 2606505, 2632321, 2702805, 2609797, 2596190, 2531350, 2338922, 2122710, 1964808, 1758503, 1532687, 1392971, 1265968, 1172704, 1170695, 1169033, 1117941, 1118273, 1059132, 866721, 915048, 906601, 801073, 751641, 815132, 755685, 713703, 722966, 802124, 675063, 629889, 566502, 595567, 567418, 569163, 576136, 607813, 564709, 557666, 608148, 634095, 601726, 514042, 609360, 641488, 605831, 635408, 632171, 527889, 561955, 643338]
4662F43338q9269o6833Q7780n7720N9451Q8869K0182r6807k9759q9760j6269J91503
4650F44706j53597R425j1104j08856Q6544J491J8301N3491k4714j68534Q0472
4639D27625J24197Q8782j28589k4262j15050n6497R9043O3417j1823M3981L4663
4628E45487n6781n1089Q4911Rj31725k5117J05590P8372L9039r7081q127O6148
4616E49636o5892k4209j9534k4109l3990L893m7726J20595J6243l4532M0o0192
4604C80223m2639R4243L7371m3831O8967O7828K8054o8912j4138k1776p6918K7575
4592D36047l8894R2255P9004J56074K536M5561j5907m1320J7836m3092N5932j01213
4580F44819o7053K1016J07864P6897Q52n4852j5987J9991r6211N7435O7741o1919
$$ y = [643338, 554069, 487236, 575016, 517296, 576747, 665616, 685798, 588991, 559232, 469472, 453203, 644706, 491109, 500534, 489430, 380574, 467118, 468609, 486910, 540401, 515687, 347153, 427625, 551822, 640604, 512015, 487753, 372703, 316206, 415249, 478666, 466843, 510824, 545487, 488706, 437617, 522528, 522537, 390812, 365695, 471285, 549657, 588696, 491615, 483488, 549636, 483744, 459535, 440001, 415892, 381902, 385795, 338069, 458664, 474907, 440375, 440415, 380223, 337584, 431827, 469198, 425367, 494334, 562162, 590216, 521304, 507166, 485390, 408472, 436047, 397153, 489408, 568412, 724486, 727022, 772583, 756676, 715356, 733192, 690100, 746032, 644819, 577766, 598782, 706646, 783543, 784395, 729543, 713556, 733547, 637336, 694771, 762512, 700593]
4568G00593n3939J56437J0073p2515M4268m3283j3105O2298n0313j2375n2903
4557F75236r146N2642l3213J9936k5409j2492p4458N8469Q3216j29278k5368J54465
4545G34600P6520j5724k7948N3271r6521l4506L9474K3353K9791R4611k1496m075
4533H51350M4657J44274M302k8834p7115q8555j3844R3728j8388l4335J20434
4522I97674m947N2788k8628J632R3674Q7745j46147j8191J32395J0321L2749j1461
4510A199604n9644o5435J36856M9931j3154q7794N0714J23458L4506M0853q0841
4499A329054K343Q2990K6492L4339J48504o3668K34892K50175L8475K10395J3668
4488B307659Q8658O3123Q3331j51801m7534k16542j00979J07175j09372j18695
$$ y = [700593, 646654, 803091, 813164, 740649, 784917, 741634, 728529, 790827, 740514, 728139, 675236, 666090, 718732, 685519, 705455, 680046, 667554, 593096, 651565, 734781, 605503, 580135, 734600, 811120, 795396, 767448, 820719, 724198, 689692, 729166, 752519, 782310, 876921, 855425, 851350, 896007, 1040281, 1044583, 1015749, 938634, 850079, 836235, 929963, 911575, 877240, 997674, 992727, 1045515, 1016887, 1018519, 1112193, 1199938, 1053791, 1035600, 1167995, 1178316, 1211065, 1199604, 1139960, 1074525, 1211381, 1261312, 1248158, 1160364, 1211078, 1334536, 1369042, 1409895, 1329054, 1331397, 1414387, 1440879, 1475218, 1623722, 1560054, 1794946, 2045121, 2083596, 2293991, 2307659, 2396317, 2459440, 2542771, 2390970, 2343436, 2126894, 2025915, 2133090, 2023718, 1905023]
4478A905023q9219o4234k8570N7937L3506L1924Q7968J1376R423K39899K26802
4467B421835J12893J83392L82737J46307K11163K91805K93408M3586n8488j35623
4457C893015k81673m22873l71290m67834k63889m1131r7786j98550l0250K687
4447A720426O772j18631k5388o8266j16324p4746j10482j5269N4601P5138j4091
4436A313740k1255K7409K8409m9807q8934m3551P3877o3254n1228P2182m4834
4425A152754J8410K6351J61956R3935j51139L6831J3610K7626j00458r897Q2145
4414A352124J8353l6826M1792L7224l2530Q7008M5822K4950n4547L8953N6438
4403A578761n2885j45860J27914K43818O2542Q211J46551J88606J83842J42354
$$ y = [1905023, 1815804, 1751570, 1723000, 1780937, 1814443, 1846367, 1934335, 1945711, 1955134, 2195033, 2421835, 2534728, 2718120, 3100857, 3247164, 3458327, 3750132, 4043540, 4087126, 4028638, 3893015, 3611342, 3188469, 2817179, 2349345, 2085456, 2044325, 1946539, 1747989, 1717739, 1720426, 1727198, 1608567, 1583179, 1514913, 1398589, 1323843, 1213361, 1198092, 1252693, 1327831, 1313740, 1292485, 1319894, 1348303, 1298496, 1209562, 1166011, 1239888, 1176634, 1125406, 1197588, 1152754, 1171164, 1197515, 1359471, 1453406, 1302267, 1339098, 1352708, 1380334, 1279876, 1269979, 1352124, 1370477, 1333651, 1375443, 1412667, 1380137, 1467145, 1512967, 1537917, 1483370, 1522323, 1578761, 1525876, 1380016, 1507930, 1751748, 1814290, 1822501, 1969052, 2157658, 2341500, 2483854]
4393B483854K00712J76078J48895K0885j9221J5822k58945o2420m7926j22134
4383B535600j83498k4018N445j05225p5765L6956j29688j18778m3332J38211P480
4372B043388J6252J23913N0240O798N1737R2040J00513J61985J85480J28844J61337
4361C122527K49681J15903K4216J81505k456j75827q3134j63454o1465q7579O309
4350C126226o5136j30245p7133M8361P4997L9788L355O9328J17643N0689J07609
4339C365482P5337K06999J32139K03357K43491K23071K46346J82751K35178J65681
4329E279832L86663K76250L19102M56376O59515M40393J73743K09623K83153L25112
4319H809762K6959R3617q4572m4823l23487m27921k88504k73967m26947k73881
$$ y = [2483854, 2684566, 2860644, 3009539, 3030424, 3011203, 3027025, 2768080, 2705660, 2657734, 2535600, 2352102, 2328084, 2333529, 2228304, 2152539, 2189495, 2059807, 1941029, 1897697, 2035908, 2043388, 2059640, 2183553, 2233793, 2240591, 2292328, 2384368, 2484881, 2646866, 2832346, 2961190, 3122527, 3372208, 3488111, 3512327, 3693832, 3691376, 3515549, 3432415, 3268961, 3207496, 3119917, 3126226, 3061090, 2930845, 2853712, 2902073, 2977070, 3016858, 3020213, 3089541, 3207184, 3257873, 3365482, 3440819, 3647818, 3779957, 3983314, 4226805, 4449876, 4696222, 4878973, 5114151, 5279832, 5666495, 5942745, 6261847, 6718223, 7377738, 7818131, 7991874, 8201497, 8484650, 8809762, 8836721, 8930338, 8845766, 8800943, 8477456, 8049535, 7761031, 7487064, 7060117, 6786236]
4309F786236j83110j73902k10345k03940q9475l8812j56298R008N0270L3978J00471
4298E924081K39991N9059J43424J62849J90974K04997J94026K89594K56009M27163
4288H092167K77991K28208M1210J89608J4466q4514k24175m33747l04092l05861
4278G491261l56175m42281k86750k85084l88378k27818l72680k19806k46655k25653
4268D439981j38180l5791k98047j24357n2841j92299q2771M0756j01909p8337
4258C376205N877j21580j93105k5528r3281O1829n1757K6164m2788o5840K4011
4247B900207n289j89608J22309Q3945j01281n3165j33149M1034K2208K8294j03263
4236B612242o1150o138O5381r9967L6461R894O7365l9178J17216k121q8852j6533
$$ y = [6786236, 6603126, 6429224, 6218879, 6014939, 5925464, 5886652, 5730354, 5739362, 5789632, 5823610, 5924081, 6164072, 6223131, 6366555, 6529404, 6720378, 6925375, 7119401, 7408995, 7665004, 8092167, 8370158, 8598366, 8639576, 8829184, 8843650, 8759136, 8534961, 8101214, 7797122, 7491261, 7135086, 6692805, 6406055, 6120971, 5732593, 5504775, 5132095, 4912289, 4665634, 4439981, 4301801, 4266010, 3967963, 3843606, 3790765, 3598466, 3515695, 3556451, 3454542, 3376205, 3382082, 3260502, 3067397, 3041869, 2948588, 3010417, 2958660, 2984824, 2942036, 2876196, 2900207, 2894918, 2705310, 2827619, 2911564, 2810283, 2757118, 2623969, 2665003, 2687211, 2715505, 2612242, 2551092, 2544954, 2610335, 2510368, 2546829, 2556723, 2624088, 2584910, 2702126, 2700005, 2611153, 2594620]
4224B594620L3325N0726p590L6832L0631j8046l3523P4555R9532K8315q3226n0835
4212B755316Q3638p0384Q1165N2519J38709o170m99J28455L1170l7632k9380J06120
4200C233027k8612q011J59959J61500K8383R620P541J08008M6674K55441L7176
4189D010706L8570J54124m886J01729Q3752O4351K653J41049N2588J52773J22404
4178D919813R6447R6326J48837K26150J30912N8625J06282K53598K29605K21480
4168F488075K67999L03310K30841L86332L20459K57762N18231L98667M47996O19545
4158A0239217O32475O36517P34710Q16637J015104J061598R04389J196024J121389
4149A8358060Q46163O88154O18896N87747N41064N18594M19568L92805L44212
$$ y = [2594620, 2627945, 2678671, 2671081, 2707913, 2738544, 2720498, 2686975, 2761530, 2861062, 2889377, 2806151, 2755316, 2838954, 2768570, 2849735, 2902254, 3040963, 3034793, 3034294, 3162749, 3193919, 3156287, 3126907, 3233027, 3204415, 3196404, 3356363, 3517863, 3546246, 3555866, 3563407, 3671415, 3718089, 3973530, 4010706, 4049276, 4203400, 4198514, 4300243, 4383995, 4448346, 4450999, 4592048, 4644636, 4797409, 4919813, 5016260, 5112586, 5261423, 5487573, 5618485, 5677110, 5783392, 6036990, 6266595, 6488075, 6756074, 7059384, 7290225, 7676557, 7997016, 8254778, 8773009, 9171676, 9619672, 10239217, 10871692, 11508209, 12242919, 13059556, 14074660, 15136258, 16040647, 17236671, 18358060, 19204223, 19892377, 20511273, 21099020, 21640084, 22158678, 22578246, 22971051, 23315263]
4140B3315263L73306K93342L69830O26630N16216O89464Q29137P82177R87780
4131B8783145R21214O23689N84817L84265K58637K34102m2130p6712j01260k15534
4121C1354233k02190j21618j26218j39319r0470J8959K21256L29506M28147N48141
4111C2220427O97236P38663P32847O24834M57987L98614K17008O6920j50063j7371
4101C5987102k0226N3398K2137j48827j96722o78729q77767j084403j101050j322701
4091C0632212j438925j497911j562301j562910j408065j372035j212814r97366
4083A9579885r52005q58931p54092o77142o80026o05581m19103l17831l97190
4074A3917984k31570l96352l14349k07680l30721l66924k35980k64540q6993J8035
$$ y = [23315263, 23688569, 23981911, 24351741, 24978371, 25494587, 26184051, 27013188, 27795365, 28783145, 29704359, 30328048, 30912865, 31297130, 31555767, 31789869, 31747739, 31671027, 31569767, 31354233, 31152043, 31030425, 30904207, 30764888, 30674418, 30693377, 30914633, 31244139, 31672286, 32220427, 32917663, 33656326, 34389173, 35014007, 35471994, 35870608, 36087616, 36154536, 36004473, 35987102, 35966876, 36020274, 36042411, 35893584, 35696862, 35018133, 34140366, 33055963, 31954913, 30632212, 29193287, 27695376, 26133075, 24570165, 23162100, 21790065, 20577251, 19579885, 18627880, 17768949, 17014857, 16337715, 15657689, 15052108, 14633005, 14315174, 13917984, 13686414, 13290062, 12975713, 12768033, 12437312, 12070388, 11834408, 11569868, 11482875, 11500910]
4064A1500910m6211p2566L8654Q0668m2874M7352J18948K01474N1290J40964K67419
4053A2286028K41361J58883J04460K20373p233J31425J67103K41720K33943L58968
4043A4137031M49157N22314N92199O71845P57041Q01458R43936J005018J071105
4034B0951104J125757J441692J477548J441207J574069J723935J561897J681665
4026C2978874J758061J231390J030826R64066M17932J87021j33943j24601j67295
4017C8142331l69249m39727m34372l89101k57469j24129k39486k74727k83313
4008C5330758n16689o35521o87226n67767l29696k32130j42496P1118J09211K01414
3998C2600976L82582L01199L35720R9625O6641J40085O7392M6933l25475n26749
$$ y = [11500910, 11454699, 11382133, 11420787, 11501455, 11458581, 11505933, 11624881, 11826355, 11877645, 12018609, 12286028, 12527389, 12686272, 12790732, 13011105, 13003872, 13135297, 13302400, 13544120, 13778063, 14137031, 14586188, 15108502, 15700701, 16372546, 17129587, 17931045, 18874981, 19879999, 20951104, 22076861, 23518553, 24996101, 26437308, 28011377, 29735312, 31297209, 32978874, 34736935, 35968325, 36999151, 37963217, 38381149, 38568170, 38434227, 38309626, 38142331, 37773082, 37333355, 36898983, 36509882, 36252413, 36128284, 35888798, 35614071, 35330758, 34814069, 34178548, 33491322, 32923555, 32593859, 32361729, 32219233, 32290351, 32399562, 32600976, 32983558, 33284757, 33620477, 33720102, 33786743, 33926828, 33994220, 34041153, 33715678, 33188929]
3988C3188929m91600o74703r43589q76649q04123q29920q78210p73424m20491
3979B6496220m45274l14641k63211m38093m21188m59374o14492o08720p73343
3970B2157884q20674q66603q70000q77256p80496n65797q57992o30392m31012
3961A5457662n04340m82079l25793k94227n01035l31226k02222k60233j67152
3952A2389355q0276j02305l3848r2246j12341j02447j85295K3693k8836n8112
3942A1617342n2288j10983j83408j90098k22130k12416M1718K6342o1427l2373
3932A0620279l913L6442J80262J47539P2113J20923J55019J6033K28839J54328
3922A1727864j7127j9877N4968j06607j50243l22428l93859k00143k9760o9464
$$ y = [33188929, 32697329, 32022626, 31079037, 30202388, 29398265, 28568345, 27690135, 26916711, 26496220, 26050946, 25736305, 25473094, 25035001, 24613813, 24154439, 23539947, 22931227, 22157884, 21337210, 20470607, 19600607, 18723351, 17942855, 17377058, 16519066, 15888674, 15457662, 14953322, 14471243, 14145450, 13851223, 13350188, 13018962, 12816740, 12556507, 12389355, 12309079, 12206774, 12172926, 12080680, 11968339, 11865892, 11680597, 11704290, 11675454, 11617342, 11565054, 11454071, 11270663, 11080565, 10858435, 10646019, 10687737, 10714079, 10652652, 10620279, 10616366, 10652808, 10833070, 10980609, 11052722, 11173645, 11328664, 11344697, 11573536, 11727864, 11710737, 11690860, 11745828, 11639221, 11488978, 11166550, 10772691, 10572548, 10542788, 10473324]
3912A0473324j82194R316j0805Q2094J8028m7887j3251J06419Q0407J51265J17118
3901A0783834M9773N3251m1494j89383j86775j32039j02754j03151o1841r0609
3891I978812R8631P4562j00259L6358L6532R4070J34135K35047l2958Q5006J89382
3880A0829318q7093J68112n0143j52794n5882j33875m1544q1747l2437M7868K4118
3869A0433901J68549J11408L7384J71665J26806K03787J83945R7619J54345K69684
3859A1959093J95483L16377K80727K41868K70011K48369K31540K29762R6161K53394
3849A4322785N5802M2914J43695K09573K96706K24544L65793M01489L67037M92644
3839A6922982O44030N61989O84247N28117O90039R17024P40812O32866Q06712
$$ y = [10473324, 10291130, 10300446, 10289641, 10371735, 10389763, 10341876, 10328625, 10435044, 10515451, 10666716, 10783834, 10833607, 10886858, 10845364, 10655981, 10469206, 10337167, 10234413, 10131262, 10069421, 9978812, 10077443, 10152005, 10051746, 10088104, 10124636, 10218706, 10352841, 10587888, 10554930, 10639936, 10829318, 10742225, 10910337, 10860194, 10707400, 10651518, 10517643, 10476099, 10394352, 10361915, 10409783, 10433901, 10602450, 10713858, 10751242, 10922907, 11049713, 11253500, 11437445, 11535064, 11689409, 11959093, 12154576, 12470953, 12751680, 12993548, 13263559, 13511928, 13743468, 13973230, 14069391, 14322785, 14378587, 14421501, 14565196, 14774769, 15071475, 15296019, 15661812, 16063301, 16430338, 16922982, 17567012, 18129001, 18813248, 19341365, 20031404, 20948428, 21689240, 22322106, 23128818]
3830B3128818J225148J249519J237449J550219J897385K039695K401752K792175
3822C7522160L012901L212572L329293L146383J822651L52161p10664k017924
3814D9669533k627375k644641j799273q05094m15968K88107O43879P26184J022147
3805D4057499J127498J175726J519867J420037J502025J737563J996518K154796
3797E6691529K530713K829519L424867L891338M304956M609510N057138N697188
3789H9036758O404501O812086P462410Q388866R385295J0675990J1951224J2930617
3781A63047747J3003567J2145539R779470O766912M408371J735793l248475j0578220
3773A97060704j6321527j8676307j7800223j5509932j2758971j0272038q639229
$$ y = [23128818, 24353966, 25603485, 26840934, 28391153, 30288538, 32328233, 34729985, 37522160, 40535061, 43747633, 47076926, 50223309, 52045960, 52398121, 51687457, 49669533, 47042158, 44397517, 42598244, 41793150, 41377182, 41665289, 42309168, 43035352, 44057499, 45184997, 46360723, 47880590, 49300627, 50802652, 52540215, 54536733, 56691529, 59222242, 62051761, 65476628, 69367966, 73672922, 78282432, 83339570, 89036758, 95441259, 102253345, 109715755, 118104621, 127489916, 138165906, 150117130, 163047747, 176051314, 188196853, 197976323, 204743235, 209151606, 210887399, 207638924, 197060704, 180739177, 162062870, 144262647, 128752715, 115993744, 105721706, 97082477]
3766I7082477p358053o422980n447544m979294m522196m310839l926019l568725
3758E6546827l065478k773176k267556k085722j858643j778815j853780j625445
3750C9238212j669714j658745j425634j670966j566112j383118j447216j252084
3742B7164623j171953r74629q35824q73636q50530p92400p72820o55325n45712
3733A9691794n83881n61219n28976m27534l84823m28039l88226l93086m06259
3724A5589751j22002l68122k65083k32462k31706j10119k60551j09949k59382
3715A3630375j79858m9627j78104j72930j23129K1646j3539j30737O67r4630R9255
3704A2809389Q5546L1877N4938P2645N2819J00905K20050J91667K55184M0274
$$ y = [97082477, 89724424, 83301444, 77853900, 72874606, 68352410, 64041571, 60115552, 56546827, 53481349, 50708173, 48440617, 46354895, 44496252, 42717437, 40863657, 39238212, 37568498, 35909753, 34484119, 32813153, 31247041, 29863923, 28416707, 27164623, 25992670, 25018041, 24182217, 23308581, 22458051, 21665651, 20892831, 20237506, 19691794, 19107913, 18546694, 18017718, 17590184, 17205361, 16777322, 16389096, 15996010, 15589751, 15467749, 15099627, 14834544, 14602082, 14370376, 14260257, 13999706, 13889757, 13630375, 13450517, 13400890, 13222786, 13049856, 12926727, 12948373, 12934834, 12804097, 12804764, 12710134, 12809389, 12894935, 12926812, 12981750, 13054395, 13107214, 13208119, 13428169, 13619836, 13875020, 13915294]
3694A3915294n4249N979j09839R0258j09445N0124K4998k79511k17226l6272j97793
3683A3082318j80605j05213j43161n7513j66078n6784J02774j54943j95662l55229
3673A1769904j9975K5100r8452p1876p8077k03972j04083p7201l58687j53046
3663A0629635l17136l35179j69118k16710j06999n2589r0023l7244k32387j60767
3653H911483j73663r2339j41291k20680k17184j6320j28176r6682j13266r8234
3643G613648p138m8150q3975r7996r5193j72323R5886P4265j81937n6801m6753
3632F993533J01205p9201L9425j54493k71806j88406j6767l9771p1736k9396M6731
3621F329318Q170K1759o1463O1645J22670j8547J63134M1206q7431N0022J9049
$$ y = [13915294, 13861045, 13867024, 13757185, 13847443, 13737998, 13788122, 13813120, 13533609, 13316383, 13280111, 13082318, 12901713, 12796500, 12653339, 12595826, 12429748, 12372964, 12475738, 12320795, 12125133, 11769904, 11749929, 11775029, 11676577, 11604701, 11526624, 11322652, 11218569, 11141368, 10782681, 10629635, 10312499, 9977320, 9808202, 9591492, 9484493, 9431904, 9341881, 9304637, 9072250, 8911483, 8737820, 8645481, 8504190, 8283510, 8066326, 8050006, 7921830, 7825148, 7711882, 7613648, 7606510, 7558360, 7474385, 7376389, 7281196, 7108873, 7204759, 7279024, 7097087, 7040286, 6993533, 7094738, 7015537, 7054962, 6900469, 6628663, 6440257, 6423490, 6383719, 6311983, 6282587, 6329318, 6337488, 6359247, 6297784, 6359429, 6482099, 6463552, 6626686, 6667892, 6580461, 6630483, 6649532]
3610F649532j28229j01278r2291l7666l0469J1135N5545J27523P2130m4899K4320
3599F505353J03671J6363j2915N4154J03596j2652q9170M5481Q4405n1150O2391
3588F809527k1976M4370Q8424P5667o7888N2240J30147M6779N4857J8399l199
3577G227347R7927P8482R2915P8327j1903K0680P6492O1595J76654k53J17285
3566H015548N037Q8790R1472J36199R5009J66294K05609K32411J97131K39747
3556I473247J78514L12761K80352K54705L31975L21084K57529L50247L82088M22343
3546A2564845M66226N95964O82537N34562P62467P72476R38183Q77407J143485
3537A9338152J193224J129014J069267J060713R03614Q44971O51940M82883L86118
$$ y = [6649532, 6521303, 6420025, 6327734, 6290068, 6259599, 6270734, 6326279, 6453802, 6525932, 6481033, 6505353, 6609024, 6625387, 6612472, 6666626, 6770222, 6757570, 6668400, 6713881, 6798286, 6747136, 6809527, 6787551, 6831921, 6920345, 6996012, 6928124, 6980364, 7110511, 7157290, 7212147, 7230546, 7227347, 7325274, 7403756, 7496671, 7574998, 7563095, 7583775, 7660267, 7721862, 7898516, 7898263, 8015548, 8020585, 8109375, 8200847, 8337046, 8432055, 8598349, 8803958, 9036369, 9233500, 9473247, 9651761, 9964522, 10244874, 10499579, 10831554, 11152638, 11410167, 11760414, 12142502, 12564845, 13031071, 13627035, 14309572, 14844134, 15606601, 16379077, 17317260, 18194667, 19338152, 20531376, 21660390, 22729657, 23790370, 24693984, 25538955, 26190895, 26673778, 27059896]
3528B7059896M81852K94166L62193M67511N61034P19621O73552P73959Q01487
3519C2195271Q15545O81843P51700R44866R25008Q67657J145488J434971J629976
3510D1392325J889805K044367K368991K502719K430654K322761K202568J738656
3502E8892846J158424P38937L27749o4070m99001o40352m78518m49377n14795
3493E8471843l65625l71675o30347q85017j164014j645394k093471k458165k860840
3484D5997295k926493k912475k929691k770446k616565k163874k078622j882030
3476B5717099j610284j365029j291319j091165r31249q69231p27054q50027n61732
3467A6420009m80893n46213n18735m03909l52787j54624k79229l99530k07265
$$ y = [27059896, 27541748, 27835914, 28198107, 28665618, 29226652, 29946273, 30619825, 31393784, 32195271, 33010816, 33692659, 34444359, 35389225, 36314233, 37181890, 38327378, 39762349, 41392325, 43282130, 45326497, 47695488, 50198207, 52628861, 54951622, 57154190, 58892846, 60051270, 60790207, 61117956, 61053886, 60554885, 59914533, 59436015, 58986638, 58471843, 58106218, 57734543, 57104196, 56219179, 55055165, 53409771, 51316300, 48858135, 45997295, 43070802, 40158327, 37228636, 34458190, 31841625, 29677751, 27599129, 25717099, 24106815, 22741786, 21450467, 20359302, 19428053, 18558822, 17831768, 16981741, 16420009, 15939116, 15392903, 14874168, 14470259, 14117472, 13962848, 13683619, 13284089, 13076824]
3458A3076824k70291k38858k17707j89019k00901q0842j36766k28146r2279q4242
3448A1337773r892N087l5385l5202l157k11976K738N6542J22465j8202j05132
3437A1105659N4458Q0960O0331m3077j85120J18653K30054O4625l6248j462J79927
3426A1628760J1593J7803J34061M8798J19653J1008M7653Q9333Q6573J15050K53418
3415A2563703N3373J44805K58795O9421J27350K32407L02108R8305L83468L23565
3405A4557300K15673M33185M09909M12350N51377N91188N37090O72748P95669
3396A9176489P42670R11721J088381J177284J287352J337515J314979J489649
3388B8526040J603115J559187J634328J508176J618765J841529J625932J617134
$$ y = [13076824, 12806533, 12567675, 12349968, 12160949, 11960048, 11879206, 11742440, 11514294, 11422015, 11337773, 11327881, 11332968, 11297583, 11262381, 11259224, 11047248, 11049986, 11106528, 11228993, 11210791, 11105659, 11160117, 11241077, 11301408, 11258331, 11073211, 11191864, 11421918, 11486543, 11450295, 11448833, 11628760, 11640353, 11658156, 11792217, 11841015, 11960668, 11971676, 12019329, 12108662, 12195235, 12310285, 12563703, 12617076, 12761881, 13020676, 13090097, 13217447, 13449854, 13751962, 13850267, 14233735, 14557300, 14772973, 15206158, 15616067, 16028417, 16579794, 17170982, 17708072, 18380820, 19176489, 19919159, 20830880, 21919261, 23096545, 24383897, 25721412, 27036391, 28526040, 30129155, 31688342, 33322670, 34830846, 36449611, 38291140, 39917072, 41534206]
3380D1534206J683028J956928J980758J993091J835902J684845J596121J380592
3372E5645471Q96483N69401J10048l55301p24715j226386j230849j384477j616701
3363E0682974j584179j447897j261499j062896r14995o05353j96923l5415L93547
3354D3967364Q07280R85867J481825J906678K328810K772459L221859L836615
3346F1308757M118985M747383N069804N431570N644677N542500N266333M808919
3338A01938928M169351L307526K419957J598735R33003L53687k56861n12578q77037
3329A13074711j039602j441174j404947j697766k271302k570168l108002l473279
3321I6068471l916823m176063m418280m521412m487890m361615m231180m040057
$$ y = [41534206, 43217234, 45174162, 47154920, 49148011, 50983913, 52668758, 54264879, 55645471, 56541954, 57111355, 57221403, 56866102, 56141387, 54915001, 53684152, 52299675, 50682974, 49098795, 47650898, 46389399, 45326503, 44411508, 43806155, 43609232, 43573817, 43967364, 44774644, 45760511, 47242336, 49149014, 51477824, 54250283, 57472142, 61308757, 65427742, 70175125, 75244929, 80676499, 86321176, 91863676, 97130009, 101938928, 106108279, 109415805, 111835762, 113434497, 114367500, 114721187, 114464326, 113951748, 113074711, 112035109, 110593935, 109188988, 107491222, 105219920, 102649752, 99541750, 96068471, 92151648, 87975585, 83557305, 79035893, 74548003, 70186388, 65955208, 61915151]
3313F1915151l793337l604044l194442l014401k692522k518451k281501k218518
3305C8597935j956337j739914j781240j546352j549245j255660j101828j137887
3297B6529472q57296p88345p67623n99214n20890l89851n07894l68207k75786
3288B1454366k05482k37282R4935j15191P0149J06127J13610N9237J06163o390
3278B1440242k392j30517k24525k89469l62864l38970m94532o61628n19675n82223
3268A7833447o84589o65007n57930o32684m83848m52287m84636l76048j60892
3259A3335526l82760l32620k50079j91329k60535j52926j68850q0071J4493n0662
3249A1480187o5332j52516l4623p5995m8356K158J59316M4952K9356N7143K3260
$$ y = [61915151, 58121814, 54517770, 51323328, 48308927, 45616405, 43097954, 40816453, 38597935, 36641598, 34901684, 33120444, 31574092, 30024847, 28769187, 27667359, 26529472, 25672176, 24883831, 24116208, 23516994, 22996104, 22606253, 22098359, 21730152, 21454366, 21248884, 21011602, 21106537, 20991346, 21061495, 21167622, 21281232, 21340469, 21446632, 21440242, 21437850, 21307333, 21082808, 20793339, 20430475, 20091505, 19596973, 18935345, 18415670, 17833447, 17148858, 16483851, 15925921, 15293237, 14809389, 14357102, 13872466, 13496418, 13335526, 12952766, 12620146, 12370067, 12178738, 11918203, 11765277, 11596427, 11516356, 11530849, 11480187, 11414855, 11262339, 11227716, 11151721, 11103365, 11105523, 11264839, 11309791, 11339147, 11396290, 11419550]
3238A1419550N7859J36149J04354J55534J77684J53035J78257L19754K53966M36573
3228A3392715L68151K81753K17883K02561J61901J83052J75206J47177o2582M7058
3218A5114875p6614o0056j6909j55078j07436m9841p0699k707M2668K3453J96197
3207A4837853J79427Q4714K70988J92096K32971K40955J57353J72975L46902K39585
3197A6955819L71490M41508N11754M67557N00998N02639O74556P81927O53186
3188B1861434Q02193P77858Q47871R48635Q75551Q56764Q62877Q77220R63446
3179B9673849N50691N42740O55796M56315M92401M61674K70062K75000M9978M3046
3169C3471552k4024k53300k96253l38107j69065j71260j59550m2234K65629L40432
$$ y = [11419550, 11477409, 11613558, 11717912, 11873446, 12051130, 12204165, 12382422, 12702176, 12956142, 13392715, 13760866, 14042619, 14260502, 14463063, 14624964, 14808016, 14983222, 15130399, 15067817, 15114875, 15038261, 14978205, 14961296, 14806218, 14698782, 14648941, 14578242, 14575535, 14618203, 14641656, 14837853, 15017280, 15101994, 15372982, 15565078, 15798049, 16039004, 16196357, 16369332, 16716234, 16955819, 17327309, 17768817, 18280571, 18748128, 19249126, 19751765, 20426321, 21208248, 21861434, 22663627, 23441485, 24289356, 25237991, 26113542, 26970306, 27833183, 28710403, 29673849, 30224540, 30767280, 31423076, 31879391, 32371792, 32833466, 33103528, 33378528, 33428506, 33471552, 33447528, 33194228, 32897975, 32559868, 32390803, 32219543, 32059993, 32017759, 32283388, 32623820]
3159C2623820M56063O89296O28429Q64067Q75287Q63413R14655Q04626J035508
3150C9755164R89106J017820J068689J100087J229935J377152J745064J922795
3142E0205812K000625K257555K444066K649078K729440K959900L022505L098284
3134G1367265K990243K831080K588165K432305K153575J850560J554767J513472
3126H9281432J462535J608790J784378J747512K021674K033187J982396J762772
3118A03684676J566871R83148P95589K55895j88399o74540r32620j003156j321444
3109A03166020j484111j638121j615227j669999j626996j651868j764824j774387
3101H9940487j855988k120504k322269k370200k463096k699018k897468k705803
$$ y = [32623820, 33079883, 33769179, 34397608, 35261675, 36136962, 37000375, 37915030, 38719656, 39755164, 40744270, 41762090, 42830779, 43930866, 45160801, 46537953, 48283017, 50205812, 52206437, 54463992, 56908058, 59557136, 62286576, 65246476, 68268981, 71367265, 74357508, 77188588, 79776753, 82209058, 84362633, 86213193, 87767960, 89281432, 90743967, 92352757, 94137135, 95884647, 97906321, 99939508, 101921904, 103684676, 105251547, 106234695, 107030284, 107286179, 107097780, 106423240, 105490620, 104487464, 103166020, 101681909, 100043788, 98428561, 96758562, 95131566, 93479698, 91714874, 89940487, 88084499, 85963995, 83641726, 81271526, 78808430, 76109412, 73211944, 70506141]
3093G0506141k620934k416816k323082k227653k006418j908372j761473j739928
3085E3501465j613729j705805j927955j786144j802163j641670j616695j301266
3077D0106038j115585r55866r62217r34240p94534o32116m55780k83356j35229
3068C3837115j57932N040J31850J30023J43096K1818J32053J65497Q9019Q3596
3058C4581175J12905k2539p3739J0310p5945J70526j61622j38184j19281Q028
3048C4291634N649k80429m69197p01961l85714k23644k40083k14245K53476K65464
3038C2300950K39959L68231M98663N15722O30262N24748M67436N40741L93312
3029C6480024K31282K06852J75616R8317J18726J82954J8001j9392k11608k60365
$$ y = [70506141, 67885207, 65468391, 63145309, 60917656, 58911238, 57002866, 55241393, 53501465, 51887736, 50181931, 48253976, 46467832, 44665669, 43023999, 41407304, 40106038, 38990453, 38034587, 37072370, 36138130, 35343596, 34711480, 34255700, 33972344, 33837115, 33679183, 33684223, 33816073, 33946096, 34089192, 34111010, 34243063, 34408560, 34497579, 34581175, 34694080, 34671541, 34597802, 34608112, 34532167, 34702693, 34541071, 34402887, 34283606, 34291634, 34297283, 34016854, 33547657, 32845696, 32459982, 32236338, 31996255, 31782010, 32035486, 32300950, 32540909, 32909140, 33407803, 33923525, 34553787, 35078535, 35545971, 36086712, 36480024, 36711306, 36918158, 37093774, 37192091, 37310817, 37493771, 37511772, 37492380, 37280772, 37020407]
3019C7020407l47345n91843o92718p43339p64964r46150p28686p79396q52672
3010C0573294o84387n33700n05296m75598k68475r0732o5916J82924J66810M50773
3000B8749697O17328P91582R74135J145089J216985J425343J298477J497120J609618
2991C9325374J678984J638465J717050J686358J743757J706925J698781J742290
2983E2937984J765226J844337K049151K347620K445681K813750K935468L111938
2975G2251155L350718L108684K873583K512347J840817Q95493J2312j154871k324813
2966H3365425l360383m053271m616129n077373n221430n051917m681230m244020
2958D7059672l959289l390417k993550k660931k216162j985926j850118j609699
$$ y = [37020407, 36673062, 36081219, 35388501, 34645162, 33880198, 32934048, 32205362, 31425966, 30573294, 29888907, 29355207, 28849911, 28374313, 28105838, 28015106, 27949190, 28132114, 28298924, 28749697, 29367025, 30158607, 31132742, 32277831, 33494816, 34920159, 36218636, 37715756, 39325374, 41004358, 42642823, 44359873, 46046231, 47789988, 49496913, 51195694, 52937984, 54703210, 56547547, 58596698, 60944318, 63389999, 66203749, 69139217, 72251155, 75601873, 78710557, 81584140, 84096487, 85937304, 86832797, 86845109, 85690238, 83365425, 80005042, 75951771, 71335642, 66258269, 61036839, 55984922, 51303692, 47059672, 43100383, 39709966, 36716416, 34055485, 31839323, 29853397, 28003279, 26393580]
2950B6393580j378014j158133j001581j057959q61015q16631o44556p35911o22336
2941A8117444m87778m80413m59935l84718l60913k66716m69313k45202k75412
2932A4687044k93419l48508j94826k35424k67834l32009l80304k77786k44060
2923A2112874j44094j31296j92884k02972j16445j32211k08541k43225j07809
2914A0633397j23538r6089J1399j03270p4871K0620J5450j39144j12800M46K4936
2903A0056536L6004N2877O1797l429R8625J79243J04730J56002K10013J74404
2893A1126802L11980K69948K23312L65494K40638M66729N58332M81679N97802
2884A4642716N26898O20679N41421N80975M57634M61474K55344K03745K84314
$$ y = [26393580, 25015566, 23857433, 22855852, 21797893, 20936878, 20120247, 19475691, 18739780, 18117444, 17629666, 17149253, 16689318, 16304600, 15943687, 15676971, 15207658, 14962456, 14687044, 14393625, 14045117, 13850291, 13614867, 13347033, 13015024, 12634720, 12356934, 12112874, 11968780, 11837484, 11644600, 11441628, 11325183, 11192972, 10984431, 10741206, 10633397, 10509859, 10413770, 10425169, 10321899, 10247028, 10267648, 10283098, 10143954, 10031154, 10031600, 10056536, 10092540, 10145417, 10207214, 10203785, 10302410, 10481653, 10586383, 10742385, 10952398, 11126802, 11438782, 11708730, 11932042, 12297536, 12538174, 13004903, 13563235, 14044914, 14642716, 15169614, 15790293, 16331714, 16912689, 17370323, 17831797, 18087141, 18290886, 18575200]
2875A8575200j1525J16199j14749l25361k95182l56188n15398o08004p07258p79601
2865A4978133o86900o37723n77244o53277n76691m00531m10395m46229l58347
2856A0230796l96374k11208j42089k33483r8629k49325j11352j27813n8830j44320
2846H457373k26233j1719j45919m2768j7626N8962m2181k67019q7581j1628L7588
2835G701249L3514M8062J32722n9407N0905J37822j2490N59p9171J36744J79719
2824H270228N1358l2118L473K38163M4117Q5496J80533J30192J56596J76741R2699
2813I397478P3646M7935J39371K07977J43875R3550K56393K66834J90177K28636
2803A1045872J21097K24933J55338K76158K16091L64907M25584K25070K64483
$$ y = [18575200, 18563675, 18679874, 18565125, 18239764, 17944582, 17588394, 17072996, 16464992, 15757734, 14978133, 14291233, 13653510, 13076266, 12422989, 11846298, 11445767, 11035372, 10589143, 10230796, 9834422, 9623214, 9481125, 9247642, 9149013, 8899688, 8788336, 8660523, 8601693, 8457373, 8231140, 8219421, 8073502, 8030734, 8013108, 8072070, 8029889, 7762870, 7675289, 7663661, 7701249, 7734763, 7782825, 7915547, 7856140, 7907045, 8044867, 8032377, 8032936, 7953765, 8090509, 8270228, 8321586, 8289468, 8292941, 8531104, 8575221, 8660717, 8841250, 8971442, 9128038, 9304779, 9397478, 9471124, 9519059, 9658430, 9866407, 10010282, 10103832, 10360225, 10627059, 10817236, 11045872, 11166969, 11391902, 11547240, 11823398, 12039489, 12404396, 12829980, 13055050, 13319533]
2794A3319533L58918K77039M16544M94325K95110L62717L23587L19512M18735
2785A6586020M00241M21730M74438N87757N25734M03571N04007O01687N09260
2776B1014445K64028N14242M20038N92315O14128O59853O55160Q83532O70888
2767B6288629R32099J004795R33655J073748J170688J332124J349133J561545
2759C5646416J773119J823844K083581K494596K616503L042435L272658L890623
2751E6643775M359281M885531N344205N930038O648072P123380P930652Q547008
2743A07411942R313364R612167R197092Q062635O615538N259476M039429K875971
2735A62387614K159689L030641N332837Q388099J1743627J5054193J7801575K0405911
$$ y = [13319533, 13678451, 13955490, 14372034, 14866359, 15161469, 15524186, 15847773, 16167285, 16586020, 16986261, 17407991, 17882429, 18470186, 18995920, 19399491, 19903498, 20505185, 21014445, 21278473, 21792715, 22212753, 22805068, 23419196, 24079049, 24734209, 25617741, 26288629, 27220728, 28225523, 29159178, 30232926, 31403614, 32735738, 34084871, 35646416, 37419535, 39243379, 41326960, 43821556, 46438059, 49480494, 52753152, 56643775, 61003056, 65888587, 71232792, 77162830, 83810902, 90934282, 98864934, 107411942, 116725306, 126337473, 135534565, 143597200, 150212738, 155472214, 159511643, 162387614, 164547303, 167577944, 172910781, 181298880, 193042507, 208096700, 225898275, 246304186]
2727B46304186K1264245J9770155J5136088O521050o287216j9980802k9220869
2720B53506837l1360084k8252933k3750876j9306203j5433570j2879727j0932109
2713A11591335r461206q205483p158570o222289n442311m815287m229309l857181
2705F2199699l445644l054814k710027k615240k313668k087089j914682j650789
2697D2407746j584641j479519j314107j246809j208142r87705r61858r76393j009623
2688C1638949r21556q69815q96450p04877q08997o35338o38598o71152n04083
2679B4988083k37769m39744m40925j78054k53703j41605K9252J15373r9521q5569
2669B3255818J08395L49801L07492K53807K45805N34078P20485O27939Q82743
$$ y = [246304186, 267568431, 287338586, 302474674, 308995724, 302708508, 282727706, 253506837, 222146753, 193893820, 170142944, 150836741, 135403171, 122523444, 111591335, 102130129, 93924646, 86766076, 80543787, 75101476, 70286189, 66056880, 62199699, 58754055, 55699241, 52989214, 50373974, 48060306, 45973217, 44058535, 42407746, 40823105, 39343586, 38029479, 36782670, 35574528, 34586823, 33624965, 32648572, 31638949, 30717393, 29847578, 28951128, 28246251, 27437254, 26801916, 26163318, 25492166, 24988083, 24750314, 24310570, 23869645, 23691591, 23437888, 23296283, 23325535, 23440908, 23341387, 23255818, 23364213, 23714014, 24021506, 24275313, 24521118, 25055196, 25775681, 26403620, 27286363]
2660B7286363J049489J206214J445119J739318K146487K430177K682892K929889
2652D2915948L141886L492207L839954L793418L361338K787755J415687m07029
2644F4341164k309014l951297m839909n020356m686096m229351l537979l009719
2636C2757443k693526k314832j954869j706106j571090j488505j263691j113049
2628A8651775r84143q36793q11571p23643o63627o18370o09738m12549m35119
2619A2556222n14703k63608l33996m59306l06237l41817k56200k87495k80714
2610I512146k37267l92936k49965j59025j83304k57290k79445l49711k37233k26091
2600F939879j63904j43973j67007j10811j45784l7341j10795j62955r0935j34594
$$ y = [27286363, 28335852, 29542066, 30987185, 32726503, 34872990, 37303167, 39986059, 42915948, 46057834, 49550041, 53389995, 57183413, 60544751, 63332506, 64748193, 64341164, 62032150, 58080853, 53240944, 48220588, 43534492, 39305141, 35767162, 32757443, 30063917, 27749085, 25794216, 24088110, 22517020, 21028515, 19764824, 18651775, 17667632, 16830839, 16019268, 15295625, 14631998, 14013628, 13403890, 12991341, 12556222, 12041519, 11777911, 11443915, 10984609, 10678372, 10336555, 10080355, 9792860, 9512146, 9274879, 8881943, 8631978, 8472953, 8289649, 8032359, 7752914, 7403203, 7165970, 6939879, 6775975, 6632002, 6464995, 6354184, 6208400, 6171059, 6060264, 5897309, 5806374, 5671780]
2590E671780j50551j00709o7147q9408m6923m6751k5644k02676n1860j90868j54288
2579D544955o0564K5648Q9855j25881j33310m5800o8504R5695j08183j68866m5706
2568C999339q3434j01298m0608N5643m4621o9884l30012N854p9788L1428K4058
2557C366677p2839o3622O9235j32627m3502l0642R170M0595r6264n5455k6169
2546B964557j57837J1710M2290m3447j08065J08945k6603j29461j01324m8673
2536B512092m9541O4364n8195l2744q202n1704M2045j17494J5618K2100r9166
2525B239173o6928J7051p9985j08020p451M2975j41750J620Q5685K3792j19488
2514A886674q1472j4612R586p6120m4977p097L2494R146N1299l8833K2062k0069
$$ y = [5671780, 5521229, 5420520, 5353373, 5263965, 5217042, 5170291, 5144647, 4941971, 4890111, 4699243, 4544955, 4484391, 4510039, 4599894, 4474013, 4340703, 4294903, 4226399, 4322094, 4213911, 4045045, 3999339, 3915905, 3814607, 3773999, 3829642, 3785021, 3715137, 3385125, 3390979, 3311191, 3342619, 3366677, 3293838, 3230216, 3299451, 3166824, 3123322, 3092680, 3101850, 3142445, 3046181, 2990726, 2964557, 2806720, 2818430, 2860720, 2817273, 2709208, 2818153, 2791550, 2662089, 2560765, 2512092, 2462551, 2526915, 2468720, 2435976, 2427774, 2376070, 2418115, 2300621, 2316239, 2338339, 2239173, 2172245, 2189296, 2109311, 2001291, 1993840, 2036815, 1895065, 1896685, 1982370, 2006162, 1886674, 1805202, 1790590, 1800176, 1724056, 1679079, 1671982, 1704476, 1713622, 1764921, 1726088, 1748150, 1728081]
2502A728081K8314m276k8843k4124K8408Q3989m7984q1370O2578L9390N3062r7969
2490A739256L9787P4290j9926l7964J01842L6420R7704m2394M4647j4231l8710
2479A980721l1661L9031J06986N293J33684j3472J66804J41804L4870Q6754J7322
2468B668136K3987j36498r2594j71276k03040p0465j80543j00216j81906j07067
2458A448518l534n8234j75160R23l3160o3983Q762o8491q6792M2807K1349l438
2446A029567o2595m9890M4141p2957l3569j5962J50L8568j68686j02381L153K26957
2434H36496m8136j3248j04761J1333L826q262Q0956J0490m2467j01139J36794
2423G61882p1933j5776K0160m0984o4914k3769n6307J00717l2198M7828k9265
$$ y = [1728081, 1756395, 1752119, 1723276, 1699152, 1727560, 1811549, 1763565, 1682195, 1744773, 1784163, 1837225, 1739256, 1779043, 1853333, 1833407, 1795443, 1897285, 1933705, 2031409, 1989015, 2033662, 2019431, 1980721, 1949060, 1988091, 2095077, 2100370, 2234054, 2220582, 2387386, 2529190, 2564060, 2650814, 2668136, 2692123, 2555625, 2463031, 2291755, 2088715, 2018250, 1837707, 1737491, 1555585, 1448518, 1444984, 1386750, 1211590, 1212513, 1179353, 1115370, 1124132, 1055641, 968849, 1011656, 1033005, 1029567, 966972, 917082, 961223, 888266, 854697, 838735, 838885, 877453, 708767, 606386, 609539, 836496, 788360, 775112, 670351, 681684, 685510, 677248, 758204, 768694, 726227, 625088, 761882, 689949, 674173, 694333, 653349, 588435, 564666, 508359, 609076, 576878, 624706, 595441]
2412E95441p968n5856R175J34992M5783j9714j18435o9451L5140J27526l2339
2401F44294n3280L3350Q0601P4482q3377J0310J869k3236o713L2222J966n2491
2389F59997l7396k9375P4893m9838J2424r3083L9701j028j5087j9399o5505l5542
2377D40762j233J16598m0956L0637l091j43020O4695J5301l9765J5324M452p8813
2365C80891n1023P0132N0752P3762M5282j48119n4459q8514O578O2326M278j1553
2353C40333m9325n7756Q0677M148O5781k8825r8693m0255Q7227N1523q5967J3662
2341B82530p5408L0969R2231k287o8789O7873N5710m2213o9886M9110J6943q8946
2329B47837j7360J52824m9312o2603R4748j2638J5760q2328J7491Q638K7671K8033
$$ y = [595441, 587473, 531617, 540792, 675784, 721567, 701853, 583418, 513967, 549107, 676633, 644294, 591014, 624364, 704965, 779447, 696070, 706380, 708249, 685013, 678300, 710522, 712488, 659997, 622601, 593226, 668119, 618281, 630705, 537622, 577323, 576295, 561208, 541809, 476304, 440762, 439529, 556127, 515171, 545808, 542717, 399697, 464392, 479693, 439928, 455252, 459704, 380891, 329868, 400000, 450752, 524514, 569796, 421677, 367218, 278704, 285282, 347608, 351886, 340333, 291008, 233252, 313929, 318077, 383858, 355033, 256340, 216085, 303312, 354835, 268868, 282530, 207122, 238091, 330322, 328035, 259246, 327119, 382829, 340616, 270730, 319840, 336783, 247837, 230477, 383301, 333989, 271386, 366134, 353496, 369256, 286928, 304419, 313057, 340728, 368761]
2317C68761n8967l3190J10206m7943k948M5164n5261J1899j01893J44413Q5788
2306D66029n6321n633J08468j09508J23884o0987j3637J35233j55637j02882J34432
2295D63441k2657j49145J21776L7742j08562O7620M904j21409n1402l9395L2675
2284B35588K1331m047O0287l619k5030k876L3025L7463l9041n2000j0425n5005
2272A95651O5288J7679m8349M2935K2758o959o0686k0747k8998p0305Q6505J6916
2260B11688m5647Q9037o0711M1586n1492O2360o1770J6137N2008j65727J06625
2249A94094Q7884p8965L43q0725J06409J1440K4491J12199j13478o8987Q8120
2238B82825n3475n0248J56315k7099n1742R739l9102N0966L868r579j1609O861
$$ y = [368761, 309794, 276604, 386810, 338867, 335919, 381083, 325822, 337721, 235828, 380241, 466029, 409708, 404075, 512543, 403035, 526919, 465932, 452295, 587528, 431891, 329009, 463441, 440784, 291639, 413415, 451157, 342595, 410215, 415119, 293710, 242308, 202913, 235588, 256919, 252872, 313159, 309540, 284510, 281634, 314659, 352122, 313081, 261081, 250656, 195651, 260939, 278618, 230269, 273204, 295962, 289003, 228317, 207570, 178572, 108267, 194772, 211688, 166041, 255078, 194367, 235953, 184461, 246821, 185051, 201188, 253196, 87469, 194094, 281978, 203013, 203356, 122631, 229040, 240480, 264971, 377170, 263692, 194705, 282825, 229350, 179102, 335417, 308318, 256576, 266315, 227213, 278179, 282047, 272468, 260859, 267720]
2226B67720O6222m5080R074R0626q2172q9446J1704N9356M5787n565O1646j2338
2214C77534m9329L3217K0001j48726K520P9932n3578Q5626o5798R079J16170j3366
2202C93282N9033q594k8883J3386J4684p1129l993J7445n72l1067o4126p2519
2190B16947J43251p698J5828P7005K1405o1082o8629O8155k6387m083l8493J2775
2178C48994M7253n2795N3245O4012N2303m4414m1670j07105O822Q1318l6224r143
2166C62596n3876Q8677J8602q6004K5298J07313O8911j1071m3224q5744L004J26774
2154E21256M564o9725P2860N882k5037M9878n0126j1813p978j4025J35362K9854
2142F40952P7600N0909k09935q0371K31533J54318K7793j15917L9451J82474n982
$$ y = [267720, 333942, 288862, 297936, 388562, 306390, 216944, 228648, 288004, 333791, 328226, 389872, 377534, 328205, 361422, 381423, 232697, 235217, 315149, 261571, 347197, 281399, 290478, 406648, 393282, 452315, 443721, 414838, 428224, 442908, 371779, 367786, 385231, 384659, 353592, 289466, 216947, 360198, 352500, 368328, 445333, 466738, 405656, 337027, 405182, 378795, 374712, 336219, 348994, 396247, 343452, 396697, 460709, 513012, 468598, 426928, 319823, 326645, 407963, 371739, 362596, 308720, 397397, 415999, 329995, 355293, 462606, 531517, 520446, 477222, 391478, 394482, 521256, 525820, 456095, 528955, 534837, 509800, 559678, 509552, 497739, 489761, 475736, 611098, 640952, 718552, 769461, 559526, 479155, 710688, 865006, 892799, 776882, 816333, 998807, 992825]
2131I92825m7326J5877J63108L5535j23460O3824O0803O4049M8729j14261J20109
2120A279812p7303J20384O2198P5756J65838j7497j1547m4182L2368P9356L1086
2109A696269J9115l1242N4598J31180n2934R4679P8083M9297N4718K5376J14899
2098B234038L8707N357J43075Q7634J79170K07815J08323J38553J31168K01584
2088C475424J86881L29532K92645K79063K59742L06107J93562L70784M70714N65130
2078F729584M90922O75161O26754Q82263Q37620J019868J245102J448355J680602
2069A5636231K218330K370235L070615L680521M857676N518758P507615Q161762
2061E3021743O884820L760724n724120j1774187j1646949p370125m756569l255014
$$ y = [992825, 945499, 961376, 1124484, 1160019, 1036559, 1100383, 1161186, 1225235, 1273964, 1159703, 1279812, 1202509, 1322893, 1385091, 1460847, 1626685, 1609188, 1597641, 1553459, 1585827, 1665183, 1696269, 1715384, 1684142, 1738740, 1869920, 1816986, 1911665, 1989748, 2039045, 2093763, 2119139, 2234038, 2272745, 2278102, 2421177, 2508811, 2687981, 2895796, 3004119, 3142672, 3273840, 3475424, 3662305, 3991837, 4284482, 4563545, 4823287, 5129394, 5322956, 5693740, 6164454, 6729584, 7220506, 7895667, 8522421, 9404684, 10242304, 11262172, 12507274, 13955629, 15636231, 17854561, 20224796, 23295411, 26975932, 31833608, 37352366, 44859981, 53021743, 59906563, 63667287, 57943167, 46168980, 34522031, 27151906, 22395337, 19140323]
2053A9140323k403214j837999j565559j153260q95555q74000o01949n96575q52444
2044H359768r14865o02158n58530l38751l90241l67553l79042l18170k58139k31680
2034D000639n2715j56213j83345j38307j39227q3960p2095k1254j86924j54317
2024B812282k3726k47198j79194K9081k29643l7075j62340p0577o2446p7128L3560
2013A785596j19077R4916j33176J4376L5944j06261j00945K626J0308j46143K5413
2002A363577j18377j12582N3905j5112j5730k4428O484k9789J01934l2617m9410
1991A127855k8387n3532N4582j6484q2744j30374q4209j6656J2585K8473M1218
1980H52327J7326j37147o7753j07746l339L2406j0321K8821J01923q6061p6114
$$ y = [19140323, 16737109, 14899110, 13333551, 12180291, 11284736, 10410736, 9808787, 9212212, 8359768, 7444903, 6842745, 6284215, 5945464, 5555223, 5187670, 4808628, 4490458, 4232319, 4000639, 3947924, 3791711, 3608366, 3470059, 3330832, 3246872, 3174777, 3153523, 2966599, 2812282, 2788556, 2541358, 2362164, 2391245, 2161602, 2124527, 1962187, 1891610, 1829164, 1752036, 1785596, 1666519, 1761435, 1628259, 1642635, 1678579, 1572318, 1471373, 1473999, 1484307, 1338164, 1363577, 1245200, 1132618, 1186523, 1171411, 1155681, 1131253, 1137737, 1107948, 1209882, 1177265, 1127855, 1099468, 1045936, 1100518, 1084034, 1001290, 870916, 786707, 770051, 782636, 811109, 852327, 869653, 732506, 664753, 557007, 553668, 586074, 575753, 604574, 706497, 620436, 544322]
1969E44322P4959l77j7662q1101L2462R1350q9902p2544M3136j45588k2133M3612
1957D00534Q4198J25180m9339k09568J33374q0955M0292m5315Q435j10188j21582
1946A75066J31875N3763R328p3416J0365L813l1795j5586O8056j03368m8321K09164
1934C88944j46466n1055N9316l8288l7488O862n7927J14305M9818o1961N2004
1923B78064L6873k2992n6116L824m8352K4409R1997n9483o906m2303K2541l5242
1911A86314j7098N4128J3763r6452j373M0523m1972R3694Q768l1528j43694n6482
1899H591J58053K8510j15325N5701r0690O4539J76924p4325j60240M7617J2913
1888A12268Q439n9077l3918P0904J01785K1044p6098k6533j9929j30460J37004
$$ y = [544322, 619281, 618904, 601242, 520141, 552603, 643953, 554051, 481507, 524643, 379055, 356922, 400534, 484732, 609912, 560573, 351005, 484379, 403424, 443716, 398401, 406836, 296648, 175066, 306941, 360704, 370032, 296616, 306981, 310794, 278999, 263413, 331469, 228101, 179780, 388944, 242478, 191423, 250739, 212451, 174963, 181825, 123898, 238203, 288021, 226060, 278064, 314937, 291945, 235829, 239653, 191301, 215710, 307707, 248224, 241318, 199015, 221556, 186314, 169216, 223344, 237107, 140655, 139282, 179805, 137833, 231527, 240295, 208767, 65073, 8591, 166644, 195154, 79829, 135530, 44840, 109379, 286303, 211978, 51738, 99355, 112268, 120707, 61630, 27712, 98616, 200401, 221445, 145347, 118814, 98885, -31575, 105429]
1877A05429P212m0205M9295p1835j0274k3439P7193m0460J9224J00023k6119m762
1865A41282J2071j49593o1898N0558m2887J13771R697r2644p244J7599N7108m0031
1853G789p6369K6442K96872j04604j22846M5719j41920n276J16015J45270R1204
1842B78296j13657r8518p1864N5535R0558k308J8968k6216M4409o3899M9294p664
1830A52934M5213r7832J03344m7828O5239j11592k1294J87435M230O2170k1136
1819C20883j6264J54009q2087j43014k7453n110j6845L0677r0799j11061N6719
1808F9655m3036k4555J15533J13401r4517k892q789m8842j59282P6548n8292Q8564
1796B3496P3251k0649K5046l8843m5154n6375j7215N5881J15699j52427j03113
$$ y = [105429, 112641, 72436, 121731, 49896, 39622, 16183, 93376, 52916, 72140, 172163, 146044, 141282, 153353, 3760, -58138, -7580, -50467, 63304, 73001, -19643, -26887, -9288, 47820, 7789, -68580, -42138, 254734, 150130, 27284, 73003, -68917, -74193, 41822, 187092, 278296, 164639, 66121, -5743, 49792, 140350, 138042, 157010, 130794, 175203, 111304, 160598, 152934, 198147, 100315, 203659, 155831, 221070, 109478, 88184, 275619, 279849, 342019, 320883, 304619, 458628, 376541, 233527, 206074, 200964, 184119, 214796, 123997, 12936, 69655, 26619, 2064, 117597, 230998, 136481, 133589, 124800, 75958, -83324, -6776, -65068, 23496, 96747, 76098, 101144, 62301, 17147, -39228, -56443, -562, 115137, -37290, -140403]
1785a40403k3344J14660J6339N0716J4642q9763K6484J3250J8194L2959L4846
1774F8580L45j52092o3173J72706J1091M113m5438J05395q1678N9035R9871j38044
1762D0711o0369j2454l2777n7439P1637P5545K2698K6057j21605J26410l0965
1751D7449j20874m192J7308K8713k2428J17920j1571j5398Q5022q6318k9325L3053
1739C9359j24303j7743P2917R704l8775J3714J08216m4919o5993N779n7397K964
1727i6477L1661R1807Q4342j1474j30829r1353O5046j9028n124K5011j3206M8029
1715b1595J7708m7271N6489M740o300m9825K6624r1400Q1864K8619L237P5023
1703G7913k9588l9025j9004K7475J8035j2966l557N1863n8845l4340p3527m3375
$$ y = [-140403, -163747, -49087, -32748, 17968, 32610, -57153, -30669, -17419, 775, 33734, 68580, 68925, -83167, -146340, 26366, 37457, 41570, -3868, 101527, 19849, 78884, 178755, 40711, -19658, -32112, -64889, -122328, -50691, 24854, 47552, 73609, -47996, 78414, 47449, -73425, -77617, -60309, -31596, -54024, 63896, 52325, 36927, 121949, 35631, 6306, 39359, -84944, -102687, -29770, -20066, -58841, -45127, 63089, 18170, -47823, -42044, -99441, -96477, -64816, 26991, 111333, 99859, -30970, -122323, -57277, -76305, -81429, -56418, -69624, -21595, -3887, -51158, 5331, 10071, 3771, -46054, -19430, -110830, -28966, -347, 2890, 77913, 48325, 9300, -9704, 17771, 35806, 22840, 19283, 71146, 12301, -22039, -95566, -138941]
1691a38941l009J1935J66948N1370J261L7595p0653j21382m5061L3702R8651J968
1679B4384p3724Q032l6569P7592N9786l8160m3106J04267l0410n8996J38006k5401
1667A05701j06172J37569n5069l408m7609n5074O4310k0873m5357K0499q1531
1656h7014N419N002J10319n7833o0723K3697P2394j37984L5560M9579M5533Q520
1644A2469q4959m1377N1774J3440M5473L6017K5502M9846l178J0702j72114P1295
1632A4890o6903M7073J0820j43369Q8026K0449J671N998K1336n7472m3670N8128
1620d3023j01514k404J22554j02446k9862R8227L6375l7280N0089p60j2168P2803
1608E0591m523R635l7900N4676n3987k8928J6955m8885k3740J27932k8811q1631
$$ y = [-138941, -141950, -130015, 36933, 88303, 89564, 127159, 56506, -64876, -109937, -76235, 22416, 24384, -49340, -41308, -77877, -285, 59501, 21341, -21765, 82502, 52092, -6904, 131102, 105701, -471, 137098, 82029, 78621, 31012, -24062, 40248, 19375, -25982, -5483, -87014, -81595, -76593, 33726, -24107, -84830, -61133, 11261, -126723, -91163, -41584, 3949, 12469, -72490, -113867, -62093, -48653, -3180, 32837, 58339, 108185, 105007, 115709, -56405, 14890, -52013, -4940, 5880, -137489, -49463, -29014, -27343, -21345, -9, -57481, -101151, -43023, -144537, -146941, -24387, -126833, -156695, -58468, -22093, -59373, -9284, -10044, -22212, 50591, 46068, 55703, 17803, 72479, 18492, -10436, 6519, -42366, -66106, 61826, 33015, -48616]
1596d8616p504J31109j1336j02006J53868p0576p603R2577m6718q9891r5466R6096
1584f066K2222j110j13722K3583j4544L5945k8524N7281N7392j4818o8156k583
1572e3100Q9324O9368j79168q5789M4682P7386R850n4096r4563Q9937L9571K9738
1560a6860l8131m6552L78K3517J33988k8860j9588j05406J68027k0235q7517k5379
1548f2618l2113Q831L8410L6531l4882k8047m0276P7203J772l9813L2726N6062
1536A3786R8719j13562j4638l3472p8188M9264n2382l2237J37675Q9575n079p2618
1524a3157N9672q972N5037l4936j01840Q2683J455o6241N7681k5222J08374p5752
1512C8782j18456K0900Q1464j430j52524M5303m0207o28R4355N9981n7043n6673
$$ y = [-48616, -56120, 74989, 63653, -38353, 115515, 44939, 37336, 129913, 83195, -6696, -102162, -6066, 16156, 15046, -98676, -75093, -89637, -53692, -82216, -24935, 32457, 17639, -50517, -53100, 36224, 105592, -73576, -159365, -114683, -37297, -27447, -81543, -176106, -86169, -46598, -16860, -54991, -101543, -101165, -77648, 56340, 27480, 7892, -97514, 70513, 50278, -37239, -62618, -94731, -85900, -47490, -10959, -45841, -73888, -114164, -36961, -35189, -75002, -42276, 13786, 112505, -1057, -15695, -49167, -127355, -78091, -130473, -162710, -25035, 64540, 59461, -13157, 46515, 37543, 92580, 57644, -44196, 38487, 39942, -26299, 31382, 6160, 114534, 38782, -79674, -58774, 22690, 21260, -131264, -85961, -126168, -126796, -32441, 27540, -29503, -86176]
1500h6176k7435J7522Q596M2912r4817L1802M5241l5J00464R0044k3478j52621
1488d7981k6085M2099J2229l7734L9497k2206r561o2897N0469N8129m2771J10504
1476F3692l8323j33643O5906l2603R0267l3405n5565N7750p5662J22657k7067
1465D004N6313K4393j23484r6228K9469J47476m0917M009q6959M3500l8825Q6892
1453I643J6478q7808l6292M0206j5418O4409L0319p3499j5743J1994J36732p2979
1441H042j02430l7183j8550P658R1586q4573K6553M6945L1487J0443j5702L893
1429c1831J60401N2545j93228l2975O5358R5454N6434n2100j10077r7926M4068
1418d3877k180l4631J87394r5096j11979J02349m7978K3910J5936J10485K6331
$$ y = [-86176, -113611, -96089, -87493, -44581, -139398, -107596, -62355, -62390, 38074, 128118, 104640, -47981, -74066, -31967, -19738, -57472, -17975, -40181, -49742, -112639, -62170, -4041, -46812, 63692, 25369, -108274, -42368, -74971, 15296, -18109, -73674, -15924, -91586, 31071, 4004, 60317, 84710, -38774, -135002, -105533, 41943, 1026, 5035, -81924, -38424, -77249, 9643, 26121, -61687, -97979, -57773, -73191, -8782, 21537, -51962, -67705, -55711, 81021, 8042, -94388, -131571, -150121, -142463, -50877, -135450, -108897, -61952, -30465, -20022, -35724, -31831, 128570, 181115, -12113, -45088, 20270, 115724, 172158, 120058, 9981, -87945, -43877, -46057, -80688, 106706, 11610, -100369, 1980, -45998, -22088, -6152, 104333, 130664]
1407A30664j05920m6113k1384N4606P9469j90015O203M1660l396m2676l3011O319
1395a23594P1782Q4122r4021L5974k4389J28235K946p4203N9670j4987m1025k3493
1383a2983L2749l2973q2253J5216R5245L8602o8392k5223L9455q5350M9744M5951
1371I788N1073j34017k5272J10601J999j06466K7637P0760m3561J46087o0161
1360D8468p2614k6201K4938L5625J7922k1373J6928k0848K6347j16497P624O3163
1348a6518O2738Q326m8819j08763m6671J85735r4072j7109R3872o3627R610L2877
1336b421J5754p3015j4121n3015M7775J45781j11169J08293p2767L3905P3721
1325I8721n6649o7088q3952j3792J96650o410n6247M8417O7305n7306j08685k6080
$$ y = [130664, 24744, -21369, -42753, 11853, 91322, -98693, -92490, -50830, -54226, -96902, -129913, -123594, -51812, 32310, -61711, -25737, -50126, 78109, 81055, 6852, 66522, 51535, 10510, -12983, 19766, -13207, -95460, -80244, 15001, 53603, -14789, -40012, -557, -85907, -36163, 9788, 60861, -73156, -98428, 12173, 14172, -92294, -64657, 6103, -37458, 108629, 48468, -24146, -50347, -25409, 10216, 28138, 6765, 23693, 2845, 29192, -87305, -79681, -16518, 46220, 54546, 5727, -103036, -149707, 36028, -58044, -75153, 18719, -44908, -35298, -2421, 13333, -59682, -73803, -126818, -79043, 66738, -44431, 63862, -8905, 25000, 98721, 42072, -25016, -108968, -122760, 73890, 67480, 11233, 59650, 126955, 69649, -39036, -65116]
1313f5116K2685l3980l9101J28026l5905P2276j27520m9515m5359O1406K1165
1302i0938K7916N9591n2153k6774N2556k8641L3161J04187q5143K5856K705j8288
1290D035J2102q1363r2332J22605k3364R1086k4729K7135m5239j08285M3271j8827
1278i3905P2181r396N0959m2828n6021J3850q9848L1827L9685p07J0454K5592
1266d8157m0883N2556J63077p5907M0645K0000q8684J9346N723o2912J6855m5637
1254d3978q4393k1356K1873P4977J7023p5934J37037N8235p5488j32740J72308
1243D7564L5264j92454k7687M1609r320Q1997k9767p5212L8257J77659j00655
1232a2745k8851l623M3882Q2313n2368o6956j23621k9219O2817K9893Q80M862
$$ y = [-65116, -42431, -76411, -115512, 12514, -23391, 48885, -78635, -128150, -173509, -112103, -90938, -63022, -3431, -55584, -82358, -29802, -58443, -25282, 78905, -6238, 19618, 22323, 4035, 16137, -65226, -157558, -34953, -58317, 32769, 8040, 35175, -10064, -118349, -75078, -93905, -21724, -31120, 19839, -22989, -79010, -65160, -155008, -123181, -83496, -84203, -73749, -48157, -89040, -36484, 126593, 50686, 91331, 111331, 22647, 41993, 47716, -15196, 1659, -43978, -128371, -149727, -127854, -52877, -35854, -111788, 25249, 83484, 7996, -124744, 47564, 82828, -109626, -137313, -95704, -105024, -23027, -52794, -128006, -89749, 87910, -12745, -41596, -45219, -1337, 80976, 28608, -38348, -161969, -191188, -128371, -98478, -97598, -92736]
1220i2736P6031O1461J5037j69243j2754N9618r5283M7468Q2782N4012j6N8890
1208H5267j03622Q7738r7420j14823J54311o7111p9662L7167r0127K8410J57226
1197b646k3316j31470J81339M6761o8442r4413l588l2960K11964j55761L9040
1186c3492O0612r7584L5765M2404l8992m138q166J7054o4558M9146M9348j02173
1174i4774J6654O0581q5705j04211O868K4867O3359R0704L550O0599M9548j65583
1162g3543j267j69O1893j7347j2102m6086L5161J22826j32287l8391j06341P8906
1150a28747R0206Q2585q6043q6639J04856j02031k490j06373N1547K4731N5125
1139a03273J7702j0153j10016L4619P5845M1644L2082K7773K3233N5464N311m2457
$$ y = [-92736, -16705, 44756, 59793, -109450, -122204, -62586, -157869, -110401, -27619, 26393, 26377, 85267, -18355, 69383, -28037, -142860, 11451, -55660, -135322, -98155, -188282, -159872, -2646, -25962, -157432, 23907, 70668, 2226, -92187, -95775, -128735, 83229, -72532, -33492, 27120, -70464, -34699, 7705, -31287, -35425, -43591, -26537, -91095, -41949, 7399, -94774, -78120, -17539, -103244, -207455, -200587, -175720, -112361, -21657, -18107, 42492, 92040, -73543, -74810, -74979, -13086, -30433, -42535, -88621, -53460, 69366, -62921, -101312, -207653, -128747, -38541, 44044, -41999, -128638, -23782, -125813, -128303, -234676, -183129, -158398, -103273, -85571, -95724, -205740, -171121, -95276, -53632, -21550, 6223, 29456, 84920, 90231, 47774]
1127D7774l3808J6443K2049j26117j924q758L9015K3325j12622N4950j7753M8128
1115d9298L2880J74918n2842k14386j5987l4481M2238J68707j05724l6791J29239
1104C8473o8453r915L9613O1051j18809R363P4352K8791p2850K034O1243q4568
1092c9675L471J3766O2102k2982m4103o8732O5603p7677L3721P203j073P7778
1080I402o206J10856j43633j83117J57232J45511N5732k26714p6227O8331n1836
1069a40669O2562J40052r0241M6747N568K7816N1564j60168r3405J36656N2240
1058C8722n4809J4910M9693N4002p6837j8731o6005k7532J10384L1794j30526
1047g4935m2157j152K05295j26736m4904k87N3364j1831O0729j0810N6509K735
$$ y = [47774, 13966, 30409, 52458, -73659, -75583, -84341, -45326, -22001, -134623, -79673, -97426, -49298, -16418, 158500, 105658, -108728, -124715, -159196, -116958, 51749, -53975, -90766, 38473, -29980, -39895, -282, 60769, -58040, -48677, 25675, 54466, -18384, -16350, 44893, -39675, -36204, -22438, 39664, 16682, -27421, -96153, -30550, -108227, -74506, -67303, -68376, 9402, 3196, 114052, -29581, -212698, -55466, 90045, 145777, -80937, -157164, -88833, -140669, -78107, 61945, -28296, 18451, 24019, 51835, 103399, -56769, -150174, -13518, 38722, -16087, -1177, 48516, 102518, 25681, 6950, -59055, -86587, 23797, 55591, -74935, -117092, -118244, 87051, -39685, -84589, -84876, -31512, -43343, 17386, 6576, 63085, 65820]
1035F5820r8022q8296J38580K1643l1358j2025p7839M0361J24540l2967k1026
1024B9411o6212j1021J01503l3602j11341n4371o1975J7338J60632n7161N881
1013h0918K5246L5905J8290k9476Q3260l9099K7696J29667p3364j38694n2002
1002i3489P2313m8295Q3262M6740J3913n8186j9243m977p3398n0885K7308k1271
990a26208R4630k6070l8285R3479n4235J576k1935L3095N9950r490k1084p1045
978h5622K5603l910K1318L2623p226j23210K9352Q4216O423k8588o8656l4063
966a51740L0437J28338N9758p6678j20063M3061Q948J15308l4524j08617R0616
955a5156P9286o6294K9795L5943p511j63576J5655K37260p8332j21358j1732J14122
$$ y = [65820, -32202, -120498, 18082, 39725, 8367, -3658, -81497, -41136, 83404, 50437, 29411, -36801, -47822, 53681, 20079, -91262, -145633, -207608, -190270, -29638, -86799, -80918, -55672, -19767, -1477, -30953, 52307, 13208, 40904, 170571, 97207, -41487, -93489, -21176, -69471, 13791, 60531, 74444, 16258, -2985, -7962, -81360, -132245, -104937, -126208, -31578, -57648, -95933, -2454, -56689, -55113, -77048, -43953, 15997, 6507, -14577, -85622, -60019, -63929, -42611, -9988, -17214, -140424, -111072, -26856, -20433, -49021, -117677, -151740, -121303, 7035, 66793, -9885, -129948, -86887, -77939, 37369, 2845, -105772, -15156, 64130, -2164, 27631, 63574, 56063, -107513, -91858, 145402, 67070, -54288, -66020, 48102]
943D8102o8547K5607J0175j03391L1513j4193m6029K6627R025n1816o5616J22507
931g6036P8093k9025j05603l223J38273J773p2222M9833K6842q8254M8802J18801
919H8054J7790q4874l9477j7435l0828r1245K1016L0367k6581J20717O2946j1394
907C9056j45528K3731Q2521Q2796n94k0521k926l8062K7038j6728n9795n0786
895g9798M4972J4465m764m8875n9684O6962N9750j1689l3215M8066n827l6105
883d5742L5491p2531J19108Q1452j00191j39475M9020l6109M3417N7511J2076
872D027o5395M719Q8629K2414j10876j2235L2272N3743o2670L8958j6203n5512
860g8129J21613j01254r3052R1442m7328K7391P803k0442J41973L9660N0354j15150
$$ y = [48102, -20445, 5162, 15337, -88054, -56541, -70734, -116763, -90136, -81111, -132927, -198543, -76036, 2057, -26968, -132571, -135794, 2479, 4252, -67970, -18137, 8705, -79549, -30747, 88054, 105844, 20970, -18507, -35942, -66770, -158015, -136999, -106632, -133213, -12496, 50450, 39056, -106472, -82741, -220, 82576, 81982, 61461, 58535, 20473, 47511, 30783, -29012, -79798, -34826, -20361, -25125, -74000, -133684, -66722, -6972, -18661, -51876, -3810, -9637, -45742, -10251, -82782, 36326, 117778, 17587, -121888, -72868, -108977, -65560, -8049, 4027, -61368, -56649, 31980, 54394, -56482, -68717, -36445, 17298, -45372, -6414, -22617, -78129, 43484, -57770, -150822, -59380, -106708, -79317, -71514, -91956, 50017, 89677, 140031, 24881]
848B4881j8606k9332P6938K6374j41000q371m9561K0521M2664o933Q6589j07548
836h3384n0912J51047n32N378M986j05303M9159P8341J0927n9189Q0781M8415
824A29714n3625l4613L4368n7253n5270K6851l6265l6186q622L1170J24103R117
812G3489q7870l1600L4812L2068n202p1856m8693N0500M364O106Q4071j57355
800a17166K4488O0205p0878l723M3812n0394J1838R1147k0844k876J2526J01407
788G9542o6874r1220J89576O3742j15056Q742l8982L244p5071L1619R2998k1536
776F0724j7358j8029L0596J628Q0117p5655k36501L3490J34277J4461o8438K4751
764c5937m200L7223M3331o3600O8249O1469P3813j01880j68703K7024K9938J4319
$$ y = [24881, 6275, -23057, 53881, 80255, -60745, -69116, -118677, -98156, -55492, -62425, 24164, -83384, -134296, 16751, 16219, 21597, 26583, -78720, -29561, 48780, 59707, 518, 81299, 129714, 76089, 41476, 75844, 18591, -36679, -9828, -46093, -82279, -90901, -59731, 64372, 73489, -14381, -45981, -11169, 20899, 15697, -56159, -104852, -54352, -49988, -43882, 40189, -117166, -92678, -32473, -103351, -107074, -63262, -113656, -101818, -10671, -31515, -34391, -21865, 79542, 12668, -78552, 111024, 174766, 59710, 68452, 29470, 32714, -42357, -10738, 82260, 60724, 43366, 25337, 55933, 57561, 137678, 62023, -174478, -140988, -6711, 7750, -60688, -35937, -40137, -2914, 40417, -23183, 45066, 106535, 180348, 78468, -90235, -63211, -33273, -18954]
752a8954j0630J67941k565q1885m7619q0583M6610J01055L3249n4580l0319P0029
740I1749j9172j8699l2157k1795k6313k2662K6784O9462l5846N2609L4667m102
728I4525J00481o3560j57312o8999M4102p5633N5136O9898N604P0238k525O985
716G8940r4567j604M5068m7858P0428j0646l7614l2998L0680m3213j7577N4506
704f455M8405Q329p4673k6835J1046l975M8045k9303n6734Q5642L7789l2485j4086
691e290l9172l2429J62927q6040J4310J8815n4161K596R880M350l7954Q1708M4381
678H3921l2865p4574j35374L0804O7655J28426n6387R4609p1799m5524l1358j27759
666a70225J32559N0990j4962o6783m0860K8418J43790j38100o5369M3041M0331
$$ y = [-18954, -29584, 138357, 135792, 53907, 6288, -74295, -27685, 73370, 106619, 52039, 21720, 91749, 72577, 53878, 21721, -74, -26387, -49049, -22265, 47197, 11351, 63960, 98627, 94525, 195006, 131446, -25866, -94865, -50763, -126396, -71260, -1362, 4242, 74480, 71955, 78940, -15627, -17231, 27837, -20021, 50407, 39761, 2147, -30851, -171, -43384, -60961, -6455, 41950, 50279, -24394, -51229, -40183, -44158, 3887, -25416, -82150, 3492, 41281, 8796, -5290, -44462, -76891, 86036, -4, 14306, 33121, -21040, -18444, -8564, -4214, -42168, 39540, 83921, 51056, -23518, -158892, -128088, -60433, 67993, 11606, 106215, 34416, -11108, -42466, -170225, -37666, 13324, -1638, -68421, -109281, -80863, 62927, -75173, -140542, -97501, -57170]
655e7170j1646P3008r2313M3901J15022L5113o5948l8864n3973J07855r917j11541
643f6473m7433N4513K6400Q6955p5823j6595l0380K7938J2919m997l7571M299
631f6248J51494j45486p119j01941Q7355L4821m0970O964j7029p805L0090J13977
619C8103K4864J23558m3247j05480m376N3045p8299l4300K5673L3857M3891l9870
607C7419n9198j6141P7015q3134K2539j3914R204M5667J27225P8484j03017P08
595A22857q8221r4442R6562n3076L7949l995n7748m476Q4041J139p4109J2955
583b0564P7228k9478j00600J2604Q0013q1335m1881Q392O8298J2190j1943L1663
571D587M2826p6580R9728j4704j09178l9491P5303K236J14951j90132q8199J29039
$$ y = [-57170, -68816, 4192, -88121, -44220, 70802, 105915, 39967, 1103, -52870, 54985, 45068, -66473, -113906, -59393, -32993, 53962, -21861, -38456, -68836, -40898, -27979, -32976, -70547, -66248, 85246, -60240, -67359, -169300, -81945, -47124, -88094, -81130, -98159, -105964, -75874, 38103, 62967, 186525, 143278, 37798, 33422, 86467, 8168, -26132, -459, 33398, 77289, 37419, -21779, -37920, 39095, -44039, -21500, -35414, -26210, 19457, 146682, 225166, 122149, 122857, 34636, -59806, 36756, -16320, 21629, 17634, -40114, -44590, 39451, 40590, -33519, -20564, 56664, 27186, -73414, -60810, 19203, -62132, -104013, -95621, -27323, -15133, -27076, 4587, 47413, -29167, 70561, 55857, -53321, -92812, -17509, -15273, 99678, -90454, -178653, -49614]
559d9614k7915R6297K7337l2934n6156P8424M2030j1541r4931P9482j8972P768
547C9275L6736l7847j66021Q6703l0710p6520R8248J07720o4723k5324n5347M0672
535d7138l0889m4474O9129M5682j16415J03191Q6666J0661N5136j7008m45m2898
523G1198O0280o4710n0192q7720O2305J81680j40334M5316K8030p0730L89k8998
511F514M6372n0571K4326m3482N2776n2693k1356O7181M1575k2109m4662O3096
499F6967K4089l3994l6970J7567k5236M8813K4888L7976l8756k6625k7041J4762
487D6440k9178l7026R6967j8281K6224p3291n7726K066K6684J37270P3332n7430
475A36051L7348r4290m4528L3723k0866j00274j9142J49129l9300L196K9543n8574
$$ y = [-49614, -77529, 18768, 46105, 13171, -42985, 35439, 77469, 65928, -29003, 50479, 31507, 39275, 76011, 38164, -127857, -41154, -71864, -148384, -50136, 57584, -7139, -32463, -87810, -47138, -78027, -122501, -53372, -7690, -124105, -20914, 65752, 76413, 131549, 114541, 114096, 71198, 131478, 66768, 16576, -71144, -8839, 172841, 32507, 77823, 105853, 35123, 35512, 6514, 52886, 2315, 26641, -16841, 35935, -16758, -38114, 29067, 70642, 48533, 3871, 66967, 91056, 57062, 20092, 37659, 12423, 61236, 86124, 124100, 85344, 58719, 31678, 46440, 17262, -19764, 77203, 58922, 85146, 11855, -45871, -43805, -17121, 120149, 193481, 136051, 173399, 79109, 34581, 68304, 47438, -52836, -71978, 77151, 37851, 41047, 70590, 12016]
463A2016J5626M5211p533j6747K0256j949Q808k7108n0433N2197n3944p4159Q1156
450C397n62p32o777l670J4092L4343Q8924j07931n5443l8201N3920L3549l8503
437b3594R7071o8110K3801M6778l5618j36104P5495J2853Q448m2038m0146O2747
425a8417q512o6361K8429Q6964N4033r578k877j83050N4679L9695Q14O5445k518
412C8746k1998J3628J5546L6845m761M5882k5527m2770o560q2799M7918r3536
400g9386Q9667q0581M0214L9687j4867J9339M907Q057j553L4418M4285j07949
388c762J13713n112j7942q294j000K1868N1330j5370o5660m4837M4853m024o0186
375E577k4203j02023N8879L4369R7597N2916j17928O9276N9539l2485J0555j3373
$$ y = [12016, 27642, 72853, 65320, 48573, 68829, 66880, 75688, 48580, -1853, 50344, -3600, -77759, 3397, 2835, 2103, -4674, -8344, 5748, 40091, 129015, 21084, -34359, -72560, -18640, 14909, -23594, 73477, 5367, 29168, 75946, 40328, -95776, -20281, -7428, 1020, -41018, -81164, -18417, -26929, -93290, -64861, 22103, 76136, 66558, 63681, -119369, -64690, -24995, -24181, 41264, 38746, 16748, 30376, 45922, 82767, 78006, 123888, 98361, 55591, 49031, -33768, 14150, -79386, 10281, -70300, -30086, 9601, -5266, 14073, 18980, 27037, 25484, 59902, 104187, -3762, 109951, 104839, 86897, 78603, 77603, 99471, 150801, 135431, 69771, 24934, 69787, 65763, 5577, -18626, -120649, -61770, -27401, 70196, 123112, 5184, 74460, 133999, 101514, 112069, 98696]
363I8696r6200M2139j8692L3570k6684R8464j5917l2627l6350o6916m8413L7376
351c1554k8639M3196J01126j6686M7420m3994P4383K7649j30899k2738J22098
340A41362l118L8667q7310j41163J5835J10281J192o1408J9211J00960o553J345
328A29301j01771j31944M351P93J33630Q4260j17757K5631m745M4730k0442P351
316E3388J0693o3811R1374J0508l1908K7407n3268r683j40695J56176j77r5658
304d5654P4551J58578o4650j94834J58323J5684q4776L9822P3263j2456J1776
293A29627M4589j8195q178j27283K0366M5129M274j34288N0630o6513o4729J9955
281a04616J02017J6986r2233P5246P3568k0096p9029O5624j1843l9019L220M6312
$$ y = [98696, 2496, 44635, 25943, 59513, 32829, 131293, 115376, 82749, 46399, -20517, -68930, -31554, -60193, -16997, 84129, 67443, 114863, 70869, 145252, 172901, 42002, 19264, 141362, 138244, 176911, 89601, -51562, -35727, 74554, 75746, 14338, 33549, 134509, 127956, 129301, 27530, -104414, -100063, -99270, 34360, 118620, 863, 26494, 21749, 66479, 46037, 53388, 64081, 270, 91644, 102152, 70244, 97651, 44383, 34700, -105995, 50181, 50004, -45654, 28897, 187475, 122825, -72009, 86314, 101998, 17222, 57044, 130307, 117851, 129627, 174216, 156021, 147843, 20560, 40926, 86055, 90329, -43959, 6671, -59842, -124571, -104616, -2599, 14387, -77846, -2600, 70968, 50872, -28157, 37467, 25624, -13395, -10175, 36137]
269C6137N7660J4982j03476M8367Q79K5378J2675M3817l1209M4378j08649j12308
257g1369L3400L7028Q8694r9464m8893Q0443M4743n700O5866j40643j7282J06721
245G3544N2221r8014M3829O3359J1240K1239n7418J9154p5073N1864j6960P4467
233A63452o7143j1202o103k2753O9680K3966o4325l7059J9135K4406N0369m2599
221I9824j29255p1728N6375Q7656l7133m7510N3800Q1188n6069K8245K6024p5237
209A6180j906L6545k8172j47683L4588j9539O6779J33008m1877L8021J4891m5106
197E5729J5514J8292k945m9209L1392N2446l5622j5767J08002M2728q4994r5955
185C9611m3102K9028N5903J08589r4080j29774R9302l6279K6061k0206K1179N3687
$$ y = [36137, 93797, 108779, 5303, 53670, 54549, 79927, 92602, 136419, 105210, 149588, 40939, -71369, -37969, -941, 87753, -11711, -60604, 19839, 64582, 58882, 124748, -15895, -33177, 73544, 125765, 27751, 71580, 134939, 146179, 167418, 110000, 129154, 54081, 105945, 88985, 163452, 96309, 85107, 79004, 56251, 125931, 149897, 85572, 48513, 67648, 92054, 142423, 99824, -29431, -101159, -44784, 42872, 5739, -41771, 12029, 93217, 37148, 65393, 91417, 16180, 14274, 50819, 22647, -125036, -90448, -109987, -43208, 89800, 47923, 85944, 100835, 55729, 71243, 89535, 86590, 37381, 68773, 121219, 85597, 69830, 177832, 220560, 135566, 39611, -3491, 25537, 81440, 190029, 95949, -33825, 65477, 29198, 55259, 35053, 56232, 109919]
173A09919r0192r154L1502Q1717p215O1330n0428r922K0560N760k9620J7780r8684
160C3353M8329n7732m5753o849K8735N4643L4054j4706n6668P6284j32543J0261
148b8592O6104l4889L0438p798O6740N0436k8020l6890k4508O6139k6454j4131
136G8575L4257K202L2849k8919q6095P8682l0667k7460O6125K5251n1256L3452
124A26996j26228l0718O5367M8879J198j2832O52q6962o7891M2781R1579j6793
112C6028N5510L4459q7189l7751K4181K1660N0418n5743o5887K4637J5557K7384
100D3264N7600K2111k5971P662q402k1993m0247L8532K679l7975m742m0727j82
87h391J25312L7273k0642k0340r29r8110P8423j9567R611q81n9580J7473l576
$$ y = [109919, 19727, 10573, 42075, 123792, 116577, 177907, 127479, 117557, 138117, 143877, 114257, 132037, 33353, 81682, 23950, -21803, -28652, 83, 54726, 88780, 74074, 17406, 93690, -38853, -28592, 37512, 2623, 33061, 25263, 92003, 142439, 114419, 77529, 53021, 119160, 92706, 78575, 112832, 115034, 147883, 118964, 32869, 111551, 80884, 53424, 119549, 144800, 93544, 126996, 768, -29950, 35417, 84296, 85494, 72662, 73314, -13648, -81539, -38758, 52821, 36028, 91538, 125997, 38808, 1057, 25238, 46898, 97316, 41573, -24314, 323, 15880, 43264, 100864, 122975, 97004, 104666, 96264, 74271, 34024, 72556, 75235, 37260, 32518, -8209, -8391, 116921, 154194, 133552, 113212, 112283, 14173, 92596, 73029, 82640, 81759, 22179, 39652, 36076]
74C6076R464q4204L2496Q5716k6224K2372L5382Q616o0254n195M023k8553m979
61B4736P4363n3940J7955N6451n2039J20710n5720n1178L019K513l3776J1789
49F4883L4242l3676m667O1805K9004o1603l8253K4475r776K3582R8394j09210
37G9200p2000J2122K0054J5148J5586L7792p504N7494q6982l6708K6664O9510
25A30376k9876k3358l9945n8854r556K3859p1100R9957R494L0872J4864j4625
13F2108O5492L8904j23520M4806N0649L1086n0612l9501m0956j804L3116P480
1G7248J3228
0I0476
$$ y = [36076, 45540, -38664, -6168, 79548, 53324, 75696, 111078, 119694, 59440, 54245, 58268, 29715, 24736, 99099, 45159, 63114, 119565, 67526, 188236, 132516, 81338, 84357, 86870, 53094, 64883, 99125, 65449, 60782, 122587, 151591, 89988, 51735, 76210, 66434, 90016, 188410, 79200, 7200, 19322, 39376, 54524, 70110, 107902, 100398, 157892, 70910, 34202, 60866, 130376, 100500, 77142, 37197, -21657, -31213, -7354, -78454, 21503, 30997, 61869, 76733, 62108, 127600, 166504, 42984, 87790, 138439, 169525, 118913, 79412, 38456, 36652, 69768, 77248, 90476]
$$ Imaginary data points
##PAGE= N=2
##DATA TABLE= (X++(I..I)), XYDATA
16383a929734k6731P5142J27024o7485o0625J8561M3536J3933M10P9962N3889
16372a672118M2046P900O1777P923P1506Q6160k018k2526n998j154L0840l4750
16360a430412J7156N3175R3007N2355m8817O5672P0958O8048L1898n7212K4624
16349a059548K9559N2078l1157o3523K8872O6563J03267N5640M4654J8090n3903
16338h09408K9228O9243k0971J5994j3695L135L3688O3766M0418K0617l0403J06180
16326d92208P8636r5013j1183O4061N6898k37l8025J23240P1188n3924r843K2468
16314b83942o6683K4843K20159O7048m275q1513K0060J05133K5941N2654M1307
16303A20732k2389n6121j747J5345J2872J48465n8499K6904K2500L2425J64145
$$ y = [-1929734, -1956465, -1881323, -1754299, -1821784, -1882409, -1863848, -1820312, -1806379, -1805969, -1726007, -1672118, -1630072, -1622172, -1560395, -1552472, -1480966, -1394806, -1396824, -1419350, -1425348, -1426502, -1395662, -1430412, -1413256, -1360081, -1267074, -1214719, -1263536, -1197864, -1126906, -1058858, -1026960, -1084172, -1059548, -1029989, -977911, -1009068, -1072591, -1043719, -977156, -873889, -818249, -773595, -755505, -809408, -780180, -710937, -731908, -715914, -729609, -726474, -692786, -629020, -588602, -567985, -598388, -492208, -413572, -508585, -519768, -455707, -398809, -399046, -437071, -313831, -242643, -296567, -306410, -283942, -350625, -325782, -105623, -38575, -42850, -124363, -104303, 830, 26771, 79425, 120732, 98343, 42222, 40475, 55820, 68692, 217157, 158658, 185562, 208062, 240487, 404632]
16292D04632o5546l3746k2159K2012L6096J5860L6485M0982Q0419L3599l1856
16281E16778Q2562m9114n9174m327R6382P370Q3532m7866N3149K9545L4566k9297
16269G14106k58m6478L9197R5772q9708L1030K2196O1992L6870j1721R9280P3732
16257A026010j1192l1161k8018l4413L2622M0698k3299j8772N2733P1682m2234
16246A034656j15787O2128R1454j39246J97022J08421o469k4720M6638n5502j1081
16235A187514J16810l1350l4390M3333L82k4481o632K3534n692l632N7790j9203
16223A303983L8568k3990K3533j8049P6349Q2041k0432k1570k0565O2417M5462
16212A527747J71735n1566m3377N6830n7860l6101K7925l0530J8782P6675J7308
$$ y = [404632, 339086, 305340, 283181, 305193, 341289, 357149, 393634, 434616, 515035, 548634, 516778, 599340, 550226, 491052, 486725, 583107, 590477, 674009, 626143, 679292, 708837, 743403, 714106, 713848, 667370, 706567, 802339, 712631, 743661, 765857, 827849, 864719, 852998, 952278, 1026010, 1014818, 983657, 955639, 921226, 953848, 994546, 971247, 952475, 1005208, 1076890, 1034656, 918869, 980997, 1072451, 933205, 1130227, 1238648, 1232179, 1207459, 1254097, 1198595, 1187514, 1304324, 1272974, 1238584, 1281917, 1282299, 1257818, 1251186, 1274720, 1269028, 1265396, 1323186, 1303983, 1342551, 1318561, 1342094, 1324045, 1400394, 1482435, 1462003, 1440433, 1419868, 1482285, 1527747, 1699482, 1647916, 1604539, 1661369, 1603509, 1567408, 1595333, 1564803, 1583585, 1660260, 1677568]
16201A677568j9174Q5993m1166j5232K8361l5390K4578L160n4228k7160M0750
16190A668060L8583j7907Q487j6322O2454j7978N8067r7580k7924L8437M9419
16179A745796o9046K10994P7226k3406K7006j17896r666K9965j1962p9068M8409
16168A828352k7413O6003K7170r2902N7771J51016n4851O6179j23213N2903R6829
16157B047844m1973n4995L3255N2270n3206O3964L3767M3213j11778N1819Q2039
16146B146219j28052k0491p1590M3166r0536J10881J23700n9021n1911O075q886
16135A999554J36564j05790l4550J4534J7825M6890n8055j4963M6623P0722P2668
16124B192022r1308J54836j67031J5502J01386o1773K6371r6830k3008R7894K0636
$$ y = [1677568, 1658394, 1744387, 1703221, 1687989, 1716350, 1680960, 1705538, 1708698, 1654470, 1627310, 1668060, 1706643, 1688736, 1697223, 1680901, 1743355, 1725377, 1783444, 1685864, 1657940, 1696377, 1745796, 1676750, 1887744, 1964970, 1941564, 1968570, 1850674, 1841008, 1870973, 1859011, 1779943, 1828352, 1800939, 1866942, 1894112, 1801210, 1858981, 2009997, 1955146, 2021325, 1898112, 1951015, 2047844, 2005871, 1950876, 1984131, 2036401, 1983195, 2047159, 2080926, 2124139, 2012361, 2064180, 2146219, 2018167, 1997676, 1926086, 1969252, 1878716, 1989597, 2113297, 2054276, 2002365, 2008440, 1999554, 2136118, 2030328, 1995778, 2010312, 2028137, 2075027, 2016972, 2002009, 2048632, 2119354, 2192022, 2100714, 2255550, 2088519, 2104021, 2205407, 2143634, 2170005, 2073175, 2050167, 2148061, 2168697]
16113B168697j4240M6784N2489O3906j27861L0355p4587J4689p6198o65J5035
16102B098404p835J4365p1431l7933J14440K9307M1954M3655j876j14357m9002
16091B059691R641J27022P059j6927P1170l7568r519l4068M4047m17J7918K1746
16079B259795o8534J3973j3430J1933J0219q4574J13721j2577j47151N3804k7080
16068B110099M3976O6887j2570J04691j14962k9338l417O0972n32l2892P6829
16057B269743M8507j6701p793J27767j89602J3703O3502n793n6874p083R836o6908
16045B182304l5058P4614M3000N170r8974K1708L305J8375J8192m3320k6726l5500
16033B127090J19404Q2275j01493q215J21695J1761l2538L4931q1802J0929M1010
$$ y = [2168697, 2154457, 2201241, 2253730, 2317636, 2189775, 2220130, 2145543, 2160232, 2084034, 2083369, 2098404, 2090569, 2104934, 2033503, 1995570, 2110010, 2139317, 2181271, 2224926, 2223050, 2108693, 2059691, 2069332, 2196354, 2203413, 2186486, 2257656, 2220088, 2210569, 2176501, 2220548, 2220131, 2238049, 2259795, 2191261, 2205234, 2191804, 2203737, 2213956, 2129382, 2243103, 2230526, 2083375, 2137179, 2110099, 2154075, 2220962, 2208392, 2313083, 2198121, 2168783, 2165366, 2226338, 2225806, 2192914, 2269743, 2318250, 2301549, 2293756, 2421523, 2231921, 2245624, 2309126, 2303333, 2246459, 2239376, 2249212, 2182304, 2147246, 2221860, 2264860, 2270030, 2171056, 2192764, 2196069, 2214444, 2232636, 2189316, 2162590, 2127090, 2246494, 2328769, 2227276, 2219061, 2340756, 2352517, 2319979, 2354910, 2273108, 2284037, 2325047]
16022B325047p8005j46086R7776J18665J8872l9488m3027m0774k7402P6034L9478
16011B301090K1113m3744k6860j9297j6789L5306o3828p1145J29137m3674k5502
16000B175807P5607J27315j32089l7580O4073n9784p9769j26M5452j0606N7982
15989B226282P5870K5533k2598K3967m4833J08564L5429r4582j2832j18598o5725
15978B136477O1604J19215J76K770n7378q5789L253R0450o5467M37l904J8496
15966B220340k6852M714M3692J21584k9609q6726N5786o5753l3932R5029k4872
15955B273401k9456l658Q2547j6498p7256M0127j6137M426P1226k7387M167J7341
15943B322843M9594j95860R2110K0659J2731O2132j07886M1808q4187M4743j2879
$$ y = [2325047, 2247042, 2100956, 2198732, 2317397, 2336269, 2296781, 2253754, 2212980, 2185578, 2261612, 2301090, 2322203, 2278459, 2251599, 2232302, 2215513, 2250819, 2186991, 2115846, 2244983, 2201309, 2175807, 2251414, 2378729, 2246640, 2209060, 2273133, 2213349, 2133580, 2133454, 2178906, 2168300, 2226282, 2302152, 2327685, 2305087, 2329054, 2284221, 2392785, 2428214, 2333632, 2320800, 2202202, 2136477, 2198081, 2317296, 2317472, 2320242, 2262864, 2177075, 2180328, 2270778, 2205311, 2205748, 2201844, 2220340, 2193488, 2198202, 2241894, 2363478, 2333869, 2247143, 2302929, 2237176, 2203244, 2298273, 2273401, 2243945, 2240287, 2322834, 2306336, 2229080, 2269207, 2253070, 2257496, 2328722, 2301335, 2305502, 2322843, 2372437, 2176577, 2268687, 2289346, 2302077, 2364209, 2256323, 2298131, 2213944, 2258687, 2245808]
15932B245808R6433l6875j07895n90m1831J07738k4991Q129j4359j1580J57908
15921B377895j6836r3696N545q6596L5337j4989m9614P7089l3448R2321k9920
15910B263088j3368J9448O6790k6185J935j16198M0760M18M0536n999N9959j1581
15898B319603q8499J30081p9392j42999Q8415l0096n9425q1839O2744O0410K02382
15887B381385n1860O5659l8234j19866J084j2123l9078r293k6378K7767P3199
15876B252262j00781J67683l4207j6705R0103p3503K5666M9380o8587K1384k8555
15865B284140O2763p7500R7855o6396o7286p3622J21831p91j43497N3739R5420
15854B286656o0981J9463j3280k2051J05174o8101K8163J16421L7484j02984J0988
$$ y = [2245808, 2342241, 2305366, 2197471, 2196881, 2155050, 2262788, 2237797, 2245926, 2231567, 2219987, 2377895, 2361059, 2267363, 2272908, 2186312, 2221649, 2206660, 2157046, 2234135, 2200687, 2293008, 2263088, 2249720, 2269168, 2335958, 2309773, 2311708, 2195510, 2236270, 2236688, 2277224, 2271225, 2331184, 2319603, 2231104, 2361185, 2281793, 2138794, 2227209, 2197113, 2137688, 2055849, 2118593, 2179003, 2381385, 2329525, 2395184, 2356950, 2237084, 2238168, 2226045, 2186967, 2177674, 2151296, 2179063, 2252262, 2151481, 2319164, 2284957, 2268252, 2358355, 2284852, 2310518, 2359898, 2291311, 2312695, 2284140, 2346903, 2269403, 2367258, 2300862, 2233576, 2159954, 2281785, 2280994, 2137497, 2191236, 2286656, 2225675, 2245138, 2231858, 2209807, 2314981, 2246880, 2275043, 2391464, 2428948, 2325964, 2336952]
$$ [...]
##END NTUPLES=NMR SPECTRUM
##END=
