##TITLE=1H_CG-1148-D4
 CDCl3, 8 sc, 
 9.07.2021
##JCAMPDX= 6.0         $$ Bruker NMR JCAMP-DX V2.0
##DATA TYPE= NMR SPECTRUM
##DATA CLASS= NTUPLES
##ORIGIN= UXNMR, Bruker Analytische Messtechnik GmbH
##OWNER= root
$$ XWIN-NMR		Version 3.5
$$ Fri Jul  9 12:08:06 2021 Russian Standard Time (UT+4h)  she@DPX200
##.OBSERVE FREQUENCY= 200.131506
##.OBSERVE NUCLEUS= ^1H
##.ACQUISITION MODE= SIMULTANEOUS
##.ACQUISITION SCHEME= undefined
##.AVERAGES= 8
##.DIGITISER RES= 18
##SPECTROMETER/DATA SYSTEM= spect
##.PULSE SEQUENCE= zg30
##.SOLVENT NAME= CDCl3
##.SHIFT REFERENCE= (INTERNAL, CDCl3, 0, 17.513)
##AUDIT TRAIL= $$ (NUMBER, WHEN, WHO, WHERE, WHAT)
$$ ##TITLE= Audit trail, XWIN-NMR		Version 3.5
$$ ##JCAMPDX= 5.01
$$ ##ORIGIN= Bruker BioSpin GmbH
$$ ##OWNER= she
$$ F:/spectra/data/she/nmr/H-F/1/pdata/1/auditp.txt
$$ ##AUDIT TRAIL=  $$ (NUMBER, WHEN, WHO, WHERE, WHAT)
(   1,<2021-07-09 12:06:49.65 +0400>,<she>,<DPX200>,
      <created by zg, POWCHK disabled, PULCHK disabled
       configuration hash MD5:
       00 E9 B6 7A A2 85 ED C7 34 08 36 98 17 FE 4E 26
       data hash MD5: 16K
       F3 86 0B 0C 2D B1 B6 5C 61 D2 80 50 09 3A 7B 18>)
(   2,<2021-07-09 12:06:52.37 +0400>,<she>,<DPX200>,
      <Start of raw data processing
       efp BC_mod = 2 LB = 0.24 FT_mod = 6 PKNL = 1 PHC0 = -12273.93 PHC1 = 10.00101 SI = 16K 
       data hash MD5: 16K
       E8 F7 BA 35 B6 E8 B4 44 2A 86 17 D9 D7 6D 7A EF>)
(   3,<2021-07-09 12:07:11.98 +0400>,<she>,<DPX200>,
      <pk PHC0 = -5.065156 PHC1 = 5.400001 
       data hash MD5: 16K
       32 80 3B A2 6C E1 90 68 C5 D4 85 AB 45 C3 98 5F>)
(   4,<2021-07-09 12:07:15.31 +0400>,<she>,<DPX200>,
      <abs ABSG = 5 
       data hash MD5: 16K
       01 90 8B 4D F6 41 D3 76 E1 B3 87 A5 5C 0C 52 B7>)
(   5,<2021-07-09 12:07:43.12 +0400>,<she>,<DPX200>,
      <abs ABSG = 5 
       data hash MD5: 16K
       68 AF 4A F2 FD 74 F4 DC 17 A3 E4 DF 22 D7 A7 5A>)
$$ ##END=
$$ 
$$ hash MD5
$$ AF D8 18 AE AB 04 F2 FD F2 BC 5D 35 A9 E4 CF 8B
##$RELAX= 
##$RELAX= 
##$RELAX= 
##$RELAX= 
##$RELAX= 
##$RELAX= 
$$ Bruker specific parameters
$$ --------------------------
##$DU= <F:/spectra>
##$EXPNO= 1
##$NAME= <H-F>
##$PROCNO= 1
##$TYPE= <nmr>
##$USER= <she>
##$AMP= (0..31)
100 100 100 100 100 100 100 100 100 100 100 100 100 100 100 100 100 100 
100 100 100 100 100 100 100 100 100 100 100 100 100 100 
##$AQSEQ= 0
##$AQ_mod= 1
##$AUNM= <au_zg>
##$AUTOPOS= <>
##$BF1= 200.13
##$BF2= 200.13
##$BF3= 200.13
##$BF4= 200.13
##$BF5= 200.13
##$BF6= 200.13
##$BF7= 200.13
##$BF8= 200.13
##$BYTORDA= 1
##$CFDGTYP= 0
##$CFRGTYP= 5
##$CHEMSTR= <none>
##$CNST= (0..31)
1 1 145 1 1 1 1 1 1 1 1 1 1 1 1 1 1 1 1 1 1 1 1 1 1 1 1 1 1 1 1 1 
##$CPDPRG= <>
##$CPDPRG1= <>
##$CPDPRG2= <>
##$CPDPRG3= <>
##$CPDPRG4= <mlev>
##$CPDPRG5= <mlev>
##$CPDPRG6= <mlev>
##$CPDPRG7= <mlev>
##$CPDPRG8= <mlev>
##$CPDPRGB= <>
##$CPDPRGT= <>
##$D= (0..31)
0 1.2 0 0 0 0 0 0 0 0.06 0 0.03 0 0 0 0 0.0002 0 0 0 0 0 0 0 0 0 0 0 0 
0 0 0 
##$DATE= 1625818009
##$DBL= (0..7)
$$ [...]
##$SUBNAM3= <"">
##$SUBNAM4= <"">
##$SUBNAM5= <"">
##$SUBNAM6= <"">
##$SUBNAM7= <"">
##$SUBNAM8= <"">
##$SUBNAM9= <"">
##$SW= 20.0188882624521
##$SWIBOX= (0..15)
0 0 2 0 0 0 0 0 0 0 0 0 0 0 0 0 
##$SW_h= 4006.41025641026
##$TD= 16384
##$TD0= 1
##$TE= 0
##$TE2= 300
##$TE3= 300
##$TEG= 300
##$TL= (0..7)
0 120 120 120 120 120 120 120 
##$TP= (0..7)
150 150 150 150 150 150 150 150 
##$TP07= 0
##$TPNAME0= <>
##$TPNAME1= <>
##$TPNAME2= <>
##$TPNAME3= <>
##$TPNAME4= <>
##$TPNAME5= <>
##$TPNAME6= <>
##$TPNAME7= <>
##$TPOAL= (0..7)
0.5 0.5 0.5 0.5 0.5 0.5 0.5 0.5 
##$TPOFFS= (0..7)
0 0 0 0 0 0 0 0 
##$TUNHIN= 0
##$TUNHOUT= 0
##$TUNXOUT= 0
##$USERA1= <user>
##$USERA2= <user>
##$USERA3= <user>
##$USERA4= <user>
##$USERA5= <user>
##$V9= 5
##$VALIST= <valist>
##$VCLIST= <CCCCCCCCCCCCCCC>
##$VD= 0
##$VDLIST= <DDDDDDDDDDDDDDD>
##$VPLIST= <PPPPPPPPPPPPPPP>
##$VTLIST= <TTTTTTTTTTTTTTT>
##$WBST= 1024
##$WBSW= 4
##$XGAIN= (0..3)
0 0 0 0 
##$XL= 0
##$YL= 0
##$YMAX_a= 565276
##$YMIN_a= -797613
##$ZGOPTNS= <>
##$ZL1= 120
##$ZL2= 120
##$ZL3= 120
##$ZL4= 120
##$ABSF1= 17.51299
##$ABSF2= -2.506048
##$ABSG= 5
##$ABSL= 3
##$ALPHA= 0
##$AQORDER= 0
##$ASSFAC= 0
##$ASSFACI= 0
##$ASSFACX= 0
##$ASSWID= 0
##$AUNMP= <proc_1d>
##$AZFE= 0.1
##$AZFW= 0.1
##$BCFW= 0
##$BC_mod= 2
##$BYTORDP= 0
##$COROFFS= 0
##$CY= -3
##$DATMOD= 1
##$DC= 0
##$DFILT= <>
##$DTYPP= 0
##$F1P= 0
##$F2P= 0
##$FCOR= 1
##$FTSIZE= 16384
##$FT_mod= 6
##$GAMMA= 0
##$GB= 0
##$INTBC= 1
##$INTSCL= 1.334414e-10
##$ISEN= 128
##$LB= 0.24
##$LEV0= 0
##$LPBIN= 0
##$MAXI= 10000
##$MC2= 0
##$MEAN= 0
##$ME_mod= 0
##$MI= 1.114404
##$NCOEF= 0
##$NC_proc= -6
##$NLEV= 6
##$NOISF1= 3.799351
##$NOISF2= 2.8
##$NSP= 0
##$NTH_PI= 0
##$NZP= 0
##$OFFSET= 17.51299
##$PC= 1
##$PHC0= -12279
##$PHC1= 15.40101
##$PH_mod= 1
##$PKNL= yes
##$PPARMOD= 0
##$PSCAL= 0
##$PSIGN= 0
##$REVERSE= no
##$SF= 200.130004329041
##$SI= 16384
##$SIGF1= 3
##$SIGF2= 2
##$SINO= 5.538805
##$SIOLD= 16384
##$SREGLST= <1H.CDCl3>
##$SSB= 0
##$STSI= 16384
##$STSR= 0
##$SW_p= 4006.41025641026
##$SYMM= 0
##$S_DEV= 0
##$TDeff= 16384
##$TDoff= 0
##$TI= <>
##$TILT= no
##$TM1= 0
##$TM2= 0
##$TOPLEV= 0
##$USERP1= <user>
##$USERP2= <user>
##$USERP3= <user>
##$USERP4= <user>
##$USERP5= <user>
##$WDW= 1
##$XDIM= 16384
##$YMAX_p= 530112954
##$YMIN_p= -225114
$$ End of Bruker specific parameters
$$ ---------------------------------
##NTUPLES= NMR SPECTRUM
##VAR_NAME=  FREQUENCY,     SPECTRUM/REAL,   SPECTRUM/IMAG
##SYMBOL=    X,             R,               I
##VAR_TYPE=  INDEPENDENT,   DEPENDENT,       DEPENDENT
##VAR_FORM=  AFFN,          ASDF,            ASDF
##VAR_DIM=   16384,         16384,           16384
##UNITS=     HZ,            ARBITRARY UNITS, ARBITRARY UNITS
##FACTOR=    0.24454680195387, 1,            1
##FIRST=     3504.87495494577, 0,            0
##LAST=      -501.535301464487, 0,           0
##MIN=       -501.535301464487, -225114,     0
##MAX=       3504.87495494577, 530112954,    0
$$ Real data points
##PAGE= N=1
##DATA TABLE= (X++(R..R)), XYDATA
$$ [...]
5388C6854934J718971J266019J026659N20352O2914o59060j166350j368593j599038
5379C6656808j559668j238243j024045q16083n29302j83457J16813K66972N92030
5370C2281825R28364J231221J527342J881497K175411K443441K743761K934657
5362D8147519L015837L164289K798883K630486K182886J522880O50332l71148
5354F3741964j444930k275273l034245l474895l711207l408238l140208k831509
5346D0421459k548969k079156j696595j401682r45069p64118m86780j39701J28682
5337C0488071L09038N00098Q51630R73874R62741J161550J248319R90261P42736
5328C8228318N15981J68551l91359j298429j726640k176407k511934k571222k270829
$$ plain form
5388 36854934 38573905 39839924 40866583 41386935 41449849 40790789 39624439 38255846 36656808
5379 36656808 35097140 33858897 32834852 32018769 31489467 31306010 31422823 31689795 32281825
5370 32281825 33210189 34441410 35968752 37850249 40025660 42469101 45212862 48147519
5362 48147519 51163356 54327645 57126528 59757014 61939900 63462780 64113112 63741964
5354 63741964 62297034 60021761 56987516 53512621 49801414 46393176 43252968 40421459
5346 40421459 37872490 35793334 34096739 32695057 31749988 30985870 30499090 30359389 30488071
5337 30488071 30797109 31297207 32148837 33122711 34085452 35247002 36495321 37485582 38228318
5328 38228318 38744299 38912850 38521491 37223062 35496422 33320015 30808081 28236859 25966030
5319B5966030k055121j872160j713108j360686j252082j086663r67608q56360
5311A4802242p33347o21258o08997n24560m93479k91642m19770m08678k65024
5302A0435487l81737k47486j33800k14157k08554k25484k40588k39464k27315
5293H316902j54950k30264k14783k53462j83643j12449j37224j44804r2296j08373
5283F684654o3260m6621l9583p3753p2539p3477J3555N0447j43859j72571k5594
5272F037399k737j86606n8491j29674j61693j5019j33719r3700p3823k19689n3712
5261D908536m3810r1347k12967K0926P4217k3894j2286j45744L3336j2916j8693
5250D475358J2319k7033o5936O5950M6393M1640Q9999J867J3660o3220r6449n3186
$$ plain form
5319 25966030 23910909 22038749 20325641 18964955 17712873 16626210 15658602 14802242
5311 14802242 14068895 13447637 12838640 12314080 11820601 11528959 11109189 10700511 10435487
5302 10435487 10053750 9806264 9672464 9458307 9249753 9024269 8783681 8544217 8316902
5293 8316902 8161952 7931688 7716905 7463443 7279800 7167351 7030127 6885323 6793027 6684654
5283 6684654 6621394 6574773 6535190 6461437 6388898 6315421 6328976 6379423 6235564 6062993 6037399
5272 6037399 6034662 5848056 5789565 5659891 5498198 5483179 5349460 5255760 5181937 4962248 4908536
5261 4908536 4864726 4773379 4560412 4581338 4655555 4631661 4619375 4473631 4506967 4494051 4475358
5250 4475358 4487677 4460644 4394708 4460658 4507051 4548691 4638690 4640557 4654217 4590997 4494548 4441362
5238D441362j4620q7076j20719n0930O428q6194j5324o192J7299O7788p1906P8968
5226D158884R0197o6630p3467J11320N1280l7741j22538n0967L4105L9663K0987
5215D155093j920o0463O1983p2839L5955N7904L8801N8495O7861j543p8125l908
5203D257294O417j28557K9631j5674m8270k202K6182j0766j5412j13991m0671
5192C943981M382P3342K2439j6927P5673j18801O5477k3712N6744N1183l5198
5181D098583J1713n403K1567p9509k1996R9600m914o1860J8689N4764o3254M3158
5169D111138O6193P0412K362M0316K1817N8368R559M6607j2280m059j1198J30584
5157D529819N6959q3632J8045j8402L812L5185O5236J1462Q496J22676k9040r815
$$ plain form
5238 4441362 4426742 4339666 4218947 4168017 4174445 4088251 4072927 4066735 4084034 4151822 4079916 4158884
5226 4158884 4249081 4182451 4108984 4220304 4271584 4233843 4111305 4060338 4094443 4134106 4155093
5215 4155093 4153173 4092710 4154693 4081854 4117809 4175713 4214514 4273009 4340870 4339327 4261202 4257294
5203 4257294 4263711 4135154 4164785 4149111 4100841 4098639 4124821 4114055 4098643 3984652 3943981
5192 3943981 3948363 4021705 4044144 4027217 4102890 3984089 4049566 4025854 4082598 4133781 4098583
5181 4098583 4110296 4104893 4126460 4046951 4024955 4124555 4119641 4057781 4076470 4131234 4067980 4111138
5169 4111138 4177331 4247743 4250105 4290421 4312238 4370606 4380165 4426772 4414492 4410433 4399235 4529819
5157 4529819 4586778 4503146 4521191 4502789 4506601 4541786 4607022 4618484 4626980 4749656 4720616 4710801
5145D710801k0278M6150r74R755K0400J03807K469n9556K2269J12323J17399m055
5133E060510P0465j7356P319L4146M1285J32992j144n9717Q8945N3503J6229J0047
5121E437224P7685N2798L8964P7616J64813J2970O3442N1108K20417N6665J9653
5110F273355J53841R4988L6442K51393J34851m625N5503J51056J66570J63595
5100G476969N6833Q2470Q9247K6545J46912J4642O1070J16796R6462J6612O1388
5089H245946J79009P1363K10422J84414K04894K11074K13445J76205J01876K70838
5079A0069486J91957K23648K67520K49476J84494K16767O1227J61322P5435R2161
5069A1793493J66167K82172K88953K77006L33846L89299L23934K91806K71310
$$ plain form
5145 4710801 4690523 4736673 4735699 4745454 4765854 4869661 4872130 4812574 4834843 4947166 5064565 5060510
5133 5060510 5130975 5113619 5120938 5155084 5196369 5329361 5328217 5268500 5357445 5410948 5427177 5437224
5121 5437224 5514909 5567707 5606671 5684287 5849100 5862070 5925512 5976620 6197037 6253702 6273355
5110 6273355 6427196 6522184 6558626 6810019 6944870 6940245 6995748 7146804 7313374 7476969
5100 7476969 7533802 7616272 7705519 7732064 7878976 7893618 7954688 8071484 8167946 8184558 8245946
5089 8245946 8424955 8496318 8706740 8891154 9096048 9307122 9520567 9696772 9798648 10069486
5079 10069486 10261443 10485091 10752611 11002087 11186581 11403348 11464575 11625897 11701332 11793493
5069 11793493 11959660 12241832 12530785 12807791 13141637 13530936 13854870 14146676 14417986
5060A4417986K85145M47837N28017N76781O58989K87068p2516N307J65484N7298
5050A7357396j10270j6125k5414J49699K35015K30394L16132L49357L70299N83046
5040A9439529O78285P44136Q84330J203548J223549J018193J150990J079274J026566
5031B8448400J073449J373392J633283J935720J892494J029548P2708L16781P75253
5022C8551028P98955J131277J598611J961661K427141K980236L409842L971683
5014E6830434M495921N144154N663942O132386O840080P241964P534205P401640
5006A07284726O876942O008083M577527L304340J975677K98708j426449l104038
4998A25795516m697685o763485p786340p478187p248632o954330o540397n970790
$$ plain form
5060 14417986 14703131 15150968 15678985 16255766 16914755 17201823 17129307 17134614 17300098 17357396
5050 17357396 17247126 17231001 17205587 17355286 17590301 17820695 18136827 18486184 18856483 19439529
5040 19439529 20117814 20861950 21746280 22949828 24173377 25191570 26342560 27421834 28448400
5031 28448400 29521849 30895241 32528524 34464244 36356738 37386286 37458994 37775775 38551028
5022 38551028 39349983 40481260 42079871 44041532 46468673 49448909 52858751 56830434
5014 56830434 61326355 66470509 72134451 78266837 85106917 92348881 99883086 107284726
5006 107284726 114161668 120169751 124747278 128051618 130027295 130326003 128899554 125795516
4998 125795516 121097831 114334346 106548006 99069819 91821187 84866857 78326460 72355670
4990G2355670n233292m449486l808543l253122k741552k200060k003064j497706
4982D7168845j308133j131626q26100o95037o21833n43633l52470l17497k23186
4973D1149330K3384L06651O11205P30508Q22670M24868L08309L19523M08997O55065
4963D5760510Q97338J263855J633142J398327R58439K42670j10020L2752R2635
4954E2169648J84487M04611N47015P61533J017078J148457J389447J799638J980948
4945F1402862K133110J904455J364423J044816P43293R09452J301047J939001
4937G2742459K222897J519328r1132j964217k986864l202471l360367l059390
4929F1820243k655586k152240j714035j574853j589337j322690j086761r67940
$$ plain form
4990 72355670 67122378 62672892 58864349 55611227 52869675 50669615 48666551 47168845
4982 47168845 45860712 44729086 43902986 43207949 42586116 42042483 41690013 41372516 41149330
4973 41149330 41172714 41479365 42090570 42821078 43643748 44068616 44376925 44696448 45105445 45760510
4963 45760510 46657848 47921703 49554845 50953172 51911611 52154281 52044261 52077013 52169648
4954 52169648 52354135 52758746 53305761 54067294 55084372 56232829 57622276 59421914 61402862
4945 61402862 63535972 65440427 66804850 67849666 68592959 69502411 70803458 72742459
4937 72742459 74965356 76484684 76393552 74429335 71442471 68240000 64879633 61820243
4929 61820243 59164657 57012417 55298382 53723529 52134192 50811502 49724741 48756801
4921D8756801q43629j010568j076688j178163j221612j166959o77236m06584n20826
4912D0654536q27290j433803k090199k343456k238483k196661j890351j717477
4904B5916816j383624j183432j037480r43673p76384o31969o90427o78452n64220
4895A8027155o12047n20752n26374l76713n22892m13526l91695l55010k56541
4886A4051605l41292l19236l37457k09727k75672k55344j91893k30400j22637
4877A1767947j74359k11077k14556j70086j28658l1950p7614j45051j31883j05663
4867A0377050j34194j00993j56051j70693j01283o7443o0605j56678j41323k6413
4857I261374o6742o0490j22133k3205J3801j98940m1674j3282r625J1313n4502
$$ plain form
4921 48756801 47913172 46902604 45825916 44647753 43426141 42259182 41581946 41175362 40654536
4912 40654536 39827246 38393443 36303244 33959788 31721305 29524644 27634293 25916816
4904 25916816 24533192 23349760 22312280 21368607 20592223 19960254 19269827 18591375 18027155
4895 18027155 17415108 16894356 16367982 15991269 15468377 15054851 14663156 14308146 14051605
4886 14051605 13710313 13391077 13053620 12843893 12568221 12312877 12120984 11890584 11767947
4877 11767947 11593588 11382511 11167955 10997869 10869211 10837261 10759647 10614596 10482713 10377050
4867 10377050 10242856 10141863 9985812 9815119 9713836 9646393 9585788 9429110 9287787 9261374
4857 9261374 9194632 9134142 9012009 8988804 9002605 8803665 8761991 8748709 8739084 8750397 8695895
4846H695895j1265P189Q7553m9614R1996N5571m3532m6230l0023N284j83016m3250
4834H536558m8306L7720n2129J5114j4619Q9336R063n8089N1117l4897J77176
4823H708044L1154P215o7823K0796J48959J43357Q7037J63671J52151L091J20924
4812I518576K24563J12824K23625L30148L42734M19544N47678Q23790J046574
4803A3590056J229658R43699Q65585L94054L04741K67695P70621J166083J380305
4794B0912497J744613J007723j548865k088320j396778j246931j378432j469612
4786A4535895j295537r29521p11359n16173m15676l34667l08022k62111k00265
4777I562564k37541p6884j59492j32015k5084j10965j04399n2639j79351l3141
$$ plain form
4846 8695895 8684630 8691819 8779372 8729758 8821754 8877325 8833793 8787563 8757540 8762824 8579808 8536558
4834 8536558 8488252 8525972 8473843 8488957 8474338 8563674 8572737 8514648 8565765 8530868 8708044
4823 8708044 8739198 8746413 8678590 8699386 8848345 8991702 9078739 9242410 9394561 9397652 9518576
4812 9518576 9743139 9855963 10079588 10409736 10752470 11172014 11719692 12543482 13590056
4803 13590056 14819714 15763413 16628998 17023052 17327793 17595488 18366109 19532192 20912497
4794 20912497 22657110 23664833 22115968 20027648 18630870 17383939 16005507 14535895
4786 14535895 13240358 12310837 11599478 11083305 10667629 10332962 10024940 9762829 9562564
4777 9562564 9325023 9248139 9088647 8956632 8931548 8820583 8716184 8663545 8484194 8451053
4767H451053L7121o1642p2300P0994j02376q2768J2778j04j7433J9955k8198q3204
4755H143876r7937J1963q9012N1293N5394O0561j07514j4429L1141q7352J7601
4744G975585M7990Q2519R8210o9904p504q332R6454O4449n3354J02105l42J7546
4732H345422L2808O3907k7873k5271k2040J37144J56354p8554m1578l1348k9403
4721H479568r949o7678m7227J05936q5185J7600r9097M4256J1039o4381J3307
4710H298189n7060o243M7961J06651l8512n4988l8545J14182P1002m0704l4317
4699H367616o9385R5230N169p467R6992o7280J26769J14374p8371J6928M1020
4688H641595M6424M6661J8635O9823N2717M1126J2385j1918J55170k5601K6716
$$ plain form
4767 8451053 8488174 8426532 8354232 8425226 8322850 8240082 8252860 8252756 8235323 8255278 8227080 8143876
4755 8143876 8045939 8057902 7968890 8020183 8075577 8136138 8028624 8014195 8045336 7957984 7975585
4744 7975585 8023575 8106094 8204304 8134400 8126896 8118564 8215018 8279467 8226113 8328218 8327876 8345422
4732 8345422 8378230 8442137 8414264 8388993 8366953 8504097 8660451 8581897 8540319 8508971 8479568
4721 8479568 8469619 8401941 8354714 8460650 8375465 8393065 8293968 8338224 8349263 8284882 8298189
4710 8298189 8241129 8234886 8282847 8389498 8350986 8295998 8257453 8371635 8442637 8401933 8367616
4699 8367616 8298231 8393461 8398630 8391163 8488155 8420875 8547644 8662018 8583647 8600575 8641595
4688 8641595 8688019 8734680 8753315 8823138 8875855 8916981 8929366 8917448 9072618 9047017 9073733
4677I073733O3768K2332M9099J5380K8509J00496J5212M7568M485Q2449l911R252
4665I508372M4098L9885P0959R922J13945M0987N7412J8085P6173K7713p552J67010
4653A0167009L0888J25816j6071L1837O8239N8046J16493p1513J03983L9811k0558
4642A0633980j3204k191J00724L7357r8996l1268l9031r792L5356N8375o3057
4631A0608253P1372k2086n7722N980J8328R5864N2428K4965P3390k0388N7967
4620A0908351N1746j0126K4945n360J4140P6595k8979Q9043m755n9900k6383M6909
4608A1076226k1490N3915j4812j9228J2444r555J5116P9217R3158J9781K8784
4597A1313556m101R5887r092M5914J39742k1503p3569k5525J72812J3132k0175
$$ plain form
4677 9073733 9137501 9159833 9208932 9224312 9252821 9353317 9368529 9416097 9420582 9503031 9499120 9508372
4665 9508372 9552470 9592355 9663314 9673236 9787181 9828168 9885580 9903665 9979838 10007551 9999999 10167009
4653 10167009 10197897 10323713 10307642 10339479 10407718 10465764 10582257 10510744 10614727 10654538 10633980
4642 10633980 10620776 10618585 10719309 10756666 10657670 10626402 10587371 10577579 10612935 10671310 10608253
4631 10608253 10679625 10657539 10599817 10605797 10624125 10719989 10772417 10797382 10870772 10850384 10908351
4620 10908351 10960097 10949971 10974916 10969556 10983696 11060291 11031312 11120355 11115600 11055700 11029317 11076226
4608 11076226 11054736 11108651 11093839 11074611 11087055 11077500 11092616 11171833 11264991 11284772 11313556
4597 11313556 11309455 11405342 11396250 11442164 11581906 11560403 11486834 11461309 11634121 11647253 11627078
4586A1627078R2710Q35l164K5550n356J12380p596J5158q107Q8938J07850J3528
4574A2059804n750m4240m5251R9277O8203P2371L3468j9247J6336o705K4212o5520
4562A2186958K1731R888M3499o4677l5986K2436L5546K0518M017M0758J17942
4551A2402630m4957M1488K3457J60874m360m1322O298M4569m382K4555N5665R5972
4539A2760487K3031N7526K7507L0262P1287n1969K5849O0871P0366N1336j2756
4528A3113797M1247q599N4931N0456m0443p249R5155N3481j8516J54343R9786
4517A3588389M378L7672j5214J41296M8869O7229J32732J27477N8616P6036J42427
4506A4409907M9261J76663R0171Q7360P3739O7063J04764J17725O7170K40097
$$ plain form
4586 11627078 11719788 11720623 11717459 11743009 11737653 11850033 11842437 11857595 11849488 11938426 12046276 12059804
4574 12059804 12054054 12009814 11964563 12063840 12132043 12204414 12237882 12218635 12234971 12228266 12252478 12186958
4562 12186958 12208689 12218577 12262076 12197399 12161413 12183849 12219395 12239913 12243930 12284688 12402630
4551 12402630 12357673 12399161 12422618 12583492 12579132 12537810 12544108 12588677 12584295 12608850 12664515 12760487
4539 12760487 12783518 12841044 12868551 12898813 12970100 12918131 12943980 13004851 13075217 13126553 13113797
4528 13113797 13155044 13146445 13201376 13251832 13211389 13204140 13299295 13352776 13334260 13488603 13588389
4517 13588389 13592767 13630439 13615225 13756521 13805390 13872619 14005351 14132828 14191444 14267480 14409907
4506 14409907 14459168 14635831 14726002 14813362 14887101 14954164 15058928 15176653 15243823 15483920
4496A5483920K51067J99584J48246J93888K88972K74277M12281L30399L49044
4487A7931678M17515L34377L27173L06545K82259J09027Q0327q1014j47418j74077
4477A9386392j20974r9186j21733m9103l2100R6800R9732K33588J8133J60891
4467A9572440K00868K61396K61518K55164K30389L59319K83394J93769L95377
4458B2013634L13823L37187L30983K74233L63890L38509L57369K95490K02671
4449B4827789K44668J28926J29808K12640R3293K2476J10620n876R9257K40298
4439B6103899K74063K23871K82104L07368L26507K31405L76769L44471M19141
4430B8889598L88525M65825M99122M78180N37821N99763P00769O86916O98354
$$ plain form
4496 15483920 15734987 15934571 16082817 16276705 16565677 16839954 17252235 17582634 17931678
4487 17931678 18349193 18683570 19010743 19317288 19599547 19708574 19788901 19707887 19560469 19386392
4477 19386392 19265418 19166232 19044499 18995396 18963296 19060096 19159828 19393416 19411549 19572440
4467 19572440 19773308 20034704 20296222 20551386 20781775 21141094 21424488 21618257 22013634
4458 22013634 22327457 22664644 22995627 23269860 23633750 23972259 24329628 24625118 24827789
4449 24827789 25072457 25201383 25331191 25543831 25637124 25659600 25770220 25764344 25863601 26103899
4439 26103899 26377962 26601833 26883937 27191305 27517812 27749217 28125986 28470457 28889598
4430 28889598 29278123 29743948 30243070 30721250 31259071 31858834 32559603 33246519 33944873
4421C3944873P83196P51792Q47741Q69386Q16828Q47121P64423O94582P17808
4412D1037750O70445O41947O05181P26211P92626J100401J110923J227059J407834
4403D9320377J577353J768452J897086K113681K323677K625157K826540L033425
4395F7485748L290821L703654L802180L971665M200513M437322M800058N132198
4387A00824159N457018N648647N892904O304034O375294O701755O937297P004942
4379A51146050O997896O646469O175471N158168L954099K364581M87794j331786
4371A81598742l427879n283880o707550p594893p814064p613270p328899o907905
4363A28920402o414295o252073o532736o769215o786303o608715o189938n506222
$$ plain form
4421 33944873 34728069 35479861 36327602 37196988 38013816 38860937 39625360 40319942 41037750
4412 41037750 41708195 42350142 42955323 43681534 44474160 45574561 46685484 47912543 49320377
4403 49320377 50897730 52666182 54563268 56676949 59000626 61625783 64452323 67485748
4395 67485748 70776569 74480223 78282403 82254068 86454581 90891903 95691961 100824159
4387 100824159 106281177 111929824 117822728 124126762 130502056 137203811 144141108 151146050
4379 151146050 158143946 164790415 170965886 176124054 180078153 182442734 182930528 181598742
4371 181598742 178170863 172886983 166179433 158584540 150770476 143157206 135828307 128920402
4363 128920402 122506107 116254034 109721298 102952083 96165780 89557065 83367127 77860905
4355G7860905m960605m283601l583876l161573k751093k345097k096750j887954
4347E2790356j670241j461957j424970j264965j083197j122783j129393j163119
4339D2469731j178469j044907j105082j003441r19693r33056p90849p64259o53893
4330C4076082o99207o80924n68864m46898m42524m82270n49852m67092m64301
4321B9274150m42441l69276n00800m54777m26480l13670k56628k94537k53886
4312B5961655k39336k49794k01372j84443l51062k77333k71569l91398m10914
4303B3384434m76612m72588m93371n60239n39857n63229m89447l58347m72264
4294A8958480k85397m44884l92397j69293k41367j67060j35274j94600j23429
$$ plain form
4355 77860905 72900300 68616699 65032823 61871250 59120157 56775060 54678310 52790356
4347 52790356 51120115 49658158 48233188 46968223 45885026 44762243 43632850 42469731
4339 42469731 41291262 40246355 39141273 38137832 37218139 36285083 35494234 34729975 34076082
4330 34076082 33376875 32695951 32127087 31680189 31237665 30755395 30205543 29738451 29274150
4321 29274150 28831709 28462433 27961633 27506856 27080376 26766706 26510078 26215541 25961655
4312 25961655 25722319 25472525 25271153 25086710 24735648 24458315 24186746 23795348 23384434
4303 23384434 22907822 22435234 21941863 21381624 20841767 20278538 19789091 19430744 18958480
4294 18958480 18673083 18228199 17835802 17666509 17425142 17258082 17122808 16928208 16804779
4285A6804779j17396j59339o7931j54310j03510j00334j54459p3838r7491k0272
4275A5755899l573q73n3475k03903q4603k8898o5512J3023r4387o5782p1596L4431
4263A5130751p9511J5603R80M5231J6001O203L0345R3361Q1211j81374L7352J21137
4251A5317290J1172J22877J30376J69514R4491J13188J67967J56889J75340J13552
4241A6572656Q2920J36785J53473k839J39428J82732J17827K33344J57012K55365
4231A8028703K13326J88600M08422L27483M60706M53505M72956N10214N94764
4222B1658679O63705P13436P08747O37371O46159P50760N06958N90352M48529
4213B7324696M61279M38942M99121P08293P72135Q32495J080320J131301J238138
$$ plain form
4285 16804779 16687383 16528044 16460113 16305803 16202293 16101959 15947500 15873662 15776171 15755899
4275 15755899 15752326 15751453 15697978 15494075 15409472 15380574 15315062 15328085 15233698 15167916 15096320 15130751
4263 15130751 15051240 15066843 15067823 15113054 15129055 15135258 15165603 15258964 15340175 15158801 15196153 15317290
4251 15317290 15328462 15451339 15581715 15751229 15845720 15958908 16126875 16283764 16459104 16572656
4241 16572656 16655576 16792361 16945834 16942995 17082423 17265155 17382982 17616326 17773338 18028703
4231 18028703 18242029 18430629 18839051 19166534 19627240 20080745 20553701 21063915 21658679
4222 21658679 22322384 23035820 23744567 24381938 25028097 25778857 26285815 26876167 27324696
4213 27324696 27785975 28224917 28724038 29432331 30204466 31036961 32117281 33248582 34486720
4204C4486720J354356J625048J941581K021714K269905K344070K391459K386859
4196E0821712K353868K145928J698364J161044N23588k469n24011o55405p75440
4187E6747179q27704r30945q66430p53874m61875j75333K29826O55114R75507
4178E4591465J334711J635632J886747K279410K676048K929378L228345L687845
4170G4249581L915579L831849L864890L399802K709266J643716K46631j500500
4162I2360814k860084l676805l900945l495897l048997k540540k010830j440043
4154F9386673q71494m90269l0685K98083Q88615J424867J790371K212258K702653
4145G7311072L254998L787841M271424M979400N571125O080264O553195P246596
$$ plain form
4204 34486720 35841076 37466124 39407705 41429419 43699324 46043394 48434853 50821712
4196 50821712 53175580 55321508 57019872 58180916 58704504 58702035 58178024 57522619 56747179
4187 56747179 55919475 54988530 54122100 53368226 52906351 52731018 52960844 53615958 54591465
4178 54591465 55926176 57561808 59448555 61727965 64404013 67333391 70561736 74249581
4170 74249581 78165160 81997009 85861899 89261701 91970967 93614683 93861314 92360814
4162 92360814 89500730 85823925 81922980 78427083 75378086 72837546 70826716 69386673
4154 69386673 68515179 68024910 67994225 68292308 69180923 70605790 72396161 74608419 77311072
4145 77311072 80566070 84353911 88625335 93604735 99175860 105256124 111809319 119055915
4137A19055915P813269Q321282Q839176R549308J0447529J1702858J2975350J2999419
4129B01704106J2351750J1355918J0022481O523373j093792j0850697j8733807
4122B11279332k2044424k1292767j8298368j5081649j2387142j0502519q807440
4115A02865023p274621o181333n230624m643454l901836l399307l030941k825940
4107F6376967k810766k769039k841347k630413k500239k254764j925288j786379
4099D6858732j706505j474161j257148r56590j053648r65924q35004n80162o04141
4090C7425449n05099l86090k88358n4993q128l2198j29001q7745n6320j25108
4080C5752409o02682o73327p80483q91429j034089q64356q39593q23238o00666
$$ plain form
4137 119055915 126869184 135190466 144029642 153578950 164026479 175729337 188704687 201704106
4129 201704106 214055856 225411774 235434255 241957628 240863836 230013139 211279332
4122 211279332 189234908 167942141 149643773 134562124 122174982 111672463 102865023
4115 102865023 95590402 89409069 84178445 79534991 75633155 72233848 69202907 66376967
4107 66376967 63566201 60797162 57955815 55325402 52825163 50570399 48645111 46858732
4099 46858732 45152227 43678066 42420918 41464328 40410680 39444756 38609752 38029590 37425449
4090 37425449 36920350 36534260 36245902 36190909 36182781 36150583 36021582 35933837 35877517 35752409
4080 35752409 35149727 34476400 33695917 32804488 31770399 30906043 30066450 29243212 28642546
4071B8642546n67205m56958l28302l53289k62592o9231j68508j79038l1249p697
4061B6218477J01870N9349J3296L6891M1489k18153l97379l11347m34183n75900
4051B4534410m00846m15407l14809k63598j36135j58339l37313k01623k17842
4042B2088498k79621l10016l57666k50072k37333l12892j85565k59766k85672
4033A9609895k27101k38665k12566j39595k90695k14304j89233k75964k66932
4024A7554840j05291k11967n3199j21196K47P6583O0168J47671O3034R5682j4847
4013A7491725J18498m9309o1066k19957k50054k42394j90128k07769j98808j64311
4003A6026427n3384j5331q4917N2609j12456k3030O9348L6538J37246K09771K33799
$$ plain form
4071 28642546 28075341 27618383 27290081 26936792 26674200 26604969 26436461 26257423 26226174 26218477
4061 26218477 26320347 26379696 26392992 26429883 26471372 26253219 25855840 25544493 25110310 24534410
4051 24534410 24133564 23718157 23403348 23139750 23003615 22845276 22507963 22306340 22088498
4042 22088498 21808877 21498861 21141195 20891123 20653790 20340898 20155333 19895567 19609895
4033 19609895 19382794 19144129 18931563 18791968 18501273 18286969 18097736 17821772 17554840
4024 17554840 17449549 17237582 17184383 17063187 17063434 17140017 17200185 17347856 17410890 17506572 17491725
4013 17491725 17610223 17560914 17499848 17279891 17029837 16787443 16597315 16389546 16190738 16026427
4003 16026427 15973043 15957712 15872795 15925404 15812948 15789918 15859266 15895804 16033050 16242821 16476620
3992A6476620K53694K81094L12447M27303M07231L62829L23978M54062M71404
3983A9770662M90305P60690O84406Q84451J064833J105602J491245J677077J957529
3974B9886800K279323K688624K942984L519008M006817M426598M810091N008031
3966E9568276M645506M231557L579204J605175j766772m652904o022746n810081
3958E5377215m611284l372570k240656j604536r99263q41440p44211l40949Q626
3949D0630932j12850o32998j221427j722196j711256j480518j273141j141023
3941C1335523j080146r62840r42013j118830j039345r97336q72957o60951o16607
3932B3044498o03539l50098k91250k96417k25813k75882k59178l33728m36335
$$ plain form
3992 16476620 16730314 17011408 17323855 17751158 18158389 18521218 18845196 19299258 19770662
3983 19770662 20260967 21021657 21706063 22590514 23655347 24760949 26252194 27929271 29886800
3974 29886800 32166123 34854747 37797731 41316739 45323556 49750154 54560245 59568276
3966 59568276 64213782 68445339 72024543 73629718 71862946 67210042 61187296 55377215
3958 55377215 50765931 47393361 45152705 43548169 42548906 41707466 40963255 40622306 40630932
3949 40630932 40518082 39885084 38663657 36941461 35230205 33749687 32476546 31335523
3941 31335523 30255377 29292537 28350524 27231694 26192349 25195013 24322056 23661105 23044498
3932 23044498 22440959 22090861 21799611 21503194 21277381 21001499 20742321 20408593 19972258
3923A9972258k57913k06792m24770l15023l56407k43715l15329k16066k48297
3914A7387946j15722P306j30983L7516R5001O8416J26475K26130L11352L09333
3904A8322770L55866M77773N09367L94046M70722L72583L62118L32112K34863
3895B1832220J32436K05483K14880K66605K55831L12950L33520N05341N98016
3886B4657282P04002R51477J148839J348512J606528J853673K155297K472917
3878C6898527K898424L152374K959291K697669K752771K519471Q97660j330481
3870E3445706k676681k641321j772616o45534L59025J164338J834530K314237
3862E1381684K308273K181251J873963Q67851j107802l266745m275481m308868
$$ plain form
3923 19972258 19714345 19507553 19082783 18767760 18411353 18167638 17852309 17636243 17387946
3914 17387946 17272224 17279530 17148547 17186063 17281064 17349480 17475955 17702085 18013437 18322770
3904 18322770 18678636 19156409 19665776 20059822 20530544 20903127 21265245 21597357 21832220
3895 21832220 21964656 22170139 22385019 22651624 22907455 23220405 23553925 24059266 24657282
3886 24657282 25361284 26312761 27461600 28810112 30416640 32270313 34425610 36898527
3878 36898527 39796951 42949325 45908616 48606285 51359056 53878527 54776187 53445706
3870 53445706 50769025 48127704 46355088 45709554 46068579 47232917 49067447 51381684
3862 51381684 53689957 55871208 57745171 58613022 57505220 54238475 49962994 45654126
3854D5654126l750384k895669k269409j889135j677489j496879j320392j033202
3846B9321567q93778p92235n93157m17557k87893o6037p1146R0324J54848J11021
3836B6555957n8451k17379p8824j71479O564K88143L92340M21543N23465N45449
3826B8207328K73371l071k20166l02750k14721j01801O6004K23604J36648n8962
3816B8005484k90960n22765m48972m50902l17652k89072j93950J75196K49055
3807B5915462K61802L45261N60982O26679O48881O84206O92077P12851Q60786
3798C1308987Q55435Q94454R21399Q19868Q07961Q07455O93539Q02131Q73572
3789C8784801R21117R47105R34923R73594J042072Q65777P66141O84245N16952
$$ plain form
3854 45654126 41903742 39008073 36738664 34849529 33172040 31675161 30354769 29321567
3846 29321567 28427789 27635554 27042397 26624840 26336947 26270910 26199764 26290088 26444936 26555957
3836 26555957 26497506 26280127 26201303 26029824 26036388 26324531 26716871 27138414 27661879 28207328
3826 28207328 28480699 28477628 28257462 27954712 27739991 27638190 27704194 27927798 28064446 28005484
3816 28005484 27714524 27191759 26742787 26291885 25974233 25685161 25491211 25666407 25915462
3807 25915462 26177264 26522525 27083507 27710186 28359067 29043273 29735350 30448201 31308987
3798 31308987 32164422 33058876 33980275 34800143 35608104 36415559 37109098 37911229 38784801
3789 38784801 39705918 40653023 41587946 42561540 43603612 44469389 45235530 45919775 46436727
3780D6436727M59216K85394L01353M55781N32764N07988N32472N24444M55689
3771E0491828L66176K04348j20611l05580m39838o76439o52465n75665p65608
3762D7526146p57714o60156q98005j082333j182493j282884j494144j479225j657981
3753C7031211j687076j467609j457906j271650j139118q78046q66331q86400q60198
3744B6516877r45893r90693j010604r02537r65366r29928p85478q58451q58603
3735A8269324p44501o67665o11395o21656n12372n12038l21822m91900n39815
3726A3246160l11083l21948m70575l81586k42599j27723k19279k71557k77244
3717A0622566j45455j64378j65322j18994j66401j78097j03295j22583j77444
$$ plain form
3780 46436727 46895943 47181337 47482690 47938471 48471235 48979223 49511695 50036139 50491828
3771 50491828 50858004 51062352 50941741 50636161 50196323 49519884 48867419 48291754 47526146
3762 47526146 46768432 46108276 45210271 44127938 42945445 41662561 40168417 38689192 37031211
3753 37031211 35344135 33876526 32418620 31146970 30007852 29129806 28263475 27377075 26516877
3744 26516877 25570984 24580291 23569687 22667150 21701784 20771856 19986378 19127927 18269324
3735 18269324 17524823 16857158 16245763 15624107 15111735 14599697 14277875 13785975 13246160
3726 13246160 12935077 12613129 12142554 11760968 11518369 11390646 11171367 10899810 10622566
3717 10622566 10477111 10312733 10147411 10028417 9862016 9683919 9580624 9458041 9280597
3708I280597j29515j28663j06595j54747q8834N149K5122J8753K3200j21464p7327
3697H545676j05026l765l7146o7943p9666k5278L8037j20929L7812K7274o3164
3686H145882j56074j53087N1996j34364n5214p2197L6849m3000q83R44p760K7042
3674G640134l4570J1382J6501L3699N4984k4219M0778M312n075k2438P0056k0866
3662G764678M7067J11533J42960L8162k3694K1804J39991J66716Q8576K3028m760
3651H516061J80871J25960Q8882K17085J07739J02859R8667J94985K09710K08106
3641A0050925K55008K03088K48612K50816L28094M31989L49011M08882M19980
3632A2946405N05352M63932M94154N23395N39025O85078O79477P02107N34203
$$ plain form
3708 9280597 9151082 9022419 8915824 8761077 8672243 8677392 8702514 8721267 8744467 8623003 8545676
3697 8545676 8440650 8436885 8399739 8331796 8252130 8226852 8264889 8143960 8181772 8209046 8145882
3686 8145882 7989808 7836721 7888717 7754353 7699139 7626942 7663791 7620791 7619908 7620852 7613092 7640134
3674 7640134 7605564 7616946 7633447 7667146 7722130 7697911 7738689 7743001 7737926 7715488 7785544 7764678
3662 7764678 7811745 7923278 8066238 8104400 8080706 8102510 8242501 8409217 8497793 8520821 8516061
3651 8516061 8696932 8822892 8911774 9128859 9236598 9339457 9438124 9633109 9842819 10050925
3641 10050925 10305933 10509021 10757633 11008449 11336543 11768532 12117543 12526425 12946405
3632 12946405 13451757 13915689 14409843 14933238 15472263 16157341 16836818 17538925 18073128
3623A8073128O99206O84460M79694L92644K14162K19338J22416P5655N5308m7264
3613B0968747Q9885L5130K66672M01884M56463N01251N35540P60958Q36571J065343
3603B5918444J189967J302661J461484J510964J598855J786445J780970J751181
3595C8300971J746474J617559J303557J078000P65052J87508m3531n88765r11671
3586D3455154j160610j151672j160386r08744p39024n55854l72637p9733M8598
3577C7375092L58577N84161Q84538R65426J223091J406679J592350J871588J937957
3568D8199459J984142J900972J827855J731455J412126J052185L65235l75270
3560E8098159q92355j600662k102810k260143k276431k139929k002331j871446
$$ plain form
3623 18073128 18772334 19456794 19936488 20329132 20543294 20762632 20885048 20960703 21016011 20968747
3613 20968747 21058632 21093762 21360434 21762318 22218781 22720032 23255572 24016530 24853101 25918444
3603 25918444 27108411 28411072 29872556 31383520 32982375 34768820 36549790 38300971
3595 38300971 40047445 41665004 42968561 44046561 44811613 44999121 44955590 44366825 43455154
3586 43455154 42294544 41142872 39982486 39073742 38334718 37778864 37406227 37326494 37375092
3577 37375092 37733669 38317830 39202368 40167794 41390885 42797564 44389914 46261502 48199459
3568 48199459 50183601 52084573 53912428 55643883 57056009 58108194 58473429 58098159
3560 58098159 57205804 55605142 53502332 51242189 48965758 46825829 44823498 42952052
3552D2952052j537526j191456j004199p04799n07450j50074L9813K41795M80299
3543C8618455P07867R22748J021597J295588J160200J120493R37646Q10469M78114
3534D7073177J09596j49785o83837j116236j499865j795779j912412j940716j865622
3525C6218521j797142j625753j472071j441229j238796j214542j204889q88481
3517B5335618j010382o64619n55087m90489m47823l40307k92133k18150j24848
3508B1191780j60755k02887j77255k28257k57629m26972n24550n91701n87399
3499A8034375o84395p16964o43079n28721m49683n38500m81746m15037l93091
3490A3183159l46482k20320j91533k72263k19397j11652j13990j86071j75909
$$ plain form
3552 42952052 41414526 40223070 39218871 38514072 38006622 37856548 37896361 38138156 38618455
3543 38618455 39326322 40249070 41270667 42566255 43726455 44846948 45784594 46595063 47073177
3534 47073177 47182773 47032988 46349151 45232915 43733050 41937271 40024859 38084143 36218521
3525 36218521 34421379 32795626 31323555 29882326 28643530 27428988 26224099 25335618
3517 25335618 24325236 23660617 23105530 22615041 22167218 21826911 21534778 21316628 21191780
3508 21191780 21031025 20828138 20650883 20422626 20164997 19738025 19213475 18621774 18034375
3499 18034375 17349980 16633016 15989937 15461216 15011533 14473033 13991287 13576250 13183159
3490 13183159 12836677 12616357 12424824 12152561 11933164 11821512 11707522 11521451 11345542
3481A1345542o0776j43906n6218j66n1116j02149p4229j59278j0512J4203j53689
3470A0547706N251k6189k2190l1420m194l3953o8430o4820j48136l5761J07179
3459A0225043O4843J2117r2139p1921j8820l5741J317p8878j30076O488R38n2155
3447I831016K9562j23415o682L0848K4608j0723P0197J61007q9916K8004P9873
3436A0024379J48552j4716l5038J43700M4443O1422Q0023k0959O6469n7926n3498
3425A0386851J00116J22708J02207M1136K1249m6407P1141Q3662M4378M9790P5528
3414A1052359J30980O9037N3375R7019O8222P8427J37953Q7265P5259R3388O1197
3403A2004481K45798J75364J70499J88556J23169K58633K17898K77708K92995
$$ plain form
3481 11345542 11284766 11140860 11084642 11084476 11033360 10931211 10856982 10697704 10687192 10701395 10547706
3470 10547706 10552957 10526768 10504578 10473158 10468964 10435011 10366581 10301761 10153625 10117864 10225043
3459 10225043 10289886 10302003 10209864 10137943 10119123 10083382 10084699 10005821 9875745 9882233 9883171 9831016
3447 9831016 9860578 9737163 9730481 9761329 9785937 9775214 9845411 10006418 9916502 9944506 10024379
3436 10024379 10172931 10158215 10123177 10266877 10311320 10372742 10452765 10431806 10498275 10440349 10386851
3425 10386851 10486967 10609675 10711882 10753018 10774267 10727860 10799001 10882663 10927041 10976831 11052359
3414 11052359 11183339 11252376 11305751 11402770 11470992 11549419 11687372 11774637 11849896 11943284 12004481
3403 12004481 12250279 12425643 12596142 12784698 12907867 13166500 13384398 13662106 13955101
3394A3955101K34037L74245K80013M24251M55446N45859N23744O58497O59462
3385A8110655O87143P81652Q14503Q69719Q72947R51374R70179R07094R04277
3376B5869543Q94562P51392O50106O30683O54265M41841L94376L96381M65029
3367C1148178M58218L73196N83298P65801R04984J186705J127080J197558J183556
3358C8928574J009891J176387J401821J714929J959542J755516J217073N88003
3350D9751736J16347J28693K17733M98422Q67535J108252J523668J790794J682397
3341E7685577J549164J483382J603066J692945J703987J557105J112738R73807
3333F9361771J144691J660416K310287K403897J516912m89545k403868l303708
$$ plain form
3394 13955101 14189138 14563383 14843396 15267647 15723093 16268952 16792696 17451193 18110655
3385 18110655 18797798 19579450 20393953 21263672 22136619 23087993 24058172 24965266 25869543
3376 25869543 26764105 27515497 28165603 28796286 29450551 29892392 30286768 30683149 31148178
3367 31148178 31606396 31979592 32562890 33328691 34233675 35420380 36547460 37745018 38928574
3358 38928574 39938465 41114852 42516673 44231602 46191144 47946660 49163733 49751736
3350 49751736 49868083 49996776 50214509 50712931 51580466 52688718 54212386 56003180 57685577
3341 57685577 59234741 60718123 62321189 64014134 65718121 67275226 68387964 69361771
3333 69361771 70506462 72166878 74477165 76881062 78397974 77908429 75504561 72200853
3325G2200853l483323l118721k818051k218454j821657j520539j148309r27784
3317E5144015o97272q00797j026192j278522j549957j577578j512452j356147
3309D5345098j142926p60253k94626k93940o25113j296013k028028k162176j951598
3300C4790425k049691j751094j439375j151213r53916q43395o42596n09462m57764
3291B4991919l74056l55901k71693k96763j40395j60736l1693j93193j14138K4723
3281B3078074k12623r192N174k4964j06238j31964r2716j29906n71P2586M303
3270B2451963L9495K13157J89969K01640J53957J46860K22840J30679J61517J25244
3260B4037321J42829J41135J57239J60234J32047Q8757J13615J30241K75370R9931
$$ plain form
3325 72200853 68717530 65598809 62780758 60562304 58740647 57220108 56071799 55144015
3317 55144015 54446743 53645946 52619754 51341232 49791275 48213697 46701245 45345098
3309 45345098 44202172 43441919 43147293 42853353 42228240 40932227 38904199 36742023 34790425
3300 34790425 32740734 30989640 29550265 28399052 27445136 26601741 25959145 25449683 24991919
3291 24991919 24617863 24261962 23990269 23693506 23553111 23392375 23360682 23167489 23053351 23078074
3281 23078074 22865451 22856259 22861433 22836469 22730231 22598267 22505551 22375645 22375074 22447660 22451963
3270 22451963 22491458 22704615 22894584 23096224 23250181 23397041 23619881 23750560 23912077 24037321
3260 24037321 24180150 24321285 24478524 24638758 24770805 24859562 24973177 25103418 25378788 25478719
3250B5478719K74420L37620L17629L03114M10277M52098M44653M89243O00853
3241B9108626N71983P58025P98689R44938J123952J147962J265726J525938J624943
3232C8870782J803603K031240K210391K547398K640275K938467L294689L535372
3224E9872217L755289L887946M109352M355166M633482M676280M638101M665781
3216I4593614M496094L984511L278177K640549J852409J004258L38104k42564
3208A11945152p90700r67191r22371q88679j020953j094271j280019j593056k075832
3199A01312080k875997l391572l943077m388105m659274m895262m692218m540615
3191F7925960m262687l800070l343863l173468k714240k370037k260538j979243
$$ plain form
3250 25478719 25753139 26090759 26408388 26711502 27121779 27573877 28018530 28507773 29108626
3241 29108626 29680609 30438634 31237323 32182261 33306213 34454175 35719901 37245839 38870782
3232 38870782 40674385 42705625 44916016 47463414 50103689 53042156 56336845 59872217
3224 59872217 63627506 67515452 71624804 75979970 80613452 85289732 89927833 94593614
3216 94593614 99089708 103074219 106352396 108992945 110845354 111849612 112187716 111945152
3208 111945152 111154452 110187261 109264890 108376211 107355258 106260987 104980968 103387912 101312080
3199 101312080 98436083 95044511 91101434 86713329 82054055 77158793 72466575 67925960
3191 67925960 63663273 59863203 56519340 53345872 50631632 48261595 46001057 44021814
3183D4021814j681001j525113j409435j131592r86427r90057o29162n04319n73379
3174C4591329m30391l87778l07786l10127j16987K6727J70887J74955O0690K40021
3164C3711540K42785K16625K57564K51227L57885L36501L42256M51459K88646
3155C6456488L77698L87077L61771M34355L13414K68852K57475M11215L41971
3146C9610316L93971M67940L13255L89681K77852L86729L89938K99039M14098
3137D2942819M34085M37776N33762N36786N91757O17959P74229Q49673R34883
3128D8653729J028863J094854J287753J391597J295467J602190J734148J821428
3120E9910029K085650K144967K407906K594005K759181L028534L148404L361229
$$ plain form
3183 44021814 42340813 40815700 39406265 38274673 37288246 36298189 35669027 35164708 34591329
3174 34591329 34160938 33773160 33465374 33155247 33038260 33064987 33235874 33410829 33471519 33711540
3164 33711540 33954325 34170950 34428514 34679741 35037626 35374127 35716383 36167842 36456488
3155 36456488 36834186 37221263 37583034 38017389 38330803 38599655 38857130 39268345 39610316
3146 39610316 40004287 40472227 40785482 41175163 41453015 41839744 42229682 42528721 42942819
3137 42942819 43376904 43814680 44348442 44885228 45476985 46094944 46869173 47718846 48653729
3128 48653729 49682592 50777446 52065199 53456796 54752263 56354453 58088601 59910029
3120 59910029 61995679 64140646 66548552 69142557 71901738 74930272 78078676 81439905
3112H1439905L605506L820235M175588M362649M778300N358357N784928O400742
3104A19726210O959002P666536Q394357R068977R803975J0350131J0690285J1051488
3096A93710961J1023499J0799693J0155644R130140P845025O108728M400910K746648
3088B55921248J306819J05964n74062r78664j074754j261764j378782j751319
3080B50314686k467475l434000m674849n981946p366503q539975r400521r830819
3072A98618598r956975r695565r117993q431896p476784o509874n681355m788726
3064A36959430l753789k876298k162734j284749m73755L21807J055632J790447
3056A29575991K446045L083675L795168M367279M995138N568237O078978O556577
$$ plain form
3112 81439905 85045411 88865646 93041234 97403883 102182183 107540540 113325468 119726210
3104 119726210 126685212 134351748 142746105 151815082 161619057 171969188 182659473 193710961
3096 193710961 204734460 215534153 225689797 234819937 242664962 248773690 253174600 255921248
3088 255921248 257228067 257334031 256759969 255781305 254706551 253444787 252066005 250314686
3080 250314686 247847211 244413211 239738362 233756416 226389913 217849938 208449417 198618598
3072 198618598 188661623 178966058 169848065 161416169 153939385 147429511 141748156 136959430
3064 136959430 133205641 130329343 128166609 126881860 126408105 126729912 127785544 129575991
3056 129575991 132022036 135105711 138900879 143268158 148263296 153831533 159910511 166467088
3048A66467088O821951O669004O467379N797480N286954M971838M583676L807420
3040B10872790K312877k163j266601k225329k818461l223151l532913l535056
3032A96581993l500174l288564l508393l738501l799849l907754m197197m540322
3024A66101239m654400m875744n039075m965101m820799m774840m774779m964730
3016A27231771n091095m332213l082327j980276j495465l382793n440320n351905
3008I7075377n092517m470839l817450k998748k326664k037489j751124j244677
3000G3335869j061709r59033r76275p36874o08463n00663l13085k1093K00820
2991F8359494L07323L63536N50661K19643K86948P27246R94096J325560J106861
$$ plain form
3048 166467088 173289039 179958043 186425422 192222902 197509856 202481694 207065370 210872790
3040 210872790 213185667 213183504 211916903 209691574 206873113 203649962 200117049 196581993
3032 196581993 193081819 189793255 186284862 182546361 178746512 174838758 170641561 166101239
3024 166101239 161446839 156571095 151532020 146566919 141746120 136971280 132196501 127231771
3016 127231771 122140676 117808463 114726136 112745860 111250395 107867602 102427282 97075377
3008 97075377 91982860 87512021 83694571 80695823 78369159 76331670 74580546 73335869
3000 73335869 72274160 71315127 70338852 69601978 68993515 68492852 68179767 68158674 68359494
2991 68359494 68666817 69030353 69581014 69800657 70087605 70814851 71808947 73134507 74241368
2982G4241368j25166j130173j279035j305863j312788j217903j092216q83347
2974F5894877j015732j204678j104456j170248r65646r28771p69473n00662k81741
2965E7953470j07202J76082N08774P52155J097041J285327J584686J791325K034254
2956F7075912K506434K710769K927699L160148L268901L357185L598442L523292
2948I2128782L613286L237232K899294K641716K223976J855384J361065Q69184
2940A10829919N18787J95121k37615j93959l46598n17854o43874q58568j308963
2931A07436396j962438k456780k989278l807094m373033m575151m823218m931807
2923G7517597m887258m688301m347014m033116l645533l325796l168709k776792
$$ plain form
2982 74241368 74116202 72986029 71706994 70401131 69088343 67870440 66778224 65894877
2974 65894877 64879145 63674467 62570011 61399763 60434117 59505346 58735873 58235211 57953470
2965 57953470 57846268 58022350 58531124 59283279 60380320 61665647 63250333 65041658 67075912
2956 67075912 69582346 72293115 75220814 78380962 81649863 85007048 88605490 92128782
2948 92128782 95742068 98979300 101878594 104520310 106744286 108599670 109960735 110829919
2940 110829919 111348706 111543827 111306212 111112253 110765655 110247801 109603927 108745359 107436396
2931 107436396 105473958 103017178 100027900 96220806 91847773 87272622 82449404 77517597
2923 77517597 72630339 67942038 63595024 59561908 55916375 52590579 49421870 46645078
2915D6645078k482895k317888j967883j803071j663981j363863j290597j214306
2907C2540594j121597j119207j078275q67813q72036p48344p28503o47178n71728
2898B4785913n14899m46763m29476k95300l60823k45670o8475k13639o3101K5270
2888B2173037N6165Q5500L6622R494J92213Q5783l2181M702k62445j53436l77815
2877B1817639n42922m97497m65147n99956o39705n99398o39755o07541m67450
2868A6758268m07388l83620m01900l41957k76973k68012k39913j23269k00297
2859A4114939k17043k10315k55404r6511r6148k32706j45821n9952j51707j30914
2849A2518418n1867j22720K0723l9437q0418p670p4122J2438K6155M5589P5624
$$ plain form
2915 46645078 44162183 41844295 39876412 38073341 36409360 35045497 33754900 32540594
2907 32540594 31418997 30299790 29221515 28353702 27481666 26733322 26004819 25357641 24785913
2898 24785913 24271014 23824251 23394775 23099475 22738652 22492982 22424507 22210868 22147767 22173037
2888 22173037 22229202 22314702 22351324 22360818 22553031 22638814 22606633 22611335 22348890 22195454 21817639
2877 21817639 21274717 20777220 20312073 19712117 19072412 18473014 17833259 17225718 16758268
2868 16758268 16350880 15967260 15565360 15223403 14946430 14678418 14438505 14315236 14114939
2859 14114939 13897896 13687581 13432177 13335666 13239518 13006812 12860991 12801039 12649332 12518418
2849 12518418 12466551 12343831 12364554 12325117 12244699 12237029 12162907 12175345 12201500 12247089 12322713
2838A2322713l5350K5765J07123O0089J54488L1733N8808M7793N8657l089l1577
2827A2797153J34175J56280K3870Q1574M5616l4446P7785J68805J56719P2223
2817A3679754J50861J15433P6964J01767N6741j1602J87593J31600J02247J63411
2807A4754769K52045L15446K40514L67785L94183M18862L78616M48813M48219
2798A8019252N21142M20000N53420N37625M48347M46700N96737O22187N70521
2789B2735931O67055N80610P32583Q38670P94003P77201P58654P04024P02543
2780B9291274Q38369Q58088R24293J101714J018779J070065J204941J123218J260379
2771C8691120J289895J045560J070868R80909J014057R24979J068170J014259
$$ plain form
2838 12322713 12287363 12313128 12420251 12480340 12634828 12666561 12725369 12773162 12831819 12828730 12797153
2827 12797153 12931328 13087608 13111478 13193052 13238668 13204222 13282007 13450812 13607531 13679754
2817 13679754 13830615 13946048 14023012 14124779 14181520 14169918 14357511 14489111 14591358 14754769
2807 14754769 15006814 15322260 15562774 15930559 16324742 16743604 17122220 17571033 18019252
2798 18019252 18540394 18960394 19513814 20051439 20499786 20946486 21543223 22165410 22735931
2789 22735931 23402986 23983596 24716179 25554849 26348852 27126053 27884707 28588731 29291274
2780 29291274 30129643 30987731 31912024 33013738 34032517 35102582 36307523 37430741 38691120
2771 38691120 39981015 41026575 42097443 43078352 44092409 45017388 46085558 47099817
2763D7099817J121518J304632J361796J574568J825838J949018K175910K382060
2755F0795157K726622K916826L098420L529220L781877M059457M462112M736404
2747I0106095N085011N516485O012376O487592P217137Q404059R534900J0981804
2739A49345459J2361421J3649395J5263699J6885680J7920437J8315184J8705377
2732B62446652J9883978K1739732K3284196K4510733K6463332K8766492L0280914
2725D37376029K9262539K5856502K1131648J4545203J941033j8016379l7639115
2718D74457460m9388069n1510650m6452926l9180688l2020930k6275600k1939726
2711B07688871j8524621j5898842j3688965j1941643j0306997r017814p806223
$$ plain form
2763 47099817 48221335 49525967 50887763 52462331 54288169 56237187 58413097 60795157
2755 60795157 63521779 66438605 69537025 73066245 76848122 80907579 85369691 90106095
2747 90106095 95191106 100707591 106719967 113207559 120424696 128828755 138363655 149345459
2739 149345459 161706880 175356275 190619974 207505654 225426091 243741275 262446652
2732 262446652 282330630 304070362 327354558 351865291 378328623 407095115 437376029
2725 437376029 466638568 492495070 513626718 528171921 530112954 512096575 474457460
2718 474457460 425069391 373558741 327105815 287925127 255904197 229628597 207688871
2711 207688871 189164250 173265408 159576443 147634800 137327803 128309989 120503766
2704A20503766o738657n886704n179340m810284m227011l713065l477163l135001
2696H3336541k810450k749681k721061k711917k749193k726853k597588k590105
2688F1679693k509658k321757k210698k106540j881342j770735j675471j700244
2680D5503248j440102j272098j222670j283377r94115j070735r79517j004185
2672C6236449j020720q51110j044869q69327r15765q33327q76330q59874p83889
2663B8181238q41902q55663q13890o69185p39005p04636o18324p37429n45858
2654B1655346n51911n23586m58521n04995n14481m34677n62627n04907n47369
2645A7052272m66856m06010l41237l80726m36480l41298l88864l03490k82852
$$ plain form
2704 120503766 113765109 107878405 102699065 97888781 93661770 89948705 86471542 83336541
2696 83336541 80526091 77776410 75055349 72343432 69594239 66867386 64269798 61679693
2688 61679693 59170035 56848278 54637580 52531040 50649698 48878963 47203492 45503248
2680 45503248 44063146 42791048 41568378 40285001 39290886 38220151 37240634 36236449
2672 36236449 35215729 34364619 33319750 32450423 31534658 30701331 29825001 28965127 28181238
2663 28181238 27339336 26483673 25669783 25000598 24261593 23556957 22938633 22201204 21655346
2654 21655346 21103435 20579849 20121328 19616333 19101852 18667175 18104548 17599641 17052272
2645 17052272 16585416 16179406 15838169 15457443 15020963 14679665 14290801 13987311 13704459
2636A3704459l06510l31468l36819k19536l51406k79230k97500j36950k59856
2627A1185184k07145k38061j18951k81937j88380j25096j05765j96032k30808
2618I493009j02553j91875k46408r1173o8788k89577k26150j91300l5627k34882
2608G814676k11889r9469k06362r6433K3990j92039j42133j51888o9570o4266
2598F604617j15909j58255l1686j51413j72826p1399j51166l8837m1927j73925
2588E497274j16899r7857j62527p2095r1657k8571r7932l0997K2097o0399l9544
2577D720893p1360O317l4262q0830R6098j21070j53735J6035K7853m591p6096
2566D325252r4455R580P8639q0925p5240o4941O162j38462j7241p876n2651j7977
$$ plain form
2636 13704459 13397949 13066481 12729662 12510126 12158720 11879490 11581990 11445040 11185184
2627 11185184 10978039 10739978 10621027 10339090 10150710 10025614 9919849 9723817 9493009
2618 9493009 9390456 9198581 8952173 8861000 8792212 8502635 8276485 8085185 8049558 7814676
2608 7814676 7602787 7503318 7296956 7200523 7224513 7032474 6890341 6738453 6668883 6604617
2598 6604617 6488708 6330453 6298767 6147354 5974528 5903129 5751963 5713126 5671199 5497274
2588 5497274 5380375 5282518 5119991 5047896 4956239 4927668 4829736 4798739 4820836 4760437 4720893
2577 4720893 4649533 4655850 4621588 4540758 4636856 4515786 4362051 4378086 4405939 4401348 4325252
2566 4325252 4230797 4240377 4319016 4238091 4162851 4097910 4104072 3965610 3948369 3940493 3887842 3869865
2554C869865q6153p1900K7263q0417n1308r8524n6400r0454l8965q4087p3100
2543C165820O6336J2994j21283n4637m2775m0259m8624j16282j25562r058L8337
2532B725007k0087q5858j76632r7843l2344l9812p7304p8425j62410o5970O2465
2521A950787k0848M9883l1885n0660O5152R2212P8312O5409k2705K0244M044n1508
2509B148437P5870j02379m8263O6068K1931R589k1450M4283N6093l9234R0025
2498B300970J3561j4091l6539j9192K0713p5209L4726O9858n3133m5513N5185
2487B251336J47314N3371j3207k0076M3083Q6232Q1288J46706K0859O2014J21848
2476B980768J29937K1092J34739K01908J23402J31917J46565K3165J8333J22085
$$ plain form
2554 3869865 3783712 3711812 3739075 3658658 3607350 3508826 3452426 3361972 3323007 3238920 3165820
2543 3165820 3232156 3245150 3123867 3069230 3026455 2986196 2937572 2821290 2695728 2686670 2725007
2532 2725007 2704920 2619062 2442430 2344587 2312243 2272431 2195127 2116702 1954292 1888322 1950787
2521 1950787 1929939 1979822 1947937 1897277 1962429 2054641 2132953 2198362 2175657 2195901 2199945 2148437
2509 2148437 2224307 2121928 2073665 2139733 2161664 2171253 2149803 2194086 2250179 2210945 2300970
2498 2300970 2314531 2300440 2263901 2244709 2265422 2190213 2224939 2294797 2241664 2196151 2251336
2487 2251336 2398650 2452021 2438814 2418738 2461821 2548053 2629341 2776047 2796906 2858920 2980768
2476 2980768 3110705 3131797 3266536 3468444 3591846 3723763 3870328 3893493 3911826 4033911
2466D033911O9983j15804j30897j77730k28555k04947k43506j69270k11571q3310
2456B538304k31338r8109m1780M5207J3793J225j61187j01829L3395j98709l5604
2445A763368J2684p5036P8135r1917j1424R118m5394j20006k7350M5054L2521
2434A569753l4515j7076m397n250m5043j3236m0150j24836J9002N1846Q6180m1556
2422A400722o9460l6413j05514o8092M116J4951L0992l2968Q5028l6514M502l6829
2410A154521r91L6936k7825j12608o6788l544k3403J27339j08608p7662J4927
2399I12294n743R237Q8441L8617j3264n7788p9165N2080m3620n6826K9848N7196
2387I31307l3289J4828n150q479N5223l5317j13589J4990P58L2899j345q5066
$$ plain form
2466 4033911 4103894 3988090 3857193 3679463 3450908 3245961 3002455 2833185 2621614 2538304
2456 2538304 2306966 2208857 2167077 2212284 2226077 2227302 2066115 1964286 1997681 1798972 1763368
2445 1763368 1776052 1701016 1779151 1687234 1675810 1684928 1639534 1519528 1492178 1537232 1569753
2434 1569753 1535238 1518162 1513765 1508515 1463472 1450236 1410086 1285250 1304252 1356098 1442278 1400722
2422 1400722 1331262 1294849 1189335 1121243 1125359 1140310 1171302 1138334 1223362 1186848 1191350 1154521
2410 1154521 1153530 1190466 1162641 1050033 983245 979701 956298 1083637 975029 897367 912294
2399 912294 906551 915788 1004229 1042846 1029582 971794 892629 944709 901089 844263 874111 931307
2387 931307 898018 912846 907696 899217 954440 919123 805534 820524 821282 854181 852836 767770
2375G67770l449J27380p8329j307j1162k4957J5872j0848j9658k3772L5218L4365
2363H07123L1018n2931j8852Q6982o7107p8300J4689K2200N0502j26677N2263
2352G20910o5447J1122J8642m579o4890R274P2722j9393j8077q0997k3309r0728
2340D65250M4221J27637L7085k5703o6217q3373Q544P5585L2707Q6393L3789p6746
2328F59172r0119m8689N3727m641J6724m6659K8834M231q6866M3892J2934N3173
2316E95713L7826o7747l2278J9243O2081K358m9099n7488R2735k8092l7866O2281
2304E99667j8474J6671l2671J7627M6657k8014r3860M0915N3738j18974R5551
2293E78833J35161r6800j04305R4277j00855j0757J22496l836j34433J8845p791
$$ plain form
2375 767770 764321 891701 813372 812065 800903 775946 791818 780970 761312 737540 772758 807123
2363 807123 838141 785210 766358 853340 786233 707933 722622 744822 795324 668647 720910
2352 720910 655463 666585 685227 680648 615758 625032 697754 678361 660284 579287 555978 465250
2340 465250 509471 637108 674193 648490 582273 498900 507444 583029 615736 702129 735918 659172
2328 659172 569053 520364 574091 569450 586174 539515 568349 572580 485714 529606 542540 595713
2316 595713 633539 565792 533514 552757 614838 617196 568097 510609 603344 575252 537386 599667
2304 599667 581193 597864 565193 582820 629477 601463 507603 548518 602256 483282 578833
2293 578833 713994 617194 512889 607166 506311 495554 618050 614214 479781 498626 490835
2282D90835o0239L3269o9466O8058m1082J8228J7224m534N3804j22224N5182k3828
2270D15227q0325L0354K5849K6096n5661Q1711R0036l5477o3013j11937N3066
2259C75926J038r60L4260j02260P7432O4281J5241M8981l2759n4716m792l2238
2247C89434k113M8096j7803o3317J4566L6913j5330l2348j67J2313N0254k9703
2235C90795L4177q5760K9979J22n3871R032J06322L7740r5962J8506R2854n1157
2223D32777k7766j08875R0887K9462j9225M5393m0169p6409K3529j8093j3963
2212C17548K260J2335n4811l619L0678J3368N0297m8805J4892j6620Q9964o0801
2200C46686O783K1054m1045R740L9712Q8904j07576k4234R0494o3123N4875r7277
$$ plain form
2282 490835 430596 463865 394399 462457 421375 439603 456827 452293 506097 383873 439055 415227
2270 415227 334902 365256 391105 417201 361540 443251 533287 497810 434797 322860 375926
2259 375926 376964 376004 410264 308004 385436 449717 464958 513939 481180 426464 421672 389434
2247 389434 387321 435417 417614 354297 368863 405776 390446 358098 357931 370244 420498 390795
2235 390795 424972 339212 369191 369313 315442 324474 430796 468536 372574 391080 483934 432777
2223 432777 405011 296136 387023 416485 397260 442653 402484 326075 349604 331511 317548
2212 317548 319808 332143 277332 273713 304391 317759 368056 319251 334143 317523 407487 346686
2200 346686 353469 374523 333478 343218 382930 471834 364258 340024 430518 367395 422270 324993
2188C24993j9744K3191N5655p2146O7887L9317r3526m7048O0461l4298K1080k8347
2176B97475K2855R4222n3640l958j0203J3588k3711R8088l7326N0480K4949l0914
2164D41905m5865l5717k096j3106K745P5452o3461k2968J22815L1019m4253l2784
2152D13686K2453k5422N3855m8889L120j5455J16275k7596o3967N3290L1974l5161
2140D78163O308m1572p6340N7976J3849k5629k2325K9373l1222j0872R6946L6338
2128E10993n3597K1551l2769m4145L5814J4529j8188n364L7415P3850P7972Q4802
2116G02863r2810m1368R1985J1228j1892K3822n4635L8513L182L7306M7826Q4019
2104H40039Q661M4625M0859j73J25933L2821o0240k4877j1603J9517k0578J08846
$$ plain form
2188 324993 305249 328440 384095 311949 379836 419153 325627 278579 339040 304742 325822 297475
2176 297475 320330 414552 360912 356954 346751 360339 336628 434716 397390 447870 472819 441905
2164 441905 396040 360323 358227 345121 347866 423318 359857 336889 459704 490723 446470 413686
2152 413686 436139 410717 464572 415683 418803 403348 519623 492027 428060 481350 513324 478163
2140 478163 484471 442899 366559 424535 438384 412755 390430 419803 388581 377709 474655 510993
2128 510993 457396 478947 446178 402033 437847 452376 434188 428824 466239 540089 618061 702863
2116 702863 610053 568685 660670 671898 660006 683828 629193 667706 670888 708194 756020 840039
2104 840039 848700 893325 934184 934011 1059944 1092765 1032525 1007648 996045 1015562 994984 1103830
2092A103830M206m8176J7539Q4150L4412p6933M0019N9371P7952O7110J31303
2081A494783J083M3833Q2244Q6742R1407J26583J26206J30220J23303J94715J86598
2070B687717J82019J86235K68971L70383L95160M13707L92253M49893M92585N67493
2060F406416Q84109J072203J176479J371312J906969K510881K634741J951303
2052A9914413J961099K413486j127402l661380l442814l370886k393527j640094
2044H652895j163583r03577p18631n85062l41307l90648k26077k83519l51526
2035C688965l78306k30194k95035k43519p8082j17382k9108r7315j04973j08197
2025B006854r9322K5146n8007r6337m5226j11894o8418j37674j4631N1439r9214
$$ plain form
2092 1103830 1108036 1059860 1077399 1161549 1195961 1119028 1159047 1218418 1296370 1363480 1494783
2081 1494783 1495866 1539699 1621943 1708685 1800092 1926675 2052881 2183101 2306404 2501119 2687717
2070 2687717 2869736 3055971 3324942 3695325 4090485 4504192 4896445 5346338 5838923 6406416
2060 6406416 7290525 8362728 9539207 10910519 12817488 15328369 17963110 19914413
2052 19914413 21875512 24288998 23161596 19500216 16057402 12686516 10292989 8652895
2044 8652895 7489312 6585735 5867104 5282042 4940735 4550087 4324010 4040491 3688965
2035 3688965 3310659 3080465 2785430 2541911 2463829 2346447 2317339 2220024 2115051 2006854
2025 2006854 1907532 1932678 1874671 1778334 1733108 1621214 1552796 1415122 1400491 1451930 1352716
2014A352716j16934J05350L9073j53065j26424l5024k6593j2281l3959k0838m196
2003I67825o256m7203j5474k6553o0750k5757L5147j37398M7630O3586k8760p7947
1991F88090k9851J6925p3677l8282m2251J2287K4998M613o1326r572P5229J4245
1979E81428q8101K7855K5250L8502l3594n7039K4468r4773O2173r051r0533O4593
1967D51178j1786o2327k1435K8406m309L8403l8150n5388j8996J0070O9059j9714
1955C65011p3172j01204O5254j149M1281L3035l6991O0779J29630n7132r5337
1944C30005K5703L9743o0916n0404Q065k6103M514n3224N6607j9515l8846L6238
1932B51867N213J6443j2661j7046j0953j6438J6237O0887l4257q4961o694k3592
$$ plain form
2014 1352716 1235782 1341132 1380205 1227140 1100716 1065692 1039099 1026818 992859 972021 967825
2003 967825 961569 914366 898892 872339 811589 785832 820979 683581 731211 794797 766037 688090
1991 688090 658239 675164 601487 563205 520954 533241 558239 562852 501526 491954 567183 581428
1979 581428 493327 521182 546432 584934 551340 494301 518769 423996 486169 477118 386585 451178
1967 451178 439392 377065 355630 384036 379727 418130 379980 324592 305596 315666 384725 365011
1955 365011 291839 190635 255889 254740 296021 329056 292065 352844 482474 425342 330005
1944 330005 355708 395451 334535 284131 292196 266093 270607 217383 273990 254475 215629 251867
1932 251867 257080 273523 260862 243816 232863 216425 232662 293549 259292 174331 167637 144045
1920A44045P9772Q5320n8754l5879K0276Q70J105N6724k7738q7467r477J6289
1908A85086R6493k0958l2461N706m6168q3132k1285O7040K1258l9860n0489M6594
1896A27824Q7272p478j1687j2462o6877p0141K3936Q9168P6397L6686p9734k2191
1884A70713o3425M1254Q3517K314J2804o290M9299k7908N426m0407j2087k7629
1872A87581p093K3906l2368P0996M8746j11427J6792m437r0034J7218R4906k2032
1860A92754m3103J4559p2891J7899N7027j4917l3323M496o0763k5851M1355J09987
1848A87229L650o5048n5546l4189K5701l645K8077K231L0035K5055l9960J19826
1836B23416n3108m0490n2776M4164L5425p6715n7790J5147N7563K9535L4314j09201
$$ plain form
1920 144045 223817 309137 250383 214504 234780 235650 236755 293479 265741 178274 168797 185086
1908 185086 281579 260621 228160 233866 187698 104566 83281 150321 171579 131719 81230 127824
1896 127824 215096 207618 195931 183469 116592 46451 70387 159555 235952 272638 192904 170713
1884 170713 107288 148542 232059 234373 247177 240887 290186 262278 267704 227297 215210 187581
1872 187581 180488 204394 172026 243022 291768 180341 197133 192696 102662 119880 214786 192754
1860 192754 149651 164210 91319 109218 166245 151328 118005 122501 61738 35887 77242 187229
1848 187229 190879 125831 70285 36096 61797 58152 86229 88460 118495 143550 103590 223416
1836 223416 170308 129818 77042 121206 156631 79916 22126 37273 94836 124371 158685 49484
1824D9484R7628l8737o180q557L688J43661J9320p0313j06628J10148J1978J5523
1812B21015K5183P590J7167j12444O7899M2820R149m8443Q979k1650l7547m4348
1800A35370m0796J5186O8309J1756M8789k2960k1963r3596o2021N2491O2688n6400
1788I6853J4830L2288K823o352l970L0445M393k2074m6504M4936j2715J8811m3222
1775A10542m0611O5800M3044Q1797p5744n8277j5555m5808J08420m7462K9869
1764A56015p177m3403k6830O952j5775m1582M3935J04515J1080o4104q50R526
1752A32302j00326J2611j0391Q0942k8231r7263j5733O7549M4708N9002J7j21422
1740B3765q528p8920J29622O1572o5963M5411O0435p969r6358M7350Q566J1542
$$ plain form
1824 49484 147112 108375 102195 93638 97326 240987 260307 189994 83366 193514 205492 221015
1812 221015 246198 253788 270955 158511 226410 269230 278379 229936 238915 217265 179718 135370
1800 135370 94574 109760 178069 189825 238614 215654 193691 100095 38074 90565 153253 96853
1788 96853 111683 143971 146794 140442 136472 166917 171310 149236 102732 147668 134953 153764 110542
1775 110542 69931 135731 178775 260572 184828 126551 110996 65188 173608 126146 156015
1764 156015 148838 105435 78605 85557 69782 28200 72135 176650 187730 123626 122776 132302
1752 132302 31976 44587 34196 115138 86907 -10356 -26089 41460 86168 145170 145187 23765
1740 23765 15237 -63683 65939 127511 61548 106959 167394 159425 63067 110417 118983 130525
1728A30525k4358o031Q320N1173n2772o4565L3681Q4627l1072j07598K17351m8011
1716A91270j15972k7675K0433m7688Q046J1831Q602M9499k4506P785k5588M7793
1704A03830m2940j8078P8545k506K8027M6609o4435j05059R8295k2245j01136
1693a093J28438j8908k6200O9560n8801o7127J6725l2669K4969L0214j5019q571
1681D1518K3735K294L7712o3573O2024n8010J56026N239j24054m0214J09391N0735
1669B02823p364l5022j41768M0738l9797O4262N3360n0014Q7061J8664o8903m8224
1657G5816k0759M2028k9737O2650o937p696O94q1249p3023N5887O4021m040l9629
1644C8026M084o5499J03393K8160j1663l4721N0996M0998J4059O4283k9039j15632
$$ plain form
1728 130525 106167 100136 108456 159629 106857 42292 75973 160600 129528 21930 239281 191270
1716 191270 75298 47623 68056 20368 28414 40245 48847 98346 73840 81625 56037 103830
1704 103830 60890 42812 121357 118851 146878 193487 129052 23993 122288 100043 -1093
1693 -1093 127345 108437 82237 151797 92996 25869 42594 9925 34894 65108 50089 41518
1681 41518 65253 67547 105259 41686 103710 45700 201726 206965 82911 42697 152088 202823
1669 202823 195459 160437 18669 59407 19610 83872 137232 87218 174279 192943 124040 75816
1657 75816 55057 97085 67348 129998 123061 115365 116059 34810 -38213 17674 81695 77655 38026
1644 38026 42110 -23389 80004 108164 96501 61780 112776 153774 167833 232116 203077 87445
1632H7445J00625K3586k6192m0957j6598j9963j2175m4642l9811K5051j171q5507
1620e0309J07108L9937l1705n755J9839K6918m5859l5929L1395j3292q6047R2462
1608D8763k7920j12311R0603L9127M9421O9765q6218o0977k9510j4618M7145k0088
1596f818Q5634J152j9879P9278K3455N4707q7521l4979o2571o3974N1299J8962
1584C8745J01530k3669j42874L1006l072j5958K8203R2171l4678K9014m7693L1021
1572H3746j3630p543q416M5290l9855N0265Q734l82k2098r0646j21414J36481
1560B0532j9711J3310O1268n5300L5901K3426k5655l6093j1122j9052K7177J16165
1548A30846N0370j42378O1812K307l6349k2815P9079j5482K6753j1087L9347m3876
$$ plain form
1632 87445 188070 211656 185464 144507 127909 107946 95771 51129 11318 36369 35198 -50309
1620 -50309 56799 96736 65031 59276 79115 106033 60174 24245 55640 42348 -43699 48763
1608 48763 20843 -91468 -865 38262 87683 157448 71230 10253 -19257 -33875 13270 -6818
1596 -6818 78816 79968 60089 139367 162822 217529 130008 95029 32458 -31516 19783 38745
1584 38745 140275 116606 -26268 4738 1666 -14292 13911 106082 71404 100418 52725 83746
1572 83746 70116 62573 54157 99447 59592 109857 118591 118209 96111 5465 -115949 20532
1560 20532 821 14131 75399 20099 56000 79426 53771 17678 6556 -12496 14681 130846
1548 130846 181216 38838 100650 102957 66608 43793 122872 107390 134143 123056 162403 118527
1536A18527O9534n1013k6790K4559j05367M7766M4190j7329r7776R824O9203j2065
1524G3263L7472l96n7601R7803j1024m8629j5667j02438J04712n6117K5650k1294
1512B5734J9892O7599j1791P519o7894j5183n8282O6468j4743N5095P426K1456
1500A03296m1586j07661Q5684k6336o6641L9210N3923k4567N1920J9996o089l3302
1488D7847l1937L6955m926K0584p7937N9783o3603R8634J0692r9917n4637R2949
1476C4487J0233m375j919Q008j4198n5583Q6371k7539q3188R5212M276m905J7938
1463F4818k4201L3586m6609j876j7523M3199J5572J546k6325M6946j086o0865
1451B7182j8198K3410l2905K1158n6402l5252j193Q379R0897p2080P593j2482
$$ plain form
1536 118527 188061 137048 110258 134817 29450 77216 121406 104077 6301 16125 85328 73263
1524 73263 110735 110339 52738 150541 139517 90888 75221 -27217 77495 21378 47028 25734
1512 25734 45626 113225 101434 108953 41059 25876 -32406 34062 19319 74414 81840 103296
1500 103296 61710 -45951 39733 13397 -53244 -14034 39889 15322 67242 87238 81149 47847
1488 47847 15910 52865 47939 68523 -9414 50369 -13234 85400 96092 -3825 -58462 34487
1476 34487 44720 40345 38426 46434 32236 -23347 63024 35485 -47703 47509 51785 46880 64818
1463 64818 40617 74203 27594 25718 8195 51394 66966 68512 42187 89133 88047 27182
1451 27182 8984 32394 -511 20647 -35755 -71007 -72200 -63821 27076 -45004 -37411 -49893
1439d9893Q9172O7281l7558m0663M9416K3529o8729l6028L0167P7773M1144m1027
1427A04584j37255K6808K5857N3139L876m9024o942k8230l2342O5812k5459J2591
1415A3415n02k239p1609l085N4634k5390Q9599K779p7024l092j1111j774P6860
1402D1461J20549q2924J8194m392L4282M2681m6883l3625n1415k4331k7698O452
1390g649O3099m8921p937L1686P6208l8906m7262M1184l9771l2678l1358J2581
1378b9724n724K0507R7309j9317n8089M5857N3515j0788p4640K5376m3185N4555
1366E5652j21807k9203R0375k5278j9345m015R824N4153M317J096J601L0504N2823
1353A00697p7840K0238K5322J5349J3547j5864q135m8576K2093j1813k6402m6514
$$ plain form
1439 -49893 39279 106560 69002 28339 77755 101284 32555 -3473 26694 104467 145611 104584
1427 104584 -32671 -5863 19994 73133 77009 27985 21043 -7187 -39529 26283 824 13415
1415 13415 12913 10674 -60935 -64020 -9386 -34776 54823 57602 -19422 -22514 -33625 -35399 41461
1402 41461 162010 79086 97280 92888 127170 169851 122968 89343 37928 13597 -14101 -7649
1390 -7649 55450 6529 -1408 30278 106486 67580 20318 61502 21731 -10947 -42305 -29724
1378 -29724 -35448 -14941 82368 63051 4962 50819 104334 93546 18906 44282 1097 55652
1366 55652 -66155 -95358 -4983 -30261 -49606 -53621 -43797 10356 14673 15769 17370 47874 100697
1353 100697 22857 43095 68417 83766 97313 81449 73314 24738 46831 35018 8616 -37898
1341c7898p396Q8317J4903J7654K1199J6139j17521p657m6595l2983o2157Q9955
1329f4040P7955q5836k9505O4952K9429l3605J21227l110j13194l7380J29586
1318E6479J374p5173J7536O4957o9258L9030N983K5546j7353r1449P2466j9975
1306A0163L702m1600O6544l9344M5291l625j00464P3103J7789K3258J565J00721
1294A57103j52345j5683O4985M3621p6174p9063J04690l7434J0493L6707k5627
1283C1273l0843K5320m4358m59j7731J1100R6039r4612k1401k1592J64120M5722
1271A42578j63003L9766j03r581O7283p4239n3030n4781O9780N8029O953P457
1259C7109L3797J0104j2481m3946q4657K2337J20893j9481m4082j6526j3284r264
$$ plain form
1341 -37898 -45294 43023 57926 75580 96779 112918 -4603 -12260 -58855 -91838 -153995 -64040
1329 -64040 13915 -71921 -101426 -36474 -7045 -40650 80577 77467 -35727 -73107 56479
1318 56479 57853 -17320 216 65173 -4085 34945 40928 66474 49121 -42328 30138 10163
1306 10163 13865 -27735 38809 -535 44756 41131 -59333 13770 31559 54817 56382 157103
1294 157103 4758 -10925 54060 97681 21507 -57556 47134 9700 20193 56900 31273
1283 31273 430 25750 -18608 -19067 -36798 -25698 70341 -24271 -45672 -67264 96856 142578
1271 142578 -20425 19341 19238 9657 76940 2701 -50329 -105110 -35330 22699 29652 37109
1259 37109 70906 81010 68529 24583 -60074 -37737 83156 63675 19593 3067 -10217 -19481
1247a9481O6513j2058m3789J6961M3086K7256j11175j0593K358k3550K2555R971
1235c1946l2398L0660M9274k0657J8789K9279r317q3532k437j8920Q7486k4615
1223h334j775L8488N7501J9280j31061M7431m6654O8219L1926O6624j68689Q0098
1211E3054J0872j00250L2706m4942Q485N2948n0624K194P0480J3095J6325p6763
1199a2420M4747N4083r0222J5540L1304o1610N0097M7796j2168P2798j5022l2916
1187I2007m5493L8492k0115j9174k2131J12660l7573q7470j1221m4878j5240J42783
1175H2647p7699j9219P6697M9608j08895l9879J1205q181L3392r028P3052l8097
1163B5603L9609M0404l9840l1010m7729j67141J70337Q2437o7689j5475n7606
$$ plain form
1247 -19481 47032 34974 -8815 8146 51232 78488 -32687 -43280 -40922 -64472 -41917 -31946
1235 -31946 -64344 -33684 15590 -5067 13722 43001 33684 -49848 -52285 -71205 16281 -8334
1223 -8334 -10109 28379 85880 105160 -25901 21530 -25124 43095 75021 141645 -27044 53054
1211 53054 63926 -36324 -3618 -48560 -40075 12873 -37751 -35557 34923 48018 64343 -12420
1199 -12420 32327 86410 -3812 11728 43032 -18578 31519 79315 67147 139945 124923 92007
1187 92007 46514 85006 64891 45717 23586 136246 98673 11203 -18 -44896 -60136 82647
1175 82647 4948 -14271 62426 112034 3139 -36740 -25535 -33716 -324 -9352 63700 25603
1163 25603 65212 105616 65776 34766 -12963 -180104 -9767 72670 4981 -10494 -68100
1152f8100N3423m3415P4718K7629j19269O2328l415M5048L027n3075J1367M615
1140e119O5338r599o3488j5429K0357j623R831Q9587N0859k2744n9384k6794o7400
1127c5608J06960L9812m5844j40075J8255Q8253N2292o542L7697n3778L430K1635
1115H6487l2551l6303l342R232J7476l1041l5379J2563m2583M9614P7772l2155
1103C9790L8046k8402j3114p5606k6976J20539n3427o5847M7932K6870p369k6661
1091b4225o6363J31696o1404O0600o3620M1511J04742o9526j45146J4168M0984
1080c6583J1626j0776k4046J9708R504N4388j05867K7801N0946K0835m6793L2917
1068C660J0312k6032P776L769K5904P9363N1935l6843j06003J3179l5495P064
$$ plain form
1152 -68100 -14677 -58092 16626 44255 -75014 -12686 -16101 28947 31974 -21101 -9734 -5119
1140 -5119 60219 50620 -12868 -28297 -7940 -9563 268 89855 140714 117970 58586 31792 -35608
1127 -35608 71352 111164 65320 -74755 -56500 31753 84045 77503 115200 61422 64852 86487
1115 86487 53936 17633 14291 23523 40999 9958 -25421 -12858 -55441 -5827 71945 39790
1103 39790 77836 49434 36320 -39286 -66262 54277 850 -64997 -17065 9805 2436 -24225
1091 -24225 -90588 41108 -20296 40304 -23316 18195 122937 53411 -91735 -77567 -36583
1080 -36583 -24957 -35733 -59779 -40071 -30567 23821 -82046 -54245 -3299 17536 -29257 3660
1068 3660 13972 -12060 -4284 -515 25389 104752 156687 119844 13841 27020 -8475 -1411
1056a411J3191J3813j7472q9959l7256J84913l4387j21250J626j465L1641N9027
1044A011J2841l8481K0065k1341k0022n0680Q4413J9862r3615J7289O4032L3542
1032B8916o5466N176O841Q886l3829n912J1987k2473k379L0813Q807J1011k3685
1019d1307j6590O5171n5240K7062j5661M1477k2883p4558P4916R4696o8944l7234
1007b9095R5128M1850m1529L217n1164l5355n2990p066J25L2475m36N5813r3321
994h2348P911J5848K3047R9512j0711n5940k4699J27277l0171l2707M0989p8921
982i13L8684m7415P315N0588o6717M8103P2690J835q9226j00489J5235J9493K1393
969b9424J00095j3073j19727l958J03297r3999n7214K17578n8706J1445J7453
$$ plain form
1056 -1411 11780 25593 8121 -81838 -119094 65819 31432 -89818 -88192 -89657 -58016 1011
1044 1011 13852 -24629 -4564 -25905 -45927 -96607 -12194 7668 -85947 -68658 -4626 28916
1032 28916 -36550 -31374 -24533 -15647 -49476 -55388 -43401 -65874 -68253 -37440 -28633 -17622 -41307
1019 -41307 -57897 7274 -47966 -20904 -36565 4912 -17971 -92529 -17613 77083 8139 -29095
1007 -29095 66033 107883 66354 69571 18407 -16948 -69938 -77004 -76879 -44404 -44840 10973 -82348
994 -82348 -74437 -58589 -35542 63970 53259 -2681 -27380 99897 69726 37019 78008 -913
982 -913 37771 -9644 -2329 48259 -18458 29645 102335 104170 14944 -85545 -70310 -50817 -29424
969 -29424 70671 57598 -62129 -66087 37210 -56789 -114003 103575 44869 56314 73767
958G3767r4725M3156K670n8040N3016N3465l9516K0484l3096j8092O5538k1305
946D7322j5037N1940m7089o2321L1614k9884l0012P3676j5959P1236j38495M7640
934a5369M674k573l9861N3825J9552q5099p063L0522K7166n2501m5320k469J33381
921A8865k1167j5108k3707o6168q08J12184J4374K2143q1299m8228J40394k526
909D8949k6012k4803n153L4445P5321r2045L0209r0788k3584K4724l9339J02227
897A4151n8968K1432M1836p431m4272L4321q1259K4944j3235p3815J04513O3017
885B5234p7351J08565O446m9937Q891n4379O0908K1212L6252j14542R990N0742
873C2031K8862l9565l9863N032M9400O4170n0680j5906k526l4426j74M1168q323
$$ plain form
958 73767 -20958 22198 24868 -33172 19844 73309 33793 54277 21181 3089 68627 47322
946 47322 32285 84225 37136 -25185 6429 -23455 -53467 20209 4250 75486 -63009 -15369
934 -15369 -10695 -13268 -53129 696 20248 -64851 -71914 -41392 -14226 -66727 -112047 -114516 18865
921 18865 -2302 -17410 -41117 -107285 -108093 4091 18465 40608 -40691 -88919 51475 48949
909 48949 22937 -1866 -7019 27426 102747 10702 40911 -49877 -73461 -48737 -88076 14151
897 14151 -44817 -23385 18451 11020 -33252 1069 -80190 -55246 -68481 -142296 -37783 25234
885 25234 -52117 56448 62894 12957 21848 -32531 28377 49589 85841 -28701 -18711 32031
873 32031 60893 21328 -18535 -13503 35897 100067 49387 33481 30955 -3471 -3645 37523 29200
860B9200j1952J2638K2014j8746k281k8620l9451M7420l6050R661J521n1673K5504
847d0815K9713p9749j3599J01279L872J7577J1152l0088m1804J4097N5069l9055
835a2351l5714R185n6156K1177J4737J0607M3794j5154K3543L9733q103r190l3601
822g493J4022M0022o5394K5670l1474l8622j3625M3976P4865j7854r3208M6806
810b2309k8343k9673K1026j06098R7764J7227J0756m6768O209l2693J1469J14649
798A3216m5232n2874M3752j6125j0675l0471m938Q5665N267L0546O207m2623N098
785a3187O535J0543K9168L6816k1510p4720M6797n9912Q0568Q3823L528j20676
773G773j1474N5692k2305l6717m0096Q696k0745o1989N7276M9802j0006L779K0988
$$ plain form
860 29200 17248 29886 51900 33154 30873 2253 -37198 10222 -25828 -16167 -14646 -66319 -40815
847 -40815 -11102 -90851 -104450 -3171 701 18278 29430 -658 -42462 -28365 26704 -12351
835 -12351 -48065 -38880 -95036 -73859 -59122 -48515 -4721 -19875 3668 43401 35298 26108 -7493
822 -7493 6529 46551 -18843 6827 -24647 -63269 -76894 -32918 41947 24093 -69115 -22309
810 -22309 -50652 -80325 -59299 -165397 -67633 -50406 -39650 -86418 -80209 -112902 -101433 13216
798 13216 -32016 -84890 -41138 -57263 -67938 -98409 -103347 -17682 -12415 18131 24338 -18285 -13187
785 -13187 -6652 3891 33059 69875 48365 -26355 20442 -39470 41098 124921 128449 7773
773 7773 -3701 51991 29686 -7031 -47127 -38431 -59176 -121165 -63889 -14087 -24093 -20314 674
760F74K5752o5812Q006K4608K8229j1603R8045p1910r1140m9248p488K2016J0654
747g9217L4180L6833K477j0026N9554j28826J3223J10251k9925Q300P012k5402
735a566p7442j3898O5154p856l3849O2537P9801q817n3707M1647J1973l2655m0410
722i088r213j9717n118J1111j194r3301J13065R9860o0254j18129M9007N4385
710A1414o5588M2217k1971m2890N5212p42r621N2581J0617n1418m9207M2226O4556
697C7386m1333N6742l7385j2393l0473o0164J46681l570j17865N9779O7664n2086
685A2983K5608J0031r8569q3600J24163k6848K7502L4094k0249J342J5759m0279
673a8063J3431j6634M5391n4348K0838l442Q1087o444n0375j2828j10933O1852
$$ plain form
760 674 26426 -39386 -31380 -6772 21457 9854 107899 35989 -55151 -104399 -111887 -89871 -79217
747 -79217 -45037 -8204 -5727 -15753 43801 -85025 -71802 38449 8524 16824 23836 -1566
735 -1566 -79008 -92906 -27752 -35608 -69457 -6920 72881 64064 10357 52004 63977 31322 -9088
722 -9088 -18301 -38018 -43136 -32025 -33219 -126520 -13455 86405 26151 -91978 -42971 11414
710 11414 -54174 -11957 -33928 -76818 -21606 -22348 -31969 20612 31229 -20189 -69396 -27170 37386
697 37386 -3947 52795 15410 3017 -27456 -87620 59061 55491 -62374 -2595 65069 12983
685 12983 38591 48622 -49947 -133547 -9384 -36232 -8730 25364 5115 6457 22216 -18063
673 -18063 -4632 -21266 24125 -30223 -9385 -12827 68260 61816 11441 -1387 -112320 -50468
661e0468J32204k1434j5752m1575j10588N2878Q818j026n8688O8516Q9788K5309
649G7982n9196q22k2997o1586O8654M24j11708N6248L2165M7742j7727j2384o8282
636g1487J05505M3379l3480q283Q953j3098p9453q3649K7303R0640L9653n002
624B0981k1275R994k2053l5285k0998J09314J226q5355O757P0817j2316l678r23
611A7206o707p6791j1065o570Q2060k6045n3266N7195P0872n2164l5894Q3242
599D2073O7939n4258j06825l9130R4484m5427r2270l9425J12462N38N880k486
587e6445O995Q6185l3458j03253K1675L1020o1094k678J14777k6045J3901J1367
575B947k0991J013r2184J54713O3040N06j47404m1079J5443j9837L8756m6261
$$ plain form
661 -50468 81736 60302 44550 2975 -107613 -54735 -45917 -46943 -105631 -37115 52673 77982
649 77982 18786 17964 -5033 -66619 2035 2459 -109249 -53001 -20836 26906 9179 -3205 -71487
636 -71487 34018 77397 43917 35634 44587 31489 -47964 -131613 -104310 -13670 25983 20981
624 20981 -294 9700 -12353 -47638 -68636 40678 41904 -43451 -36694 34123 21807 18129 17206
611 17206 10499 -66292 -77357 -83927 -1867 -27912 -81178 -23983 46889 -5275 -41169 42073
599 42073 110012 55754 -51071 -90201 4283 -41144 -133414 -172839 -60377 -59839 -53959 -56445
587 -56445 -49450 36735 3277 -99976 -78301 -47281 -108375 -111053 3724 -22321 -8420 2947
575 2947 -18044 -17031 -109215 45498 108538 109044 -38360 -79439 -63996 -83833 -45077 -91338
563i1338J06620K4514o9715j6003L4197q8687L4264J03517o9094m5631R628M1445
551b6283k7511M0279J5249o5537L0351O0982p7548l5870n1232Q1623J6847k0100
539e8750K6966J0144l9456j4109o4282M4348N9899J1022m7334l4739O2096N6026
527A1831N8305k2682m8271m9172J1293j5651O0405p15j40080N344O4884n1036
515a15545J9726K7131r407J07907M303n6865n5527J08660o6042l7820j826Q806
503f6499R0707m9338j920l70q0253J1430N552l004q5860M9684K5891N5281K2989
490b5710k967M1576J9979J4028o6405k1899l9638M5853k6921n1778l1179O6062
478g8999K1575J7542K7932o7257J4417K2166l7698j1289r693O8603p0101J06955
$$ plain form
563 -91338 15282 39796 -29919 -45922 -11725 -100412 -66148 37369 -31725 -77356 -67728 -26283
551 -26283 -53794 -13515 1734 -63803 -33452 27530 -50018 -85888 -137120 -55497 -38650 -58750
539 -58750 -31784 -21640 -61096 -75205 -139487 -95139 -35240 -24218 -71552 -106291 -44195 11831
527 11831 70136 47454 -817 -49989 -38696 -54347 6058 5343 -134737 -129393 -64509 -115545
515 -115545 -95819 -68688 -78095 29812 34115 -22750 -78277 30383 -35659 -73479 -75305 -66499
503 -66499 24208 -25130 -27050 -27420 -107673 -96243 -90691 -93695 -179555 -129871 -103980 -48699 -25710
490 -25710 -28677 12899 32878 46906 -19499 -41398 -81036 -35183 -62104 -113882 -145061 -78999
478 -78999 -57424 -39882 -11950 -79207 -64790 -42624 -80322 -91611 -101304 -32701 -102802 4153
466D153J8556n3682R9468m2731o3513K6808k1291l0788J4468J0718l2985K5785
454d5034J37430m8272j20944P8114K3313k2073l3439K9284K937j19524J26719
443H511k2866m1205j0861j5631p831M9952J3555o2628R033J952k1479P247N1412
430d0839O5777l8843l7518k7002k1062R513J7289N2438l2995J3270K8215m536
418a6293j1041P5988o022m1832o9325K2657O7203k42K3670q1770r4552O4735P4916
405H092l9937p3198O663J0414J31639j0509j10529J3931K3615n3541L1550k2307
393h4117M2429m5011L6050J2269N2271n424n424k8827o2676J54536L1187j22475
381b5212K1676o0803k0128N2410J8857m0363M3155j7806m9186J6246N2216K9872
$$ plain form
466 4153 22709 -30973 68495 25764 -37749 -10941 -32232 -63020 -48552 -37834 -70819 -45034
454 -45034 92396 44124 -76820 1294 24607 2534 -30905 -1621 1316 -118208 8511
443 8511 -14355 -55560 -66421 -82052 -89883 -39931 -26376 -89004 -79971 -78019 -99498 -92251 -40839
430 -40839 24938 -13905 -51423 -78425 -99487 -89974 -72685 -20247 -53242 -39972 -11757 -16293
418 -16293 -27334 48654 42632 800 -68525 -45868 21335 21093 44763 -37007 -131559 -66824 8092
405 8092 -31845 -105043 -98380 -87966 43673 33164 -77365 -63434 -39819 -93360 -61810 -84117
393 -84117 -41688 -86699 -50649 -38380 13891 8467 3043 -25784 -88460 66076 97263 -25212
381 -25212 -3536 -64339 -84467 -32057 -13200 -53563 -10408 -28214 -77400 -61154 -8938 20934
369B0934O4605j4805n3845p0773r460N3796J086k273q4462k2191n7279L3815M0420
356a00432q300k0201J44004L1751M2974j08204n388K2215n9025J8505K8738Q1609
344F8246J4165j20635n83k4690p2293O3416M3200j21670o4528Q6071L0432o1983
332a60852R9101K4911R125l1033q4341N4673P3622l9990k478n1518J9719N4657
320c4404j010L0796J24020q2193j2146l1977j1720P360N93j14789L7942n765o7566
307a60859P6984N9474N045p6341J6590L7021k4561K3910M1764M7330o2029k9558
295d5230j4766P102J550k9337k169j2283Q6062r8807M7340N6150j2017N2326n631
282C0290m8657Q3084m0047p7850r576n0907n8981J05040J5821r630N0943J8120
$$ plain form
369 20934 85539 70734 16889 -53884 -63344 -9548 -8462 -10735 -95197 -117388 -174667 -140852 -100432
356 -100432 -108732 -128933 15071 46822 89796 -18408 -23796 -1581 -60606 -42101 -13363 68246
344 68246 82411 -38224 -38807 -63497 -135790 -72374 -29174 -150844 -215372 -129301 -98869 -160852
332 -160852 -61751 -36840 -27715 -58748 -143089 -88416 -14794 -54784 -57262 -108780 -89061 -34404
320 -34404 -35414 -4618 119402 37209 25063 -6914 -18634 -11274 -10681 -125470 -87528 -93293 -160859
307 -160859 -83875 -24401 -19356 -95697 -79107 -42086 -66647 -42737 -973 46357 -15672 -45230
295 -45230 -59996 -52894 -51344 -80681 -82850 -95133 -9071 -107878 -60538 -4388 -16405 35921 30290
282 30290 -18367 64717 24670 -53180 -62756 -113663 -172644 -67604 -51783 -61413 -10470 7650
270G650o1713L4622L9886p2938l3007R1701l6469j02157j6165K1468M7730R0008
258A0616p3278m7662L5804l6084L5909q7959k6069n932N1420Q5576L3420K6936
246B697n5497L4095q320J06082j3422j4818k1519o0246k9994M4488J0286j9550
234b5718j8302o6743K7372J4139N3463J9057N659p0087M5464M6667j3279n1844
222c4152n124N1112q4633m9676M6226k1925L9483J787j09753K6924O1511N9277
210a8943l9295L7610o192p7301J1373J4200L0O1708M4072j6440p7435N4596n5800
197f7817l8811P2649j1526K3618k2594r4549j1351L7429J22435j0226J2553n0581
185c8771k4760J1224M3490j2013q1884N829k7447K0430J07870j00152m8158J13486
$$ plain form
270 7650 -54063 -19441 20445 -52493 -85500 6201 -30268 -132425 -148590 -127122 -79392 10616
258 10616 -62662 -110324 -74520 -110604 -74695 -162654 -188723 -194655 -143235 -57659 -24239 2697
246 2697 -52800 -18705 -27025 79057 65635 50817 29298 -30948 -60942 -16454 -6168 -25718
234 -25718 -44020 -110763 -83391 -69252 -15789 3268 8927 -61160 -15696 30971 17692 -34152
222 -34152 -39276 11836 -72797 -122473 -76247 -98172 -58689 -56902 -166655 -139731 -78220 -18943
210 -18943 -58238 -20628 -26820 -104121 -92748 -78548 -78518 -16810 27262 10822 -66613 -12017 -67817
197 -67817 -106628 -33979 -45505 -21887 -44481 -139030 -150381 -112952 9483 -743 11810 -38771
185 -38771 -63531 -52307 -8817 -20830 -102714 -96885 -124332 -103902 3968 -96184 -144342 -30856
173c0856p948j355N7680k9683q6181J5438p861J18385Q436j19131j3512K4671
161g1917o4842R0423J7415L0562K270M9538j20904p5120J05260o3917N0248P1667
149B0683n0105J6187o9127P8751j0886n2822m1173J1766K3590k4960J2650L9955
137d5491r2482j326R0246N3735m3757m1009J5178K0214M5669j13801K8777K1252
125f2795O133L7305j3510r967k7659m3565j5464k6507p625R2207j030N6695o1888
112g7670m882M9434m2574j8839M7453K7447K1293J4085j1020q4228L2339P218
100c9944m3888p665K9440K1698L4405L3793o9097M5197l4356j6594Q20m869K8942
87b2118M601n8216R6441n6295k6361L2276m5026m1513m5794K3360K30P963O8867
$$ plain form
173 -30856 -38804 -40159 17521 -12162 -98343 -82905 -90766 27619 36055 -83076 -96588 -71917
161 -71917 -136759 -46336 -28921 1641 3911 53449 -67455 -142575 -37315 -101232 -50984 20683
149 20683 -29422 -13235 -82362 -3611 -14497 -67319 -108492 -96726 -73136 -98096 -85446 -45491
137 -45491 -137973 -139299 -49053 4682 -39075 -80084 -64906 -44692 977 -112824 -84047 -62795
125 -62795 -56662 -19357 -32867 -42834 -70493 -114058 -129522 -156029 -163654 -71447 -72477 -15782 -77670
112 -77670 -82552 -33118 -75692 -94531 -47078 -19631 1662 15747 4727 -79501 -47162 -39944
100 -39944 -83832 -91497 -62057 -40359 -5954 27839 -41258 3939 -30417 -47011 -46191 -51060 -22118
87 -22118 -17517 -75733 20708 -35587 -61948 -29672 -74698 -116211 -162005 -138645 -138415 -130452 -61585
74f1585R232L2999n2758m0857j3055Q1497K7110j4846K0219r501o8478l1224K093
61a19154q084R4029r9293j1790K6093N5268M8811j4012j2171o8835P9772j2295
49d1661J7039L7295k2031p0551M7187j0120j5290o4163J344K8682k4744K7118
37h9895o982J8460N3385o112K879J4301j8416R1380p1381o9410O364k1908K1628
24g5707l6728O1351n327l5137K8864l657L1364N481l4891n7522K5522K7020l877
11g3244q317N660l926P7249P904o4439m3651M0837K0016p6707L3432
0h5186
$$ plain form
74 -61585 -52353 -19354 -72112 -112969 -126024 -44527 -17417 -32263 -12044 -21545 -90023 -121247 -119154
61 -119154 -127238 -33209 -132502 -144292 -118199 -62931 -14120 -28132 -40303 -109138 -29366 -41661
49 -41661 -24622 12673 -9358 -79909 -32722 -42842 -58132 -122295 -120951 -92269 -117013 -89895
37 -89895 -96877 -78417 -25032 -31144 -28265 -13964 -32380 59000 -12381 -81791 -75427 -97335 -75707
24 -75707 -112435 -51084 -56411 -91548 -62684 -66341 -34977 -29496 -64387 -121909 -96387 -69367 -73244
11 -73244 -81561 -75901 -79827 -2578 5326 -59113 -102764 -61927 -41911 -118618 -85186
0 -85186
$$ Imaginary data points
##PAGE= N=2
##DATA TABLE= (X++(I..I)), XYDATA
16383c557706R6860M8164J0357O1477M5202O2042N8057o475P3204M0180K7187
16372c041451N0959Q2452O9604N1066M0437l6798L0329N6982O0372L2762L848
16361b599438L4336J06648Q6648M2196Q5063l1336j1490P8608P2752N5819M5354
16350b034840K6697N271O1118O5997L5100R0848K3638p650M5145M6039K8568O9369
16338a544700K2894J24918K6192L9341k5981L4848P7819M3048M3775M6576M7804
16327a063466M7112q956L3078O0424O9106N9840j8321K4153M7416J23277p732
16316f34069j7266N7538Q7180l4058Q0670j1745M0885J25169J2644O3891J2471
16305b16690Q994J06508m9675J9508n4851K0543J32300N8774K2770O5138J11084
$$ plain form
16383 -3557706 -3460846 -3412682 -3402325 -3340848 -3295646 -3233604 -3175547 -3182022 -3108818 -3068638 -3041451
16372 -3041451 -2990492 -2908040 -2838436 -2787370 -2746933 -2783731 -2753402 -2696420 -2636048 -2603286 -2599438
16361 -2599438 -2565102 -2458454 -2371806 -2329610 -2244547 -2275883 -2287373 -2208765 -2136013 -2080194 -2034840
16350 -2034840 -2008143 -2002872 -1941754 -1875757 -1840657 -1749809 -1726171 -1733821 -1688676 -1642637 -1614069 -1544700
16338 -1544700 -1521806 -1396888 -1370696 -1331355 -1357336 -1322488 -1244669 -1201621 -1157846 -1111270 -1063466
16327 -1063466 -1016354 -1025310 -992232 -931808 -862702 -802862 -821183 -797030 -749614 -626337 -634069
16316 -634069 -651335 -593797 -506617 -540675 -460005 -471750 -430865 -305696 -293052 -229161 -216690
16305 -216690 -207696 -101188 -150863 -131355 -186206 -165663 -33363 25411 48181 113319 224403
16294B24403N7927L0297Q354k850O6561J2544J1777O1216P1160n2380k3207L5033
16282E00835Q388J10982L077N49Q3919l598R8015N9708k2825Q9445J327m2155
16270H87667J2636k0490P2805O7784K9610M1637l7045R5231N9919L3282p288M9731
16258A285479k5600O3717M1671M7020K2123Q5671L7703m8704L7115k2899j3441
16247A509855J14544P2348N3987n4180K7554M2924M0799P195N7029N818p8236
16236A799637J04360m2409m3234J21175J08394J0279o4559m0131P802N8985J77632
16225B197931l5039p8837O23J08474R8027J6261q3164n1470k3845J05635M9545
16214B304141L7854j2296O7076j4241n4252L5208L8434k514K6767Q3320L6714
$$ plain form
16294 224403 282330 312627 320981 318131 384692 397236 409013 470229 541389 489009 465802 500835
16282 500835 509223 620205 623282 623831 707750 704152 802167 861875 839050 928495 929822 887667
16270 887667 900303 879813 952618 1020402 1050012 1091649 1054604 1149835 1209754 1243036 1235748 1285479
16258 1285479 1259879 1323596 1365267 1412287 1434410 1520081 1557784 1509080 1546195 1523296 1509855
16247 1509855 1624399 1696747 1750734 1696554 1724108 1767032 1807831 1815026 1872055 1877873 1799637
16236 1799637 1903997 1861588 1818354 1939529 2047923 2058202 1993643 1953512 1961314 2020299 2197931
16225 2197931 2162892 2084055 2084678 2193152 2291179 2307440 2224276 2172806 2148961 2254596 2304141
16214 2304141 2341995 2329699 2396775 2382534 2328282 2363490 2401924 2399410 2426177 2509497 2546211
16203B546211k4446R150L9394k4748n615Q0455P4161N463L1212L2338K444n9583
16191B706436O2148N3266M1221l7819m4270O084J2340K5275n1729K3974N1127
16180B848053r824p3590P6398O6933M915l1771L1279k3153j10722L7361M9185
16169B865064P2473L3360K8615Q286m9845J28203L0565Q07k6906J25J9319o7271
16157C042795k8029L5041K7189M1424P2705n9205k3488J9675M5315n177r658L1160
16145C189747K6032l8043K4045Q8961N116r4486m2818Q4258j3843O9458N7694
16134C356121q7788J4376K577J4256K9071n7034j1283N3589j295M0522m4542K3896
16122C332466N6874j8905k0818M8307N043R7600n3784o7508k8840Q3742L5356
$$ plain form
16203 2546211 2521765 2530915 2570309 2545561 2539946 2620401 2694562 2700025 2731237 2763575 2766019 2706436
16191 2706436 2768584 2821850 2863071 2825252 2780982 2787066 2799406 2824681 2772952 2796926 2848053
16180 2848053 2838229 2764639 2841037 2907970 2912885 2881114 2912393 2889240 2778518 2815879 2865064
16169 2865064 2937537 2970897 2999512 3007798 2957953 3086156 3116721 3117528 3090622 3090747 3110066 3042795
16157 3042795 3014766 3049807 3076996 3118420 3191125 3131920 3108432 3128107 3173422 3168245 3158587 3189747
16145 3189747 3215779 3177736 3201781 3290742 3295858 3201372 3158554 3242812 3228969 3298427 3356121
16134 3356121 3268333 3282709 3285286 3299542 3328613 3271579 3260296 3313885 3312590 3353112 3308570 3332466
16122 3332466 3389340 3370435 3349617 3397924 3402967 3500567 3446783 3379275 3350435 3434177 3469533
16111C469533p9981n4820j073N1638N8699j4494k1843J6279j3867J05535J1201
16100C526807n0988k5313j4841O5845m5816J1659o1891l0694M354R9248K9509
16089C507879o9075K114O3554J8513j4482j1991J9374K7744M6207m0405n7913
16078C491519k1355L9393J0488O3117K2129Q955m0611n707p1345L7963J44955
16067C679501k795q6329Q7039o8692q2988K4276l7053O8358J2302j824J4131L1388
16055C637314o9845p1756L4384Q3480r8673k2288n132J09265k4625M8233L1258
16044C651615J1719n9180O2575r2705p4729n6496N0668m7990J4925k0613N2357
16033C492146J19792K4405o9019J7253j48122J50755Q3879j06189j3849o376M5725
$$ plain form
16111 3469533 3389552 3334732 3333659 3385297 3443996 3429502 3407659 3423938 3410071 3515606 3526807
16100 3526807 3475819 3450506 3435665 3501510 3455694 3467353 3405462 3374768 3379122 3478370 3507879
16089 3507879 3438804 3440918 3504472 3522985 3508503 3496512 3515886 3543630 3589837 3549432 3491519
16078 3491519 3470164 3509557 3520045 3583162 3605291 3614246 3573635 3567928 3496583 3534546 3679501
16067 3679501 3676706 3590377 3677416 3608724 3525736 3550012 3512959 3581317 3593619 3591795 3605926 3637314
16055 3637314 3567469 3495713 3530097 3613577 3514904 3492616 3487484 3596749 3572124 3620357 3651615
16044 3651615 3663334 3604154 3666729 3574024 3499295 3442799 3493467 3445477 3460402 3439789 3492146
16033 3492146 3611938 3636343 3567324 3584577 3436455 3587210 3671089 3564900 3551051 3544675 3590400
16022C590400L7725o5568P807K3210q5066M1466K8678o0390Q2097m5454L4977
16011C589882L0231n5050m2389P0356l9998m3821N9787k4799j1925L5785Q3571
16000C651630j0176p1283k0525L9694j0385O7831m6420k9705k3003K9007n6124
15989C520541P4515M9434o4217l3575j6809K6290q967O4L0508N6905P2167l3564
15977C673292K7980j32440k405K9136R0037n5907r0830j4368P6346O7106j921
15966C666026m772N9429n0222J7256k0921K2638n0135j7192P1622m3875n1639
15955C598215J5625L64M8695N2693N49j6083m0933n9828K8786p855L8717L7461
15943C696406r7602l277P7711N6899j61163n7524Q5871l419q7432j5983L4700
$$ plain form
16022 3590400 3628125 3562557 3570364 3593574 3508508 3549974 3578652 3518262 3600359 3554905 3589882
16011 3589882 3620113 3565063 3522674 3593030 3553032 3509211 3568998 3544199 3532274 3568059 3651630
16000 3651630 3641454 3570171 3549646 3589340 3578955 3646786 3600366 3570661 3547658 3576665 3520541
15989 3520541 3595056 3644490 3580273 3546698 3529889 3556179 3547212 3547276 3577784 3634689 3706856 3673292
15977 3673292 3701272 3568832 3566427 3595563 3685600 3629693 3538863 3524495 3600841 3667947 3666026
15966 3666026 3661254 3720683 3670461 3687717 3666796 3689434 3639299 3622107 3693729 3649854 3598215
15955 3598215 3613840 3614204 3662899 3715592 3716141 3700058 3659125 3599297 3628083 3620228 3658945 3696406
15943 3696406 3598804 3595527 3673238 3730137 3568974 3511450 3597321 3593902 3506470 3490487 3525187
15932C525187n1643P9270J1976O3023L9092n3844r3342P280j8360O0310J04020
15921C672969j8628l1548M2612o124j9892r3754K9332L4053K9007m4653k1969
15910C571405O577k3851L5569Q92j9139O0449k9557j36488O3841K0229J09299
15899C659226m8147l1758m0975L7513P6819l7719m4090N9234P0361l9159o8156
15888C593149K4153K1603P1368k3319n8200K9525l1783M0407N081o4182J6009
15877C623811R66k6784j8480O7904J2784p2794J2302k2811m5257R0014k9763N4104
15865C645996m2121j9149j2707o520L0277M5504P9013m4715q019q2404j9488M2279
15853C607946K290K6278l6609Q3822p401j6278J2520N363j8798N9921M100m8281
$$ plain form
15932 3525187 3473544 3552814 3564790 3627813 3666905 3613061 3519719 3526999 3508639 3568949 3672969
15921 3672969 3654341 3622793 3665405 3659281 3639389 3545635 3574967 3609020 3638027 3593374 3571405
15910 3571405 3577982 3554131 3589700 3590592 3571453 3631902 3602345 3465857 3529698 3549927 3659226
15899 3659226 3611079 3579321 3538346 3575859 3652678 3614959 3570869 3630103 3700464 3661305 3593149
15888 3593149 3617302 3638905 3710273 3686954 3628754 3658279 3626496 3666903 3671984 3607802 3623811
15877 3623811 3624777 3597993 3579513 3647417 3660201 3587407 3599709 3576898 3531641 3621655 3591892 3645996
15865 3645996 3603875 3584726 3572019 3565499 3595776 3641280 3720293 3675578 3667559 3585155 3565667 3607946
15853 3607946 3610236 3636514 3599905 3683727 3676326 3660048 3672568 3677931 3659133 3719054 3723154 3674873
15841C674873j04588K0020L1678k9526L5535J38070j9544n7283R492J7351K3529
15830C739607n5945q1643N6907K7339N5091k3160l7070O7766l2799m7792j5241
15819C653060J424P50l4052O1033O3133p2959K8971J8981k1642n7008N5743N6144
15807C753578r2687L4192j196O0893p023q5297p8361o8487N6638M5736P6279N949
$$ plain form
15841 3674873 3570285 3590305 3621983 3592457 3627992 3766062 3746518 3689235 3698727 3716078 3739607
15830 3739607 3683662 3602019 3658926 3686265 3741356 3718196 3681126 3748892 3716093 3668301 3653060
15819 3653060 3654484 3655234 3621182 3682215 3745348 3672389 3701360 3720341 3698699 3641691 3697434 3753578
15807 3753578 3660891 3695083 3693887 3754780 3747757 3662460 3584099 3515612 3572250 3617986 3694265 3700214
$$ [...]
##END NTUPLES=NMR SPECTRUM
##END=
