##TITLE=1H_CG-1148-D2
 CDCl3, 8 sc, 
 9.07.2021
##JCAMPDX= 6.0         $$ Bruker NMR JCAMP-DX V2.0
##DATA TYPE= NMR SPECTRUM
##DATA CLASS= NTUPLES
##ORIGIN= UXNMR, Bruker Analytische Messtechnik GmbH
##OWNER= root
$$ XWIN-NMR		Version 3.5
$$ Fri Jul  9 12:23:11 2021 Russian Standard Time (UT+4h)  she@DPX200
##.OBSERVE FREQUENCY= 200.131506
##.OBSERVE NUCLEUS= ^1H
##.ACQUISITION MODE= SIMULTANEOUS
##.ACQUISITION SCHEME= undefined
##.AVERAGES= 8
##.DIGITISER RES= 18
##SPECTROMETER/DATA SYSTEM= spect
##.PULSE SEQUENCE= zg30
##.SOLVENT NAME= CDCl3
##.SHIFT REFERENCE= (INTERNAL, CDCl3, 0, 17.5154)
##AUDIT TRAIL= $$ (NUMBER, WHEN, WHO, WHERE, WHAT)
$$ ##TITLE= Audit trail, XWIN-NMR		Version 3.5
$$ ##JCAMPDX= 5.01
$$ ##ORIGIN= Bruker BioSpin GmbH
$$ ##OWNER= she
$$ F:/spectra/data/she/nmr/H-F/1/pdata/1/auditp.txt
$$ ##AUDIT TRAIL=  $$ (NUMBER, WHEN, WHO, WHERE, WHAT)
(   1,<2021-07-09 12:21:02.50 +0400>,<she>,<DPX200>,
      <created by zg, POWCHK disabled, PULCHK disabled
       configuration hash MD5:
       00 E9 B6 7A A2 85 ED C7 34 08 36 98 17 FE 4E 26
       data hash MD5: 16K
       4B E2 96 88 AF 21 F5 B5 A9 5B 16 CC 22 0A 3F B0>)
(   2,<2021-07-09 12:21:05.50 +0400>,<she>,<DPX200>,
      <Start of raw data processing
       efp BC_mod = 2 LB = 0.24 FT_mod = 6 PKNL = 1 PHC0 = -12277.43 PHC1 = 13.40101 SI = 16K 
       data hash MD5: 16K
       C7 11 8F 0A EF 83 9F 95 A9 29 EE 6E 98 91 A0 D8>)
(   3,<2021-07-09 12:21:26.42 +0400>,<she>,<DPX200>,
      <pk PHC0 = 0.4338341 PHC1 = 0.5999999 
       data hash MD5: 16K
       34 E6 F6 AD 7B 63 BF 18 58 E6 FC 6A BC AD 57 D6>)
(   4,<2021-07-09 12:21:29.92 +0400>,<she>,<DPX200>,
      <abs ABSG = 5 
       data hash MD5: 16K
       36 7F A9 90 BD 4A 65 86 6D 45 D4 BE C8 A3 5B E0>)
$$ ##END=
$$ 
$$ hash MD5
$$ FE 3F F2 05 50 0F 32 24 76 15 82 03 AB E6 10 AB
##$RELAX= 
##$RELAX= 
##$RELAX= 
##$RELAX= 
##$RELAX= 
##$RELAX= 
$$ Bruker specific parameters
$$ --------------------------
##$DU= <F:/spectra>
##$EXPNO= 1
##$NAME= <H-F>
##$PROCNO= 1
##$TYPE= <nmr>
##$USER= <she>
##$AMP= (0..31)
100 100 100 100 100 100 100 100 100 100 100 100 100 100 100 100 100 100 
100 100 100 100 100 100 100 100 100 100 100 100 100 100 
##$AQSEQ= 0
##$AQ_mod= 1
##$AUNM= <au_zg>
##$AUTOPOS= <>
##$BF1= 200.13
##$BF2= 200.13
##$BF3= 200.13
##$BF4= 200.13
##$BF5= 200.13
##$BF6= 200.13
##$BF7= 200.13
##$BF8= 200.13
##$BYTORDA= 1
##$CFDGTYP= 0
##$CFRGTYP= 5
##$CHEMSTR= <none>
##$CNST= (0..31)
1 1 145 1 1 1 1 1 1 1 1 1 1 1 1 1 1 1 1 1 1 1 1 1 1 1 1 1 1 1 1 1 
##$CPDPRG= <>
##$CPDPRG1= <>
##$CPDPRG2= <>
##$CPDPRG3= <>
##$CPDPRG4= <mlev>
##$CPDPRG5= <mlev>
##$CPDPRG6= <mlev>
##$CPDPRG7= <mlev>
##$CPDPRG8= <mlev>
##$CPDPRGB= <>
##$CPDPRGT= <>
##$D= (0..31)
0 1.2 0 0 0 0 0 0 0 0.06 0 0.03 0 0 0 0 0.0002 0 0 0 0 0 0 0 0 0 0 0 0 
0 0 0 
##$DATE= 1625818861
##$DBL= (0..7)
120 120 120 120 120 120 120 120 
##$DBP= (0..7)
150 150 150 150 150 150 150 150 
##$DBP07= 0
##$DBPNAM0= <>
##$DBPNAM1= <>
##$DBPNAM2= <>
##$DBPNAM3= <>
##$DBPNAM4= <>
$$ [...]
##$SUBNAM3= <"">
##$SUBNAM4= <"">
##$SUBNAM5= <"">
##$SUBNAM6= <"">
##$SUBNAM7= <"">
##$SUBNAM8= <"">
##$SUBNAM9= <"">
##$SW= 20.0188882624521
##$SWIBOX= (0..15)
0 0 2 0 0 0 0 0 0 0 0 0 0 0 0 0 
##$SW_h= 4006.41025641026
##$TD= 16384
##$TD0= 1
##$TE= 0
##$TE2= 300
##$TE3= 300
##$TEG= 300
##$TL= (0..7)
0 120 120 120 120 120 120 120 
##$TP= (0..7)
150 150 150 150 150 150 150 150 
##$TP07= 0
##$TPNAME0= <>
##$TPNAME1= <>
##$TPNAME2= <>
##$TPNAME3= <>
##$TPNAME4= <>
##$TPNAME5= <>
##$TPNAME6= <>
##$TPNAME7= <>
##$TPOAL= (0..7)
0.5 0.5 0.5 0.5 0.5 0.5 0.5 0.5 
##$TPOFFS= (0..7)
0 0 0 0 0 0 0 0 
##$TUNHIN= 0
##$TUNHOUT= 0
##$TUNXOUT= 0
##$USERA1= <user>
##$USERA2= <user>
##$USERA3= <user>
##$USERA4= <user>
##$USERA5= <user>
##$V9= 5
##$VALIST= <valist>
##$VCLIST= <CCCCCCCCCCCCCCC>
##$VD= 0
##$VDLIST= <DDDDDDDDDDDDDDD>
##$VPLIST= <PPPPPPPPPPPPPPP>
##$VTLIST= <TTTTTTTTTTTTTTT>
##$WBST= 1024
##$WBSW= 4
##$XGAIN= (0..3)
0 0 0 0 
##$XL= 0
##$YL= 0
##$YMAX_a= 265917
##$YMIN_a= -428967
##$ZGOPTNS= <>
##$ZL1= 120
##$ZL2= 120
##$ZL3= 120
##$ZL4= 120
##$ABSF1= 17.51421
##$ABSF2= -2.504829
##$ABSG= 5
##$ABSL= 3
##$ALPHA= 0
##$AQORDER= 0
##$ASSFAC= 0
##$ASSFACI= 0
##$ASSFACX= 0
##$ASSWID= 0
##$AUNMP= <proc_1d>
##$AZFE= 0.1
##$AZFW= 0.1
##$BCFW= 0
##$BC_mod= 2
##$BYTORDP= 0
##$COROFFS= 0
##$CY= -3
##$DATMOD= 1
##$DC= 0
##$DFILT= <>
##$DTYPP= 0
##$F1P= 0
##$F2P= 0
##$FCOR= 1
##$FTSIZE= 16384
##$FT_mod= 6
##$GAMMA= 0
##$GB= 0
##$INTBC= 1
##$INTSCL= 1.334414e-10
##$ISEN= 128
##$LB= 0.24
##$LEV0= 0
##$LPBIN= 0
##$MAXI= 10000
##$MC2= 0
##$MEAN= 0
##$ME_mod= 0
##$MI= 1.114404
##$NCOEF= 0
##$NC_proc= -7
##$NLEV= 6
##$NOISF1= 3.799351
##$NOISF2= 2.8
##$NSP= 0
##$NTH_PI= 0
##$NZP= 0
##$OFFSET= 17.51544
##$PC= 1
##$PHC0= -12277
##$PHC1= 14.00101
##$PH_mod= 1
##$PKNL= yes
##$PPARMOD= 0
##$PSCAL= 0
##$PSIGN= 0
##$REVERSE= no
##$SF= 200.13000384042
##$SI= 16384
##$SIGF1= 3
##$SIGF2= 2
##$SINO= 5.538805
##$SIOLD= 16384
##$SREGLST= <1H.CDCl3>
##$SSB= 0
##$STSI= 16384
##$STSR= 0
##$SW_p= 4006.41025641026
##$SYMM= 0
##$S_DEV= 0
##$TDeff= 16384
##$TDoff= 0
##$TI= <>
##$TILT= no
##$TM1= 0
##$TM2= 0
##$TOPLEV= 0
##$USERP1= <user>
##$USERP2= <user>
##$USERP3= <user>
##$USERP4= <user>
##$USERP5= <user>
##$WDW= 1
##$XDIM= 16384
##$YMAX_p= 377209761
##$YMIN_p= -479461
$$ End of Bruker specific parameters
$$ ---------------------------------
##NTUPLES= NMR SPECTRUM
##VAR_NAME=  FREQUENCY,     SPECTRUM/REAL,   SPECTRUM/IMAG
##SYMBOL=    X,             R,               I
##VAR_TYPE=  INDEPENDENT,   DEPENDENT,       DEPENDENT
##VAR_FORM=  AFFN,          ASDF,            ASDF
##VAR_DIM=   16384,         16384,           16384
##UNITS=     HZ,            ARBITRARY UNITS, ARBITRARY UNITS
##FACTOR=    0.24454680195387, 1,            1
##FIRST=     3505.3650719015, 0,             0
##LAST=      -501.045184508757, 0,           0
##MIN=       -501.045184508757, -479461,     0
##MAX=       3505.3650719015, 377209761,     0
$$ Real data points
##PAGE= N=1
##DATA TABLE= (X++(R..R)), XYDATA
$$ [...]
7650 19850831 19321959 19032567 18749642 18685790 18690095 18857978 19273073 19582808 19875411 19737953
7640 19737953 19922374 20146376 20424790 20774292 21053115 21673758 22139476 22929450 23529367
7631 23529367 23493194 23000059 22143139 21195157 20142315 19299607 18896661 18712973 18656241 18924758
7621 18924758 19012868 18678402 17868318 16955660 16243141 15611319 15179008 15003349 14721231 14817407
7611 14817407 14949528 15119666 15464741 15941365 16339601 16632261 16796165 16797606 16405884 15804604
7601 15804604 15304928 14909217 14518717 14087664 14102339 13691684 13187895 12827158 12332202 11543101
7591 11543101 10905544 10258167 9644030 8973348 8585203 8074120 7706810 7570268 7279745
7582 7279745 6936630 6896665 6839792 6867421 6928427 7049762 6994654 6947625 7049555 7033823 7207347
7571 7207347 7396712 7693483 7796738 7901144 7669732 7449367 7295470 7015804 6657581 6497480
7561 6497480 6411922 6228195 6327731 6023303 5725597 5592323 5343144 5084305 4575808 4043591
7551 4043591 3779435 3465413 3384962 3279918 3189666 2896700 2894753 2926373 2660379 2538544
7541 2538544 2546488 2560773 2548807 2424015 2376875 2177086 2106784 2174585 1954675 1930909 1837542
7530 1837542 1752113 1717686 1741387 1625702 1681806 1718929 1633584 1563449 1491585 1502907 1523526
7519 1523526 1453853 1350078 1169325 1164487 1316639 1392523 1318501 1218610 1246866 1132205 1251303
7508 1251303 1178281 1022934 1208372 1195265 1153138 1136832 1082710 1085010 1065326 1088414 965339
7497 965339 916436 1000064 1107577 1134442 1094064 1110442 1091677 897944 1091134 1176053 1042957
7486 1042957 922654 890458 848707 842057 962552 908280 918611 858331 876275 1051251 1100109
7475 1100109 920819 899472 766521 616136 770945 757603 840965 904257 770167 727576
7465 727576 701085 833812 949774 961112 726669 809656 774884 834192 858272 979691 837775
7454 837775 875760 1043698 1002714 869218 678496 609014 660966 766860 851902 713693 535008
7443 535008 642099 632002 697051 804747 912009 926985 688122 1008787 1114077 1156957
7433 1156957 1361070 1233789 1201288 1179160 1264959 1384700 1350339 1280173 1355166 1091578 915759
7422 915759 863340 1025535 952740 765544 953772 974059 820413 698481 650037 537541
7412 537541 717237 721674 708100 681984 588658 721453 676392 536450 611838 642070 512320
7401 512320 585047 696592 666306 633969 798959 817490 758688 772616 478062 655741 743717
7390 743717 540391 642570 542213 528067 515157 402784 509891 620595 673423 527805
7380 527805 356559 231931 483205 614742 465593 435702 376662 451358 499928 449558 439974
7369 439974 270696 166465 330680 388281 497492 348741 321804 467547 431976 272879
7359 272879 344662 343980 449212 237460 216558 75291 173597 239618 232004 480789 415140
7348 415140 253688 226008 315966 313640 223941 333252 330359 341930 364853 367150 365404 477201
7336 477201 320789 417948 587925 576232 354368 354964 396229 226957 254106 144744 146281
7325 146281 154553 39719 182092 167825 210190 369636 151636 300242 346080 55358 109789
7314 109789 324316 432516 383207 376438 342958 117738 48083 64330 262301 -61744 25679
7303 25679 127256 6125 -106392 58506 182687 75637 108662 1592 324987 394362
7293 394362 132320 -43255 -54553 45473 -21884 144526 88089 111624 101737 154607 186164
7282 186164 152259 62911 22288 24109 86612 95931 -59273 103783 98628 186401 308042 242511
7270 242511 146274 117870 5865 -90942 201166 105122 84007 -113712 -272831 -173771 -221206
7259 -221206 -179929 13043 170945 132613 -74976 -40887 -57040 -40035 179259 167307 86234
7248 86234 35034 -142917 -109331 108050 112678 -56315 -76030 104188 180638 130420 177848
7237 177848 245535 138001 -69103 -9733 52848 90356 123482 -19537 3849 87768 162659
7226 162659 122806 62594 -71735 -88401 127905 25145 10697 -54456 -30106 26724 34446
7215 34446 200197 85030 -100968 -118731 -150281 -75054 93681 -14842 -142722 -23110
7205 -23110 -138294 -239153 -258667 -205707 -139918 -226136 -139703 -219722 -86278 55766 298269
7194 298269 95783 -145332 -81539 65262 -54710 -127611 -108891 -113083 -157404 -190755 30466
7183 30466 1308 -12696 138791 220006 5030 -129145 -76533 -124554 -99230 -224609 -276454
7172 -276454 -231140 -126348 14039 137012 -99884 -225882 -273253 -128405 -51486 26899
7162 26899 -80590 159987 165561 -46918 -103066 -86571 -7302 13155 126202 53063 14081
7151 14081 67834 -22463 -155644 -40743 42376 -178712 -76645 70887 -43397 27838 -82038
7140 -82038 69360 137823 229695 167070 152247 231825 36050 -85772 -71609 -84526 -20350
7129 -20350 -17252 -36374 -99064 -253432 -234424 -159470 -158813 -59135 -134297 -160084 -16196 -47980
7117 -47980 -99138 -11033 66717 8076 -262199 -183936 -203102 -120760 148130 244252 310474
7106 310474 270784 210712 91139 17478 188909 286219 49097 77464 252441 284986 360081
7095 360081 35898 -62740 -93696 -147898 -16522 13137 -40933 -98516 -98123 -114906 -126605 -72410
7083 -72410 -10702 68543 -49872 -175947 -147459 -158590 -131519 -102746 -153129 -35955 -113529
7072 -113529 -34634 62654 132432 -29780 -209366 -84076 -31068 93842 114002 205984 69646
7061 69646 -143897 -36106 183337 63813 -92834 -29884 162916 369495 413408 316581
7051 316581 241340 180546 261426 221136 257518 348435 243520 156849 163844 113895 49745 225574
7039 225574 356725 505389 389688 240807 205784 241720 549527 540826 392264 179318
7029 179318 493813 569735 477509 442823 375826 464217 499507 404225 359903 377907 362705
7018 362705 341996 267722 352949 482670 596115 478980 347148 321906 413852 357122 267444
7007 267444 263685 300606 207401 107868 127202 290041 226325 168643 91099 197711 277057
6996 277057 253687 181796 136452 274721 287720 50329 14408 -13565 -3090 82797 191222
6985 191222 255732 75355 196791 46966 -9246 65738 154612 134939 153644 34974 -62314
6974 -62314 65741 146857 101570 244462 261450 232137 90902 36512 207399 29695 18380
6963 18380 118966 7257 -5682 -4713 45349 -2537 -59503 -18747 41802 24390 73101 7902
6951 7902 -125049 -89919 -57201 111787 44402 -116475 -128431 -72079 -42621 -67938 -69738 4255
6939 4255 49678 -134183 86241 113299 -48582 -23336 -25701 71545 121262 -140688 -122476
6928 -122476 -58958 -93883 127015 199883 244719 92668 150680 124680 95188 60143 174460
6917 174460 143633 104929 38346 98963 113008 -56796 41220 19855 189539 -7862 -83262
6906 -83262 -187088 -205981 -34151 27427 155240 155431 78681 100527 57253 16942 73435 -51734
6894 -51734 -128204 -15740 2338 133918 37201 -74837 123217 34260 6454 -18026 144102
6883 144102 168748 42143 74021 153190 6663 17856 3673 143151 122164 229870 -969
6872 -969 -169963 14922 20778 43716 -2946 -201179 -120251 -14701 25704 219045 93907
6861 93907 -99010 -42854 15663 99549 -98184 -93239 132151 286833 250091 246731 245277 104736
6849 104736 -38568 -166418 95229 73240 235272 305278 204398 35321 21812 72160
6839 72160 21551 80860 97397 196130 180042 293063 169128 145799 378561 225480 212050
6828 212050 213431 272208 313448 171075 221355 198693 47057 75644 64952 70754 63236 380
6816 380 16848 65707 -100405 142342 253163 138915 97613 143273 237236 42042 202869
6805 202869 90607 -66731 178924 95422 96286 244609 305023 56667 147397 240226 313144
6794 313144 218590 130554 153804 77708 -42586 118896 -11849 -6515 52625 321432 364651
6783 364651 151704 150483 104929 111595 70806 99496 -4133 54151 152337 226087 236240 315880
6771 315880 214149 122444 214363 233104 86815 98454 187552 256606 151268 -5029 -28098
6760 -28098 -44772 49011 263503 274396 187592 51841 264450 170187 65536 -31423 -4746
6749 -4746 -114944 56764 225798 2677 2582 13492 148455 111909 145815 207630 94264
6738 94264 39962 43277 -39130 -18085 113919 244907 236287 423027 269349 183434 77772
6727 77772 259545 454623 128213 188351 225010 253605 99693 206058 402703 321546 319605
6716 319605 365132 377282 209975 260090 278504 126082 334305 417740 286026 86127 405422
6705 405422 386307 219389 248020 397956 397905 286878 328212 375350 389759 472576 372803 393011
6693 393011 358160 154068 375015 356206 243518 236816 179924 289231 267493 187050 212268
6682 212268 226334 171538 235400 274854 241834 389163 376246 244472 183340 411227 230340
6671 230340 269176 364028 331137 491108 427045 287137 219246 386480 527079 494878 568604
6660 568604 571823 549174 552136 681544 504414 344201 422953 364998 263448 355133 365264
6649 365264 222228 262247 394441 401272 333899 233602 152285 300241 409189 394911 393946
6638 393946 466028 335795 90467 189278 325284 446704 336509 396889 334418 509230
6628 509230 446199 389487 446593 353134 437762 421606 282461 325885 488686 440688 449166
6617 449166 472453 474615 454487 597354 703225 691211 663295 434240 416955 218521 135094
6606 135094 276857 305396 296829 290289 294675 199028 387022 422853 282922 218984 246287 321568
6594 321568 289286 386726 424500 268654 78768 197253 372658 364375 376800 190720 243085
6583 243085 401182 336522 172305 249446 225191 330918 288709 412007 419357 494100 196957
6572 196957 40354 278432 191748 179813 267950 189983 291400 387200 407576 230897 224880
6561 224880 279427 279039 331781 307011 236110 184631 216244 328726 576324 514325 358377
6550 358377 332954 406749 404193 300539 238845 291979 344168 266236 346066 372181 386421 336096
6538 336096 378056 425854 401053 469789 369182 317544 189045 236153 389221 406444 229874
6527 229874 315568 492581 427063 484012 447387 585865 757520 735392 664088 520672 538521
6516 538521 613134 776163 783799 614964 375074 465178 472543 351801 240435 194246 150617
6505 150617 174384 311256 268655 247410 432469 524412 462231 366098 408535 441706 505512
6494 505512 681457 594845 512195 732282 505104 479363 517477 380893 349966 352181 560982
6483 560982 740936 795255 578798 559415 567459 723786 828829 765097 778446 511355 592740
6472 592740 651085 576982 578508 674974 692621 717387 703579 591449 505907 621788 589701
6461 589701 485871 500884 618613 566181 454776 551411 437149 292870 315175 363461 441054
6450 441054 471428 524200 677253 575849 492598 515109 537662 593365 542509 507178 550584
6439 550584 408595 343428 487747 503502 505137 579803 370833 398468 459958 686492 552659
6428 552659 617453 713527 446990 275776 90717 121424 233694 252532 307945 226084 232222
6417 232222 440041 570922 625347 583935 566574 421391 253827 238011 326097 383957 295949
6406 295949 281469 440836 486429 553022 655565 651995 610023 625292 501195 381220 231573
6395 231573 453900 372717 519649 554186 501838 530192 488635 505096 387388 469708 460573
6384 460573 467504 223266 324910 238750 358823 379520 441299 317975 325203 508607 568281
6373 568281 522038 503266 444761 391396 350505 493008 551506 453226 298051 174277 346946
6362 346946 492851 515198 640096 667494 559307 679655 749871 685913 496190 545648 490063
6351 490063 552353 665987 688958 562187 582428 496107 620123 725031 719116 654529 543102
6340 543102 364312 367003 511981 502025 310312 303988 489802 646652 533995 518972 823160
6329 823160 540260 478483 418838 562787 565166 449354 530477 612908 695449 532093 397656
6318 397656 544432 502744 603283 624929 746752 780589 407619 492644 544079 521351 352601
6307 352601 348774 381725 379185 401305 438536 319744 393963 390715 487530 434683 357087 429727
6295 429727 503827 467123 501376 477980 421147 485457 387326 489909 464144 497966 471550
6284 471550 341676 417222 394041 400252 412608 488808 690021 605986 660628 762736 758835
6273 758835 816169 787691 624400 654007 720095 590985 649732 596795 557885 565163 798890
6262 798890 648498 559173 551025 590708 598480 471026 684498 706441 632215 569321 638659
6251 638659 455869 647251 570068 503881 499826 750603 657645 556939 931244 874472 904828
6240 904828 818358 720742 515056 536057 679494 637675 758064 750102 768560 922594 901057
6229 901057 710686 738073 874611 711180 775012 886920 917742 859362 689358 891043
6219 891043 1119045 959620 804061 721886 808064 946422 882910 841037 836132 691275 817360
6208 817360 969589 771665 731430 866058 878208 825354 1032356 1071618 941118 962520 924557
6197 924557 821767 939221 838322 840583 947459 854770 948075 909922 988716 827707 868167
6186 868167 794475 822568 794918 789921 847941 654170 563846 587904 788281 787745 1001084 978124
6174 978124 815029 789486 881175 885353 698433 608825 758963 877694 847664 895798 849610
6163 849610 837976 862393 811476 787699 820976 977369 858223 847126 920425 861755 914737
6152 914737 980106 922628 730397 822827 979090 948660 982765 906268 822580 874287 902240
6141 902240 747398 768494 868488 1024103 949485 755427 618971 796117 834190 917903 765667
6130 765667 614837 914809 904042 771210 846688 1029815 855190 951583 912448 815398 921009
6119 921009 838463 904956 854799 1162922 1100011 901713 960287 903934 715471 643328 835588
6108 835588 1063172 1144818 1184630 1074489 1049156 978942 919573 904636 817641 817833 857253 831622
6096 831622 750489 897523 1003540 899203 1032861 1180925 961955 1161549 1056616 1089034
6086 1089034 1023561 1006433 1030248 947437 869259 1065288 1077268 1029740 913113 1046567 894677
6075 894677 1016483 1192055 1115013 997622 1054340 1182506 1062413 1221769 1339297 1168577
6065 1168577 968273 1135012 1105403 1121213 936596 992027 1213444 1171115 1179283 1140714 1126070
6054 1126070 1150427 1056337 1182134 1293248 1277328 1369438 1277534 1176444 1373939 1446105 1315581
6043 1315581 1342691 1267376 1152634 1137790 1272561 1333360 1313747 1310876 1375218 1580046 1682702
6032 1682702 1527899 1467347 1463981 1401966 1561363 1581925 1442769 1507018 1567278 1355319 1441467
6021 1441467 1481380 1414691 1663382 1566799 1587821 1408755 1332677 1418993 1375798 1443789 1533390
6010 1533390 1525459 1510165 1611030 1552564 1583653 1630929 1766476 1649286 1551091 1564243 1488941
5999 1488941 1591619 1596569 1570260 1706736 1676043 1750804 1739098 1530353 1621231 1723650 1798387
5988 1798387 1925972 1882102 1684774 1602199 1753296 1893369 2046261 2081810 2204923 2099564
5978 2099564 2154823 2164408 1954935 2044693 2111969 2267764 2191919 2253388 2414924 2279605 2308934
5967 2308934 2131973 2188713 2393209 2588090 2568122 2568587 2501410 2507543 2437700 2662490 2502470
5956 2502470 2485680 2311220 2120163 2379553 2237535 2258417 2323870 2344237 2346516 2393796 2520840
5945 2520840 2494884 2427143 2429825 2530496 2689327 2533656 2357970 2418622 2472041 2542024 2333887
5934 2333887 2410234 2273447 2348963 2560667 2449673 2449943 2292963 2254297 2382400 2566334 2527942
5923 2527942 2534358 2389329 2385775 2538305 2545775 2717805 2885755 2657477 2796026 2923178 3021467
5912 3021467 2842072 2861916 2911863 2941271 2821082 2787602 2900568 2804064 2652743 2745031 2861228
5901 2861228 2781682 2821859 2905764 2706838 2570022 2546487 2548693 2631542 2800897 2733989 2857004
5890 2857004 2660229 2784137 2944395 2964277 3119851 3043725 2986511 2972331 2991929 3012172 3242087
5879 3242087 3103360 3119963 3109679 3065353 3252598 3124213 3078077 3088553 3230382 3320248 3339398
5868 3339398 3265055 3218565 3253879 3307317 3407138 3320183 3294593 3319858 3464889 3376965 3343992
5857 3343992 3308187 3323573 3363556 3353420 3336080 3352999 3315272 3465996 3610365 3816745 3839085
5846 3839085 3588856 3458294 3545480 3543031 3660177 3741529 3619063 3720657 3637614 3685445 3718962
5835 3718962 3591614 3733751 3857055 3830966 3758611 3779569 3596026 3666163 3741516 3835709 3952402
5824 3952402 3925431 3972588 4042706 3925344 3751238 3823707 3891991 3934195 4010976 4116304 4042872
5813 4042872 4011766 4106190 3979437 3784098 3912142 4208817 4127592 4092738 4200295 4071736
5803 4071736 4222485 4216731 4185150 4161143 4219476 4293101 4486167 4621009 4367215 4435186 4532875
5792 4532875 4525967 4380635 4602088 4740504 4720774 4778532 4824073 4956546 4705878 4978896
5782 4978896 4902638 4988522 5264714 5258121 5229600 5206935 5191571 5131795 5151208 5212085 5303976
5771 5303976 5281540 5341962 5554388 5630140 5503258 5625069 5620642 5716035 5957885 6160247 6150252
5760 6150252 6071837 6282683 6597638 6519961 6599998 6742714 6708844 6696884 6911201 7179656
5750 7179656 7113850 7237048 7264420 7344261 7478423 7382422 7392367 7355396 7247242 7233707 7252309
5739 7252309 7304976 7325413 7349336 7360399 7307321 7641860 7548389 7450966 7416779 7251331 7344433
5728 7344433 7230586 7080928 7274909 7433653 7397745 7317340 7379827 7541822 7634365 7638222 7813935
5717 7813935 7769256 7678591 7551691 7529467 7639682 7733055 7840386 7838841 7816955 7951007 8067378
5706 8067378 7951521 7926790 8323682 8257924 8078006 8164560 8349344 8431421 8502994 8679659
5696 8679659 8680525 8686491 8565105 8662275 8620343 8784191 8941149 9211451 9214978 9180330 9199457
5685 9199457 9211071 9215145 9317038 9249561 9151509 9379182 9521335 9700787 9849077 9870733 9821484
5674 9821484 9779740 9796647 9933337 10162210 10210945 10276745 10387398 10426900 10108360 10352366
5664 10352366 10405038 10445435 10632683 10734248 10899671 11030645 11030517 11074252 11028237 11154198 11383049
5653 11383049 11528521 11650493 11579686 11684851 11919844 11972804 11870865 11854129 12048195 12205291
5643 12205291 12192884 12388177 12264802 12365162 12637946 12645253 12673449 12699623 12850113 13055227
5633 13055227 13131820 13108433 13109695 13114433 13321513 13572564 13602039 13552500 13778330 13979817 14058546
5622 14058546 14225271 14104522 14332407 14416204 14477339 14548710 14560693 14754817 14726284 14689074
5612 14689074 14772005 14914065 15168035 15134078 15283664 15401558 15431979 15484378 15808085 15820462
5602 15820462 15811248 16072229 16181321 16130199 16259057 16265628 16506460 16451786 16498888 16752405 16918008
5591 16918008 16831177 17007949 17215192 17328242 17344019 17338328 17382745 17311260 17489055 17378771
5581 17378771 17614470 17770019 17870521 17996252 18099637 18071965 18263898 18422820 18521225 18506908
5571 18506908 18674805 18823639 18933652 18895714 18986684 18935518 19140582 19164681 18924973 18802304
5561 18802304 18850462 18923260 18857054 18940538 19091055 19277759 19273841 19486289 19364703 19407369 19396763
5550 19396763 19354917 19535981 19729231 19744580 19559057 19694939 19668335 19846129 19963456 20121903
5540 20121903 20328855 20248261 20406232 20429248 20308921 20392681 20529877 20501639 20566304 20735200
5530 20735200 20803709 20746057 20576743 20607896 20693392 20804809 20766363 20681936 20776658 20739094 20929783
5519 20929783 21065947 21061771 21150913 21090382 21099117 21190040 21383269 21439067 21451664 21638900 21879256
5508 21879256 22035255 22010664 22132406 22268303 22286975 22318637 22443921 22510720 22443992 22669471
5498 22669471 22609446 22650463 22478949 22456346 22806703 22928307 22992582 22985936 23183634 23294539
5488 23294539 23559910 23632419 23832283 24138110 24431556 24710951 24854725 25144719 25352980 25615415
5478 25615415 25915213 26043358 26101282 25933865 25944033 25918681 25783609 25773103 25688092 25480968
5468 25480968 25395669 25326230 25223006 25142867 25136731 25228937 25177554 25411447 25576642 25744433 26026132
5457 26026132 26089995 26337280 26568279 26867568 27130999 27156617 27276390 27536308 27647150 27900369
5447 27900369 27961037 28080215 27973890 27799169 27500186 27205477 27061666 26828593 26458805 26105083
5437 26105083 25917789 25454016 25153670 24832735 24602869 24516843 24397256 24299866 24174418 24020385
5427 24020385 24168807 24074413 24116045 24353193 24561244 24776258 24896496 24986601 24920209 24985456
5417 24985456 25271098 25229759 25300158 25264384 25034516 24668687 24203628 23848782 23404616 23319558
5407 23319558 22989601 22567167 22412599 22310004 22226884 22200402 22166393 22025043 22150560 22308720
5397 22308720 22660868 22794113 22823192 22794912 22860455 23077263 23306218 23652704 23788737 24093125
5387 24093125 24298305 24660785 24941997 25098199 25302941 25647612 26056913 26402667 26946892
5378 26946892 27549904 28605715 29732396 30824656 32032888 33183818 34532732 35517021
5370 35517021 36555613 37425194 38013492 38418599 38418838 37826147 37182134 36663721 35568875 34693817
5360 34693817 34081223 33726086 33272714 33019411 32964486 32939527 33165881 33653904 34392965 35383845
5350 35383845 36337338 37535886 39080048 40730808 42602781 44536936 46289230 48169032
5342 48169032 49661025 50966524 52032213 52733548 52831351 52240492 51159165 49516975 47628421
5333 47628421 45401690 43053186 40790839 38799742 36954691 35418046 33978633 32832888
5325 32832888 31940898 31293276 30864680 30511763 30347121 30360156 30464708 30721465 31151955 31656376
5315 31656376 32131902 32493509 33074163 33518185 33702794 33832670 33777431 33325473 32215902
5306 32215902 31008308 29566268 27994981 26448217 24802366 23224795 22179597 21210806
5298 21210806 20224025 19377051 18707827 18000861 17373255 16759826 16265340 15854105 15445736
5289 15445736 15014968 14691049 14321984 14152396 13998476 13646653 13413663 13200090 13016567
5280 13016567 12870768 12598898 12387407 12210256 12000333 11850608 11714034 11569861 11352519
5271 11352519 11199921 11226641 11257551 11278016 11152076 10833041 10686963 10523056 10254651 10227713
5261 10227713 10256357 10144298 10127373 9981370 9856205 9762137 9677545 9565371 9495871 9307636
5251 9307636 9252561 9105875 9118581 9062217 9002966 8746062 8770471 8707340 8601152 8575177 8542957
5240 8542957 8610908 8583430 8565330 8489835 8327321 8141705 8057396 7911832 7857716 7927376 7925741
5229 7925741 7690813 7587271 7652828 7689945 7597415 7833405 7897057 7768268 7747107 7676779 7701818
5218 7701818 7563279 7533876 7481955 7208206 7207776 7459005 7383634 7295045 7412987 7367542 7185260
5207 7185260 7250559 7228076 7320705 7294005 7282514 7453443 7151438 7447459 7393408 7426264 7362737
5196 7362737 7224616 7208469 7344788 7500068 7421192 7324984 7344195 7299786 7320982 7240762 7025659
5185 7025659 6971875 6976649 7164709 7287234 7177039 7017142 7057991 7028741 7045985 7050179 6789824
5174 6789824 6670331 6741018 6880378 6958775 6746135 6761181 6614452 6650114 6633796 6822058
5164 6822058 6880575 6861983 6769849 6790103 6772142 6772639 6821731 6848134 6831551 6914289 7066389 7020938
5152 7020938 7114433 7054106 7017758 7195674 7339509 7498039 7535348 7358997 7398350 7611614
5142 7611614 7531730 7570703 7731789 7881736 8049972 8116806 8305570 8556494 8943316 9155632
5132 9155632 9342177 9483297 9717467 9978998 10339559 10743139 10794212 10961315 11483357 11887714
5122 11887714 12207658 12511046 12780264 12683114 12515157 12435733 12356559 12301424 12212556 12282555
5112 12282555 12495309 12565464 12751038 13245128 13292465 13672934 13921058 14053179 14515122 15156457
5102 15156457 15503640 15818018 16195532 16682661 16980429 17002249 16877448 16469079 16144901 15860434
5092 15860434 15535105 15080454 14526837 14015764 13878162 13692095 13695932 13613711 13538238 13570286
5082 13570286 13632988 13951008 13993896 13998272 14275716 14495508 14720267 14877653 15183782 15030538
5072 15030538 14757107 14401061 14243961 14134639 13781006 13507063 13381989 13215873 13149159 13008560
5062 13008560 12908106 12829253 13076384 13050523 13166097 13436468 13655799 13947076 13930748 14072867
5052 14072867 14399168 14668551 14887656 15084866 15321523 15545984 15460535 15540803 15775288 16207320
5042 16207320 16465502 16694620 17166250 17502755 17914005 18428811 18934086 19394899 20027571
5033 20027571 20515661 20968542 21526267 22100603 22978705 23743845 24483137 25365167 26447943
5024 26447943 27397699 28386511 29381293 30482298 31750736 33383057 35040558 36702135 38588979
5015 38588979 40864178 43319200 45790802 48775365 52188327 55859808 59856358 64266438
5007 64266438 69155080 74370907 80120632 86263843 93126974 100335529 107342143 114350513
4999 114350513 121275141 127949915 133542697 138410745 142004774 143717942 143802123 142437369
4991 142437369 140161593 137078271 133125436 128134046 122598870 117493176 112761055 107827407
4983 107827407 103014291 98252988 93954913 90215917 86868503 84126050 81989505 80348565
4975 80348565 79203538 78519084 78187742 78173763 78519704 78988347 79254665 79492541 79626515
4966 79626515 79657288 80003364 80750571 81658100 82506011 83317028 83210979 82368637 80545029
4957 80545029 78091764 75587091 73134649 70671044 68012912 65388529 63119525 61105135
4949 61105135 59129719 57338895 55947156 54449997 52977081 51749187 50203995 48840792
4941 48840792 47968096 46949176 45966714 45182821 44215018 43042791 41342540 39388908 37248797
4932 37248797 35371104 33561811 31712087 30032330 28507035 27047713 25736249 24601063
4924 24601063 23699868 22757247 22214508 21685613 20814065 20023816 19433203 19002459 18536617
4915 18536617 18136553 17852763 17157097 16539051 16004358 15535884 15228334 14799259 14529502
4906 14529502 14121709 13635069 13230831 12940213 12778584 12550971 12469948 12052981 11697216 11622863
4896 11622863 11333660 11150667 10979542 10808566 10824145 10916823 10679928 10717367 10486007 10288264
4886 10288264 10172397 10010391 10027720 9801834 9781392 9615782 9517523 9408790 9276951 9256385
4876 9256385 9337131 9352950 9327583 9288665 9206793 9002603 8966714 8902743 8688774 8626250 8698908
4865 8698908 8487251 8422557 8601818 8678416 8678786 8529442 8635257 8543822 8416272 8453118 8625884
4854 8625884 8640446 8643503 8853332 8792321 8854194 8994785 8961080 8773076 8633784 8477591 8277824
4843 8277824 8171445 8266028 8266683 8252547 8242615 8305862 8581913 8802756 8955320 9031010 9229394
4832 9229394 9484739 9761083 9760062 9669231 9863936 9898005 10146475 10235119 10191071 10334515 10629332
4821 10629332 10761083 10591533 10379597 9778186 9386722 8831002 8522129 8278636 7825259
4812 7825259 7595077 7495602 6954361 6597245 6533749 6511536 6243554 6108566 6049086 5971950
4802 5971950 5843018 5666225 5595000 5390112 5429061 5393521 5294273 5108081 4964615 4940797
4792 4940797 5115884 5063743 4997673 5061535 5066085 5238769 5387574 5377440 5199011 5337064 5333601
4781 5333601 5254156 5204839 5245944 5228469 5255844 5459357 5426788 5416651 5346578 5303144 5362342
4770 5362342 5330573 5507742 5528690 5646113 5754798 5638238 5639922 5771360 5858321 5781348 6050975
4759 6050975 6055247 6122035 6044544 5898905 5717163 5547899 5549701 5570603 5372916 5262181 4899488
4748 4899488 4955904 4942419 4818995 4662685 4587459 4577518 4468155 4652891 4533919 4562815 4524573
4737 4524573 4590972 4445288 4385051 4553433 4581017 4562966 4384037 4219547 4324804 4444582
4727 4444582 4557822 4511641 4412098 4340099 4317806 4349355 4382819 4495230 4640303 4686327 4763416
4716 4763416 4712066 4931051 4862735 4921101 4818446 4831645 5072289 5053209 5154297 5215705 5202354
4705 5202354 5154860 5232568 5299554 5123574 5223626 5390767 5269207 5146544 5022175 4863256
4695 4863256 4633878 4631084 4544944 4459810 4311836 4276773 4369309 4292673 4208250 4181885 4235887
4684 4235887 4265773 4113311 4108994 4126358 3962970 3818826 4063992 3995846 3905218 3889631 3851738
4673 3851738 3823035 3871897 3795408 3910149 3947016 3983318 3874506 3803233 4040695 3794396 3764595
4662 3764595 3879992 3947476 3947628 3808193 3852575 3928453 3940712 3878404 3716387 3651386 3684204
4651 3684204 3622266 3652982 3591214 3525042 3651075 3632888 3718931 3799282 3806721 3698971 3761027
4640 3761027 3722370 3562268 3586059 3483613 3506912 3700599 3728353 3698711 3765116 3891900 3750845
4629 3750845 3844914 3913536 3824579 3908023 3852968 3860774 3875786 3946543 3983976 4014434 4079576 4093226
4617 4093226 4087700 4218903 4156647 4207421 3971850 3895564 3957470 3911104 3850666 3720174 3751868
4606 3751868 3756359 3937293 3928414 3848588 3714523 3569991 3716381 3687104 3588448 3839089 3750483
4595 3750483 3714681 3830604 3888407 3773678 3789798 3878363 3769610 3718153 3577111 3765913
4585 3765913 3879199 3960168 3972408 3904754 3715161 3529363 3667630 3787626 3945691 3854382
4575 3854382 3932132 3747414 3836447 3953239 4161996 4166890 4117471 4036765 3941928 3877757 3949821
4564 3949821 3927445 3856810 4004176 3916509 3999013 4023796 3927997 4016955 3998712 4018602 4005140
4553 4005140 3944208 4084756 3807247 4009251 3905975 3856712 4031479 4116127 4229176 4017315
4543 4017315 4037419 4188107 4152735 4228561 4250635 4247954 4297697 4192650 4346658 4390001 4358905
4532 4358905 4407428 4435525 4552389 4625463 4449633 4556044 4719315 4631911 4694101 4729516 4837899
4521 4837899 4775421 4928570 5110552 5010906 4956431 5023894 5152838 5153620 5250076 5514451 5576474
4510 5576474 5685738 5702539 5837760 6218384 6240244 6341033 6563760 6893377 7132397 7203516
4500 7203516 7454469 7740404 8176870 8382403 8588518 8897920 9278853 9554267 9921701 10126811
4490 10126811 10149381 10067750 10244269 10196684 10132735 10104112 10002882 9932808 10055661 10174598
4480 10174598 10084614 10250224 10463901 10610137 11078355 11322607 11481388 11904334 12209278 12388961
4470 12388961 12579466 13053052 13215263 13297311 13505552 13916472 14224434 14584371 14847461 14953065
4460 14953065 14965521 14986328 14865510 14895030 14956831 15063494 14889698 14677102 14755281 14720873
4450 14720873 14846347 14968871 14987623 15295528 15352986 15605115 15639898 15736002 15819820 15912812
4440 15912812 15999828 15887620 16031995 16118506 16326922 16699422 16686242 17032587 17136706 17486878
4430 17486878 17986657 18285359 18630040 19030263 19457058 19721049 20367076 20722727 20895034
4421 20895034 21072242 21338737 21291705 21234772 21342037 21473962 21442768 21539015 21824629 22067741
4411 22067741 22268941 22514182 22803622 23135369 23709159 24227393 24789133 25291505 25917050
4402 25917050 26583295 27353593 28176577 28943991 29846427 30994941 31986209 33023035 34186658
4393 34186658 35132390 36435711 37611244 39172434 40727633 42375039 44261652 46318105
4385 46318105 48710702 51510654 54308296 57342271 60800777 64667042 68842818 73333066
4377 73333066 78332045 83792743 89716907 96464408 103398529 110972642 118827979 126461429
4369 126461429 133958202 141340066 147846871 153067443 156891083 158977507 158831969 156496563
4361 156496563 152157188 145988456 138363931 130054661 121558953 112819267 104027313 96209737
4353 96209737 89389457 83526698 78616568 74326418 71195358 68274870 66014848 64197111
4345 64197111 62689452 61591127 60820741 60436494 60250523 60521459 61139778 62038161 63395225
4336 63395225 65082241 66961743 69124461 71688382 74428762 77258843 80300693 83572694
4328 83572694 86697410 89666327 92507178 95248113 97625605 99760762 101301824 102045574
4320 102045574 101999811 100970021 99083426 96335745 92595028 87982236 82633726 76893284
4312 76893284 71048604 65574007 60384097 55966203 51821590 48242819 45238114 42528517
4304 42528517 40259087 38337415 37013154 35768401 34459614 33336970 32158436 31321934
4296 31321934 30625569 29869991 29418690 29002763 28579610 28284353 27911844 27630130 27278290
4287 27278290 27112797 26720134 26632865 26661570 25993976 25650045 25399373 25010850 24484608 24131358
4277 24131358 23753834 23461810 23362330 23076019 22901177 22989483 22841377 22959437 23129143 23318493
4267 23318493 23563072 23759562 24156480 24571460 25016217 25509462 25963912 26231789 26553315
4258 26553315 27070111 27363935 27549132 27393359 27349734 27265223 27068132 26822696 26550209 26454371
4248 26454371 26338496 26430113 26866044 27539758 28145888 28772555 29512205 30609799 31730314
4239 31730314 32799480 34194422 35619594 36816120 38048871 39135120 39968200 40503514
4231 40503514 40704711 40586789 40275684 39539516 38781122 37816056 37027780 36727761 36217106
4222 36217106 35954271 35976248 36071352 36383629 37056089 37920150 38812528 40143593 41952172
4213 41952172 43694573 45778059 47989204 50358087 53393342 56302317 59373728 62682550
4205 62682550 66012604 69057959 72037158 74719580 76703605 78094999 79083566 79793211
4197 79793211 80402235 81051173 81508623 81001214 79016583 75669002 71198082 66267015 61425881
4188 61425881 57046231 53264074 50714979 48967813 47980427 47317712 46935853 46837987 47173393
4179 47173393 47440350 47739925 48223583 48582019 48856628 48740645 48255787 47657108 46436086
4170 46436086 45067189 43594617 42300547 41079513 40097984 39278014 38335624 37918802 37604322
4161 37604322 37150117 37224832 37581333 37676089 37807690 38162566 38541632 39161904 39930981 40785786
4151 40785786 41669334 42639436 43830668 45424356 46942936 48744776 50829921 53266416
4143 53266416 56067212 59034345 62565622 66614470 71366727 76579269 82775693 89505003
4135 89505003 97123857 106174566 116072442 127378666 140008245 152760592 165411787 177471720
4127 177471720 189710449 202209790 213466551 219774987 218611811 211114776 201107874
4120 201107874 191747306 184505135 177958092 168939372 156521045 142410151 128319693 115207979
4112 115207979 103511992 93908918 86060654 79385037 73852049 69296718 65425241 62019175
4104 62019175 59273959 56539459 54088692 52072344 50639743 49088499 47497581 46275744
4096 46275744 45391593 44306620 43574999 42987446 42202644 41544134 40904603 40295538 39481359
4087 39481359 38596878 37798786 37089443 36219257 35593371 34870127 34272492 33834217 33207284
4078 33207284 32338838 31780688 31126086 30448699 29558650 29015924 28532441 27899554 27499647
4069 27499647 27290929 27073965 26778648 26508852 26371003 26068478 25661320 25317777 25045096
4060 25045096 24762210 24545228 24556418 24465702 24050610 23640987 23352891 23245061 23194864 22845087
4050 22845087 22610430 22214425 21925686 21767766 21445504 21156134 20870679 20451977 20079651
4041 20079651 19845726 19541164 19173474 18963545 18808552 18770787 18502540 18479143 18322811 18127627
4031 18127627 18223064 18202193 18318193 18083027 18182240 18544177 18641541 18546233 18454984 18475522 18392664
4020 18392664 18484799 18226606 18055069 18022666 17783418 17803964 17759766 17615668 17693089 17817140
4010 17817140 18020529 18557495 18987290 19608223 20630413 21586591 22311084 23193484 23898231
4001 23898231 24728498 25508408 26251022 27479848 27947182 27873554 27458044 26694547 26022147
3992 26022147 25554113 25050665 24734578 24645779 25002267 25410161 25997862 26898417 27944669
3983 27944669 29180019 30868495 32577368 34727366 37267477 40170588 43800737 48133238
3975 48133238 53163811 58335602 62919727 67442130 71774012 76497543 80810841 82294731
3967 82294731 79617399 73439688 65492961 58063116 51700241 46646667 42950244 40087401
3959 40087401 37999902 36322215 35112010 33905056 32669584 31739630 30826832 29866373 29209947
3950 29209947 28929084 28522157 28084733 27753309 27066682 26417905 26035682 25675065 25229200
3941 25229200 24915154 24513655 24174821 23509847 22754026 22065965 21418915 20855189 20466825
3932 20466825 19870974 19521347 19485125 19199310 19208461 19058352 18794893 18964573 19044033 19147783
3922 19147783 19322138 19501851 19758839 20119473 20752041 21317550 21943752 22864039 23951161
3913 23951161 25107597 26522397 28106932 29948144 31715862 33079012 34463719 36090277
3905 36090277 38569716 40566830 40565432 38393701 35223556 32116077 29766035 27941644 26532157
3896 26532157 25770580 25202641 24705550 24312382 24126220 24053188 23819941 23668201 23632164 23670849
3886 23670849 23689731 23987382 24300604 24828367 25146476 25484071 26007985 26678978 27136768 28032496
3876 28032496 28499587 28494835 28244344 27949518 27763733 27803219 28074966 28421955 29115523 29263150
3866 29263150 29728904 30052206 30735784 31711825 32629530 33937808 35081726 36609033 38612050
3857 38612050 40751129 43511497 46694562 49799953 52657510 55328428 58073556 60876439
3849 60876439 62825546 62626598 59971630 55482271 50972423 47456764 44768032 42934071
3841 42934071 41824226 41162270 40869501 41037104 41669009 42902525 44270938 46183550 48905224
3832 48905224 52526312 56928098 62070990 67936006 73792566 79510871 84914820 90856570
3824 90856570 96531890 102343947 106264232 105312859 99035478 87859340 75880842 65661599
3816 65661599 58106792 52317479 48417981 45537994 43501647 42160998 40884459 40034188
3808 40034188 39504102 38995855 38889504 38883748 38526825 38580603 38683196 39009506 39235043 39578180
3798 39578180 39836425 39985690 40440951 40772446 41225580 41589004 42229646 42491046 42710112
3789 42710112 43004893 43441305 43717815 43934544 44292328 44576552 44759104 44905763 45086128
3780 45086128 45205690 45027675 45238650 45383916 45513051 45385678 45317136 45301361 45056925 44716237
3770 44716237 44347141 43861140 43349043 42727815 42219408 41627854 41091705 40553188 39991043
3761 39991043 39613779 38920269 38050505 37109236 36179662 35033122 33870343 32606129 31506963
3752 31506963 30446142 29292638 28240191 27556012 26732877 25894229 25137999 24636826 23819082
3743 23819082 22931442 22393376 21791623 21264674 20709876 20140392 19693753 19275827 19034928
3734 19034928 18722107 18584565 18476048 18408356 18235819 18044350 17841302 17838702 17714687 17759827
3724 17759827 17629346 17395862 17559805 17591331 17550313 17765681 18012646 18355454 18471167 18625950
3714 18625950 18945259 19207132 19508585 19812010 20110414 20385441 20713838 21126193 21451076
3705 21451076 21730156 21953644 22093608 22127749 22381167 22656914 22878430 23147128 23365398 23608952
3695 23608952 24037311 24351745 24711994 24985685 25390913 25951485 26278983 26807807 27743479
3686 27743479 28596580 29432675 30366655 31277699 32266484 32991118 33847746 34499876 35057245
3677 35057245 35365608 35381103 35279742 35135262 34783009 34502553 34254495 33898883 33571399 33448751
3667 33448751 33521137 33635544 33367062 33138156 33359444 33471131 33911367 34181803 34491682 35045973
3657 35045973 35668549 36428871 37283979 37877670 38512685 39259878 39719630 40020430 40195408
3648 40195408 40089839 39731606 38968052 38219972 37303451 36302017 35417669 34553913 33536634
3639 33536634 32665050 32267928 31362203 30868982 30583011 30290428 30053121 29901073 29940223 30052077
3629 30052077 30138108 30368993 30773725 31100087 31064194 31469993 31918353 32086119 32271091 32120065
3619 32120065 31595147 30931348 30240742 29609015 28783619 27789471 26590239 25480145 24680567
3610 24680567 23642526 22702516 21821947 21144848 20664131 20090130 19685314 19192587 18815549
3601 18815549 18534931 18258248 18200475 18056452 17953366 17878322 17723395 17560457 17459244 17574633
3591 17574633 17480063 17309751 17161734 16798505 16314390 16030100 15681344 15258135 14907104 14435451
3581 14435451 13992598 13616148 13410814 13083285 12938585 12632551 12220103 12152165 12075443 12162337
3571 12162337 11865827 11750558 11678480 11718944 11869594 11725839 11607326 11674211 11683239 11726208
3561 11726208 11697661 11671243 11501182 11591027 11614368 11495055 11553871 11387574 11517199 11554622
3551 11554622 11439286 11353332 11522339 11589246 11593713 11715954 11816862 11740119 11724422 11676256 11775176
3540 11775176 11640569 11537607 11478958 11486569 11336678 11196034 11164646 11026693 10812645 10663250
3530 10663250 10608108 10610888 10428826 10470146 10537733 10357679 10280055 10197391 9994692 9815969 9613679
3519 9613679 9660860 9618227 9615903 9712953 9572702 9496035 9347656 9393175 9422457 9374217 9317924
3508 9317924 9261277 9291513 9462683 9593439 9585489 9512893 9787669 9741200 9614091 9543527 9500413
3497 9500413 9650928 9714377 9837491 9880406 9890659 9983672 10216567 10153984 10224101 10423081 10304335
3486 10304335 10300824 10335832 10551483 10859965 11257270 11151484 11320688 11799781 11975547 12119243
3476 12119243 12259666 12464426 12750522 13173726 13471744 13577034 13557253 13511293 13806991 13906497
3466 13906497 13434391 13641721 13633280 13566825 13659889 13767021 13756357 13892358 14028513 14179166
3456 14179166 14374013 14361880 14391946 14472761 14754657 14817459 14915633 15051936 15270556 15331144
3446 15331144 15493717 15433451 15461350 15513513 15352992 15238592 15218167 15285881 15303466 15259456 15722757
3435 15722757 16098925 16316524 16730966 17212429 17578986 18151498 18691363 18814047 19217248
3426 19217248 19451912 19727098 20065365 20310080 20429884 20453786 20387589 20298683 20432222 20436755
3416 20436755 20278841 20442619 20646313 20718304 20633487 20728188 20928256 20986325 20987415 21113455
3406 21113455 20958800 21011411 21093461 20959763 21297544 21583160 21621059 21808129 22212160 22344046
3396 22344046 22287094 22639704 22883883 23183451 23382621 23769857 24045752 24519000 24997868 25702444
3386 25702444 26466522 27194293 28491110 29557080 31114606 32529003 33855930 35326514
3378 35326514 36942946 38421399 39936133 41449192 43418139 45501460 47595419 49709850
3370 49709850 51132557 52605420 53366518 53718150 54359017 54873961 55720138 56678573 58240672
3361 58240672 60085818 62044242 64277343 66035340 67658889 69172361 70440462 71461119
3353 71461119 72266963 73021970 74024973 75697742 77606485 79664560 81388274 81481307 80188307
3344 80188307 78252992 75894809 73300323 70666964 68467835 66264099 64627501 63457662
3336 63457662 62520041 61989736 61546493 60851237 59890919 58670675 57339832 56055254 54890638
3327 54890638 54034114 53562553 53318423 53159848 53153233 52855285 51841210 50679380 49792169
3318 49792169 48742432 47927008 47054668 46458112 46018243 45811168 45811239 45761511 45912722 46007232
3308 46007232 46145978 46185851 46483779 46599364 46674933 46907637 47176275 47510421 47652312 48270114
3298 48270114 48746294 49319735 49926150 50670445 51481816 52295088 53499860 54835589 56253516
3289 56253516 58015975 60291246 62649046 65234887 67968946 70831684 73812129 76494077
3281 76494077 79119474 81791105 84154103 86143308 87954235 89373679 90255613 90789999
3273 90789999 90982742 91112806 90943135 90568129 89910822 88985975 88170404 86980480 85662604
3264 85662604 84107228 82059562 79806511 77376690 74538890 71525890 68498023 65471330
3256 65471330 62360507 59423082 56800385 54418675 51946632 50000939 48429651 46602279
3248 46602279 45082730 43850396 42764728 41735086 40547492 39459619 38625703 37887842
3240 37887842 37161364 36480316 35625505 34790781 34276566 33782172 33208841 32705814 32369029
3231 32369029 32048884 31433624 30821031 30368441 29921285 29779739 29527919 29148412 28977911
3222 28977911 28881908 28506498 28318233 28272379 28120324 27895664 27685169 27748563 27596397 27557427
3212 27557427 27530045 27607061 27929903 27941015 28053493 28078690 28395311 28638519 28732663 28871154
3202 28871154 29036959 29122564 29450917 29739647 30262571 30590093 30907090 31060456 31215151 31766971
3192 31766971 32302595 32801387 33011846 33238392 33113211 33170598 33514004 33792736 34024891 34085384
3182 34085384 34351068 35045257 35526163 35774160 35984425 36297995 36944697 37593494 38179406
3173 38179406 38873387 39733581 40886464 42128665 43520664 44975417 46312821 47748246
3165 47748246 49421630 51357100 52823349 53903154 54818220 55904525 57453923 58727351
3157 58727351 60095788 61363117 62715269 64190784 65441218 66636266 68017354 69186260
3149 69186260 70536843 71948997 73557312 74976113 76559745 78250321 79713244 81540155
3141 81540155 83439624 85052225 86730793 88512108 90132253 91807666 93658979 95516672
3133 95516672 97425835 99462438 101712041 104284236 106927513 109525861 112344651 115739112
3125 115739112 119243292 122730294 126835861 131253685 136235576 141680778 147646615 154022186
3117 154022186 160743096 168214606 176243009 184718029 193292408 201997350 210734542 219210328
3109 219210328 227679650 235496026 243047250 250322240 257366459 264228529 270950527 277743245
3101 277743245 284477044 291441645 298251711 304816423 310944433 316042972 320085433 322928070
3093 322928070 324435395 324586037 323543411 321519847 319086697 316554939 313663409 311165065
3085 311165065 308750816 306316234 303954729 301907085 300367336 300084636 301693430 305705329
3077 305705329 309159292 310223379 310391970 313741973 322215472 330482879 326979229 309170623
3069 309170623 284193087 260503200 241434416 226401039 215392722 209436208 207667794
3062 207667794 205323936 196442364 181619491 164877431 150180237 138528610 128931827
3055 128931827 121320019 115077731 109895856 105547273 101963247 98347152 95179402 92401062
3047 92401062 90003444 87583155 85227875 83039811 80754109 78484934 75998477 73533211
3039 73533211 71310963 69424125 67404611 65525522 63995246 62320482 60966767 59554723
3031 59554723 58482184 57418430 56345032 55622418 54587454 53423205 52674475 51906554 51354405
3022 51354405 50596268 49582495 48504021 47598129 46854306 46345087 45840843 45297581 45003649
3013 45003649 44843664 44699359 44560189 44576251 44842175 44957340 45090692 45298383 45684696 45791218
3003 45791218 45913169 45774198 45609851 45272606 45355306 45157090 44996493 44530982 44158863 43609072
2993 43609072 43134226 42995762 42782375 42877389 43139100 43296630 43676738 44051618 44558251 45217344
2983 45217344 46087293 46904052 47534886 48221306 48824198 49541582 50141491 51063218 51939189
2974 51939189 52911968 53861301 54633430 55729569 56787124 57666403 58789840 59868461 60899366
2965 60899366 61796623 63018114 64567888 65997482 67846755 69644016 71442650 73622221
2957 73622221 75794481 78200910 80508588 82720901 84957884 86933026 88926394 90626338
2949 90626338 92160022 93473259 94142802 94705580 95016629 94932712 94590280 94087372 93407655
2940 93407655 92533855 91021879 89445957 87327315 85083619 82544753 79683748 76836978
2932 76836978 74051767 71058224 68143603 65304306 62728079 60050480 57448103 55003309
2924 55003309 52564660 50114118 47844167 45370618 43282304 41294429 39478746 37532208
2916 37532208 35868843 34440973 32982037 31778418 30533202 29501196 28654140 27707395
2908 27707395 26892462 26117217 25305640 24475845 23948574 23267425 22714176 22189808 21764405
2899 21764405 21381327 21080472 20957852 20772615 20332343 19922219 19767526 19563336 19441433
2890 19441433 19243173 19060538 18901295 18800351 18457399 18287719 17950360 17647766 17364044
2881 17364044 16891502 16614334 16373212 16086380 15991616 15808937 15564906 15320604 14995794 14776574
2871 14776574 14696199 14520112 14287852 13956932 13729019 13391941 13327697 13205305 13031855 12751307
2861 12751307 12800610 12645226 12419406 12191721 12260085 12427667 12680403 12505162 12448002 12648663
2851 12648663 12700336 12801756 12771525 12849657 12780214 12873282 12840632 12601157 12614861 12605069 12584772
2840 12584772 12539407 12662283 12768422 12785184 12915980 12966594 13095174 13133361 13134541 13307765
2830 13307765 13427604 13497979 13360741 13202870 13488095 13629007 13623903 13771891 14016624 14091962
2820 14091962 14131451 14230299 14424680 14847025 14985952 15204480 15473897 15577741 15811668 15810238
2810 15810238 16138262 16343939 16652370 16862386 16944451 17422226 17891936 18307179 18605198 19111032
2800 19111032 19397345 19888924 20396811 20584630 21015485 21566933 21819394 22414313 22946797
2791 22946797 23401824 23965752 24747968 25192796 25653623 26413101 27194642 28084478 29088875
2782 29088875 29944551 30914699 32048941 33009507 34129979 35373431 36543085 37946142 39334443
2773 39334443 40515782 41692414 42888456 43797384 44773841 46278117 47729644 49117326
2765 49117326 50434118 51921437 53711471 55548811 57487474 59483086 61305647 63193525
2757 63193525 65079679 67063524 68799691 70774496 72963760 75551495 78251684 81346025
2749 81346025 84700784 88282867 92791151 97967837 103592374 110267992 117954913 126421184
2741 126421184 135823143 146229388 157416376 169613772 182632093 195967572 209327218
2734 209327218 223178438 236428069 248128560 257236331 263608148 269265159 275839500 284924351
2726 284924351 296786098 310275580 324377945 339058442 354227697 368327320 377209761
2719 377209761 376307690 363640585 342157687 316935846 292506113 272309260 256732368
2712 256732368 245479030 236609842 227401363 214974604 199794373 183543070 167692491
2705 167692491 153303219 140285138 129254521 119989064 111890858 104739354 98802860 93448238
2697 93448238 88497554 84486033 80899860 77599715 74561540 71669792 68960895 66451685
2689 66451685 63935386 61588250 59580263 57647148 55818692 54165571 52526077 50952522
2681 50952522 49405568 47805414 46248500 44591553 43010003 41393273 39763245 38250363
2673 38250363 36756429 35179289 34142559 32919153 31702649 30688083 29507895 28729788
2665 28729788 27740110 26929768 26161543 25331066 24639575 23887833 23467554 22671544 22044342
2656 22044342 21578946 21016699 20375197 19918911 19382455 18878444 18311532 17978766 17329521
2647 17329521 16989322 16548361 16172121 15687462 15327246 14884398 14553088 14131026 13797600
2638 13797600 13500376 13224219 13013163 12779109 12590270 12077236 11992005 11717443 11498050 11312237
2628 11312237 11127028 10885048 10645948 10444695 10240219 10128452 9858798 9514041 9659142
2619 9659142 9453938 9388205 9094441 8889500 8749310 8749453 8580350 8426820 8129945 7895104
2609 7895104 7818313 7592692 7554358 7450298 7290566 7190952 7039607 6996616 7011385 6971892 6786476
2598 6786476 6618370 6749770 6718318 6420503 6180822 6157093 6162965 5924818 5959199 5991249 5882501
2587 5882501 5794458 5759731 5528134 5333066 5237396 5312707 5285240 5228752 5052910 4907135 4752381
2576 4752381 4772040 4768395 4488184 4529533 4449347 4493691 4361937 4438295 4392077 4363426 4157922
2565 4157922 4004441 3991078 4166709 3906390 3760181 3871473 3977954 4137424 3868238 3676784
2555 3676784 3732488 3674762 3628665 3705301 3739397 3741728 3654101 3422603 3455486 3360979 3328907
2544 3328907 3130933 2947601 2918300 2937777 3135566 3252550 3012071 2876536 3021299 3030115
2534 3030115 2934135 2853980 2639178 2608673 2653860 2434840 2437451 2348223 2293485 2279768 2345800
2523 2345800 2175956 2262005 2339708 2385840 2428738 2489084 2409465 2481543 2496594 2192842 2261625
2512 2261625 2287323 2323228 2364588 2396841 2314179 2542007 2748279 2613698 2547329 2438445 2340963
2501 2340963 2492424 2455155 2322427 2381911 2436745 2440947 2191115 2265262 2303812 2328516 2386650
2490 2386650 2353049 2391293 2662183 2785024 2656153 2611159 2481225 2574317 2742569 2791780
2480 2791780 2803518 2669294 2927784 2940935 2934495 2963533 2778012 2981630 3128287 3100218 3264642
2469 3264642 3219902 3037726 3272816 3319005 3228046 3306880 3296815 3208145 3107823 3085448 3098433
2458 3098433 3013569 2792397 2714882 2572540 2715529 2720966 2502103 2465761 2375455 2211437 2265465
2447 2265465 2157793 2102501 1960426 1785321 1666181 1631350 1692650 1589148 1764972 1733567
2437 1733567 1588636 1579694 1483791 1670532 1632698 1625712 1601185 1358600 1381428 1507701 1400000
2426 1400000 1358114 1519151 1497009 1444137 1392204 1203017 1403732 1415791 1301112 1253580 1031920
2415 1031920 1004138 1014766 1207859 1163445 1291136 1206132 1244819 1077006 917382 877263 880249
2404 880249 899455 1087592 1047620 1007368 1089796 1029414 791635 841782 934564 861237 945792
2393 945792 993218 948246 763586 846318 958881 941964 1006375 998636 975934 931818 962313
2382 962313 959507 910892 821837 814436 867799 998745 1009208 768438 666318 810627 975678
2371 975678 962469 720461 784835 897523 921485 922023 778077 730109 795847 599536 544997
2360 544997 661277 824778 821912 794399 954732 922779 834385 843693 834591 797282 915855
2349 915855 964530 857805 975139 917223 842022 855321 745255 679534 779901 767735 780479
2338 780479 757045 686812 687690 689454 747321 464499 631570 594886 654262 712783 659966 456750
2326 456750 617501 760072 720830 533425 711278 718984 771046 737476 658768 671455 832087
2315 832087 685140 793891 910269 603195 662818 683226 767898 717376 629989 770268 724752
2304 724752 573757 698992 480051 474152 437988 369116 601386 696917 855555 726281 626958
2293 626958 655501 645465 793979 781717 743607 793174 806110 654061 643058 620611 574692
2282 574692 524658 508810 555424 554505 581602 533642 510765 714472 628797 634972 581540 605701
2270 605701 546651 586744 682113 676170 651480 763339 725855 650487 707299 605179 433034
2259 433034 506600 434730 478646 555173 527975 535371 478787 522390 265604 392654 513620
2248 513620 559441 538282 644135 694327 669754 496392 436802 355532 484435 532180 451543
2237 451543 464428 416896 349502 380636 516432 578492 555580 584156 481984 443714 506758
2226 506758 628240 622562 361380 490122 456469 353319 306037 355156 443915 348860 444018
2215 444018 616811 548177 658826 465351 391436 443036 513631 494984 377911 390654 437172
2204 437172 384630 473005 625661 606825 544918 396407 212312 281683 392356 525921 547110
2193 547110 406556 208926 480296 564839 448796 543349 692761 544531 544647 494326 407947
2182 407947 436038 310011 228363 296588 578095 570888 445433 430939 510498 511543 483744
2171 483744 427828 532075 493167 487236 349186 337902 416895 347130 487173 518478 517592 569748
2159 569748 517480 541922 498059 397292 398748 601355 645942 838172 702605 633472 695363
2148 695363 721662 649504 555783 500612 598805 557885 447094 623769 389579 448612 568900
2137 568900 566246 537464 508186 628094 705089 654460 693870 717976 595436 724666 798458
2126 798458 698492 782304 909634 819769 738455 992787 930648 755973 874558 991329 1029262
2115 1029262 988306 938243 1100843 1261475 1245337 1132004 1204140 1216163 998937 962799 1134540
2104 1134540 1237279 1240829 1179573 1153814 1192888 1258286 1226804 1153947 1246413 1184776 1194657 1214742
2092 1214742 1325153 1361373 1455728 1519157 1400092 1557589 1753149 1763750 1937917 1989462
2082 1989462 2097174 2167139 2297555 2231239 2337160 2482461 2615407 2700164 2738020 2963871
2072 2963871 3146777 3314913 3659068 4002957 4472517 5086789 5385896 5745077 6209927 6955472
2062 6955472 7606696 8311425 9196302 10197059 11688734 13402063 16132621 19748786 23683076
2053 23683076 26856052 28615826 31206553 36296942 38964293 34913865 27858299 21407771
2045 21407771 17029260 13954011 12055560 10540854 9380444 8682312 7852315 7365135 6850597
2036 6850597 6450705 6240044 5542684 5054366 4772028 4371300 4087775 3776962 3477698 3353132
2026 3353132 3305876 3275142 3185893 3076519 2830049 2814778 2781186 2566342 2424227 2506055 2374895
2015 2374895 2161871 2242219 2174754 2032263 1883347 1780496 1755180 1758713 1837422 1774512 1502628
2004 1502628 1423121 1598111 1414115 1280614 1374888 1279818 1337042 1426729 1247672 1317235 1318905
1993 1318905 1383306 1273826 1143362 1222223 1090457 1010726 1056421 1038241 858516 903759 1073947
1982 1073947 1256881 1106455 1110865 888307 846715 819095 809309 871074 840705 703675 740243
1971 740243 605937 730590 677172 436582 712649 780038 700939 670107 669692 823733 921574
1960 921574 644023 604020 586901 474338 523934 658281 525386 415062 659905 781886
1950 781886 687918 696163 484825 565304 533808 377430 403055 414081 580114 666517 663255
1939 663255 467566 409742 479165 529337 818824 615688 492971 480326 339802 457284
1929 457284 467778 212752 157340 446657 393559 350611 553081 480748 343474 429098 543508
1918 543508 448191 176080 376030 408199 339424 361070 489660 529116 361168 490057 475406
1907 475406 372068 462353 400787 517252 497716 443497 390446 389395 258153 237507 291166
1896 291166 206049 283211 262456 208673 298055 371012 364942 334758 417705 520587 493268 378151
1884 378151 381481 394179 436950 382931 297380 319860 359608 472453 476631 497913 355862 491489
1872 491489 609154 511236 540073 522469 304598 424040 262567 153882 205179 334660
1862 334660 472764 416686 433032 487006 438329 318365 266141 327250 218282 289868 398075
1851 398075 216577 402676 501963 290377 287914 310769 274844 265919 183725 367544 226801
1840 226801 180962 97641 306600 431437 176985 222167 217943 345121 291228 134508 155100
1829 155100 261503 344712 311432 232724 250490 238025 218697 421373 633024 489906 266240
1818 266240 296276 253775 314111 444773 445880 404945 312031 486275 407748 273303 391697
1807 391697 468080 431226 374786 286160 298554 337015 176651 80246 303938 175660 274931
1796 274931 262795 111675 104491 146805 269575 267028 384527 174221 135128 115026 7370
1785 7370 196732 118933 137882 305358 166741 32118 115142 158629 244781 229336 343796
1774 343796 192604 172236 227147 91243 174418 255221 235823 301061 224832 -28532 23301
1763 23301 78387 144920 250451 259748 218391 44113 -15866 140395 -10306 106307 -4283
1752 -4283 -89182 57901 183239 113506 187632 268995 151466 211139 414369 200565 203156
1741 203156 161592 264332 353262 151483 90153 83644 111318 226965 249069 135279 90102
1730 90102 -59184 84473 134935 -101332 99555 94045 296288 309843 119837 253738 259341
1719 259341 170798 46180 102493 171886 154102 85868 -74667 67342 210293 321899 270997
1708 270997 161894 31275 23554 61933 -9672 21442 171526 245147 68925 -37610 -57354
1697 -57354 52435 106817 362330 159465 185924 118799 303251 288699 230033 228382 356650
1686 356650 309526 315660 340724 248029 251578 59297 -3288 141804 82545 48057 91845 96696
1674 96696 322776 245575 148129 46104 36171 90320 235962 324760 304118 128732 -2588
1663 -2588 132306 168336 131594 -24604 20527 177119 67483 39500 123500 182815 -54916
1652 -54916 -110695 -98041 83279 240931 140543 8199 84412 221915 -51133 49128
1642 49128 22260 165966 162737 138721 256092 149431 48590 -53876 179878 157508 184356
1631 184356 141555 88064 152615 331059 207655 220323 127939 3852 54931 2270 156583
1620 156583 310235 199421 157881 144200 59199 151849 139365 -29208 -16891 40142 -133082
1609 -133082 23711 26247 -133785 -73469 119721 2251 -174253 -114611 -69141 -36699 30767
1598 30767 -81862 -33684 125396 175652 59190 -48549 284681 316049 204891 -79446
1588 -79446 -68961 50917 140144 115294 83526 37095 -6708 63700 -27946 -27072 171735 199389
1576 199389 197610 387226 282433 239174 -32366 -23094 -58187 990 -76247 -67744 220851
1565 220851 73837 -50598 49800 180433 63562 -16589 41589 214267 93000 55489
1555 55489 80926 86738 183188 170986 209797 119365 112053 -105049 -103892 109382 156522 669
1543 669 8958 69149 173388 130025 205763 170289 58019 2144 54175 79332 24827 -82030
1531 -82030 -12023 78273 22818 85243 158589 110590 -111124 47142 -72384 -30822 -143004
1520 -143004 -26766 79676 161311 177991 273564 406627 321723 164709 116850 101762 133637
1509 133637 -26836 133129 60586 -17837 90800 -25392 29045 77944 181435 141785 22279
1498 22279 26272 116554 -117700 105276 308796 213034 126314 29583 -81012 51049 235678
1487 235678 139091 88702 -28578 -100832 -92745 -192563 -23066 186632 189398 77789 228498
1476 228498 182823 70075 248700 178962 118076 156300 233487 256846 222779 170811 110679
1465 110679 79072 83215 5522 89 -22623 43641 53807 205930 186465 141863 328090 65224
1453 65224 190130 125891 163709 43833 12162 -73186 -163296 57669 157470 204017 200952
1442 200952 277595 -14910 -98755 -56648 -11040 -224752 -170039 41081 77144 -180668 -207189
1431 -207189 -9966 124923 203420 208947 -44060 22037 69995 18245 24627 -2525 101217
1420 101217 40265 254250 103734 -125281 50187 181513 104358 55572 93820 87947 51400
1409 51400 -59900 68870 -94228 -109065 103827 56829 24128 36483 -75259 28276 213252
1398 213252 70447 101303 -79109 -117320 -59505 -5636 -16130 129071 21706 -169632 -49515
1387 -49515 -43752 90112 46034 -255704 -133107 -39161 23302 18069 -21197 6140 124169
1376 124169 59438 -21108 -7337 133907 180277 78020 185444 68921 -52672 94095
1366 94095 -31155 125481 136055 120736 115539 59562 72493 143289 83156 152367 215722 182600
1354 182600 204696 37429 16163 51649 68867 2144 70058 131061 234111 118571 168633
1343 168633 206785 -12905 -5856 4236 88931 89634 134376 196883 248514 40663 51486 -50520
1331 -50520 -210514 -97394 -59399 185280 44436 39886 -55165 96948 103671 188573 284340
1320 284340 113980 94024 169152 94731 -44533 19837 -47523 95232 62560 -42819 86826
1309 86826 -112684 -174535 -195113 -169307 -54427 -106125 103706 217464 58601 -43166 -17816
1298 -17816 50078 -110570 -146453 -158720 -98940 -236776 -157829 -192915 57534 64076 164898
1287 164898 183558 38419 -7644 21382 -6209 652 69642 24109 94019 52049 133359 35052
1275 35052 7205 -46064 95057 7358 -78456 52849 224019 17158 8079 250462 244511
1264 244511 178029 198508 192194 205267 117369 114013 307392 81250 112844 -6093 69914
1253 69914 181371 105308 96550 100251 -23126 -255951 -205178 -98737 70821 54598 -80339
1242 -80339 -33293 33835 -44708 -41588 -132363 -37071 66472 62703 122078 217126 45782 -74419
1230 -74419 -166850 -103898 -11962 83615 -116401 -84409 26288 -21858 -9497 -228601 -272904
1219 -272904 -156370 -200442 -26126 118943 127683 93497 -162854 34184 211734 21433
1209 21433 -2242 -58553 -132451 36632 -7322 -182197 -24740 37708 48875 -22655 -236723
1198 -236723 8244 140589 3814 -102894 -13214 -65202 -40541 -152221 -107813 77431
1188 77431 -123264 -211523 -123284 -140194 139424 210180 180952 64732 115540 299987 110809
1177 110809 177446 41418 36896 -51918 -65638 125726 54246 -6238 -63664 -151201 126725
1166 126725 -19773 -60849 81561 -13006 181051 77123 -79486 -583 -24933 -113002 -5748
1155 -5748 137268 -46595 -103527 -179839 -209313 75382 138724 62457 41967 -763 160870
1144 160870 229215 212235 -49578 111534 142317 49823 -41399 -59797 -99265 -125551 -77419
1133 -77419 -30860 65614 6304 -59583 78763 102953 40581 -28154 -133592 -60299 -33298
1122 -33298 -134366 -129678 -91901 -3384 9598 -24141 52288 187507 186078 -118108 -99140 -120787
1110 -120787 -170529 -233653 -131791 -111929 46480 39503 34122 -1956 107865 113829 -47263
1099 -47263 102012 61366 40658 -38496 -74441 -110883 -107101 -160586 -39110 141683 -136953
1088 -136953 77884 99277 -27882 -176718 -141486 -112011 11048 46045 16532 127802 178165
1077 178165 40458 -24724 15051 -7757 33098 121516 -38577 31456 152114 58726 -115117
1066 -115117 29949 112133 55493 13842 106747 158646 157525 196561 183920 55649 -32643
1055 -32643 4325 -70985 -88881 -5350 46057 -87422 -248139 -67544 -30519 -40479 -113345
1044 -113345 -99877 174022 32916 -30478 30538 69812 -4963 67127 -19252 122947 111264
1033 111264 32697 10886 -135753 -37375 -28292 -8069 130474 167241 203102 26106 198137
1022 198137 57594 133703 243909 189720 80531 69773 137213 -157909 27446 119271 13948
1011 13948 -33309 -146966 -73617 -23627 60218 144245 -10369 -129941 -185723 -195436 -144638
1000 -144638 -33551 54315 163725 161189 -15591 -20475 -51213 112723 10627 -112012 19877
989 19877 76960 61887 -3958 33352 -6415 -56546 38655 8496 42469 3100 19382 112990
977 112990 -93187 -97884 141040 58325 90765 60723 -152681 -94349 77139 -60749 -93739
966 -93739 -76445 -52046 72246 12716 84143 65814 53030 -50088 60854 158214 52680
955 52680 133193 77787 -133715 -126801 -143030 -272435 -84584 -59062 -80839 -170784 -142864 -79976
943 -79976 -123635 -183419 45194 128668 71466 29960 -38433 -104053 -82060 -192428 -232132 -53963
931 -53963 -21649 103440 932 119084 165558 61588 -220557 -243034 -274861 -393531 -327627
920 -327627 -193200 -186140 -138720 54126 -21059 -125971 -210431 -69393 -95806 -256126 -161898
909 -161898 -258481 -35451 15132 -86815 43525 -33509 -134267 -80980 -110617 -120779 -159802
898 -159802 -50330 -155677 -139678 -90997 81990 291182 131925 20051 4089 -218871
888 -218871 -107417 39800 -128259 -113308 -127719 99728 -106736 -212936 -55637 78419
878 78419 52961 33828 57464 73850 -136304 -68862 39418 -181710 -118622 107463 187657
867 187657 -71081 -19520 46655 80215 65790 138050 57256 -51046 48642 91063 180730
856 180730 150556 -699 -118979 14674 31151 -7097 15961 33294 210441 30049 62498
845 62498 8502 46008 48615 22833 54003 46132 15591 -50247 -15545 87217 -884 22402
833 22402 -42075 -44032 -8995 65219 39701 124048 101069 87128 19622 -89797 -160830 -127545
821 -127545 -124134 -73516 2233 -295023 -222923 -260897 -253016 -198547 8514 -94654 -9460 12788
809 12788 -38074 -132874 -63111 -154714 -147235 -55236 19213 21316 -73833 -147769 -79732 15788
797 15788 116108 217147 157855 53282 73906 43954 -47402 -88064 -19332 84534 -208591
786 -208591 -137078 18731 132503 137700 225576 30599 -92016 68815 -46744 -30289 3975
775 3975 112058 53271 124361 220977 41811 -3670 77948 -29539 -163320 -160004 -148869 -102930
763 -102930 47220 70158 37455 -12433 -25262 -131997 -94151 -32651 82325 -23761 167051
752 167051 110852 102602 139031 172058 -13753 -126861 -103563 -51031 -18398 -56326 9517 -145345
740 -145345 90514 153726 -4452 -19376 15245 -14030 -22177 -57634 -10308 -54843 -182317
729 -182317 -238629 -171319 -245128 -77834 -107749 -136747 2438 -159852 -178868 -108964 -98267
718 -98267 -308729 -287821 -263729 -282081 -141647 -251452 -196067 -14794 -70468 -149271 -19009
707 -19009 139464 192208 94450 -104067 -161561 71989 82715 -92748 127048 350625 98615
696 98615 -38721 138075 193320 11210 -6087 -99614 9127 85908 -36102 34208 124171
685 124171 -20707 79447 124811 204648 -20828 -103320 -63215 76542 -76253 -93880 5469
674 5469 124167 26784 39659 -126737 -151871 -113117 -157065 -163793 -128858 -98301 -83299 30110
662 30110 -79922 -39158 -53196 114825 110693 147071 18688 119529 -99591 77454 287514
651 287514 204747 -41636 -16110 13533 -31323 -91458 -155432 -245907 -176720 -98731 -313165
640 -313165 -299306 -231728 -92154 73222 61372 -94732 -30633 110392 107334 -19206 34288
629 34288 -33459 -117092 80127 125046 -178141 -79672 15805 -74096 -21536 -78633 -85717 -177587
617 -177587 -225459 -204962 -213522 38298 161256 -34540 -210713 -160466 -163131 -71780 20596
606 20596 -65599 -174497 -209604 -30199 -70729 -76513 -82179 -108020 -282636 -156761 -184353 -241127
594 -241127 -193730 -10523 9745 -16116 44644 44430 56056 -19467 49230 162133 -53170 -132733
582 -132733 -61839 -109876 47563 21442 -99369 -162346 -189726 -309264 -43382 -84404 -99870
571 -99870 106766 179359 23194 -106452 -82219 -323474 -136192 -100025 -37198 -30773 -173579
560 -173579 28789 -109926 -134554 -210030 -100243 -38138 -80717 -99325 -84928 -69465 -67885
549 -67885 62702 -69813 -93230 -113313 -64359 -148487 -195039 -136699 -243528 -134713 -8284
538 -8284 -45155 -122461 -107794 5867 -50237 31806 22823 -94289 -111611 -32352 29188 -24299
526 -24299 -51137 -268288 -300192 -184518 -86304 60489 -134888 -187142 -208790 -17392 30587
515 30587 -57497 -133096 -154171 -207974 -76325 67069 97207 -8806 -167244 96065 -8995
504 -8995 -177830 -282409 -117037 -31339 1195 -130341 -82317 -84105 -32064 136055 -35144
493 -35144 -164010 -39861 28584 95278 81497 -36079 -192146 -73967 36169 -49280 -32870
482 -32870 -113932 -14776 -15249 -175251 -27058 39219 37882 18452 86684 -88690 -99933 -8783
470 -8783 60783 61608 55920 155607 123077 53197 63026 201634 -134 30429 21144 -60076 17284
457 17284 -47562 -92062 55955 -51608 1149 -31842 884 -79418 -18074 187354 -98265
446 -98265 -95939 8499 4709 48881 -8272 -20651 -265325 -17597 46640 20622 94094 105607
434 105607 -112971 -169215 -122774 -142284 42036 -49942 -127024 -95115 133502 -3585 6443
423 6443 77763 87810 135174 -180314 -13354 -25715 -148602 -8868 -75287 -76209 -55955 -144968
411 -144968 -244764 -232735 -134968 -232940 -247006 -96643 -6904 -66550 -38326 -93756 -200715
400 -200715 -161326 -232103 -121454 -41038 -164559 -222399 -85118 -26164 -114004 -118844 30834
389 30834 -68016 -155063 -31100 82954 -54001 -65936 -17317 -225725 -387673 -150801 -232959
378 -232959 -187422 15043 53673 -37349 -38266 -34850 -103522 -284307 -268716 -238008 -228373 -154150
366 -154150 -263612 -345073 -301131 -297576 -156268 -174960 -32523 -58713 -54214 -29284 -213745
355 -213745 -122502 13855 -31180 -72401 -111502 -212910 -135430 -35460 -70953 -193445 -195379
344 -195379 58305 206975 170666 19591 33847 26905 -218076 -278857 -129394 -71770 -18573
333 -18573 -80938 -140399 -113972 31653 20223 -10672 51030 -93952 -48253 -55120 40386 -136789
321 -136789 -225503 -328377 -107565 -37501 -115938 -26203 -21764 -98040 -92530 -117975 -125716 -230064
309 -230064 -4478 62881 18925 -120727 -143096 25635 -64636 -210301 -280421 -37950 49005
298 49005 33076 -121709 -223290 -265288 -282904 -230211 -246427 -412156 -465967 -283849 -217960
287 -217960 -260390 -265486 -193241 -163146 -337307 -401642 -251407 -146849 48752 -31432 -11576
276 -11576 -243405 -285985 -231903 -110935 -85091 -84778 -270472 -189393 -57219 -238015 -305816
265 -305816 -291373 -100972 -168621 -183080 -75137 -108472 -61305 -35157 -11102 -27030 -93268
254 -93268 -279512 -211016 27851 -65281 -10690 -114129 -101303 -2028 14193 -186477 43164
243 43164 118894 17713 -2775 -83784 34757 -75033 -86109 -170264 -87209 -174379 -237302
232 -237302 -102039 -151999 -144411 -254154 -211099 -213916 -122794 -122187 -138132 -251429 -183478 -205002
220 -205002 -189515 -44897 44439 -176939 -243072 -100834 -99624 -220303 -113877 -36808 -128292
209 -128292 -124989 -336607 -358467 -77763 55961 -175327 -80950 -33089 -148471 -17550 -10261
198 -10261 -13479 -142348 -62687 -13212 -118161 -106230 -222278 -1610 102284 -48953 -94111
187 -94111 -196847 -216980 -174407 -10308 -49694 -72455 -153352 -259807 -332891 -285139 -225451
176 -225451 -152223 -33976 -12261 -169607 -102069 -93526 -85835 -90346 -214964 -110102 1115
165 1115 -54416 -145835 -118580 -32699 -122925 -3296 63695 -97617 11958 -12117 -201079
154 -201079 -210544 -292081 -195252 -39372 43307 64774 -90407 -231545 -363134 -330641 -293041
143 -293041 -340774 -388458 -159314 -175190 -172729 -101462 -123030 -179087 -11521 82434 1463 -120474
131 -120474 -196019 -175137 -162079 -65934 54522 -27246 -131736 -142047 -154011 -222707 -337452
120 -337452 -278553 -41151 28989 69370 -50073 -43946 -71389 40701 39650 -133585 -117587
109 -117587 -117125 -38923 -148381 -208045 -47426 -140770 -166424 -173947 -73078 -83330 -94160 -178672
97 -178672 -213671 -85967 -74905 -111861 -215202 -278002 -175962 -138162 -86961 -123589 -83381
86 -83381 -67839 -208580 -212891 -214610 -136358 -158622 -209552 -149130 -18148 -209588 -177144 -239015
74 -239015 -174639 -149707 -387065 -320697 -166600 -114299 -89122 3844 -36291 -181047 -144204
63 -144204 -172443 -178104 -33354 -148641 -62496 9158 -126684 -32193 111185 45784 -85690
52 -85690 -197215 -116893 -12362 -155226 -170254 -194253 -119223 -48881 -170952 -195732 -250570
41 -250570 -206895 -131582 -178034 -144205 -229199 -371006 -222158 -116972 -102836 -130207 -39184
30 -39184 -65147 -139860 -233860 -133176 -22470 -229756 -217174 -223440 -220681 -139121 -229850 -210075
18 -210075 -110009 -5913 -6856 -10692 -18287 -53701 45498 25408 -75361 -139039 -91543 -254444
6 -254444 -328463 -220352 -143474 -66589 -103656 -94939
0 -94939
$$ Imaginary data points
##PAGE= N=2
##DATA TABLE= (X++(I..I)), XYDATA
16383 -3757969 -3735830 -3705097 -3597023 -3628708 -3616940 -3562093 -3441326 -3451889 -3421138 -3393818 -3367387
16372 -3367387 -3200880 -3171110 -3123338 -3041370 -2860624 -2878633 -3036548 -2907845 -2758377 -2668820
16362 -2668820 -2687623 -2689101 -2611530 -2579658 -2567099 -2498442 -2268318 -2193209 -2253577 -2209189 -2207049
16351 -2207049 -2232973 -2168878 -2129443 -2134135 -2101538 -2020375 -1966217 -1865512 -1754558 -1799461 -1736492
16340 -1736492 -1582145 -1574587 -1562197 -1517844 -1517778 -1439191 -1354227 -1415544 -1330466 -1317533 -1379277 -1337979
16328 -1337979 -1237669 -1181212 -1135419 -1020818 -867820 -850401 -721823 -793476 -779377 -722057
16318 -722057 -691517 -624552 -582916 -522464 -527204 -456596 -320322 -276492 -404195 -443200 -227180
16307 -227180 -330151 -223201 -155713 -275407 -173955 -134704 -39192 97713 166145 177915
16297 177915 143752 97572 88990 324350 524313 504821 500298 361332 246094 377147 353207
16286 353207 495007 601199 589584 607422 719515 818988 888342 760107 766280 726806 727182
16275 727182 739880 740918 956112 986389 1029003 971193 966948 1058762 1178625 1200553 1202350 1092941
16263 1092941 1193942 1376075 1437867 1452010 1427006 1363196 1394297 1538809 1506234 1489837 1667734
16252 1667734 1584784 1531268 1695491 1770972 1697949 1727219 1657971 1739811 1814544 1740255 1664950
16241 1664950 1714900 1870068 1885752 1957336 1978695 2002273 2101218 2094709 1947867 1902929 2057264
16230 2057264 2138613 2136324 2299648 2297731 2277231 2386313 2432259 2379615 2432188 2486016 2541861
16219 2541861 2522812 2466354 2541997 2467153 2499720 2462752 2503338 2553984 2463135 2417865 2527671
16208 2527671 2670213 2756851 2784574 2759164 2967639 2955787 2723521 2658070 2613551 2642737 2769520
16197 2769520 2988890 2813006 2711390 2930083 3048408 2886008 2827517 2907549 2975931 2991723
16187 2991723 3116831 2973220 3071732 3194626 3237095 3083972 3065042 2973535 3097932 3305933
16177 3305933 3202053 3191535 3199811 3235257 3162597 3353425 3290310 3033925 3127693 3107567 3185892
16166 3185892 3291883 3310243 3449189 3392973 3520774 3353102 3275628 3129716 3391458 3627303
16156 3627303 3530713 3364060 3227129 3333442 3481051 3388102 3258586 3298245 3323975 3486005
16146 3486005 3517376 3496889 3563875 3418102 3677203 3631310 3479517 3393954 3327561 3386267 3620867
16135 3620867 3652394 3558942 3713891 3696463 3565785 3535380 3747858 3604219 3652669 3595308
16125 3595308 3307055 3570658 3625141 3648918 3826764 3681155 3535672 3671616 3724118 3740442
16115 3740442 3649030 3594501 3853881 3843450 3690095 3567107 3607983 3709921 3741392 3804035
16105 3804035 3853956 3821237 3717844 3678446 3672104 3732316 3863340 3825371 3770107 3704724 3843177
16094 3843177 3742499 3963828 3853709 3719602 3722966 3734488 3795291 3728294 3769798 3767283 3773006
16083 3773006 3699018 3745499 3827966 3741968 3714344 3804931 3846636 3908298 3785045 3847650 3852157
16072 3852157 3777312 3821503 4026064 3940334 3754192 3906167 3879959 3809148 3805966 3752430 3783098
16061 3783098 3762076 3708763 3879206 3991275 3897831 3895681 3968017 3928590 3950954 4021255 3982659
16050 3982659 3889082 3810844 3921343 3861152 3876044 3985818 3867248 3719163 3773825 3854269
16040 3854269 4034858 4009060 3877874 3764706 3763655 3731763 3966114 4018179 4011711 4175523 4077613
16029 4077613 3870892 3821546 3909117 3944514 3996686 4005255 4032413 3934801 4019425 3965424 4026662
16018 4026662 3985151 3843851 3921464 3844949 3789221 3615040 3691921 3748343 3868444 3931915 3797265
16007 3797265 3857250 3921933 3709994 3624878 3719628 3761182 3842963 3798363 3843070 3949295 3883460
15996 3883460 3851298 3933249 3850730 3951308 3943885 3867575 3808134 3705226 3931767 4051341 3973006
15985 3973006 3947277 3961983 4008597 3856610 3724035 3729193 3796522 3748904 3664983 3899282 3918958
15974 3918958 3873845 3915022 3897686 3976858 3977607 3873585 3698722 3705678 3800941 4079510 3967773
15963 3967773 3835913 3898480 3913451 3902605 3960502 3933423 3856107 3935747 4034812 3905550 3903599
15952 3903599 3860012 3750703 3820319 3854789 3924890 3953626 3909322 3914988 3913215 3839840 3801809
15941 3801809 3844394 3875503 3934362 3919222 3937974 3926703 4039019 3920237 3808504 4041463
15931 4041463 3951498 3828555 3684720 3659217 3838098 3793669 3817924 3841727 3842197 3859696 3653564
15920 3653564 3686781 3742367 3906999 3872753 3839892 3952073 4082012 3978845 3773222 3913484
15910 3913484 3929856 3872628 3866349 4004871 3856134 3761018 4063326 4066561 3816882 3802776 4020322
15899 4020322 4122418 3965378 3767372 3776839 3848267 3951229 3995835 3984865 4063096 4090631 4165447
15888 4165447 4002366 3953642 4014222 4096425 4168346 3916613 3666339 3705139 3797565 3841332 3840458
15877 3840458 3928756 4009173 3943555 3940986 3883434 3861613 3863767 3816400 3826484 3871459 3889436 4086214
15865 4086214 3966956 3761197 3641943 3656640 3815106 4074314 3966365 3912300 3944910 3943430
15855 3943430 3893705 3918844 3810061 3698999 3741697 3765160 3853330 3941108 3991156 4000014 4017056
15844 4017056 3989430 3877089 4071900 4116436 4041213 4030655 3900361 3981537 3895180 4017443
15834 4017443 3996311 3903605 3735838 3858509 4016715 3990671 3940079 3865896 3874257 3825763 3946257
15823 3946257 3909643 3976708 4019807 4062241 4024472 3991410 3962639 4077247 4104917 3967299 4000796
15812 4000796 3839196 3840796 3781346 3844417 4273068 4195326 3970462 3956299 3953239 3966406 3998083
15801 3998083 3940451 3868384 3849219 3796145 3952309 3852283 3912328 4006478 4021370 4028787 3943175
15790 3943175 3930569 3856677 4003365 4091804 3994500 3983126 3881755 3856805 3721472 3667876 3777255
15779 3777255 3846204 3945160 3938841 3896280 3839761 3876471 3859053 3960767 3948067 3855221 4027344
15768 4027344 3922898 3875653 3906129 4061563 3986298 3941178 3979826 3806991 3775464 3756610 3905241
15757 3905241 4009482 4151614 3944394 3918624 3891538 3968651 3962773 3963958 3906539 3947523 3915908
15746 3915908 3943133 4119344 4013260 3984391 3951098 3767433 3819008 4068400 4046446 3998456
15736 3998456 4087271 3927883 3831715 3815657 3820034 3861317 3740739 3889380 3889754 4097868 3988904
15725 3988904 3972180 3885132 4015497 3918825 3841819 4023155 3943983 4122970 4016885 3752128
15715 3752128 3863893 3892165 3998220 4016508 3866745 3953128 4040469 3912334 3977455 3876337
15705 3876337 3974641 4049505 3927455 3761645 3755584 3884133 3850471 3956242 3920510 3893689 4117609
15694 4117609 3972603 3904928 3937342 3924433 3864458 3908162 3819929 3766700 4105557 4234983 4129440
15683 4129440 3977304 4074073 3886284 4073730 4038046 3858646 3918341 3970658 3984299 3904119
15673 3904119 3989217 4010122 3975343 3830754 3928473 4041004 3991345 3966636 4054377 4159885 3876684
15662 3876684 3712240 3832777 3890944 3794857 3777241 3726124 3885690 3965151 3971641 4063701 3981612
15651 3981612 3958400 3951813 3901505 3924244 3877149 3888431 3923034 3905911 3920767 4039719 3872911
15640 3872911 3912256 3841226 3985912 3944772 3870877 4065238 3932102 3948204 3958039 4068394 3993319
15629 3993319 3830494 3918400 3851950 3886027 4049899 4101499 3915504 3850524 4002248 3848891
15619 3848891 3969264 3896760 3766791 3804609 3820102 3896863 3878892 3909096 4179302 4187866 4030159
15608 4030159 3960380 3926843 4102503 3971449 4087862 4108334 4027628 3994976 3915081 4086710
15598 4086710 4164512 3990531 4035621 3982334 3952743 4080477 4213719 4055738 3911559 4073135
15588 4073135 4113160 4069037 3906742 3855572 4026444 4139810 3830148 3843647 4069971 4054850
15578 4054850 4030948 3898558 3954312 3951815 4122362 4243337 3953432 3956730 3950713 4048473 3985543
15567 3985543 4054920 4178974 4096914 3997510 3864062 3874511 4005230 4110040 3955877 4068633
15557 4068633 3866623 3784160 3950376 4084726 4012102 3926546 3888651 3934980 3939354 3939008 4067061
15546 4067061 3975026 3885077 3762141 3796828 3906595 4088568 4051136 3865899 3953093 3948698 4030709
15535 4030709 4112772 4138237 4179724 4177491 4094570 3976800 4033522 4064330 4064321 3920456 4075689 4041093
15523 4041093 4136930 4110430 4036273 4072709 4079310 4077694 4126505 4106755 4089903 3847492 3899218
15512 3899218 3980849 4080148 3959350 4039471 4083090 4214096 4139720 4218518 4169690 4123999 4241438
15501 4241438 4131184 4090894 3827552 3854504 4078705 4173073 4133377 3901856 3881028 4146607
15491 4146607 4028450 4154470 4151737 4091550 3884413 4002274 4162243 4134054 4097668 4000172
15481 4000172 3953927 3790031 3838049 3915465 3936049 3977340 3899521 3968778 3955245 4088328 4037576
15470 4037576 3853403 4095299 4208924 4086964 4010383 3977852 3896923 3918886 3917689 4183534
15460 4183534 4131243 4061593 4067255 3977490 3911778 3917979 3898561 4076316 4051576 3819469 3791906
15449 3791906 3719208 3764188 4064933 4221191 3790813 3771205 4075539 4021142 3971375 3937703
15439 3937703 3947434 4163217 4163572 4077882 4176868 4266898 4076224 4009377 3934963 4072854 4009379
15428 4009379 4129446 4097721 4023225 3779288 3881912 3766752 3871993 4137664 4060870 3890593
15418 3890593 3937372 3804241 3947374 4048865 3976676 4037026 4056340 4229300 4109330 4170888
15408 4170888 4056049 3983562 4273367 4191799 4220648 4166054 4105429 3962755 3862050 3982887
15398 3982887 4070251 4089616 4129345 4136731 4142695 4020276 3855516 3890446 3882636 3946887 3967807
15387 3967807 4120633 4208348 4211215 4248753 4338253 4212615 4113349 3938125 3786300 4063823
15377 4063823 4120826 4019902 4194509 4242022 4221696 4152946 4021050 4019243 3985263 3967755 4111137
15366 4111137 4038049 4105407 4058101 4170253 3975443 4012054 4111120 4124000 4358017 4368943 4201762
15355 4201762 4043479 4002749 4010187 3976841 4157565 4076719 4004283 4060218 4046999 3956747 4177311
15344 4177311 4139554 4130264 4046756 4113929 4003438 4004508 4225867 3975472 4085868 4091862 4013670
15333 4013670 4164589 4027291 3933440 4040024 4097453 4084822 4124429 3969072 3997602 3954769
15323 3954769 3987162 4221683 4107169 3997392 3941936 3893909 3894778 3918973 4005035 4147249 4124669
15312 4124669 3991225 3906389 4034264 3999825 3906129 3749601 3937237 4022056 3914676 3960740
15302 3960740 4092613 3973062 3955786 4044262 4202223 4300774 4111908 4162448 4210402 4131940
15292 4131940 4074998 4007393 4017699 4153548 4138042 4184852 4156404 4241904 4279550 4204898 4215649
15281 4215649 4159567 4227269 4180710 4297152 4173838 4140747 4206065 4224028 4229385 4059322 4163555
15270 4163555 4118089 4064443 4086193 4009026 4003861 4014498 4027828 4109347 4148464 4061515 4120982
15259 4120982 4318903 4322285 4271945 4303289 4306074 4268519 4062495 3902806 3895821 4065588 4205656
15248 4205656 4040057 3954812 4034785 3997979 3939585 3865093 3934745 4073863 4136891 4110469 4206366
15237 4206366 4292939 4293930 4240224 4329853 4204719 4214077 4272634 4314290 4381145 4291545 4121354
15226 4121354 4186373 4309428 4080655 3945837 4064443 3950597 4033154 3794830 3964537 4167844
15216 4167844 4119232 4227244 4180085 4074934 4078849 4139359 4172768 4039302 4053151 4220242 4107543
15205 4107543 4083178 3967636 3847416 4057852 4241839 4112722 4113934 4116614 4184699 4099971 4065871
15194 4065871 4010139 4067275 3980660 4055672 4205616 4432702 4465763 4315444 4141193 4260507
15184 4260507 4321435 4201634 4128958 4158404 4260284 4300468 4051375 4038713 4173519 4130726
15174 4130726 4122122 4267394 4347661 4248604 4207135 4199107 4288794 4196258 4259841 4199696 4242033
15163 4242033 4103391 4040300 4209840 4077610 4136913 4119053 4056442 4097095 4223435 4226223 4246612
15152 4246612 4230539 4199255 4296438 4264419 4157675 4127884 4188762 3891891 3853803 4135427 4108279
15141 4108279 4023195 4183338 4226210 4057930 3931719 4089041 4221391 4097942 4224631 4330238
15131 4330238 4128992 4197647 4126921 4040827 4038122 4140663 4165157 4188036 4108807 4060382 4214395
15120 4214395 4178230 4090647 4175697 4228338 4070710 4253635 4231544 4173457 4170951 4244493 4366837
15109 4366837 4151271 3927038 3984293 4032682 4162358 4217622 4236954 3842387 4131238 4310984
15099 4310984 4170764 4178801 4168152 4285098 4365025 4392708 4284970 4185692 3985516 4179325
15089 4179325 4193434 4158399 4298613 4241493 4370072 4288305 4175169 4202841 4219422 4291142 4323368
15078 4323368 4247560 4263687 4241177 4159961 4218617 4261158 4182767 4081865 4330632 4436144 4392743
15067 4392743 4236771 4178057 4150695 4151794 4173195 4375569 4374857 4240092 4339551 4313292 4237391
15056 4237391 4153892 4115883 4211141 4314335 4306312 4382428 4343228 4519466 4398883 4126135 4172107
15045 4172107 4145198 4128222 4032895 4155075 4179481 4159667 4213589 4244461 4281763 4256381 4369741
15034 4369741 4452083 4293164 4304949 4273949 4342905 4187825 4157481 4056446 4107334 4032531 4047960
15023 4047960 4222258 4046506 4107224 4210990 4232203 4289984 4197135 4229252 4339461 4417157
15013 4417157 4205158 4235288 4271592 4122429 4068031 4113115 4231873 4348131 4303000 4178870
15003 4178870 4350800 4203418 4121777 4199337 4367244 4415412 4135337 4036595 4153392 4238419
14993 4238419 4284463 4195200 4067058 4199739 4242252 4259172 4266176 4205532 4379475 4401161 4371829
14982 4371829 4245541 4256251 4432515 4304077 3883985 4041074 4410839 4456810 4206574 4208259
14972 4208259 4388602 4329799 4132312 4080633 4131569 4271296 4330407 4287177 4408135 4296920
14962 4296920 4241076 4234810 4309954 4372724 4284533 4136077 4267409 4243943 4245077 4341761 4195188
14951 4195188 4288790 4254326 4301647 4179244 4208649 4189845 4147574 4401178 4435021 4384596 4243926
14940 4243926 4236585 4321646 4326194 4270869 4310936 4315165 4251412 4317913 4346077 4483386 4299464
14929 4299464 4262511 4354689 4270923 4093959 4102938 4236862 4219984 4372185 4389117 4351082 4322582
14918 4322582 4248974 4231082 4402516 4261559 4138667 4272272 4229471 4287407 4248721 4382620
14908 4382620 4276419 4126758 4012453 4221195 4359130 4287200 4380849 4485166 4357442 4166973
14898 4166973 4242673 4147375 3925311 4152966 4244972 4300281 4261812 4162488 4135692 3962133 4161120
14887 4161120 4372492 4267833 4220219 4280716 4190085 4104510 4223037 4149947 4208635 4179501 4091678
14876 4091678 4197401 4328858 4263168 4127725 4298708 4264187 4345063 4172950 4125426 4139279
14866 4139279 4155570 4221739 4234358 4238717 4379939 4217117 4296755 4343417 4343404 4214466 4217417 4114210
14854 4114210 4273886 4498179 4341101 4443254 4316196 4329882 4371951 4213043 4138536 4268531
14844 4268531 4595670 4531520 4413940 4468722 4271844 4228176 4162060 4142675 4306248 4432213
14834 4432213 4319520 4280438 4426777 4254615 4314472 4373515 4373211 4255283 4143559 4300526
14824 4300526 4314668 4325517 4186924 4074737 4288952 4179594 4153488 4137685 4166150 4318970
14814 4318970 4312832 4431860 4614710 4496125 4280033 4348064 4401861 4468525 4433942 4420372 4332533
14803 4332533 4052950 4147409 4374350 4457286 4331282 4445136 4382978 4255707 4232735 4354740
14793 4354740 4440409 4335028 4312815 4398987 4339711 4225721 4314434 4193262 4497644 4513597
14783 4513597 4380649 4456785 4419218 4322751 4166593 4198327 4229865 4324499 4426758 4232661
14773 4232661 4152334 4243504 4356218 4326537 4236679 4129389 4055350 4077924 4099019 4134436 4341107
14762 4341107 4370356 4325118 4180978 4200586 4362218 4309455 3995037 4257671 4250352 4280851 4195035
14751 4195035 4290008 4228111 4399625 4480038 4402733 4325074 4243684 4231241 4317319 4569248 4499592
14740 4499592 4284138 4181619 4183996 4164349 4117350 4067783 4162237 4290134 4478302 4399252 4432993
14729 4432993 4395056 4303754 4191253 4349259 4342318 4295640 4265322 4337265 4315007 4321776 4210848
14718 4210848 4236811 4369335 4292381 4373325 4450664 4423217 4492620 4527127 4485817 4358465 4369025
14707 4369025 4358691 4515554 4536048 4333274 4310024 4344766 4303028 4135726 4127891 4282326 4341805
14696 4341805 4423653 4482554 4650679 4605031 4399971 4513389 4403665 4315561 4412783 4455921
14686 4455921 4346216 4244069 4297315 4558928 4711939 4567564 4478333 4537371 4463271 4404629
14676 4404629 4323475 4440392 4473744 4350497 4394179 4401969 4401104 4241493 4259644 4501164 4476769
14665 4476769 4311768 4295598 4358049 4370551 4306798 4369250 4371572 4352757 4366481 4435770 4510199
14654 4510199 4529469 4411409 4555698 4493922 4352008 4307230 4291946 4292051 4305397 4199153 4316775
14643 4316775 4531142 4530784 4405090 4347665 4321398 4157441 4213965 4421362 4395415 4369752 4347994
14632 4347994 4324827 4340639 4415755 4349615 4277646 4442689 4364613 4297146 4373364 4516224 4446537
14621 4446537 4284542 4377051 4333744 4259398 4385174 4637206 4609307 4426982 4423233 4359332 4387841
14610 4387841 4325549 4369093 4487907 4548043 4500324 4370295 4206664 4225771 4191081 4255191 4524415
14599 4524415 4420108 4391785 4689343 4530887 4543578 4609857 4595928 4579564 4354683 4346439 4258804
14588 4258804 4225088 4202556 4275171 4406507 4417452 4499991 4496835 4580956 4438763 4320753 4320475
14577 4320475 4337332 4318192 4470356 4365281 4384460 4288110 4493409 4554064 4539005 4663357
14567 4663357 4348816 4393125 4274718 4188536 4155117 4261807 4428368 4482889 4569841 4453211
14557 4453211 4418898 4397064 4358904 4374851 4399863 4493758 4466153 4348147 4257652 4199899 4238635
14546 4238635 4387396 4382314 4368113 4433947 4425989 4353945 4327433 4158105 4217725 4203651 4255727
14535 4255727 4364964 4428547 4418147 4451414 4525112 4431678 4565783 4492888 4407795 4533869 4585284
14524 4585284 4537840 4382977 4354963 4281227 4512096 4575281 4489874 4350469 4334680 4395245 4218670
14513 4218670 4462736 4426579 4398662 4432125 4490870 4370720 4407565 4521744 4351066 4448089
14503 4448089 4526273 4412684 4311240 4533871 4542060 4326323 4396330 4460011 4446672 4457897 4352797
14492 4352797 4314507 4487088 4497980 4527927 4513798 4442318 4603474 4546080 4379996 4360695 4491204
14481 4491204 4535734 4467348 4427236 4380766 4335895 4451433 4534133 4472526 4413780 4364306 4406084
14470 4406084 4404915 4593305 4438919 4362504 4423128 4511756 4702151 4472840 4438433 4333574
14460 4333574 4378323 4385506 4227870 4307778 4407399 4381403 4289192 4345500 4405855 4462701 4529650
14449 4529650 4576875 4607527 4504830 4417281 4391643 4479528 4433171 4351193 4333890 4293190 4343261
14438 4343261 4430603 4308350 4478002 4501350 4561531 4525450 4404186 4366142 4343053 4393909 4378154
14427 4378154 4437905 4348572 4286246 4340840 4464447 4461353 4403069 4434475 4619468 4523085 4355813
14416 4355813 4546075 4601921 4575997 4410197 4278549 4279757 4350477 4486894 4387942 4532301
14406 4532301 4311840 4376365 4507569 4519659 4550543 4470525 4328422 4257311 4622980 4559357
14396 4559357 4424575 4431887 4462660 4514891 4630003 4435700 4538750 4535614 4397586 4514683
14386 4514683 4401337 4409294 4472481 4518708 4383550 4571635 4582046 4378367 4476321 4504820 4408961
14375 4408961 4474709 4277632 4309369 4482890 4409070 4422429 4398714 4413477 4393787 4506246 4390001
14364 4390001 4339534 4520511 4477958 4500201 4703132 4691776 4569262 4712267 4630440 4539602
14354 4539602 4329992 4495954 4695750 4526059 4648557 4588261 4404217 4448437 4468620 4674982
14344 4674982 4763412 4889240 4697003 4512493 4460051 4191214 4396624 4568282 4560581 4532953
14334 4532953 4634802 4533821 4476313 4565256 4619548 4699612 4692000 4498968 4377084 4358386 4376988
14323 4376988 4473678 4761707 4598132 4531556 4590018 4545786 4551905 4529935 4451999 4394580 4619555
14312 4619555 4585536 4594590 4574864 4435815 4402219 4412624 4605440 4527479 4539453 4578904 4312265
14301 4312265 4399431 4337716 4504696 4721365 4671705 4585573 4388941 4442352 4651358 4480894
14291 4480894 4365980 4475237 4602907 4468682 4472103 4420841 4417143 4441379 4538507 4747869 4678046
14280 4678046 4592061 4548072 4609934 4729709 4574014 4395407 4559205 4568397 4483787 4604618
14270 4604618 4638663 4404777 4546520 4525130 4404595 4614524 4744368 4682982 4581267 4470923
14260 4470923 4519974 4799777 4733782 4695594 4617875 4383460 4357209 4364801 4536876 4575109 4544198
14249 4544198 4508568 4572113 4523237 4580185 4349492 4495261 4572402 4555461 4635974 4573430 4548844
14238 4548844 4389792 4537620 4702464 4570476 4586282 4493126 4478727 4585487 4555674 4499623
14228 4499623 4521016 4454977 4483352 4608645 4568134 4672193 4613666 4685242 4586627 4477213 4501415
14217 4501415 4658170 4763880 4674660 4620655 4553067 4650458 4704343 4641759 4775992 4635495
14207 4635495 4373743 4434102 4560940 4723810 4605786 4515884 4438832 4329653 4464863 4588536
14197 4588536 4598014 4629178 4509643 4562595 4636158 4622764 4474845 4465934 4641983 4593826 4562280
14186 4562280 4422275 4673531 4721905 4583138 4435235 4443641 4498931 4465778 4431993 4442893 4706282
14175 4706282 4651954 4409971 4427940 4419841 4481482 4689735 4581032 4500791 4681112 4605957 4623775
14164 4623775 4623819 4634825 4497904 4417822 4385191 4463749 4537980 4605421 4720571 4801221 4647662
14153 4647662 4611975 4749846 4619099 4522367 4515473 4425665 4462175 4566792 4444927 4441249 4607269
14142 4607269 4443060 4517517 4624252 4670708 4603462 4556676 4557518 4527207 4605821 4697202 4590934
14131 4590934 4431276 4389446 4419907 4517216 4843457 4748907 4692577 4782733 4618607 4665105 4500520
14120 4500520 4695677 4790668 4873693 4802601 4877268 4718397 4568133 4558335 4532352 4621162 4485066
14109 4485066 4331805 4505117 4636920 4683203 4520804 4584543 4681430 4758895 4602240 4660868
14099 4660868 4852958 4749759 4664273 4614401 4629754 4569328 4516124 4494908 4458402 4574419 4651381
14088 4651381 4383807 4289442 4460509 4608135 4745957 4716836 4767539 4668681 4553064 4609730
14078 4609730 4561895 4721706 4771753 4570751 4587905 4806739 4603027 4590674 4534843 4568007
14068 4568007 4675071 4629282 4669377 4833060 4724196 4675335 4639932 4511077 4633650 4687264
14058 4687264 4780612 4701227 4732312 4602614 4500287 4533780 4760899 4764530 4668192 4583521 4633180
14047 4633180 4620619 4532867 4728437 4807493 4775100 4666968 4556017 4638679 4566208 4563614 4599806
14036 4599806 4421573 4566023 4511767 4635113 4653533 4435470 4541598 4553743 4608913 4742924
14026 4742924 4651182 4602780 4692973 4712204 4669071 4650508 4715715 4684204 4601078 4568328 4593008
14015 4593008 4831927 4810183 4628435 4667033 4734553 4555540 4620217 4705908 4719119 4523000
14005 4523000 4457629 4739417 4822654 4750465 4811705 4759586 4669653 4580096 4670685 4659693 4537749
13994 4537749 4564127 4462923 4631956 4709527 4760079 4847441 4735689 4730026 4603762 4534639 4583919
13983 4583919 4642450 4599413 4600822 4520227 4624280 4773932 4734009 4675827 4731285 4669136 4652212
13972 4652212 4744295 4680067 4794218 4653153 4646384 4669993 4721976 4700320 4549946 4651486 4767035
13961 4767035 4663881 4662391 4793560 4774434 4689148 4731722 4598342 4478520 4567482 4543169 4529894
13950 4529894 4504723 4583602 4632888 4494078 4655417 4588892 4590189 4780642 4638332 4637575 4609515
13939 4609515 4781084 4837288 4728254 4664109 4865901 4991547 4830839 4718209 4845871 4835885
13929 4835885 4786354 4900473 4934225 4817608 4677154 4702740 4658258 4653809 4670627 4624133 4720982
13918 4720982 4865576 4693744 4753008 4988332 4955318 4919058 4750617 4817148 4698771 4746430
13908 4746430 4988563 4969789 4826614 4689678 4765556 4594213 4477736 4606190 4864303 4946078
13898 4946078 4890005 4864221 4917409 4775297 4679502 4613544 4633441 4602594 4613462 4524476 4598999
13887 4598999 4700932 4818401 4823053 4839064 4918243 4833992 4865340 4807714 4741868 4777578 4828382
13876 4828382 4965449 4793231 4871914 4765450 4709155 4665280 4693137 4627250 4603831 4763491
13866 4763491 4671642 4643799 4726928 4709874 4749737 4695666 4845572 4900407 4784810 4880542 4777326
13855 4777326 4822787 4833541 4805385 4813396 4796524 4747030 4630807 4599051 4701180 4705840 4712813
13844 4712813 4731356 4803858 4797571 4747538 4682518 4727989 4845424 4839463 4680350 4678968 4856356
13833 4856356 4891545 4910367 4745097 4659543 4806595 4596705 4667664 4596454 4704951 4900163
13823 4900163 4844453 4698889 4780490 4848273 4846113 4742984 4718060 4816162 4927922 4762329 4665770
13812 4665770 4644878 4724524 4816565 4876155 5111639 4971239 4684161 4707870 4753698 4738842 4766791
13801 4766791 4766201 4658757 4585938 4751649 4861616 4765787 4836147 4817487 4917642 4736172 4793511
13790 4793511 4933489 4827539 4836549 4831249 4762582 4792093 4853904 4614384 4572295 4701004 4702171
$$ [...]
##END NTUPLES=NMR SPECTRUM
##END=
