##TITLE=1H_CG-1148-D1
 CDCl3, 8 sc, 
 8.07.2021
##JCAMPDX= 6.0         $$ Bruker NMR JCAMP-DX V2.0
##DATA TYPE= NMR SPECTRUM
##DATA CLASS= NTUPLES
##ORIGIN= UXNMR, Bruker Analytische Messtechnik GmbH
##OWNER= root
$$ XWIN-NMR		Version 3.5
$$ Thu Jul  8 11:48:04 2021 Russian Standard Time (UT+4h)  she@DPX200
##.OBSERVE FREQUENCY= 200.131506
##.OBSERVE NUCLEUS= ^1H
##.ACQUISITION MODE= SIMULTANEOUS
##.ACQUISITION SCHEME= undefined
##.AVERAGES= 8
##.DIGITISER RES= 18
##SPECTROMETER/DATA SYSTEM= spect
##.PULSE SEQUENCE= zg30
##.SOLVENT NAME= CDCl3
##.SHIFT REFERENCE= (INTERNAL, CDCl3, 0, 17.502)
##AUDIT TRAIL= $$ (NUMBER, WHEN, WHO, WHERE, WHAT)
$$ ##TITLE= Audit trail, XWIN-NMR		Version 3.5
$$ ##JCAMPDX= 5.01
$$ ##ORIGIN= Bruker BioSpin GmbH
$$ ##OWNER= she
$$ F:/spectra/data/she/nmr/H-F/1/pdata/1/auditp.txt
$$ ##AUDIT TRAIL=  $$ (NUMBER, WHEN, WHO, WHERE, WHAT)
(   1,<2021-07-08 11:46:37.96 +0400>,<she>,<DPX200>,
      <created by zg, POWCHK disabled, PULCHK disabled
       configuration hash MD5:
       00 E9 B6 7A A2 85 ED C7 34 08 36 98 17 FE 4E 26
       data hash MD5: 16K
       86 69 30 A5 FE 04 54 95 F1 01 F7 7B 2C 12 B0 8C>)
(   2,<2021-07-08 11:46:40.87 +0400>,<she>,<DPX200>,
      <Start of raw data processing
       efp BC_mod = 2 LB = 0.24 FT_mod = 6 PKNL = 1 PHC0 = -12431.15 PHC1 = 8.40101 SI = 16K 
       data hash MD5: 16K
       9D 32 8C 82 FB 32 4B 4D 28 5A 85 1C 77 51 1A 70>)
(   3,<2021-07-08 11:47:07.56 +0400>,<she>,<DPX200>,
      <pk PHC0 = -2.095815 PHC1 = 4.399999 
       data hash MD5: 16K
       7D E8 D3 23 76 C7 C1 BD 54 48 ED 10 61 84 E8 9F>)
(   4,<2021-07-08 11:47:11.14 +0400>,<she>,<DPX200>,
      <abs ABSG = 5 
       data hash MD5: 16K
       6F 8D 03 1B 09 73 08 BD D3 A0 9F 58 BF 43 E6 2C>)
$$ ##END=
$$ 
$$ hash MD5
$$ BA 5D 21 BC 63 DD 60 8E EB 37 70 F3 E0 C9 11 6F
##$RELAX= 
##$RELAX= 
##$RELAX= 
##$RELAX= 
##$RELAX= 
##$RELAX= 
$$ Bruker specific parameters
$$ --------------------------
##$DU= <F:/spectra>
##$EXPNO= 1
##$NAME= <H-F>
##$PROCNO= 1
##$TYPE= <nmr>
##$USER= <she>
##$AMP= (0..31)
100 100 100 100 100 100 100 100 100 100 100 100 100 100 100 100 100 100 
100 100 100 100 100 100 100 100 100 100 100 100 100 100 
##$AQSEQ= 0
##$AQ_mod= 1
##$AUNM= <au_zg>
##$AUTOPOS= <>
##$BF1= 200.13
##$BF2= 200.13
##$BF3= 200.13
##$BF4= 200.13
##$BF5= 200.13
##$BF6= 200.13
##$BF7= 200.13
##$BF8= 200.13
##$BYTORDA= 1
##$CFDGTYP= 0
##$CFRGTYP= 5
##$CHEMSTR= <none>
##$CNST= (0..31)
1 1 145 1 1 1 1 1 1 1 1 1 1 1 1 1 1 1 1 1 1 1 1 1 1 1 1 1 1 1 1 1 
##$CPDPRG= <>
##$CPDPRG1= <>
##$CPDPRG2= <>
##$CPDPRG3= <>
##$CPDPRG4= <mlev>
##$CPDPRG5= <mlev>
##$CPDPRG6= <mlev>
##$CPDPRG7= <mlev>
##$CPDPRG8= <mlev>
##$CPDPRGB= <>
##$CPDPRGT= <>
##$D= (0..31)
0 1.2 0 0 0 0 0 0 0 0.06 0 0.03 0 0 0 0 0.0002 0 0 0 0 0 0 0 0 0 0 0 0 
0 0 0 
##$DATE= 1625730397
##$DBL= (0..7)
120 120 120 120 120 120 120 120 
##$DBP= (0..7)
150 150 150 150 150 150 150 150 
##$DBP07= 0
##$DBPNAM0= <>
##$DBPNAM1= <>
##$DBPNAM2= <>
##$DBPNAM3= <>
##$DBPNAM4= <>
$$ [...]
##$SUBNAM3= <"">
##$SUBNAM4= <"">
##$SUBNAM5= <"">
##$SUBNAM6= <"">
##$SUBNAM7= <"">
##$SUBNAM8= <"">
##$SUBNAM9= <"">
##$SW= 20.0188882624521
##$SWIBOX= (0..15)
0 0 2 0 0 0 0 0 0 0 0 0 0 0 0 0 
##$SW_h= 4006.41025641026
##$TD= 16384
##$TD0= 1
##$TE= 0
##$TE2= 300
##$TE3= 300
##$TEG= 300
##$TL= (0..7)
0 120 120 120 120 120 120 120 
##$TP= (0..7)
150 150 150 150 150 150 150 150 
##$TP07= 0
##$TPNAME0= <>
##$TPNAME1= <>
##$TPNAME2= <>
##$TPNAME3= <>
##$TPNAME4= <>
##$TPNAME5= <>
##$TPNAME6= <>
##$TPNAME7= <>
##$TPOAL= (0..7)
0.5 0.5 0.5 0.5 0.5 0.5 0.5 0.5 
##$TPOFFS= (0..7)
0 0 0 0 0 0 0 0 
##$TUNHIN= 0
##$TUNHOUT= 0
##$TUNXOUT= 0
##$USERA1= <user>
##$USERA2= <user>
##$USERA3= <user>
##$USERA4= <user>
##$USERA5= <user>
##$V9= 5
##$VALIST= <valist>
##$VCLIST= <CCCCCCCCCCCCCCC>
##$VD= 0
##$VDLIST= <DDDDDDDDDDDDDDD>
##$VPLIST= <PPPPPPPPPPPPPPP>
##$VTLIST= <TTTTTTTTTTTTTTT>
##$WBST= 1024
##$WBSW= 4
##$XGAIN= (0..3)
0 0 0 0 
##$XL= 0
##$YL= 0
##$YMAX_a= 201064
##$YMIN_a= -108672
##$ZGOPTNS= <>
##$ZL1= 120
##$ZL2= 120
##$ZL3= 120
##$ZL4= 120
##$ABSF1= 17.5081
##$ABSF2= -2.510939
##$ABSG= 5
##$ABSL= 3
##$ALPHA= 0
##$AQORDER= 0
##$ASSFAC= 0
##$ASSFACI= 0
##$ASSFACX= 0
##$ASSWID= 0
##$AUNMP= <proc_1d>
##$AZFE= 0.1
##$AZFW= 0.1
##$BCFW= 0
##$BC_mod= 2
##$BYTORDP= 0
##$COROFFS= 0
##$CY= -3
##$DATMOD= 1
##$DC= 0
##$DFILT= <>
##$DTYPP= 0
##$F1P= 0
##$F2P= 0
##$FCOR= 1
##$FTSIZE= 16384
##$FT_mod= 6
##$GAMMA= 0
##$GB= 0
##$INTBC= 1
##$INTSCL= 1.334414e-10
##$ISEN= 128
##$LB= 0.24
##$LEV0= 0
##$LPBIN= 0
##$MAXI= 10000
##$MC2= 0
##$MEAN= 0
##$ME_mod= 0
##$MI= 1.114404
##$NCOEF= 0
##$NC_proc= -8
##$NLEV= 6
##$NOISF1= 3.799351
##$NOISF2= 2.8
##$NSP= 0
##$NTH_PI= 0
##$NZP= 0
##$OFFSET= 17.502
##$PC= 1
##$PHC0= -12433.25
##$PHC1= 12.80101
##$PH_mod= 1
##$PKNL= yes
##$PPARMOD= 0
##$PSCAL= 0
##$PSIGN= 0
##$REVERSE= no
##$SF= 200.13000652975
##$SI= 16384
##$SIGF1= 3
##$SIGF2= 2
##$SINO= 5.538805
##$SIOLD= 16384
##$SREGLST= <1H.CDCl3>
##$SSB= 0
##$STSI= 16384
##$STSR= 0
##$SW_p= 4006.41025641026
##$SYMM= 0
##$S_DEV= 0
##$TDeff= 16384
##$TDoff= 0
##$TI= <>
##$TILT= no
##$TM1= 0
##$TM2= 0
##$TOPLEV= 0
##$USERP1= <user>
##$USERP2= <user>
##$USERP3= <user>
##$USERP4= <user>
##$USERP5= <user>
##$WDW= 1
##$XDIM= 16384
##$YMAX_p= 462256149
##$YMIN_p= -632868
$$ End of Bruker specific parameters
$$ ---------------------------------
##NTUPLES= NMR SPECTRUM
##VAR_NAME=  FREQUENCY,     SPECTRUM/REAL,   SPECTRUM/IMAG
##SYMBOL=    X,             R,               I
##VAR_TYPE=  INDEPENDENT,   DEPENDENT,       DEPENDENT
##VAR_FORM=  AFFN,          ASDF,            ASDF
##VAR_DIM=   16384,         16384,           16384
##UNITS=     HZ,            ARBITRARY UNITS, ARBITRARY UNITS
##FACTOR=    0.24454680195387, 1,            1
##FIRST=     3502.67553613199, 0,            0
##LAST=      -503.734720278273, 0,           0
##MIN=       -503.734720278273, -632868,     0
##MAX=       3502.67553613199, 462256149,    0
$$ Real data points
##PAGE= N=1
##DATA TABLE= (X++(R..R)), XYDATA
$$ [...]
5432A1866594j4310L69441J91086L69287N30613L82992K27378L15309K77444K65530
$$ 11866594 11852284 12221725 12412811 12782098 13312711 13695703 13923081 14238390 14515834 14781364
5422A4781364O38262J002662R67297R09583J004084J248217J220869J712500J849647
$$ 14781364 15419626 16422288 17389585 18299168 19303252 20551469 21772338 23484838 25334485
5413B5334485K177314K220663K032068J993131J586597Q69859j55679j076310
$$ 25334485 27511799 29732462 31764530 33757661 35344258 36214117 36058438 34982128
5405C4982128j590658j811742j782714j484619j115988p85690q98660k04367p7517
$$ 34982128 33391470 31579728 29797014 28312395 27196407 26410717 25512057 25307690 25230173
5396B5230173J6229L9745O75836Q29519P01131J446601J645546J986095K020113
$$ 25230173 25246402 25286147 25961983 26791502 27492633 28939234 30584780 32570875 34590988
5387C4590988K458344K947380L148025L145675L593293L368174K465494J603003
$$ 34590988 37049332 39996712 43144737 46290412 49883705 53251879 55717373 57320376
5379E7320376P43990n72685j847985k984959l998788m017628l601269l383394
$$ 57320376 58064366 57491681 55643696 52658737 48659949 44642321 41041052 37657658
5371C7657658k951388k633458k142963j746969j467061j231179r19290o38444
$$ 37657658 34706270 32072812 29929849 28182880 26715819 25484640 24565350 23926906
5363B3926906l09700m7175l9814K96160P71912Q70519Q95047J280353J699410
$$ 23926906 23617206 23570031 23530217 23826377 24598289 25468808 26363855 27644208 29343618
5354B9343618J500390J236543J512238J161361M99137p12608j452209k234831
$$ 29343618 30844008 32080551 33592789 34754150 35253287 34540679 33088470 30853639
5346C0853639k721253k514822k329407k054216k043912j600478j449503j043874
$$ 30853639 28132386 25617564 23288157 21233941 19190029 17589551 16140048 15096174
5338A5096174j078820j006083p39102p98969p49021n01281k62909m97741l41360
$$ 15096174 14017354 13011271 12272169 11473200 10724179 10222898 9959989 9462248 9120888
5329I120888l42592j13454l46297m08395l56966r4745o4215P768k24958j49673
$$ 9120888 8778296 8664842 8318545 7910150 7553184 7458439 7394224 7401992 7177034 7027361
5319G027361Q0549l1482J21720l84627J19727j10566k8149k42574n66244r9293
$$ 7027361 7107910 7076428 7198148 6813521 6933248 6822682 6794533 6551959 5985715 5886422
5309E886422k34639l5139q3483p9270q3505m6315j19139j50190j27224j77601
$$ 5886422 5651783 5616644 5533161 5453891 5370386 5324071 5204932 5054742 4927518 4749917
5299D749917j29940P5063Q3152P0009q7082K6338j53830N999m7423j19119k229
$$ 4749917 4619977 4695040 4778192 4848201 4761119 4787457 4633627 4639626 4592203 4473084 4470855
5288D470855j38637N2251Q0575j60152j06543R689j18937R1096M4052J7119M9965
$$ 4470855 4332218 4384469 4465044 4304892 4198349 4208038 4089101 4180197 4224249 4241368 4291333
5277D291333q6900K3279j93192K3587j16751j94076r748j20284m9044j37246n4659
$$ 4291333 4204433 4227712 4034520 4058107 3941356 3747280 3737532 3617248 3568204 3430958 3376299
5266C376299n677o429j6202O090M8535r7657p9500L4476j8045N8524J64936k82531
$$ 3376299 3370622 3364193 3347991 3354081 3402616 3304959 3225459 3259935 3241890 3300414 3465350 3182819
5254C182819J01687J27972k32137j430k99631L06755l0212k6359K42083j86674
$$ 3182819 3284506 3412478 3180341 3178911 2879280 3186035 3155823 3129464 3371547 3184873
5244C184873J48676j28330K11637k5532k42983Q4459K20277q2774k0000J47468
$$ 3184873 3333549 3205219 3416856 3391324 3148341 3232800 3453077 3370303 3350303 3497771
5234C497771m9205o4967K3398p8345j51312p9952R775K23366R1850n2652l87811
$$ 3497771 3448566 3383599 3406997 3328652 3177340 3097388 3107163 3330529 3422379 3369727 2981916
5223B981916L69786J42368J84504J4418j31745O6120J73742r6110j429Q8828j75500
$$ 2981916 3351702 3494070 3678574 3692992 3561247 3627367 3801109 3704999 3703570 3792398 3616898
5212C616898p1479R6938j55170k23069L72112m0706j45322L0906J18369O5547
$$ 3616898 3545419 3642357 3487187 3264118 3636230 3595524 3450202 3481108 3599477 3665024
5202C665024J90297l4668J57242R303o1099P6319k7900J93267J13818q296j16811
$$ 3665024 3855321 3820653 3977895 3987198 3926099 4002418 3974518 4167785 4281603 4273307 4156496
5191D156496J13695j01568J05604K31353j30252O6910J49872M746k0506p1108
$$ 4156496 4270191 4168623 4274227 4505580 4375328 4442238 4592110 4596856 4576350 4505242
5181D505242J45814O0213R5992j14128q9318K87077J0067l613j19910K42123K18949
$$ 4505242 4651056 4711269 4807261 4693133 4603815 4890892 4900959 4897346 4777436 5019559 5238508
5170E238508M2811L15483K9100K3231J92174J15705m7950K62509J24650R9297
$$ 5238508 5281319 5596802 5625902 5649133 5841307 5957012 5909062 6171571 6296221 6395518
5160F395518k27372r8804q1079j74892M3173J12369r4295k17057L0977L81650
$$ 6395518 6168146 6069342 5988263 5813371 5856544 5968913 5874618 5657561 5688538 6070188
5150F070188j4763K05755M47328M2992K94488J20271L26869L14523Q5024p5471
$$ 6070188 6055425 6261180 6708508 6751500 7045988 7166259 7493128 7807651 7892675 7817204
5140G817204K43322K89495p0348q9933O9326j84469k78628k28427n8251J21064
$$ 7817204 8060526 8350021 8279673 8189740 8259066 8074597 7795969 7567542 7509291 7630355
5130G630355K62579r0153m2805J07315N64770K17559l890J98382J61597J98233
$$ 7630355 7892934 7802781 7759976 7867291 8432061 8649620 8645730 8844112 9005709 9203942
5120I203942L10274O1185J28307L63071N20938M88386M38105J94408K05257L20121
$$ 9203942 9514216 9575401 9703708 10066779 10587717 11076103 11514208 11708616 11913873 12233994
5110A2233994K72904j23501m90336l89432l76326J52908n3922Q2095q7076K602
$$ 12233994 12506898 12383397 11893061 11503629 11127303 11280211 11226289 11308384 11221308 11223910
5100A1223910K75419L26983r5480P4185K66716L73551K49980M4510N19965M26580
$$ 11223910 11499329 11826312 11730832 11805017 12071733 12445284 12695264 12739774 13259739 13686319
5090A3686319M41182O93836Q67682R37172J053934P35949N81566J011408J178501
$$ 13686319 14127501 14821337 15689019 16626191 17680125 18416074 18997640 20009048 21187549
5081B1187549P36514n22348j516794j277577q39821m44920k80208J65820j60719
$$ 21187549 21924063 21401715 19884921 18607344 17767523 17322603 17042395 17208215 17047496
5072A7047496l30568L0926K43550K02654L73818L94276J40479K87831N67322Q75036
$$ 17047496 16716928 16747854 16991404 17194058 17567876 17962152 18102631 18390462 18957784 19832820
5062A9832820N52223R01586Q26334J126029J444415J309992J207238J022059J085245
$$ 19832820 20385043 21286629 22112963 23238992 24683407 25993399 27200637 28222696 29307941
5053B9307941J748709Q28302n36187p56059n18720k82315K42291M49803R53494
$$ 29307941 31056650 31884952 31348765 30592706 30073986 29791671 30033962 30483765 31437259
5044C1437259J177596J352454J472011J454377J640364K064664K373074K709279
$$ 31437259 32614855 33967309 35439320 36893697 38534061 40598725 42971799 45681078
5036D5681078L184613L417794L890875M314568M953952N299801O427399P167051
$$ 45681078 48865691 52283485 56174360 60488928 65442880 70742681 77170080 84337131
5028H4337131P950599Q221442Q508500Q912701Q349281P154777N924303M937323
$$ 84337131 92287730 100509172 109017672 117930373 126279654 133434431 139358734 144296057
5020A44296057L027415j61621l049423m719025n388122n598704n218608n129604
$$ 144296057 147323472 147161851 144112428 139393403 134005281 128406577 123187969 118058365
5012A18058365n075588m559249m301198l877340l474924l068009k668994k523220
$$ 118058365 112982777 108423528 104122330 100244990 96770066 93702057 91033063 88509843
5004H8509843j944511j814337j624053j131847j161339r23813k20925L2265m57322
$$ 88509843 86565332 84750995 83126942 81995095 80833756 79909943 79689018 79721283 79263961
4995G9263961k265816m330436m843769m662972l839784k959585k480034j967996
$$ 79263961 76998145 72667709 67823940 63160968 59321184 56361599 53881565 51913569
4987E1913569j907139j436266j675080j556945j637877j251591j142098r39333
$$ 51913569 50006430 48570164 46895084 45338139 43700262 42448671 41306573 40367240
4979D0367240q21543r16780o34956p95601o59701k39183q1650q15985j955497
$$ 40367240 39545697 38628917 37993961 37198360 36538659 36299476 36217826 35401841 33446344
4970C3446344k704617k639220k163493j916255j540110j361721r00740r20150
$$ 33446344 30741727 28102507 25939014 24022759 22482649 21120928 20220188 19300038
4962A9300038r58840m38029n67274o53934n38479o14842n97066n26951j57763
$$ 19300038 18341198 17903169 17335895 16681961 16143482 15528640 14931574 14404623 14246860
4953A4246860n52531o06100j44509p2248k70760m66597o0572m67053k63989k77511
$$ 14246860 13694329 13088229 12943720 12871472 12600712 12134115 12073543 11606490 11342501 11064990
4943A1064990j4034j82989k11443K3937j63891j02090m0074k59110j46626j85236
$$ 11064990 11050956 10867967 10656524 10680461 10516570 10414480 10374406 10115296 9968670 9783434
4933I783434j26853j66911L8623l4239q0779l92768O4084l45600l53119K00482
$$ 9783434 9656581 9489670 9528293 9494054 9413275 9020507 9084591 8738991 8385872 8586354
4923H586354m5880l49488K6694k21112J01985j68264K4948J14985j28890k84489
$$ 8586354 8540474 8190986 8217680 7996568 8098553 7930289 7955237 8070222 7941332 7656843
4913G656843k20006N6352k23239r9536M6581p6268K0824L7288M5673J96452q2071
$$ 7656843 7436837 7493189 7269950 7170414 7216995 7140727 7161551 7198839 7244512 7440964 7358893
4902G358893j18848j78651n6582J10973J75166L01529J73979j24277K12532q0527
$$ 7358893 7240045 7061394 7004812 7115785 7290951 7592480 7766459 7642182 7854714 7774187
4892G774187p0926N3157J88983N7585j80556L8858L6431J69970J85825K71324
$$ 7774187 7703261 7756418 7945401 8002986 7822430 7861288 7897719 8067689 8253514 8524838
4882H524838K90102K69838q2946J97608N56437J37575M18599N35347O65571L65896
$$ 8524838 8814940 9084778 9001832 9199440 9755877 9893452 10312051 10847398 11512969 11878865
4872A1878865N66335O45731P81034R23775J628283J674502J765117K202156L165011
$$ 11878865 12445200 13090931 13871965 14795740 16424023 18098525 19863642 22065798 25230809
4863B5230809L320660M233526L567070J562749K762750M570781O394095J943168
$$ 25230809 28551469 32784995 36352065 37914814 40677564 45248345 51642440 53585608
4855E3585608p265777q843606p474468n624745l857301k551304k279762j687986
$$ 53585608 46319831 37476225 30001757 24377012 20519711 17968407 15688645 14000659
4847A4000659j416515j190892p27002p78458o35869o38062l54526k06531k55949
$$ 14000659 12584144 11393252 10666250 9887792 9251923 8613861 8259335 8052804 7796855
4838G796855l48275k75562n5002k76350l04822k1673q2863M7584p9871j23786
$$ 7796855 7448580 7173018 7118016 6841666 6536844 6515171 6432308 6479892 6400021 6276235
4828F276235m11241j27273n2643j12230j88029j23589N1739m0490k39353N9765
$$ 6276235 5864994 5737721 5685078 5572848 5384819 5261230 5312969 5272479 5033126 5092891
4818E092891m0581m6023K9572q2124j7394j79678q5350q5223O0981j6838j73259
$$ 5092891 5052310 5006287 5035859 4953735 4936341 4756663 4671313 4586090 4647071 4630233 4456974
4807D456974K53059k60569K69r5764R6524j55867R5142J4380N5361j52319k0889
$$ 4456974 4710033 4449464 4449733 4353969 4450493 4294626 4389768 4404148 4459509 4307190 4286301
4796D286301K8515j43984k7259n6269r3733J9384J4832j04272j901R3706j13613
$$ 4286301 4314816 4170832 4143573 4087304 3993571 4012955 4027787 3923515 3921614 4015320 3901707
4785C901707j95672N5495R3343r1597K2339N7731j81016R3467k1917K9027J38082
$$ 3901707 3706035 3761530 3854873 3763276 3785615 3843346 3662330 3755797 3733880 3762907 3900989
4774C900989j14760k5483N4397k66236r3240O9773J3765Q0896K1183J38560j20687
$$ 3900989 3786229 3760746 3815143 3548907 3455667 3525440 3539205 3620101 3641284 3779844 3659157
4763C659157j83518L00325J9687k09114q5047q0986m9012J44461K12439K92783
$$ 3659157 3475639 3775964 3795651 3586537 3501490 3420504 3371492 3515953 3728392 4021175
4753D021175k64153k29774n0613J73778P1534J59332p9615p9532m6561n6542L7105
$$ 4021175 3757022 3527248 3476635 3650413 3721947 3881279 3801664 3722132 3675571 3619029 3656134
4742C656134L2430l1006L33178r8513k07706L70391n0158l06158k18539j74127
$$ 3656134 3688564 3657558 3990736 3892223 3684517 4054908 4004750 3698592 3480053 3305926
4732C305926M4832K40935J03936r4823k77046k1350P1756L56160k22428k19926
$$ 3305926 3350758 3591693 3695629 3600806 3323760 3302410 3374166 3730326 3507898 3287972
4722C287972J29091k14369j37153K73149J86982j07837K68570k12340J03037n0801
$$ 3287972 3417063 3202694 3065541 3338690 3525672 3417835 3686405 3474065 3577102 3526301
4712C526301j3150L09133j7965K1556j69757J9732l5774O9678k3693j95749j37484
$$ 3526301 3513151 3822284 3804319 3825875 3656118 3675850 3640076 3709754 3686061 3490312 3352828
4701C352828J21359J8816K50493j61391l4033j8186Q035n5286j03297J58423K97464
$$ 3352828 3474187 3493003 3743496 3582105 3548072 3529886 3537921 3482635 3379338 3537761 3835225
4690C835225m081Q7825K6926p1895j18977n0963K33988l22069R1994l7880r4008
$$ 3835225 3831144 3918969 3945895 3874000 3755023 3704060 3938048 3615979 3707973 3670093 3576085
4679C576085K05024o202j48410J75977q2183j57410K4346K29544m5727k76266
$$ 3576085 3781109 3774907 3626497 3802474 3720291 3562881 3587227 3816771 3771044 3494778
4669C494778K07800K79274j53448l5301Q2891m9649o215J50609J11718j81139
$$ 3494778 3702578 3981852 3828404 3793103 3875994 3826345 3820130 3970739 4082457 3901318
4659C901318Q5864J0907j12565j04875K48576k8603J41029j39272j85778P8157
$$ 3901318 3987182 3998089 3885524 3780649 4029225 4000622 4141651 4002379 3816601 3894758
4649C894758P4245o9973p1235P7566j4828K41397j00751k77234n6774K56202j5131
$$ 3894758 3969003 3899030 3827795 3905361 3890533 4131930 4031179 3753945 3697171 3953373 3938242
4638C938242k1450K5910J05301j9622J15187P3873M808k20156q4711P2283J84421
$$ 3938242 3916792 3942702 4048003 4028381 4143568 4217441 4222249 4002093 3917382 3989665 4174086
4627D174086n688q5965J93382n6227j31323j42464J53478J6124J670Q7303P0071
$$ 4174086 4168398 4082433 4275815 4219588 4088265 3945801 4099279 4115403 4117073 4204376 4274447
4616D274447j89261j33083J07099L6550R1069J23702o3589M9163r8232r1670P0387
$$ 4274447 4085186 3952103 4059202 4095752 4186821 4310523 4246934 4296097 4197865 4106195 4176582
4605D176582J16556L5660J23011J08533k09227Q0533K37053l211j61878J28626
$$ 4176582 4293138 4328798 4451809 4560342 4351115 4431648 4668701 4665490 4503612 4632238
4595D632238p1711m5262m1510K55041L2959j65693J82866J09639J23062m8331
$$ 4632238 4560527 4515265 4473755 4728796 4761755 4596062 4778928 4888567 5011629 4963298
4585D963298J56456J12808k94759j17765P5552R763Q7879J39726o466L283j36236
$$ 4963298 5119754 5232562 4937803 4820038 4895590 4905353 4993232 5132958 5126492 5129775 4993539
4574D993539J45607J6067L60008j02783j07525K15780K05399Q3588k4443J24278
$$ 4993539 5139146 5155213 5515221 5412438 5304913 5520693 5726092 5809680 5785237 5909515
4564E909515k06615L4839L3502Q9739l8733J48119J84002k00134L6165o1739m3275
$$ 5909515 5702900 5737739 5771241 5860980 5822247 5970366 6154368 5954234 5990399 5928660 5885385
4553E885385j40155J5553r2658O1512K40774j73763L11743O6719k25056M74685
$$ 5885385 5745230 5760783 5668125 5729637 5970411 5796648 6108391 6175110 5950054 6424739
4543F424739j77964l66473K08666R7270J26630j88122N81180j70264r6062L44285
$$ 6424739 6246775 5880302 6088968 6186238 6312868 6124746 6705926 6535662 6439600 6783885
4533F783885k1116l8220q6947O8952K86652J25190j27696L31647J89158n2565
$$ 6783885 6762769 6724549 6637602 6706554 6993206 7118396 6990700 7322347 7511505 7458940
4523G458940R7873K57219L23710p1463R8123j99224j55198J23733n3971Q4050
$$ 7458940 7556813 7814032 8137742 8066279 8164402 7965178 7809980 7933713 7879742 7963792
4513G963792L9820J16463O5441K18652L61772Q8901M4051J72807J86220l0573
$$ 7963792 8003612 8120075 8185516 8404168 8765940 8854841 8898892 9071699 9257919 9227346
4503I227346K68105L03363K89045L42244K63240L08412Q1258L95380J41065j53446
$$ 9227346 9495451 9798814 10087859 10430103 10693343 11001755 11083013 11478393 11619458 11466012
4493A1466012J32037K91782p885M5959K10137K34160P3828M30868J6003K32256
$$ 11466012 11598049 11889831 11881946 11927905 12138042 12372202 12446030 12876898 12892901 13125157
4483A3125157L31830J47271K95433K37955L11019K75748K68773L88770N83109
$$ 13125157 13456987 13604258 13899691 14137646 14448665 14724413 14993186 15381956 15965065
4474A5965065J70434K79259R5346J65289K37561J23017K09983N48508J33883L4470
$$ 15965065 16135499 16414758 16510104 16675393 16912954 17035971 17245954 17794462 17928345 17962815
4464A7962815J18528N05021J04759K93400M57209K78078M24768M25856J38712
$$ 17962815 18081343 18586364 18691123 18984523 19441732 19719810 20144578 20570434 20709146
4455B0709146Q7742J82121M14088N18106K06307N40694N90006N57607K53604L42448
$$ 20709146 20796888 20979009 21393097 21911203 22117510 22658204 23248210 23805817 24059421 24401869
4445B4401869L99879L18951P30041N09588L20552O61404R66134N50113P23072
$$ 24401869 24801748 25120699 25850740 26360328 26680880 27342284 28308418 28858531 29581603
4436B9581603O88741Q54137P01051Q49336R18635J027558J296800J091238J033488
$$ 29581603 30270344 31124481 31825532 32674868 33593503 34621061 35917861 37009099 38042587
4427C8042587J033490J522597J215516J209977J323726J799537J581786J777846
$$ 38042587 39076077 40598674 41814190 43024167 44347893 46147430 47729216 49507062
4419D9507062J822771K260706K509100K686354K738676K844404L178894L232820
$$ 49507062 51329833 53590539 56099639 58785993 61524669 64369073 67547967 70780787
4411G0780787L668789M042477M207873M134033M568246M828413N274553N407728
$$ 70780787 74449576 78492053 82699926 86833959 91402205 96230618 101505171 106912899
4403A06912899N466706N677413N843792O195404O371662O806746O822977O521482
$$ 106912899 112379605 118057018 123900810 130096214 136467876 143274622 150097599 156619081
4395A56619081N983688N719380M708610L182937Q87177j082368l170959n149364
$$ 156619081 162602769 168322149 173030759 176213696 177100873 176018505 172847546 167698182
4387A67698182o857097q295066q340880p666020p124667o313217n619827n351948
$$ 167698182 160841085 152546019 144205139 136539119 129414452 123101235 117481408 112129460
4379A12129460n600382o243310o506724o489105n899562n272623m679562l835741
$$ 112129460 106529078 100285768 93779044 87289939 81390377 76117754 71438192 67602451
4371F7602451l113559k577359k358470j603570j409739j075358r97348p54044
$$ 67602451 64488892 61911533 59553063 57949493 56539754 55464396 54467048 53713004
4363E3713004m90383n71464n31040m56417n73297l85151p80315q65847j121366
$$ 53713004 53222621 52651157 52120117 51663700 51090403 50705252 49924937 49059090 47937724
4354D7937724j572302j528183j627810j762763j501571j586952j474045j112910
$$ 47937724 46365422 44837239 43209429 41446666 39945095 38358143 36884098 35771188
4346C5771188j044354o86442o45572q55149q66364j078999j392496j481388j268362
$$ 35771188 34726834 34040392 33394820 32539671 31673307 30594308 29201812 27720424 26452062
4337B6452062o23377r90218o81430n42175o54055n25836n87249n05990l99103
$$ 26452062 25828685 24838467 24157037 23614862 22960807 22434971 21847722 21341732 20942629
4328B0942629k46385j19340l46923l95835k93603j11357k32347j97806k80383
$$ 20942629 20696244 20576904 20229981 19834146 19540543 19429186 19196839 18999033 18718650
4319A8718650m40088j81330j86879k74738L27361l27863l24489L9505j51332l97579
$$ 18718650 18278562 18097232 17910353 17635615 17962976 17635113 17310624 17350129 17198797 16801218
4309A6801218J37853M4616m66674l17209J31771k0712m6685p6562j30809j13117
$$ 16801218 16939071 16983687 16517013 16199804 16331575 16310863 16264178 16187616 16056807 15943690
4299A5943690j28765j33909L37800J19084k23602k71376J42840r1365j28036M8450
$$ 15943690 15814925 15681016 16018816 16137900 15914298 15642922 15785762 15694397 15566361 15614811
4289A5614811j4779J60590J31535k03878L1109J99465J21510M163l0664J7905
$$ 15614811 15600032 15760622 15892157 15688279 15719388 15918853 16040363 16044526 16013862 16031767
4279A6031767l3142L12663j2844j08939L43713K81080P3788J12331J41488Q909
$$ 16031767 15998625 16311288 16298444 16189505 16533218 16814298 16888086 17000417 17141905 17150814
4269A7150814K62469J92754j05148Q5344K03920L0210L10072K41207K8636K39685
$$ 17150814 17413283 17606037 17500889 17586233 17790153 17820363 18130435 18371642 18400278 18639963
4259A8639963L62623M51733M71119K04627J52493K24170L80706K63712J31809
$$ 18639963 19002586 19454319 19925438 20130065 20282558 20506728 20887434 21151146 21282955
4250B1282955Q9619l6382K09617J66535K98572K01353M03329M11069L35048K01839
$$ 21282955 21372574 21336192 21545809 21712344 22010916 22212269 22615598 23026667 23361715 23563554
4240B3563554O04527M97722O33417O65778O43519Q35967Q21307M01118Q39794
$$ 23563554 24168081 24665803 25299220 25964998 26608517 27444484 28265791 28666909 29506703
4231B9506703O13041Q07582Q39066M72174O36538N32923P27737R21247M22166
$$ 29506703 30119744 30927326 31766392 32238566 32875104 33408027 34135764 35057011 35479177
4222C5479177P44832P27882O91876Q89569R89999J249371J607577K125559K418997
$$ 35479177 36224009 36951891 37643767 38533336 39523335 40772706 42380283 44505842 46924839
4213D6924839K235381K449421K480504K553680J891403J524761O88364n00149
$$ 46924839 49160220 51609641 54090145 56643825 58535228 60059989 60748353 60248204
4205F0248204p51206r35996j223437j331056j155290j107954p11645j99913l02534
$$ 60248204 59496998 58561002 57337565 56006509 54851219 53743265 53031620 52831707 52529173
4196E2529173k02720J85134N91118Q25815J365856J671177J935026K070390K617489
$$ 52529173 52326453 52511587 53102705 53928520 55294376 56965553 58900579 60970969 63588458
4187F3588458L245684L739398M151042M516258M624303M416606L941198K667560
$$ 63588458 66834142 70573540 74724582 79240840 83865143 88281749 92222947 94890507
4179I4890507J282103r65025k857131l519779l464230l113984k516843j973722
$$ 94890507 96172610 95207585 92350454 88830675 85366445 82252461 79735618 77761896
4171G7761896o97151l72105J5254M03933R34303J273418J693787K393072L161731
$$ 77761896 77064745 76692640 76707894 77111827 78046130 79319548 81013335 83406407 86568138
4162H6568138L377594M612480N662124O173805P566101Q625531R873544J1203032
$$ 86568138 89945732 94558212 100220336 106394141 113960242 122585773 132459317 143662349
4154A43662349J2750688J4452586J6465030J7774595J8464956J8498362J6566031
$$ 143662349 156413037 170865623 187330653 205105248 223570204 242068566 258634597
4147B58634597J2661550L864370q873995k0020377k4612185k3522448j9869138
$$ 258634597 271296147 275160517 266286522 246266145 221653960 198131512 178262374
4140A78262374j6395604j3631548j3026042j2615769j1891088j0243305q577895
$$ 178262374 161866770 148235222 135209180 122593411 110702323 100459018 91881123
4133I1881123p162868o092331n382491m357562l589786l263015k932293k022261
$$ 91881123 84718255 78625924 73243433 68885871 65296085 62033070 59100777 57078516
4125E7078516j867262j787576j589891j111612j138971j143990j157284j011697
$$ 57078516 55211254 53423678 51833787 50722175 49583204 48439214 47281930 46270233
4117D6270233r09912r80522j237327j173773n85817o39355q62347r69556q89519
$$ 46270233 45360321 44379799 43142472 41968699 41382882 40743527 39881180 38911624 38022105
4108C8022105m60556n01378l89103k51674k66564m04453P5327J036K69513M55648
$$ 38022105 37561549 37060171 36671068 36419394 36152830 35748377 35823704 35824740 36094253 36549901
4098C6549901K51448K98224K00417O3646m16941m86103n66033o83939o56527q14591
$$ 36549901 36801349 37099573 37299990 37363636 36946695 36460592 35894559 35210620 34554093 33739502
4088C3739502r96826q45356p46849k86465k79452l78854j73049l8185r5544K725
$$ 33739502 32742676 31897320 31150471 30864006 30584554 30205700 30032651 29994466 29898922 29901647
4078B9901647K87908K00335j6459L13846K39210L81652M16886J74186L2653m18878
$$ 29901647 30189555 30389890 30373431 30687277 30926487 31308139 31725025 31899211 31931864 31512986
4068C1512986m59006p11008r80718p42054q66529o06136m40594j98540K0545j58712
$$ 31512986 31053980 30342972 29362254 28620200 27753671 27147535 26706941 26508401 26528946 26370234
4058B6370234l66258m354j57039m49681j3291j11673k1357j7053J86731R8838
$$ 26370234 26003976 25999622 25842583 25392902 25379611 25267938 25246581 25229528 25416259 25515097
4048B5515097l30714k83494p7227o35412m81314n23792l47232l809m28033l67855
$$ 25515097 25184383 24900889 24823662 24188250 23706936 23183144 22835912 22832103 22404070 22036215
4038B2036215m03484k67008l02234k91462K14266j38716Q1640j2116J02062J15503
$$ 22036215 21632731 21365723 21063489 20772027 20986293 20847577 20929217 20917101 21019163 21134666
4028B1134666L70656n5482m2437J95283l9253o3698p3539M9653j43938l74099
$$ 21134666 21505322 21449840 21407403 21602686 21563433 21499735 21426196 21475849 21331911 20957812
4018B0957812k53401l53494l18359j36947k02169p0343K1194K13819M0803p3434
$$ 20957812 20704411 20350917 20032558 19895611 19693442 19623099 19644293 19858112 19898915 19825481
4008A9825481K736R6215O9961J36364P4271N12699K38669q1837L68961K34343
$$ 19825481 19828217 19924432 19994393 20130757 20205028 20717727 20956396 20874559 21243520 21477863
3998B1477863L0507P0745K72616L20692N35484L19539P70829N79478N84655J169126
$$ 21477863 21508370 21579115 21851731 22172423 22707907 23027446 23798275 24377753 24962408 26131534
3988B6131534J260226J699872J521286J797571J925253K118343K325618K743391
$$ 26131534 27391760 29091632 30612918 32410489 34335742 36454085 38779703 41523094
3980D1523094K860674L014152K744733J686639l16246j712138k425081k947692
$$ 41523094 44383768 47397920 50142653 51829292 51513046 49800908 47375827 44428135
3972D4428135k946828k894938j750241j659053j634645j442547j196170j024156
$$ 44428135 41481307 38586369 36836128 35177075 33542430 32099883 30903713 29879557
3964B9879557j039382r06442o47567m37111l94365m37551n02428n59900o18759
$$ 29879557 28840175 27933733 27286166 26849055 26454690 26017139 25514711 24954811 24336052
3955B4336052l58869l99102l77299j85190k11623p1422j98321l03782l60416k65888
$$ 24336052 23977183 23578081 23200782 23015592 22803969 22732547 22534226 22230444 21870028 21604140
3945B1604140k3611l06520p4267l4150m1133j13181J00220j1866q7210O3731K3999
$$ 21604140 21580529 21274009 21199742 21165592 21124459 21011278 21111498 21099632 21012422 21076153 21100152
3934B1100152Q7426L02218p4122r5155K82781J78292k16020K44937M01671L29700
$$ 21100152 21187578 21489796 21415674 21320519 21603300 21781592 21565572 21810509 22212180 22541880
3924B2541880L44291O06293M77208N40437N70255Q25234O67373R57317Q78671
$$ 22541880 22886171 23492464 23969672 24510109 25080364 25905598 26572971 27530288 28408959
3915B8408959J114116M86167K63695K13840j79K24849K02293L98327L02752O24902
$$ 28408959 29523075 30009242 30272937 30486777 30486598 30711447 30913740 31312067 31614819 32239721
3905C2239721O92933P46499P57685J187612J153846J559379K027852K357574K383404
$$ 32239721 32932654 33679153 34436838 35624450 36778296 38337675 40365527 42723101 45106505
3896D5106505L205206L818425M417450N342023O030127O024148N693749M763652
$$ 45106505 48311711 52130136 56547586 61889609 67919736 73943884 79637633 84401285
3888H4401285O00884n182732q488637q368419o365044m679581l264723k075793
$$ 84401285 85002169 79819437 71330800 62962381 56597337 51917756 48653033 46577240
3880D6577240j517590j000171r8867M47093Q85982P11259O86097M35038j96710
$$ 46577240 45059650 44059479 43960612 44407705 45293687 46004946 46691043 47126081 46929371
3871D6929371j125441j788937j912382j482892j263649j143405j504998j280583
$$ 46929371 45803930 44014993 42102611 40619719 39356070 38212665 36707667 35427084
3863C5427084q42757r41996n18080m27931m40950k53773j57999J67978K06377
$$ 35427084 34584327 33642331 33124251 32696320 32255370 32001597 31843598 32011576 32217953
3854C2217953L92402N22860K54637J4845M1006j66207k19337l28661J17408K94180
$$ 32217953 32610355 33133215 33387852 33402697 33443703 33277496 33058159 32729498 32846906 33141086
3844C3141086K76660L38412O34682J85912L34717O15843O08432J077912K006873
$$ 33141086 33417746 33756158 34390840 34576752 34911469 35527312 36135744 37213656 39220529
3835C9220529R45390j669420k447820k347252j325816j140625q99155n37392n21198
$$ 39220529 40165919 38496499 36048679 33701427 32375611 31234986 30335831 29798439 29277241
3826B9277241k96390R5302J79965j45642O7263N30737L31609O17954K85016M31673
$$ 29277241 28980851 29076153 29256118 29110476 29177739 29708476 30040085 30658039 30943055 31374728
3816C1374728M98356M83512N14990M64350N33047Q14652P64875R61704O82020
$$ 31374728 31873084 32356596 32871586 33335936 33868983 34683635 35448510 36410214 37092234
3807C7092234O98158J041295P09590K52807P86289R16603M07476O64433Q23803
$$ 37092234 37790392 38831687 39541277 39794084 40580373 41496976 41904452 42568885 43392688
3798D3392688R05369M04967L22606J65806K9117P6224L54756L49510K90718J95191
$$ 43392688 44298057 44703024 45025630 45191436 45220553 45296777 45651533 46001043 46291761 46486952
3788D6486952L01722N3533J2777J01941k82461o15958q40276q32464q25058o72626
$$ 46486952 46788674 46842207 46854984 46956925 46674464 46058506 45218230 44385766 43560708 42888082
3778D2888082r23847n43874l92804n25107o42101p46889q95781j047004j164672
$$ 42888082 41964235 41420361 41027557 40502450 39860349 39113460 38217679 37170675 36006003
3769C6006003j284900j311767j457724j400739j144567j032961n96177q61348
$$ 36006003 34721103 33409336 31951612 30550873 29406306 28373345 27777168 26915820
3761B6915820r39297o83578o14421p79766j094162q99521p97595o69537r18964
$$ 26915820 25976523 25292945 24678524 23898758 22804596 21905075 21107480 20437943 19518979
3752A9518979o16774p62990m94675l04882n17136n14617n03028j78478m96522
$$ 19518979 18902205 18139215 17644540 17339658 16822522 16307905 15804877 15626399 15129877
3743A5129877j80222l54519l55165k09173k90261n48213k91630k9300k25391p5161
$$ 15129877 14949655 14595136 14239971 14030798 13740537 13192324 12900694 12871394 12646003 12570842
3733A2570842k91824j64524J34522l52423k23014k4882j32530j31994k00063l60491
$$ 12570842 12279018 12114494 12249016 11896593 11673579 11648697 11516167 11384173 11184110 10823619
3723A0823619j43042J16930j39900k22593J30838k5298j59401l67452l0977j4419
$$ 10823619 10680577 10797507 10657607 10435014 10565852 10540554 10381153 10013701 9982724 9968305
3713I968305j38836M1396j49800j05843j12729n626j98088J2190P8469j72685
$$ 9968305 9829469 9870865 9721065 9615222 9502493 9496867 9298779 9310969 9389438 9216753
3703I216753q1126R0760n420j83714Q8004K3613J00081k7113l08639J98689J60488
$$ 9216753 9135627 9226387 9220967 9037253 9125257 9148870 9248951 9221838 8913199 9111888 9272376
3692I272376J06140K1971j09641j43627R520M3950p5629l9025J4279o2051J76909
$$ 9272376 9378516 9400487 9290846 9147219 9156739 9200689 9125060 9086035 9100314 9038263 9215172
3681I215172l0440J61176O4326N0838j07331o85N9169J36079m3289p7999N6459
$$ 9215172 9184732 9345908 9410234 9461072 9353741 9353056 9412225 9548304 9505015 9427016 9483475
3670I483475K32785J36856o9607L7989J55580J5122L43418O2699n1185K07222
$$ 9483475 9716260 9853116 9783509 9821498 9977078 9992200 10335618 10398317 10347132 10554354
3660A0554354L24424o9177j7738M63304J63948o8678R4908M25862K73361L89059
$$ 10554354 10878778 10809601 10791863 11255167 11419115 11350437 11445345 11871207 12144568 12533627
3650A2533627K47322R5505M99466K71629L59949K05989M18099N76137N12817P73529
$$ 12533627 12780949 12876454 13375920 13647549 14007498 14213487 14631586 15207723 15720540 16494069
3640A6494069L24926L65998P17427Q59429O57150L66269M94085J44282j03281
$$ 16494069 16818995 17184993 17902420 18761849 19418999 19785268 20279353 20423635 20320354
3631B0320354K8660j601q788m0796j45097j72899L23583J58995K83563J59572
$$ 20320354 20349014 20347413 20338625 20297829 20152732 19979833 20303416 20462411 20745974 20905546
3621B0905546M06213P23914O79513R73730R20354R82761J178480J451374J424460
$$ 20905546 21311759 22035673 22715186 23688916 24609270 25592031 26770511 28221885 29646345
3612B9646345J712894K046402J603063J664897J449604J498169J024448R4381
$$ 29646345 31359239 33405641 35008704 36673601 38123205 39621374 40645822 40740203
3604D0740203n95683o84260r15627j206497j331052j292281j416053j130691o00233
$$ 40740203 40144520 39460260 38544633 37338136 36007084 34714803 33298750 32168059 31567826
3595C1567826k93871j47287J7429P633L74855N69016P25071R75961J152634J419045
$$ 31567826 31273955 31126668 31144097 31151730 31526585 32095601 32820672 33796633 34949267 36368312
3585C6368312J571333J593563J758683K094083K307056K036918J787530J642264
$$ 36368312 37939645 39533208 41291891 43385974 45693030 47729948 49517478 51159742
3577E1159742N96980m03042p51668j968105k074954k311034k170549k219132k137681
$$ 51159742 51756722 51353680 50602012 48633907 46558953 44247919 42077370 39858238 37720557
3568C7720557j748003j186998j120509j015138m18976j25279o8359p1888M38091
$$ 37720557 35972554 34785556 33665047 32649909 32230933 32105654 32037295 31965407 32403498
3559C2403498N00804P29232R55580J128852J269590J555415J743001J631750J283295
$$ 32403498 32904302 33633534 34589114 35717966 36987556 38542971 40285972 41917722 43201017
3550D3201017J525808O94075J85774j95177q62419j709467j662551k044024k052618
$$ 43201017 44726825 45420900 45606674 45411497 44549078 42839611 41177060 39133036 37080418
3541C7080418j902419j288158j239184j481469j173997q69641r50296r46036q22453
$$ 37080418 35177999 33889841 32650657 31169188 29995191 29125550 28175254 27229218 26406765
3532B6406765j058171r17752r59529o65468n10791o04378o04195m99054k50405
$$ 26406765 25348594 24430842 23471313 22805845 22295054 21690676 21086481 20587427 20337022
3523B0337022p0781O037k06228k84177k41558o00561l02891o27678m91776m87173
$$ 20337022 20266241 20272278 20066050 19781873 19540315 18939754 18636863 18009185 17517409 17030236
3513A7030236p78337o09389k96645m81762o28390l47894k15283k79958l42412
$$ 17030236 16251899 15642510 15345865 14864103 14235713 13887819 13672536 13392578 13050166
3504A3050166m24762l74950j91217j64441k50026k15523J6266k12973j6853J4363
$$ 13050166 12625404 12250454 12059237 11894796 11644770 11429247 11445513 11232540 11215687 11230050
3494A1230050j35892k20381J22371p0500M5974P2053l0367K5176K58105K45872
$$ 11230050 11094158 10873777 10996148 10925648 10971622 11043675 11013308 11038484 11296589 11542461
3484A1542461P1306p4615j1282k81047N2487j46738j74386J05377m28392m6011
$$ 11542461 11613767 11539152 11527870 11246823 11299310 11152572 10978186 11083563 10655171 10609160
3474A0609160J94181Q513j26430K06744L0123j60957J14583J10536j25948J04677
$$ 10609160 10803341 10811854 10685424 10892168 10922291 10761334 10875917 10986453 10860505 10965182
3464A0965182P1849J14018L5869j01679Q5155J39322J19951k05088L53955J31745
$$ 10965182 11037031 11151049 11186918 11085239 11170394 11309716 11429667 11224579 11578534 11710279
3454A1710279r6906K81061k30395k24377K63413J30942J11646L04233M9560K27900
$$ 11710279 11613373 11894434 11664039 11439662 11703075 11834017 11945663 12249896 12299456 12527356
3444A2527356P1166P8802K16468K43575J83767L79515K71667L77767j03497J60194
$$ 12527356 12598522 12677324 12893792 13137367 13321134 13700649 13972316 14350083 14246586 14406780
3434A4406780N00485p7013K55903J69561L34703J66968r1917M00650J13188L18021
$$ 14406780 14907265 14830252 15086155 15255716 15590419 15757387 15665470 16066120 16179308 16497329
3424A6497329K77036J9259K15068K87390M21626L49629M96976M81494M62715P41791
$$ 16497329 16774365 16793624 17008692 17296082 17717708 18067337 18564313 19045807 19508522 20250313
3414B0250313P70185J146524J013211J051114J535733J361845J910236J897352
$$ 20250313 21020498 22167022 23180233 24231347 25767080 27128925 29039161 30936513
3406C0936513K272331K163029J953476K207659K129036J534359L96087J94766
$$ 30936513 33208844 35371873 37325349 39533008 41662044 43196403 43592490 43787256
3398D3787256L79470R06696J487623K115880K567933K682638K472270K549958
$$ 43787256 44166726 45073422 46561045 48676925 51244858 53927496 56399766 58949724
3390E8949724K276697J771162J699831J610062J890287K229386K567582K054700
$$ 58949724 61226421 62997583 64697414 66307476 68197763 70427149 72994731 75049431
3382G5049431K108786J783362J636392J997382O58810j718698m354365m941849
$$ 75049431 77158217 78941579 80577971 82575353 83234163 81515465 77161100 72219251
3374G2219251m443191l780154k332278j887084j771461j533832j235066j392712
$$ 72219251 67776060 63995906 61663628 59776544 58005083 56471251 55236185 53843473
3366E3843473j363035j038851j651374k170400j878213j622846q80525o55041
$$ 53843473 52480438 51441587 49790213 47619813 45741600 44118754 43238229 42583188
3358D2583188o86782j53835m4117j90968r75715j512958k355966k173733k025528
$$ 42583188 41896406 41742571 41698454 41507486 40531771 39018813 36662847 34489114 32463586
3349C2463586j579507j266482o67968o94444p26548n18346m06632k33812l88560
$$ 32463586 30884079 29617597 28949629 28255185 27528637 27010291 26603659 26369847 25981287
3340B5981287l96615l48457l80642k68919j66354l07898m50193j78699K2198j73544
$$ 25981287 25584672 25236215 24855573 24586654 24420300 24112402 23662209 23483510 23505708 23332164
3330B3332164q6210p051j62712n75818l56017k53951m70192k47393k27832j72597
$$ 23332164 23245954 23238903 23076191 22500373 22144356 21890405 21420213 21172820 20944988 20772391
3320B0772391l19404l08260k77754j73710J75701K97016j64168k07345J48840
$$ 20772391 20452987 20144727 19866973 19693263 19868964 20165980 20001812 19794467 19943307
3311A9943307m3489k47390l7494m761j60203P7669k45897j38325l96783M2606
$$ 19943307 19899818 19652428 19614934 19610173 19449970 19527639 19281742 19143417 18746634 18789240
3301A8789240R0881k29660N0378K10227j15M4427j58412P6880R9628J62285R5841
$$ 18789240 18880121 18650461 18700839 18911066 18910951 18955378 18796966 18873846 18973474 19135759 19231600
3290A9231600K14323J41244J55086K35046n9946K12491M08313L56036L20180L5251
$$ 19231600 19445923 19587167 19742253 19977299 19917353 20129844 20538157 20894193 21214373 21249624
3280B1249624K31230L13347K25017J22897J66230J79374L10349R0341K82358O309
$$ 21249624 21480854 21794201 22019218 22142115 22308345 22487719 22798068 22888409 23170767 23177076
3270B3177076R897J66678K65860K34800P332k7544K17996M09237K10214L34877
$$ 23177076 23186973 23353651 23619511 23854311 23861643 23834099 24052095 24461332 24671546 25006423
3260B5006423M32036L53980K33064M35079L57509O32499M68056O30767M88960
$$ 25006423 25438459 25792439 26025503 26460582 26818091 27450590 27918646 28549413 29038373
3251B9038373O79977P72726J061072Q11343J125939J107104J419202J588418J796748
$$ 29038373 29718350 30491076 31552148 32363491 33489430 34596534 36015736 37604154 39400902
3242C9400902J797476J994160K031405K367854K601102K948057L561407L599875
$$ 39400902 41198378 43192538 45223943 47591797 50192899 53140956 56702363 60302238
3234F0302238L960352M468196M712154M833985M974995M803094M749342M056887
$$ 60302238 64262590 68730786 73442940 78276925 83251920 88055014 92804356 96861243
3226I6861243L739596K561444J688166J106141N04748R8941n8373k36805k86286
$$ 96861243 100600839 103162283 104850449 105956590 106461338 106560279 106501906 106265101 105978815
3217A05978815j35346p0762k56919m32073m74564j152970k212370k819390l373458
$$ 105978815 105843469 105772707 105515788 105083715 104609151 103456181 101243811 98424421 95050963
3208I5050963l580143l833511m358360m484628m373309m252595m117201l623695
$$ 95050963 91470820 87637309 83278949 78794321 74421012 70168417 66051216 62427521
3200F2427521l468202l440069k923450k554397k175819j958372j445973j219195
$$ 62427521 58959319 55519250 52595800 50041403 47865584 45907212 44461239 43242044
3192D3242044p55046o42867o87916m31474k69122O1759j37610O1214P7601L24508
$$ 43242044 42486998 41844131 41156215 40724741 40455619 40517378 40379768 40440982 40518583 40843091
3182D0843091N56140O46049P43865R29188O61807P29473N92110Q53385Q90610
$$ 40843091 41399231 42045280 42789145 43718333 44380140 45109613 45701723 46555108 47445718
3173D7445718P57308J077851N05385J30251N20652M29656M80366J77589K5688
$$ 47445718 48203026 49280877 49786262 49916513 50437165 50866821 51347187 51524776 51550464
3164E1550464J20301J12177J75585L9551J86163J23185K02813r4325k01525K31592
$$ 51550464 51670765 51782942 51958527 51998078 52184241 52307426 52510239 52415914 52214389 52445981
3154E2445981j25396r1985j52438n2712J65560P0944K38565M69946M70852N88306
$$ 52445981 52320585 52228600 52076162 52023450 52189010 52259954 52498519 52968465 53439317 54027623
3144E4027623O06730P39072J176835J262314J429677J468225J896443J797775
$$ 54027623 54634353 55373425 56550260 57812574 59242251 60710476 62606919 64404694
3136F4404694K174304K336436K809631L111090L024650L074622L430410L594951
$$ 64404694 66578998 68915434 71725065 74836155 77860805 80935427 84365837 87960788
3128H7960788L772148L704507L569423L587854L435836L513557L722894L676437
$$ 87960788 91732936 95437443 99006866 102594720 106030556 109544113 113267007 116943444
3120A16943444M454640M652840N323527N571384O398826O930162P601093Q202072
$$ 116943444 121398084 126050924 131374451 136945835 143344661 150274823 157875916 166077988
3112A66077988Q704195R161499R046737R328634Q661651Q116168O496220M768653
$$ 166077988 174782183 183943682 192990419 202319053 210980704 219096872 225593092 230361745
3104B30361745K817925J065368n06844j782573k165626k273474j845389j203991
$$ 230361745 233179670 234245038 233738194 231955621 229789995 227516521 225671132 224467141
3096B24467141o60085m33849j149822j883855k931993m274495o006756p428304
$$ 224467141 223807056 223373207 222223385 220339530 217407537 213133042 207126286 199697982
3088A99697982q547550r123509r161880q732506p794193o928874o738120m927401
$$ 199697982 191150432 182026923 172865043 164132537 156338344 149409470 142671350 137743949
3080A37743949m076324m998250n430996m391753l126652k379457j777290j034466
$$ 137743949 133667625 128669375 123238379 118846626 115719974 113340517 111563227 110528761
3072A10528761j32911O35323J114421J684436K225740K378138K868526L733993
$$ 110528761 110395850 111031173 112145594 113830030 116055770 118433908 121302434 125036427
3064A25036427M187239M490015M953740N326060N655692N805344O057380N983333
$$ 125036427 129223666 133713681 138667421 143993481 149649173 155454517 161511897 167495230
3056A67495230O142206N055059L903819L766631L837238J793202k434109m562524
$$ 167495230 173637436 178692495 182596314 186362945 190200183 191993385 189559276 184996752
3048A84996752m883746m305526l928485l785174l653289l153940k925695l000437
$$ 184996752 180113006 175807480 171878995 168093821 164440532 161286592 158360897 155360460
3040A55360460k746203l073629l375026l658585l973366l649130m055136m319693
$$ 155360460 152614257 149540628 146165602 142507017 138533651 134884521 130829385 126509692
3032A26509692m047125m141318m058055l747693l016168l133391k718613k863863
$$ 126509692 122462567 118321249 114263194 110515501 107499333 104365942 101647329 98783466
3024I8783466k129732j988225k601858l672021m078218l495122k804920k267220
$$ 98783466 96653734 94665509 92063651 88391630 84313412 80818290 78013370 75746150
3016G5746150k224022j613808j493413j600232j459698j281039j569808j075091
$$ 75746150 73522128 71908320 70414907 68814675 67354977 66073938 64504130 63429039
3008F3429039q23504q96652o76591l33523m30359k23265l55544k17698p0038M3819
$$ 63429039 62605535 61708883 61032292 60698769 60268410 60045145 59689601 59471903 59401865 59445684
2998E9445684K44468L01143M16833K47224M51404O30668K42970K28669M7411K12021
$$ 59445684 59690152 59991295 60408128 60655352 61106756 61737424 61980394 62209063 62256474 62468495
2988F2468495K69175k15953q55988n06186m36921p88021n50062n64470k36975
$$ 62468495 62737670 62521717 61665729 61159543 60722622 59934601 59384539 58820069 58583094
2979E8583094M6926J26643J42942O60081O57131Q30844J000181J196961J363819
$$ 58583094 58630020 58756663 58899605 59559686 60216817 61047661 62047842 63244803 64608622
2970F4608622J634286J665077K285266K504031K555756L057292L086507K968604
$$ 64608622 66242908 67907985 70193251 72697282 75253038 78310330 81396837 84365441
2962H4365441L059763K938548K980743K539181J873329J474084Q77791O34337
$$ 84365441 87425204 90363752 93344495 95883676 97757005 99231089 100108880 100743217
2954A00743217O1639m37377m85395n01020o86837p54626p81136j083332j167458
$$ 100743217 100804856 100367479 99882084 99381064 98694227 97939601 97158465 96075133 94907675
2945I4907675j718732k057521k898122l407710l833317m332755m661284m801130
$$ 94907675 93188943 91131422 88233300 84825590 80992273 76659518 71998234 67197104
2937F7197104m560617m403102m154338l738201l230315l223282k413618j937189
$$ 67197104 62636487 58233385 54079047 50340846 47110531 43887249 41473631 39536442
2929C9536442k239547j835984j348027j431179j381113j299098j009357p55481
$$ 39536442 37296895 35460911 34112884 32681705 31300592 30001494 28992137 28236656
2921B8236656q07953p90429o79981p29979p97825o49007m59393k88487k17622
$$ 28236656 27428703 26638274 25958293 25228314 24430489 23781482 23322089 23033602 22815980
2912B2815980m06751n03530k50972l44899k72601j33763N3906n4820R4523j26783
$$ 22815980 22409229 21905699 21654727 21309828 21037227 20903464 20957370 20902550 20997073 20870290
2902B0870290j99697J37955O9829R2837K11536J40767k33725J73931j15045l04215
$$ 20870290 20670593 20808548 20878377 20971214 21182750 21323517 21089792 21263723 21148678 20844463
2892B0844463m49377m53764n53591m21535l12603o73164o07121n44997n16019
$$ 20844463 20395086 19941322 19387731 18966196 18653593 17980429 17373308 16828311 16312292
2883A6312292l85314k98599l88877l43528j75852m55008n3280l31876k1437j09080
$$ 16312292 15926978 15628379 15239502 14895974 14720122 14265114 14211834 13879958 13858521 13749441
2873A3749441l0278l75602j13999J26488k32199j18320R2906L58880j50704j61382
$$ 13749441 13719163 13343561 13229562 13356050 13123851 13005531 13098437 13457317 13306613 13145231
2863A3145231j5025N9618j01053L07436P5799L6126L06538O0939J53889M43376
$$ 13145231 13130206 13189824 13088771 13396207 13472006 13508132 13814670 13875609 14029498 14472874
2853A4472874o050O0948o4512J78795K14356K44179k0222J27929K18893K88285
$$ 14472874 14466824 14527772 14463260 14642055 14856411 15100590 15080368 15208297 15427190 15715475
2843A5715475P9012Q9289L64153j6339P4043k81209L37630L50267K04501R2156
$$ 15715475 15794487 15883776 16247929 16231590 16305633 16024424 16362054 16712321 16916822 17008978
2833A7008978M22195K39495Q8028L90373L54143J77527L02789N17868O23344L93464
$$ 17008978 17431173 17670668 17758696 18149069 18503212 18680739 18983528 19501396 20124740 20518204
2823B0518204P19480O25441L78539P10557O10580R30668Q74799R96873M83806
$$ 20518204 21237684 21863125 22241664 22952221 23562801 24493469 25368268 26365141 26848947
2814B6848947L64311K06776j31920M0641K72231J21241J67664J81657O6508O64839
$$ 26848947 27213258 27420034 27288114 27328755 27600986 27722227 27889891 28071548 28138056 28802895
2804B8802895K76261L41473M52103M22676M72615O76945N79935P33924P44437
$$ 28802895 29079156 29420629 29872732 30295408 30768023 31444968 32024903 32758827 33503264
2795C3503264N39964R06196R88387J048879J099316J153992J274871J648249J429432
$$ 33503264 34043228 34949424 35937811 36986690 38086006 39239998 40514869 42163118 43592550
2786D3592550J179082Q45058M45801J78154L35021P50850N94080O33091J166232
$$ 43592550 44771632 45616690 46062491 46240645 46575666 47326516 47920596 48553687 49719919
2777D9719919J446285J513777J546218J656430J858118K008601K471251K491342
$$ 49719919 51166204 52679981 54226199 55882629 57740747 59749348 62220599 64711941
2769F4711941K714748L112500L059197L559587L245247L874782L832574M272206
$$ 64711941 67426689 70539189 73598386 77157973 80403220 84278002 88110576 92382782
2761I2382782M622266N337553O319421P078732P988715Q784665R518247J0790397
$$ 92382782 97005048 102342601 108662022 115740754 123729469 132514134 142032381 152822778
2753A52822778J2049884J3924139J6120666J7725074J9720252K1029706K0805929
$$ 152822778 164872662 178796801 194917467 212642541 232362793 253392499 274198428
2746B74198428J8858541J6315034J4739823J4802681J4677833J4924425J6348938
$$ 274198428 293056969 309372003 324111826 338914507 353592340 368516765 384865703
2739C84865703J6689402J4957974J3290129J3448868J2144937O859136p145514
$$ 384865703 401555105 416513079 429803208 443252076 455397013 462256149 455110635
2732D55110635k7572315m3076222m8426981m5023823l7643224l0058906k4581284
$$ 455110635 427538320 384462098 336035117 291011294 253368070 223309164 198727880
2725A98727880k0077159j6220537j3847472j2060341j0171706q523961p115422
$$ 198727880 178650721 162430184 148582712 136522371 126350665 117826704 110711282
2718A10711282o085038m847953l890696l373048k690936j978992j878761j722579
$$ 110711282 104626244 99778291 95887595 92514547 89823611 87844619 85965858 84243279
2710H4243279k102103k977526l903453m287893m307143m066326l545954k974110
$$ 84243279 82141176 79163650 75260197 70972304 66665161 62598835 59052881 56078771
2702E6078771k705763k630708k316305k201034j935700j708174j633193j482095
$$ 56078771 53373008 50742300 48425995 46224961 44289261 42581087 40947894 39465799
2694C9465799j525568j330635j482946j222977j095769r81970j041929n32894
$$ 39465799 37940231 36609596 35126650 33903673 32807904 31825934 30784005 30251111
2686C0251111n02665q98820j011138q68601p70739q76802q73984p65522p38790
$$ 30251111 29748446 28849626 27838488 26969887 26199148 25322346 24448362 23682840 22944050
2677B2944050m24310m15958n42485p52707m81135l92287o69340o82730l97299
$$ 22944050 22519740 22103782 21561297 20808590 20327455 19935168 19265828 18583098 18185799
2668A8185799l58461m88989k86382m04809l54372m01538l02089j60761o80870
$$ 18185799 17827338 17338349 17051967 16647158 16292786 15891248 15589159 15428398 14747528
2659A4747528m26937k63351l07883l72699m61001l08560k03837j28215n97130
$$ 14747528 14320591 14057240 13749357 13376658 12915657 12607097 12403260 12275045 11677915
2650A1677915j88049k94331k70339k63564r7478m88342j70101k11427k62165j52230
$$ 11677915 11489866 11195535 10925196 10661632 10564154 10075812 9905711 9694284 9432119 9279889
2640I279889k03081j6176k90627j98769j62925l63457j93744J00825m44492j54314
$$ 9279889 9076808 9060632 8770005 8571236 8408311 8044854 7851110 7951935 7507443 7353129
2630G353129j64015k63443J19766j7533Q8894l08037r936p9131j03178k39251
$$ 7353129 7189114 6925671 7045437 7027904 7116798 6808761 6798825 6719694 6616516 6377265
2620F377265N6066J9404j32556m5790m5435r7863k90884j09864Q9996K3394m7873
$$ 6377265 6433331 6452735 6320179 6274389 6228954 6131091 5840207 5730343 5820339 5843733 5795860
2609E795860K164J21864k47508l38495k3761k3506N2760l60096k01085j26879
$$ 5795860 5798024 5919888 5672380 5333885 5310124 5286618 5339378 4979282 4778197 4651318
2599D651318K78793K3877l84032l15284Q9385Q2288j61393j24425m3031j19117
$$ 4651318 4930111 4953988 4569956 4254672 4344057 4426345 4264952 4140527 4097496 3978379
2589C978379j97713J21515r3239K2120j77191K1801J2297j39345M7193o3907J10591
$$ 3978379 3780666 3902181 3808942 3831062 3653871 3675672 3687969 3548624 3595817 3531910 3642501
2578C642501l5699r1119q3780o152j19963N8567k32605p0744k42283K4005O4603
$$ 3642501 3606802 3515683 3431903 3425751 3305788 3364355 3131750 3061006 2818723 2842728 2907331
2567B907331L0108l43571k71L04845j55574j93565J23001k6999q7682m2671J6198
$$ 2907331 2937439 2593868 2593597 2898442 2742868 2549303 2672304 2645305 2557623 2514952 2531150
2556B531150J54105j59224r7574o5440J45352j03664O5478j82084p132J1274j03076
$$ 2531150 2685255 2526031 2428457 2363017 2508369 2404705 2470183 2288099 2280967 2292241 2189165
2545B189165M9557O7768K9057J79748K25841M7085k2679L608k4816r6774J77340
$$ 2189165 2238722 2306490 2335547 2515295 2741136 2788221 2765542 2769150 2744334 2647560 2824900
2534B824900j7381j18781J56457k7555q5096j60393j19646J45006q1532j51230
$$ 2824900 2807519 2688738 2845195 2817640 2732544 2572151 2452505 2597511 2515979 2364749
2524B364749J96941j42265J299l9418k2553k06327J96627Q0511k467M2461q2817
$$ 2364749 2561690 2419425 2420724 2381306 2358753 2152426 2349053 2429564 2427097 2469558 2386741
2513B386741p3167n7297M4780J98369j17501j94855L51292q0427k06080j44304
$$ 2386741 2313574 2256277 2301057 2499426 2381925 2187070 2538362 2457935 2251855 2107551
2503B107551Q8878j01217J38713J96307J35451J50120J17401L867L5623K55276
$$ 2107551 2196429 2095212 2233925 2430232 2565683 2715803 2833204 2837071 2872694 3127970
2493C127970J51703j55040j51780J20482J07817J21816K07219J74103J15494m5057
$$ 3127970 3279673 3124633 2972853 3093335 3201152 3322968 3530187 3704290 3819784 3774727
2483C774727j88770M9011Q8817M5461j27137j4932k06565l3150O474l58897l48450
$$ 3774727 3585957 3634968 3723785 3769246 3642109 3627177 3420612 3387462 3393936 3035039 2686589
2472B686589l7938M716o41432P8224R7952j94495q0313j03910j84554k2672K32565
$$ 2686589 2648651 2653367 2011935 2090159 2188111 1993616 1913303 1809393 1624839 1602167 1834732
2461A834732q3357n7198l10192m2663K12705j2952r893m2287j86570L41417k2864
$$ 1834732 1751375 1694177 1383985 1341322 1554027 1541075 1531182 1488895 1302325 1643742 1620878
2450A620878r9265J38338m28533o2315q425O8763j57282l4222J37655j24278q235
$$ 1620878 1521613 1659951 1231418 1169103 1160678 1229441 1072159 1037937 1175592 1051314 1043079
2439A043079J58475j2577k00512J24116N0915M8007L8937L9766K32026l31375
$$ 1043079 1201554 1188977 988465 1112581 1163496 1211503 1250440 1290206 1522232 1190857
2429A190857r3716k11688j65347J1158r5694R9542m3821J58137j2982J71335j93808
$$ 1190857 1097141 885453 720106 731264 635570 735112 691291 849428 836446 1007781 813973
2418H13973j70678K15372j2810M889r3647L619k5117J94251j3663j33030P5203
$$ 813973 643295 858667 845857 850746 757099 760718 735601 929852 916189 783159 858362
2407H58362k5979n1868Q0640l9112K15018j67824O038J72821p9363k51791J08646
$$ 858362 832383 780515 861155 822043 1037061 869237 875275 1048096 968733 716942 825588
2396H25588K26729j86504q9380n6830P4682J15782K6335k7021M0540l9736j8603
$$ 825588 1052317 865813 776433 719603 794285 910067 936402 909381 949921 910185 891582
2385H91582J3559o0437n1947N2591r6409j37460q2117J48968J24911n713J79001
$$ 891582 905141 844704 792757 845348 748939 611479 529362 678330 803241 797528 976529
2374I76529J79748j66566j29924k85708L4478O3204K28449p854k09502M9724l7996
$$ 976529 1156277 989711 859787 574079 608557 671761 900210 892356 682854 732578 694582
2363F94582J63097p9767J39842n9930j32502L4161k71583J67218L1005N5523J67563
$$ 694582 857679 777912 917754 857824 725322 759483 487900 655118 686123 741646 909209
2352I09209q9446M1785P1393r2649p3469N8649k8569k14291J77811m2111l40192
$$ 909209 819763 861548 932941 840292 766823 825472 796903 582612 760423 718312 378120
2341C78120j40376J56018K17318J9368j56675j73971P9626k13705N8682L17656
$$ 378120 237744 393762 611080 630448 473773 299802 379428 165723 224405 542061
2331E42061K52183L9001j00493r5517L0038j31519k92963Q6636K33155M1859J02442
$$ 542061 794244 833245 732752 637235 667273 535754 242791 329427 562582 604441 706883
2320G06883L7021L5003k26003K8495M9445J1930j72397M6909J41434k82811O4416
$$ 706883 743904 778907 552904 581399 630844 642774 470377 517286 658720 375909 440325
2309D40325K18812k38478R5195M6983j63761J35717J65629k0945j75405Q049J05830
$$ 440325 659137 420659 515854 562837 399076 534793 700422 679477 504072 512121 617951
2298F17951J54259j28867P2057J50444k2550k28311L1631j13902r9520L626Q3424
$$ 617951 772210 643343 715400 865844 843294 614983 646614 532712 433192 436818 520242
2287E20242R7745k1551Q9405n8836p1447L67032j08396k77896j94795L54172J12044
$$ 520242 617987 596436 685841 627005 555558 922590 814194 536298 341503 695675 807719
2276H07719p4362k21954j62206M7834K1467m136N1698Q799j56517J7628K91651
$$ 807719 733357 511403 349197 397031 418498 414362 466060 474859 318342 335970 627621
2265F27621J157j96605m4034l2589J2961J01135L9608p8531k05693J32036J50198
$$ 627621 628778 432173 388139 355550 368511 469646 509254 430723 225030 357066 507264
2254E07264j20611n9034P8631K67396O3650j38652r0103L69549p8675q8810n4356
$$ 507264 386653 327619 406250 673646 737296 598644 508541 878090 799415 710605 656249
2243F56249Q667o2262K2747L228K13194K73109j93990j17794q6784j14059n5309
$$ 656249 664916 602654 625401 628629 841823 1114932 920942 803148 716364 602305 546996
2232E46996M1255J13320j37984J05123j58899k30339K03771R2749j90749J17105
$$ 546996 588251 701571 563587 668710 509811 279472 483243 575992 385243 502348
2222E02348J14369q9738r7985O6482J12068J28573p6568j85629j7571J05980K164
$$ 502348 616717 526979 428994 495476 607544 736117 659549 473920 456349 562329 564493
2211E64493j72914Q3794K52652O1760r0729j61733q0740J65769q9183M920K10923
$$ 564493 391579 475373 728025 789785 699056 537323 456583 622352 533169 538089 749012
2200G49012n3557l11935L73795J31726m17862J256o9962R1038J27901m7007j68205
$$ 749012 695455 383520 757315 889041 471179 472435 402473 493511 621412 574405 406200
2189D06200O6107K16811J88955j11813p9211j39810P9276o037j19400j4498J75029
$$ 406200 472307 689118 878073 766260 687049 547239 626515 620478 501078 486580 661609
2178F61609K53909o9008R6595M3040j03686o2135J62238n1916p2823R5799j06135
$$ 661609 915518 846510 943105 986145 882459 820324 982562 930646 857823 953622 847487
2167H47487N332P207R6099J40359m8848L4262J2650J18303J3745n3038j09868
$$ 847487 852819 860026 956125 1096484 1047636 1081898 1094548 1212851 1226596 1173558 1063690
2156A063690J00349Q9250j19416r3089K78037J28805k01369r133m3114l9307K39834
$$ 1063690 1164039 1253289 1133873 1040784 1318821 1447626 1246257 1237124 1194010 1154703 1394537
2145A394537N9424J01044J07377j53898j26612N14968K00484j50281q3113l0263
$$ 1394537 1453961 1555005 1662382 1508484 1381872 1896840 2097324 1947043 1863930 1833667
2135A833667j0618j08748M1942k1332L153R2087J54883j71397P8391J73680N445
$$ 1833667 1823049 1714301 1756243 1734911 1738064 1830151 1985034 1813637 1892028 2065708 2071153
2124B071153o5249R7792o1807R7461J01176l23733L9694K34104k2831j42469n6017
$$ 2071153 2005904 2103696 2041889 2139350 2240526 1916793 1956487 2190591 2167760 2025291 1969274
2113A969274J91622J724L04786j7105j80393K04337q172k28534l3822K88112K32271
$$ 1969274 2160896 2162620 2467406 2450301 2269908 2474245 2466073 2237539 2203717 2491829 2724100
2102B724100J29929J57362L8033O9068j34561J19526K6252L17639O2836N2397
$$ 2724100 2854029 3011391 3049424 3118492 2983931 3103457 3129709 3447348 3510184 3562581
2092C562581K09116J27848L88677L29934J50434L82743M12058K93677N36240M02352
$$ 3562581 3771697 3899545 4288222 4618156 4768590 5151333 5563391 5857068 6393308 6795660
2082F795660O48209K95930N31548N24543P12889P09941Q38043Q49092J086891
$$ 6795660 7443869 7739799 8271347 8795890 9508779 10218720 11056763 11905855 12992746
2073A2992746J244106J156825J757501J616045K273601K498628L329451L919701
$$ 12992746 14236852 15393677 17151178 18767223 21040824 23539452 26868903 30788604
2065C0788604N600001O207673P976867P956859P534408O387313o052039j1333553
$$ 30788604 36388605 42596278 50573145 58530004 66064412 72451725 66399686 55066133
2057E5066133j2276362r372188n904730m329658l364764k428698j995527j495739
$$ 55066133 42789771 33417583 27512853 23183195 19818431 17389733 15394206 13898467
2049A3898467q93636j044183q10387p76855p04926q81174p79494q24775n99407
$$ 13898467 13004831 11960648 11150261 10373406 9668480 8787306 8007812 7183037 6583630
2040F583630m66192o9743k91098l80361m00580j72522j12715k25891l32796m6133
$$ 6583630 6117438 6047695 5756597 5376236 4975656 4803134 4690419 4464528 4131732 4085599
2030D085599m5409l17788m46005L1510o5859j00526j27947j16570k51516l9835
$$ 4085599 4040190 3722402 3276397 3307907 3242048 3141522 3013575 2897005 2645489 2605654
2020B605654k474M1823k06633J6581n1377k8260J6519j08943l01671P6894j59638
$$ 2605654 2603180 2645003 2438370 2454951 2403574 2375314 2391833 2282890 1981219 2058113 1898475
2009A898475p9429K3133l8467j35927j6294j58484J08647K0335k04542J8442j02542
$$ 1898475 1819046 1842179 1803712 1667785 1651491 1493007 1601654 1621989 1417447 1435889 1333347
1998A333347J7089N0654j23976J30808N1479o4780l62394O7291P867L1316J2961
$$ 1333347 1350436 1401090 1277114 1407922 1459401 1394621 1032227 1099518 1107385 1138701 1151662
1987A151662j4370R1010P8131j80288o2025J04918n3325q197j52559m0490r5707
$$ 1151662 1137292 1228302 1306433 1126145 1064120 1169038 1115713 1107516 954957 914467 818760
1976H18760k01049P3152J05914j24416m5518M6291J07371n0375R1538P1670l8189
$$ 818760 617711 690863 796777 672361 626843 673134 780505 730130 821668 893338 855149
1965H55149k510j14182k7168j52069J06013R0739j19425r1232K0504R2230N1622
$$ 855149 852639 738457 711289 559220 665233 755972 636547 545315 565819 658049 709671
1954G09671K19715k15795j74087Q8064K19019o7112k87122J12896N2035P4986
$$ 709671 929386 713591 539504 627568 846587 779475 492353 605249 657284 732270
1944G32270n6739o7865L4206m3414p1665p3596O6531N7054J6426j4973J51003
$$ 732270 675531 607666 641872 598458 526793 453197 519728 576782 593208 578235 729238
1933G29238q0203j86845J57821j01709p6911m159j35625K50017K4149N8816k4112
$$ 729238 649035 462190 620011 518302 441391 437232 301607 551624 575773 634589 610477
1922F10477p7092k08105j13253L83576K46323j78650k95610o8680n0527q6639
$$ 610477 533385 325280 212027 595603 841926 663276 367666 298986 248459 161820
1912A61820N9587K20039N597o470R9705l50947J15550j15243J73516k42492R2181
$$ 161820 221407 441446 447043 440573 540278 189331 304881 189638 363154 120662 212843
1901B12843K04413K0873m1262j39085J1353L14906k40173n4670j7662J21321O2411
$$ 212843 417256 438129 396867 257782 269135 584041 343868 289198 271536 392857 455268
1890D55268j63194J03406J29775k20843q3641J45980L3074j7225j22321k88785
$$ 455268 292074 395480 525255 304412 220771 366751 399825 382600 260279 -28506
1880b8506J80474M42458j98813k34553j92505K15324l4709K53203m046o2657j39685
$$ -28506 151968 594426 395613 161060 -31445 183879 149170 402373 398327 335670 195985
1869A95985m7703K25147R8810j62063j79951j15019J58931r8013O2636K19315
$$ 195985 148282 373429 472239 310176 130225 15206 174137 76124 138760 358075
1859C58075j02806j55734J29041k8828M3602J94686p8951k49975j7443k7291N571
$$ 358075 255269 99535 228576 199748 243350 438036 359085 109110 91667 64376 69947
1848F9947J65971n6163J46875R5849j56240k8038l2464j71628J30606o8660N9833
$$ 69947 235918 179755 326630 422479 266239 238201 205737 34109 164715 96055 155888
1837A55888K83764m5979p4734k1805J28189k53781q7154L17955o761k08939K09245
$$ 155888 439652 393673 318939 297134 425323 171542 84388 402343 395582 186643 395888
1826C95888J43532p9368j65094m9810J83175q3600k35154J98040j1121Q060K52153
$$ 395888 539420 460052 294958 245148 428323 344723 109569 307609 296488 304548 556701
1815E56701K33027j75583j92485L0564k00740M4266J98296n3855m37847P6972
$$ 556701 789728 614145 421660 452224 251484 295750 494046 440191 2344 79316
1805G9316L22341J6211j24333o1474l26250j11596J51747L8049L5116m2059J17336
$$ 79316 401657 417868 293535 232061 -94189 -205785 -54038 -15989 19127 -22932 94404
1794I4404J38726j12130r9850J55991m4643J19126R9958l12078L12542J05872
$$ 94404 233130 121000 21150 177141 132498 251624 351582 39504 352046 457918
1784D57918l9961k32321J27205l6803k9259r384k17199j73R1118J46869l303j53061
$$ 457918 417957 185636 312841 276038 246779 237395 20196 20023 111141 258010 254707 101646
1772A01646l2680K6854j15265J21028K0220J39548p5496J42765k71056j3161J35601
$$ 101646 68966 95820 -19445 101583 121803 261351 185855 328620 57564 44403 180004
1761A80004P7070j67424l4143j24982L3426L53J549j8162r8456J97860J57736
$$ 180004 257074 89650 55507 -69475 -36049 -35696 -34147 -52309 -150765 47095 204831
1750B04831r2497k58137K19872J00168p4256M2845j1441k54370n4302N3581l364
$$ 204831 112334 -145803 74069 174237 99981 142826 131385 -122985 -177287 -123706 -127070
1739a27070J01090K31336p5532n9428J88440j61606K8997j92988m0923K65790
$$ -127070 -25980 205356 129824 70396 258836 97230 126227 -66761 -107684 158106
1729A58106j24142L25910j99133o9865J05026k62948O8373k63513P1919K49890
$$ 158106 33964 359874 160741 90876 195902 -67046 1327 -262186 -190267 59623
1719E9623p66N1891J5048J676k96500N8251J49216P9317J10305K1429n6373j4211
$$ 59623 58857 110748 125796 127472 -169028 -110777 38439 117756 228061 249490 193117 178906
1707A78906o2769k57609J97534n2620J16742l881N9097O6197j45566M9447l5502
$$ 178906 116137 -141472 56062 3442 120184 116303 175400 241597 96031 145478 109976
1696A09976J88550j63052l52678J82539k1078J33730P3330j1945l9297k143L5861
$$ 109976 298526 135474 -217204 -34665 -55743 77987 151317 139372 100075 97932 133793
1685A33793j76377R6176L896O952k05030k8404M6279L79065r4665k34161j3909
$$ 133793 -42584 53592 57488 64440 -140590 -168994 -122715 256350 161685 -72476 -86385
1674h6385N6781J178J74366o6598K02364n9085k85580O3129L1704J52059L7970
$$ -86385 -29604 -28426 145940 79342 281706 222621 -62959 170 31874 183933 221903
1663B21903l38195L8315J89699r1665k1043l9187K46930L8830j33107J1322J51172
$$ 221903 -116292 -77977 111722 20057 -986 -40173 206757 245587 112480 123802 274974
1652B74974N4497j92773o8905k68833K40563K98294k18986J61547j20106j51783
$$ 274974 329471 136698 67793 -201040 39523 337817 118831 280378 160272 8489
1642H489Q3461m8164N3615p4798N8528J32347M6810M6542k20290j98206J5249
$$ 8489 91950 43786 97401 22603 81131 213478 260288 306830 86540 -111666 -96417
1631i6417r8209n7973L23311L1914J3642J42886M5701o9227j50254O3442Q1249
$$ -96417 -194626 -252599 70712 102626 116268 259154 304855 235628 85374 148816 230065
1620B30065J00952j80880N7298O470k85258J81955o499O469l5957Q6608o3152
$$ 230065 331017 150137 207435 213905 -71353 110602 104103 110572 74615 161223 98071
1609I8071q3250j2115L6765n9021J88924K1146q668o2352J01137L9423Q6626j38166
$$ 98071 14821 2706 39471 -19550 169374 190520 181852 119500 220637 260060 346686 208520
1597B08520k69500J02957r6134J86289k43502m5993K74859P3705o9503j28960
$$ 208520 -60980 41977 -54157 132132 -111370 -157363 117496 191201 121698 -7262
1587g262k9111R1896o1165K81167j91021k08877R8351K48102k02286j5695K50159
$$ -7262 -36373 55523 -5642 275525 84504 -124373 -26022 222080 19794 4099 254258
1576B54258N8934R5547k46729p2744J0634P3041j00222R9818k37091n9770J95612
$$ 254258 313192 408739 162010 89266 99900 172941 72719 172537 -64554 -124324 71288
1565G1288o5433M8378j3923k08665M5790J76516J70794k33520J08041r007k00338
$$ 71288 5855 54233 40310 -168355 -122565 53951 224745 -8775 99266 90259 -110079
1554a10079K8326J62976j70300P2517p523J33921J7450k11308J22608J29329n7376
$$ -110079 -81753 81223 -89077 -16560 -24083 109838 127288 -84020 38588 167917 110541
1543A10541k58298K21281J13046q7256k15528J45692J3333k15224Q8843k5039
$$ 110541 -147757 73524 186570 99314 -116214 29478 42811 -172413 -83570 -108609
1533a08609J9335J74426J2373r629K35688j6396j38492K5469j01364l26647o5975
$$ -108609 -89274 85152 97525 87896 323584 307188 168696 194165 92801 -233846 -299821
1522b99821K09257N6266J64700M4530M0094n1831k54260k00594K46661k3543M8397
$$ -299821 -90564 -34298 130402 174932 215026 163195 -91065 -291659 -44998 -68541 -20144
1511b0144o7647R3415N4224q1858J51818J70294J71353k72782j88950m9824r8016
$$ -20144 -87791 5624 59848 -22010 129808 300102 471455 198673 9723 -40101 -138117
1500a38117o525K5134k5114J22984K44198j16521m3707R0076m9098j20922o8927
$$ -138117 -144642 -119508 -144622 -21638 222560 106039 62332 152408 103310 -17612 -86539
1489h6539J68730n4704J06945j88380j42832J98062q3041K97637J11009K29390
$$ -86539 82191 27487 134432 -53948 -196780 1282 -81759 215878 326887 556277
1479E56277k26686j46500j58186k17472J93483j0474j03997K59134p4086L5270
$$ 556277 329591 183091 24905 -192567 916 -9558 -113555 145579 71493 106763
1469A06763L01690j39813j31771k78662J43566R1041j27951J13235L0839q4119
$$ 106763 408453 268640 136869 -141793 1773 92814 -35137 78098 108937 24818
1459B4818J44847O2755k3243k9780J3567j49562M1512m0784N4049l2538J04936
$$ 24818 169665 232420 209177 179397 192964 43402 84914 44130 98179 65641 170577
1448A70577j87061j71536N3441j291L8083J87739q1264o1462O9569q957j76741
$$ 170577 -16484 -188020 -134579 -135870 -97787 89952 8688 -52774 16795 7838 -168903
1437a68903J08129K80699j58039N0420o4532m3860L79255j61946k06802R1431
$$ -168903 -60774 219925 61886 112306 47774 3914 383169 221223 14421 105852
1427A05852R0419O2125j42012q493J89767k22328n1846J20000j41291K4211j13005
$$ 105852 196271 258396 116384 107891 297658 75330 23484 143484 2193 26404 -86601
1416h6601L180q1530J29880j87625k163L14449N5681k57957J34135O774k9991
$$ -86601 -83421 -164951 -35071 -222696 -224859 89590 145271 -112686 21449 28223 -1768
1405a768R9614q3869j75580J38670K24394k9686K4247j89574J58690o712j89187
$$ -1768 97846 13977 -161603 -22933 201461 171775 196022 6448 165138 158426 -30761
1394c0761K3369J22655J62941k16842R7424o7101k96073k6833P0414J03576P4923
$$ -30761 -7392 115263 278204 61362 158786 91685 -204388 -231221 -160807 -57231 17692
1383A7692J6818j30777r8543J37948K04479J8766o8947J26926j80549J19497J14837
$$ 17692 34510 -96267 -194810 -56862 147617 166383 97436 224362 43813 163310 278147
1372B78147J29203n9378j13285k62642Q0045K6105L2154j19553k00958J94983
$$ 278147 407350 347972 234687 -27955 52090 78195 110349 -9204 -210162 -15179
1362a5179j0517k30828J58340J04803r789J68356k91940R7184J8440q4463N0481
$$ -15179 -25696 -256524 -98184 6619 -3170 165186 -126754 -29570 -11130 -95593 -45112
1351d5112L9974k09820j28207j02366k5082L84012m3905R4160O2913q9075o0310
$$ -45112 -5138 -214958 -343165 -445531 -470613 -86601 -130506 -36346 26567 -62508 -122818
1340a22818K06598J13742j42571J20451j48669J8558l23434K34833k3223k6366
$$ -122818 83780 197522 54951 175402 26733 45291 -278143 -43310 -66533 -92899
1330i2899N3958k1475K01438j80319p1048J14913K6866K43379k04430j05519R5279
$$ -92899 -38941 -60416 141022 -39297 -110345 4568 31434 274813 70383 -35136 60143
1319F0143P6250n89Q6228j91067N7073q0463K3723m7765J94499K4330j39986p8852
$$ 60143 136393 135804 222032 30965 88038 7575 31298 -16467 178032 202362 62376 -16476
1307a6476m8276R888k61844J81758M74438j01250n7561N7429k48359J12418j55027
$$ -16476 -64752 -54864 -316708 -134950 339488 238238 180677 238106 -10253 102165 -52862
1296e2862p4837K26722k8475K9165Q9487j3450p5747k0454J06211j13443P9667
$$ -52862 -127699 99023 70548 99713 189200 175750 100003 79549 185760 72317 151984
1285A51984P2139o6772J75382k24684j34389L26659p9032k58533L3230K17208
$$ 151984 224123 157351 332733 108049 -26340 300319 221287 -37246 -4016 213192
1275B13192j22279j41360K04816P9070l02066k6042K18465L3176j9756J24534
$$ 213192 90913 -50447 154369 233439 -68627 -94669 123796 156972 137216 261750
1265B61750p7762J434j57615J53139K58106k1934l75537J01891j32710l2067j98654
$$ 261750 183988 185422 27807 180946 439052 417118 41581 143472 10762 -21305 -219959
1254b19959J87624J44852k7337k4852j84340m1967J76872K67j75632m8805J28360
$$ -219959 -32335 112517 85180 60328 -124012 -165979 10893 11160 -164472 -213277 -84917
1243h4917q3746k30434K9031L05945j57524K4326M88452k00793N1021o1343K1409
$$ -84917 -168663 -399097 -370066 -64121 -221645 -197319 291133 90340 141361 80018 101427
1232A01427J13438j56259l649O5372k29124r1951l3543O6008K55401j1624k66585
$$ 101427 214865 58606 54957 120329 -108795 -200746 -234289 -168281 87120 75496 -191089
1221a91089J99671j34674K9232k20418J19311J74285J61744l03826k34924O9948
$$ -191089 8582 -126092 -96860 -317278 -197967 -23682 138062 -165764 -400688 -330740
1211c30740J98809R8638o3483K28505q9632j71865j44789J44990j07782Q2299
$$ -330740 -131931 -33293 -96776 131729 42097 -129768 -274557 -129567 -237349 -155050
1201a55050J04150j92498O946K060M8041k7546j93237M46185l7300R5216p6610
$$ -155050 -50900 -243398 -236452 -234392 -186351 -213897 -407134 39051 1751 96967 20357
1190B0357k649j1303j37535J93475j56746L9036k1976J77587L31083m23587j14896
$$ 20357 17708 6405 -131130 62345 -94401 -55365 -77341 100246 431329 7742 -107154
1179a07154J72906O17K00487o875j45411p4720J33008j38117k49582J22394J86602
$$ -107154 65752 66369 266856 259981 114570 39850 172858 34741 -214841 -92447 94155
1168I4155k28632r7980M684J9137J84936J9649J59684J09238K2548k46796P8365
$$ 94155 -134477 -232457 -227773 -208636 -23700 -4051 155633 264871 287419 40623 118988
1157A18988J3563l03159J57078K59247j06166j83065k744j43951O1713O2241m3081
$$ 118988 132551 -170608 -13530 245717 139551 -43514 -46258 -190209 -128496 -66255 -109336
1146a09336P9644K37287j31591j64081l6952M6601n1372n3424K79969k37589k94472
$$ -109336 -29692 207595 76004 -88077 -125029 -78428 -129800 -183224 96745 -140844 -435316
1135d35316J42256O0824K12295J31856k12285j45628J13970R2646p5132J25370
$$ -435316 -293060 -232236 -19941 111915 -100370 -245998 -132028 -39382 -114514 10856
1125A0856N5996K3932j80171j1876l1806J41149L6642M4266k99163N6530n021
$$ 10856 66852 90784 -89387 -101263 -133069 8080 44722 88988 -210175 -153645 -158666
1114a58666J50208J30197k8931J01205o2092l5815j71324j17333R6099K35066
$$ -158666 -8458 121739 92808 194013 131921 96106 -75218 -192551 -96452 138614
1104A38614P1162J4896k42472J84399p2427K8562p9037J42442j3842J2385J60905
$$ 138614 209776 224672 -17800 166599 94172 122734 43697 186139 172297 184682 345587
1093C45587j76693j46189Q2564k8174J56619k6644p6539n3322M3689k52896J7401
$$ 345587 168894 22705 105269 77095 233714 207070 130531 77209 120898 -131998 -114597
1082a14597p734N5103j17053K14686P1896r8401K72840k83248R4236n6908l10519
$$ -114597 -122331 -67228 -184281 30405 102301 3900 276740 -6508 87728 30820 -279699
1071b79699L49046J38189r6125Q7320j40602N7480J16332j30879j85340K7317
$$ -279699 69347 207536 111411 198731 58129 115609 231941 101062 -84278 -56961
1061e6961k01609J81652k4436n2775L3362r7193Q3403j24771J21126O9700k1189
$$ -56961 -258570 -76918 -101354 -154129 -120767 -217960 -134557 -259328 -138202 -68502 -89691
1050h9691n6345r0342m1847L0845J37186K98233k45526j80880M6657j24900J10458
$$ -89691 -146036 -236378 -278225 -247380 -110194 188039 -57487 -238367 -191710 -316610 -206152
1039b06152O2302J87905j18062J58136l0899o0798J78423m2597r2848j05723J55635
$$ -206152 -143850 44055 -74007 84129 53230 -7568 170855 128258 35410 -70313 85322
1028H5322j68384K74969O6816K8791p3881j30631n450p714p4947k05365K49934
$$ 85322 -83062 191907 258723 287514 213633 83002 77552 69838 -5109 -210474 39460
1017C9460K3366j68268o3114K65817j28892k71998M072K63756J6633J27710n8005
$$ 39460 62826 -105442 -168556 97261 -31631 -303629 -299557 -35801 -19168 108542 50537
1006E0537k95846K01913J1801j54878J65759k3584K70728q2877o5563k02174j83359
$$ 50537 -245309 -43396 -31595 -186473 -20714 -44298 226430 143553 77990 -124184 -307543
995c07543J10750P1902J04604K17526k15681r523j11719j500J2365P1494q3416
$$ -307543 -196793 -124891 -20287 197239 -18442 -27965 -139684 -141184 -128819 -57325 -140741
984a40741O5715m737l84035J67723J82289m3928K27837K9941J36781k5738J8207
$$ -140741 -75026 -79763 -463798 -296075 -113786 -157714 70123 100064 236845 211107 229314
973B29314p4479k50349R5153J73635j13388k18446L4794q5371K76195K90768q413
$$ 229314 154835 -95514 -361 173274 59886 -158560 -123766 -209137 67058 357826 349413
962C49413k07065r2663p3254l7306j8048J58160l6521L2079K31411j22751l391
$$ 349413 142348 49685 -23569 -60875 -78923 79237 42716 74795 306206 183455 180064
951A80064K203k00051J6814l11207K76381j52215L8151Q2980K590o076J42546
$$ 180064 182267 -17784 -970 -312177 -35796 -188011 -149860 -66880 -64290 -70366 72180
940G2180p1181J75800O5M4083n0260k20410O8670q14J61069l01421k1736p4225
$$ 72180 999 176799 176864 220947 170687 -49723 18947 18133 179202 -122219 -143955 -218180
928b18180K6501K31943n1615k44174J84964L65468r4988k11600l9126p9002k6223
$$ -218180 -191679 40264 -11351 -255525 -70561 294907 199919 -11681 -50807 -129809 -156032
917a56032l0627J23866K11891J46505P3860k06633j07258j95188J15522j8700
$$ -156032 -186659 -62793 149098 295603 369463 162830 55572 -139616 -24094 -42794
907d2794j83607J755k8974K09946J33257o6249r0639o8332l5877O474k5492L9595
$$ -42794 -226401 -224646 -253620 -43674 89583 23334 -67305 -135637 -171514 -165040 -190532 -150937
895a50937Q7197K44056j13515N26J7729o5799j50302L7847J51593o0399n2803
$$ -150937 -63740 180316 66801 67327 85056 19257 -131045 -93198 58395 -2004 -54807
884e4807P7754n9205j60252O3164J04401J696q5600J97899Q1728n1534m1338j16211
$$ -54807 22947 -36258 -196510 -133346 -28945 -27249 -112849 85050 166778 115244 73906 -42305
872d2305k06716L12979k9897J65829o4276l27115J90982k3235q300Q8769K9309
$$ -42305 -249021 63958 34061 199890 135614 -191501 -519 -23754 -32054 56715 86024
861H6024j60840j30280J26286N1760N7696l7914J24353M6680k75900l9742J88932
$$ 86024 -74816 -205096 -78810 -27050 30646 -7268 117085 163765 -112135 -151877 37055
850C7055l8966j23988N4082J92095n3835q9763n1643J71705m398k34043Q0536
$$ 37055 -1911 -125899 -71817 120278 66443 -23320 -74963 96742 92344 -141699 -61163
839f1163j1425M3624P0302L07960k33562o6734r2371k8977R5287j45322j07352
$$ -61163 -72588 -28964 41338 349298 115736 49002 -43369 -72346 22941 -122381 -229733
828b29733K43738L1575j25198L14547j1794k55644p5800L847K59042k09881J56797
$$ -229733 14005 45580 -79618 234929 223135 -32509 -108309 -104462 154580 -55301 101496
817A01496R014j01239P4808o9885j31975L5389L9089J64066J79512m06371m586
$$ 101496 110510 9271 84079 14194 -117781 -82392 -43303 120763 300275 -106096 -110682
806a10682P9453J1397J3328P7935j14198j63053K06751m013N3891L33332j41033
$$ -110682 -31229 -19832 -6504 71431 -42767 -205820 931 -3082 50809 384141 243108
795B43108l26887O5109J39532Q8922j21579k06410Q5736m6220j42428O4896O1555
$$ 243108 -83779 -18670 120862 209784 88205 -118205 -32469 -78689 -221117 -156221 -94666
784i4666M2945J18073J37323l50941p4045L09107j80824J19776k4869R2603K6661
$$ -94666 -51721 66352 203675 -147266 -221311 87796 -93028 26748 1879 94482 121143
773A21143j04509k3133J36208j54685j54578J52167j17230L1891N8706L7070J6212
$$ 121143 16634 -6499 129709 -24976 -179554 -27387 -144617 -112726 -54020 -16950 -738
762g38j78760K0971k1513P1741M4969N5626r0616j60278K56133O981K4329m2325
$$ -738 -179498 -158527 -180040 -108299 -63330 -7704 -98320 -258598 -2465 4516 28845 -13480
750a3480J21505j99426M3730J72839j32177q5937J35110K42544j8779r2208j08759
$$ -13480 108025 -91401 -47671 125168 -7009 -92946 42164 284708 265929 173721 64962
739F4962J46072q4253J5330K7540j74540M1432J5471l3938N7628j39711j4982
$$ 64962 211034 126781 142111 169651 -4889 36543 52014 18076 75704 -64007 -78989
728g8989K2521K3691J6452j88142p302L14J21456j17593J51166j23008m052K54042
$$ -78989 -56468 -32777 -16325 -204467 -211769 -211455 -89999 -207592 -56426 -179434 -183486 70556
716G0556o9514j16664j82351L29432k8475J13715j1059l67601l608N1054J99825
$$ 70556 1042 -115622 -297973 31459 2984 116699 105640 -261961 -265569 -214515 -14690
705a4690O5564k4438o3189k15468J69813j27436J44591J44365j05985l4943n5856
$$ -14690 50874 26436 -36753 -252221 -82408 -209844 -65253 79112 -26873 -61816 -117672
694a17672J75239l8236J6097m0318n4773O7132o4960p7682J96652K14461j94694
$$ -117672 57567 19331 35428 -4890 -59663 7469 -57491 -135173 61479 275940 81246
683H1246o0975L5037M768r6842l4635Q7688n0701k89062Q5358K19934O7070P2493
$$ 81246 20271 55308 60076 -36766 -71401 16287 -34414 -323476 -238118 -18184 48886 121379
671A21379M5556J07707l623P85k4435j71580m9542N1010j6876J98285j74895l3728
$$ 121379 166935 274642 271019 271804 247369 75789 26247 77257 60381 258666 83771 50043
659E0043J56995r7781k11766P9461O2488j36740j23125j5519K6546L0815J0810
$$ 50043 207038 109257 -102509 -23048 39440 -97300 -220425 -235944 -209398 -178583 -167773
648a67773L1733r1472J53603K17169j27595J3281J10460J31238k57775K5737P362
$$ -167773 -136040 -227512 -73909 143260 15665 28946 139406 270644 12869 38606 45968
637D5968l93172K71501J34831P7372O9232k17686J16460k34730m4096R6999l223
$$ 45968 -347204 -75703 59128 136500 205732 -11954 104506 -130224 -174320 -77321 -80544
626h0544j4740k1269J03330k26537L0125N8217K40178o4487Q7903n0914k35123
$$ -80544 -95284 -116553 -13223 -239760 -209635 -151418 88760 24273 112176 61262 -173861
615a73861L07411o8883o7421K39943l7949l65770J93985J72839k18724k3824N2739
$$ -173861 133550 64667 -2754 237189 199240 -166530 27455 200294 -18430 -42254 10485
604A0485k04688j26052n497L61878n0097N3448l6716n3556j19633k07106L31947
$$ 10485 -194203 -320255 -325752 36126 -13971 39477 2761 -50795 -170428 -377534 -45587
593d5587R8938k26652P9028R5757J06377M8227j44348o3361q3753R2774J8479
$$ -45587 53351 -173301 -94273 1484 107861 156088 11740 -51621 -135374 -42600 -24121
582b4121K03697j49242q8141P0757R7220j55029M2224J16557j46581k13515J8509
$$ -24121 179576 30334 -57807 12950 110170 -44859 -2635 113922 -32659 -246174 -227665
571b27665K14422J63757K219j8021p7656k6038k50734J25519o8351j3321J69798
$$ -227665 -13243 150514 152733 134712 57056 31018 -219716 -94197 -162548 -175869 -6071
560f071l15992J30403N1279Q0683k37009J11873J67498j84994j91265q9822L69783
$$ -6071 -322063 -191660 -140381 -59698 -296707 -184834 -17336 -202330 -393595 -483417 -113634
549a13634J99889n9644J33014Q2814M9649m06929n6385O1644j97481K39137J57686
$$ -113634 86255 26611 159625 242439 292088 -114841 -171226 -109582 -307063 -67926 89760
538H9760L4450J20302J7058k76261j33084R5309J08801j69749N8067J33318J18672
$$ 89760 124210 244512 261570 -14691 -147775 -52466 56335 -113414 -55347 77971 196643
527A96643p6439q4822j25115l7992Q3096j18613j27100Q8501K98021j78727l2936
$$ 196643 120204 35382 -89733 -127725 -44629 -163242 -290342 -201841 96180 -82547 -115483
516a15483o3515R3713O0836l52j28329J02359P1769k10151N3291l87J90623M8232
$$ -115483 -178998 -85285 -24449 -24801 -153130 -50771 20998 -189153 -135862 -136249 54374 102606
504A02606m0957J0547P1576j20402k03564j3716K03044n0731j24727l2003L52665
$$ 102606 61649 72196 143772 23370 -180194 -193910 9134 -41597 -166324 -198327 154338
493A54338m9312j3153j82606o3304J75842j47962p551J00211N1758j60122o0897
$$ 154338 105026 91873 -90733 -154037 21805 -126157 -133708 -33497 18261 -141861 -202758
482b02758J13054J37888o1646L6453q6563j27068n9454p7464P2307J25534j50460
$$ -202758 -89704 48184 -13462 22991 -63572 -190640 -250094 -327558 -255251 -129717 -280177
471b80177Q2476j9170J34305o8307P3976Q1910J49686K8751k18786j36940N7010
$$ -280177 -197701 -216871 -82566 -150873 -76897 5013 154699 183450 -35336 -172276 -115266
460a15266j69112K49885J24077P4193q6431r6451L9668j1261j06709n521J15107
$$ -115266 -284378 -34493 89584 163777 77346 -19105 20563 9302 -97407 -102928 12179
449A2179Q2360J47488l45647l9561K08030j64000N5060P1802J10940J15353j64029
$$ 12179 94539 242027 -103620 -143181 64849 -99151 -44091 27711 138651 254004 89975
438H9975O2501j37235p8949j41792P9707j0718q1095m0956K83362k3623L0748
$$ 89975 152476 15241 -63708 -205500 -125793 -136511 -217606 -258562 24800 1177 31925
427C1925p3325R131K82035k5085k65827m3243J08025M8072j74504o1950j23741
$$ 31925 -41400 -32269 249766 224681 -41146 -84389 23636 71708 -102796 -164746 -288487
416b88487K27950p4612N2362K03228j32642O4460o3443J61393P2488l3544q1325
$$ -288487 -60537 -135149 -82787 120441 -12201 52259 -11184 150209 222697 189153 107828
405A07828j57110j79557N203R2864l1568R3772J39870j58500l8456Q7166j25827
$$ 107828 -49282 -228839 -223636 -130772 -162340 -68568 71302 -87198 -125654 -38488 -164315
394a64315j02890j06109J98777N5956K71463j02446k62915R4996k53458J57396
$$ -164315 -267205 -373314 -174537 -118581 152882 50436 -212479 -117483 -370941 -213545
384b13545P3706J49999o7743J40275M9163J81051O2551k68407O8852J43907j67955
$$ -213545 -139839 10160 -57583 82692 131855 312906 375457 107050 175902 319809 151854
373A51854l29800P4642M1536j6576j95726L9677J56540K23101k49455J73631J9932
$$ 151854 -177946 -103304 -61768 -78344 -274070 -234393 -77853 145248 -104207 69424 89356
362H9356j97830P9828J14206J8503N1062Q2769j18750K42219j21924m6618m0266
$$ 89356 -108474 -28646 85560 104063 155125 237894 119144 361363 239439 192821 152555
351A52555Q4957J94295J35414j39634j42417l13983Q5379R8248l93999J14078
$$ 152555 237512 431807 567221 427587 285170 -28813 56566 154814 -239185 -125107
341a25107l4339p3643Q5263J40630J51258k13272k06977J25087K22200r2978j8607
$$ -125107 -159446 -233089 -147826 -7196 144062 -69210 -276187 -151100 71100 -21878 -40485
330d0485l05670O4136K54120j02400J29158j578p3816N0241J53819J69740k54960
$$ -40485 -346155 -282019 -27899 -130299 -1141 -2719 -76535 -26294 127525 297265 42305
319D2305j41059J79007p8645m1463K55456k55145k27550P9290J95652k85019P9103
$$ 42305 -98754 80253 1608 -39855 215601 -39544 -267094 -187804 7848 -277171 -198068
308a98068J05162k84260J26587P4253j4345J67844J008m2843l2733M0963M6869
$$ -198068 -92906 -377166 -250579 -176326 -190671 -22827 -21819 -64662 -97395 -56432 -9563
297i563k01545j29940L4730L81524p2771j4918k29984J51043J5367k50522Q504
$$ -9563 -211108 -341048 -306318 75206 2435 -12483 -242467 -91424 -76057 -326579 -318075
286c18075K04360J50605j64088o6660J50142j69829L10890Q3003j79578J06987
$$ -318075 -113715 36890 -127198 -193858 -43716 -213545 97345 180348 770 107757
276A07757j72379K75217j1779j40693M5241K5436N123j32476r4010J09965J90211
$$ 107757 -64622 210595 198816 58123 103364 128800 133923 1447 -92563 17402 207613
265B07613Q2959k51157l1600O6910j83721J12811n7810j28116L157J41770j07632
$$ 207613 290572 39415 7815 74725 -108996 3815 -53995 -182111 -178954 -37184 -144816
254a44816q0114J35403O7282N0251J28598N3498k26783P7060J13544m6784j60431
$$ -144816 -224930 -89527 -22245 28006 156604 210102 -16681 60379 173923 127139 -33292
243c3292J4262o1618N2623N4377j43502N892j6316k12004J62172j1650J80455
$$ -33292 -19030 -80648 -28025 26352 -117150 -111258 -127574 -339578 -177406 -189056 -8601
232h601L2358L290j87055O3014j09234J02233K44245j46715R8225J1553j57614
$$ -8601 23757 27047 -160008 -96994 -206228 -103995 140250 -6465 91760 103313 -54301
221e4301K2659L4707j04245J62390k38735p6346R647O2438Q4234K07209j98270
$$ -54301 -31642 3065 -101180 61210 -177525 -253871 -244224 -181786 -97552 109657 -88613
210h8613J09889l5480m0608J46771j32212k16974K8373K27110L863j83221R6079
$$ -88613 21276 -14204 -54812 91959 -40253 -257227 -228854 -1744 2119 -181102 -85023
199h5023k5920L31394n4265l41804R5764M1509O0396M7169j05633j7495J46238
$$ -85023 -110943 220451 166186 -175618 -79854 -38345 22051 69220 -36413 -53908 92330
188I2330j12730j87698J21658O8270J13548k07349j3190K90751J5572p7343j32012
$$ 92330 -20400 -208098 -86440 -18170 95378 -111971 -125161 165590 181162 103819 -28193
177b8193N5429J28402l1031j3710j701M1845j3754p386K0124j39086Q8948J55590
$$ -28193 27236 155638 124607 110897 109196 151041 137287 129901 150025 10939 99887 255477
165B55477l39487j829K07517j85679j72120J03619N4028n0756O5354Q1636o0915
$$ 255477 -84010 -85839 121678 -64001 -236121 -132502 -78474 -129230 -63876 17760 -43155
154d3155k48292K13933J47911K9846j28315n0396m9241K29469o1963k20210K85713
$$ -43155 -291447 -77514 70397 100243 -28072 -78468 -127709 101760 39797 -180413 105300
143A05300K1527r8797l0276l3988p9938k73201P8366P1424J14816J64482l0384
$$ 105300 126827 28030 -2246 -36234 -116172 -389373 -311007 -239583 -124767 39715 9331
132I331k72074J39309K7759q0720j32264J93189K16604J30078N6468l2784j92263
$$ 9331 -262743 -123434 -95675 -176395 -308659 -115470 101134 231212 287680 254896 62633
121F2633k63986n4555r8318P0813L09511n1049k40099K38644j41438J43831L8009
$$ 62633 -201353 -255908 -354226 -283413 26098 -24951 -265050 -26406 -167844 -24013 13996
110A3996k5003R9941j58262j5393j0897p0504L855R0349p666P936M3431K5475
$$ 13996 -11007 88934 -69328 -84721 -95618 -166122 -162267 -71918 -79584 -71648 -28217 -2742
98b742o5229L2661o1762R5297J8017J44448k48818q6519q2575R7046O1011k9146
$$ -2742 -67971 -35310 -97072 -1775 16242 160690 -88128 -174647 -257222 -160176 -99165 -128311
86a28311k4504J88257M8892q5429O8773j28090K8307Q3739m9532j61928J9053
$$ -128311 -152815 35442 84334 -1095 67678 -60412 -32105 51634 2102 -159826 -140773
75a40773N0711k6521J01500O5077j13349K3799N907J10978j97769J02029P6495
$$ -140773 -90062 -116583 -15083 49994 -63355 -39556 -33649 77329 -120440 -18411 58084
64E8084j48779O2041J20578k33378O7359j0478J44212j35325p8594Q3747Q0893
$$ 58084 -90695 -28654 91924 -141454 -74095 -84573 59639 -75686 -154280 -70533 10360
53A0360k8252Q5745j49061j26650J86575O2726q903p0047r7909J6390m0848J8221
$$ 10360 -17892 67853 -81208 -207858 -21283 41443 32540 -37507 -135416 -119026 -159874 -141653
41a41653O9007Q3125O205P2109j15329J25372Q9076j05996l14216K5170O2100
$$ -141653 -72646 10479 16684 88793 -26536 98836 187912 81916 -232300 -207130 -145030
30a45030J39157J66630j73171J02353k07652o4292l7736m5654M8830J13098j23668
$$ -145030 -5873 160757 -12414 89939 -117713 -182005 -219741 -265395 -216565 -103467 -227135
19b27135K15866k4583j7003L7961r2087O3487J70696r1324O1399r4358j58941
$$ -227135 -11269 -35852 -52855 -14894 -106981 -43494 127202 35878 97277 2919 -156022
8a56022J43125l8767j23214K17733K6686q8023j01996p2630
$$ -156022 -12897 -51664 -174878 42855 69541 -18482 -120478 -193108
0a93108
$$ -193108
$$ Imaginary data points
##PAGE= N=2
##DATA TABLE= (X++(I..I)), XYDATA
16383c680570J61408n1355J12377M6282k3960J98389p9004l9379K57023r840Q0733
$$ -3680570 -3519162 -3570517 -3458140 -3411858 -3435818 -3237429 -3316433 -3355812 -3098789 -3108629 -3027896
16372c027896J6044R4299K891J5755J5991R4236j24463K9644K14132N8787R1121
$$ -3027896 -3011852 -2917553 -2914662 -2898907 -2882916 -2788680 -2913143 -2883499 -2669367 -2610580 -2519459
16361b519459l6993O6492J75355L9887k6062R6932m6380Q207J43250M1476L6910
$$ -2519459 -2556452 -2489960 -2314605 -2274718 -2300780 -2203848 -2250228 -2242021 -2098771 -2057295 -2020385
16350b020385L7929O9075J15234j76429o4410K3723K73259L6683J16624n5070
$$ -2020385 -1982456 -1913381 -1798147 -1974576 -2038986 -2015263 -1742004 -1705321 -1588697 -1643767
16340a643767Q5651L1488Q5489m8911J3563o213K44899J09504j39501R3137j142
$$ -1643767 -1558116 -1526628 -1441139 -1490050 -1476487 -1482700 -1237801 -1128297 -1267798 -1174661 -1175803
16329a175803l7639O7164O3911K4644P6969j45586O4883m8375J37361J55115k01231
$$ -1175803 -1213442 -1146278 -1082367 -1057723 -980754 -1126340 -1061457 -1109832 -972471 -817356 -1018587
16318a018587K57270J06574N2234K4036J11217L2452Q7217J3532m8787o6120m3617
$$ -1018587 -761317 -654743 -602509 -578473 -467256 -434804 -347587 -334055 -382842 -448962 -492579
16307d92579O0085J45566J2086m104J8587Q8217N5202j06018O7394K20004K61905
$$ -492579 -432494 -286928 -274842 -278946 -260359 -172142 -116940 -222958 -155564 64440 326345
16296C26345J5876k26718m5750K34290k7310p481O3820K16684j64335j38867J94432
$$ 326345 342221 115503 69753 304043 276733 269252 333072 549756 385421 246554 440986
16285D40986O1536q5974Q9096O7732K6484n0679K6775N8401j03015J27651J02585
$$ 440986 502522 416548 505644 573376 599860 549181 575956 634357 531342 658993 761578
16274G61578m9550M7K28406o8772j71031J70586R1261J6072N3512J26095k04493
$$ 761578 712028 712075 940481 871709 700678 871264 962525 978597 1032109 1158204 953711
16263I53711r2346M9373O1265P7823J16733J82810j72835J62061O6779n2441L04766
$$ 953711 861365 910738 972003 1049826 1166559 1349369 1176534 1338595 1405374 1352933 1657699
16252A657699l5796j47590L4175K7690j09453L78009j80264L8935P2577l9262
$$ 1657699 1621903 1474313 1508488 1536178 1426725 1804734 1624470 1663405 1735982 1696720
16242A696720k28861K4435J83626J72448l9216o0173J10059Q010L8706l120r3797
$$ 1696720 1467859 1492294 1675920 1848368 1809152 1748979 1859038 1867048 1905754 1902634 1808837
16231A808837K18371j15556J80991j97675j38824K21369M7354J2678j45030K41832
$$ 1808837 2027208 1911652 2092643 1894968 1756144 1977513 2024867 2037545 1892515 2134347
16221B134347J06349m6403J19398O1187j86511M0494K0938J94741L1505m9626
$$ 2134347 2240696 2194293 2313691 2374878 2188367 2228861 2249799 2444540 2476045 2426419
16211B426419l5039k02968k14698L73176p9870J20092J44253l6409r1173k70135
$$ 2426419 2391380 2188412 1973714 2346890 2267020 2387112 2531365 2494956 2403783 2133648
16201B133648K13946R335k3209L21844Q6935j35799J2454k2564L8684k6653Q1788
$$ 2133648 2347594 2356929 2333720 2655564 2742499 2606700 2619154 2596590 2635274 2608621 2690409
16190B690409j35373j54441K08559J95055J56757k34949Q170K56478j92691k54666
$$ 2690409 2555036 2400595 2609154 2804209 2960966 2726017 2734187 2990665 2797974 2543308
16180B543308K28238M2060r0139j70383K01414P1153k09222O5262n1115O7726
$$ 2543308 2771546 2813606 2723467 2553084 2754498 2825651 2616429 2681691 2630576 2698302
16170B698302J67208o8799q68O3406j16225J10463p1515J97196q8837k15074K99533
$$ 2698302 2865510 2796711 2795843 2859249 2743024 2853487 2781972 2979168 2890331 2675257 2974790
16159B974790k80986j02567K06959J42025m9761r703J31312j05602J28908o5710
$$ 2974790 2693804 2591237 2798196 2940221 2890460 2880757 3012069 2906467 3035375 2969665
16149B969665j29638J27922M4297P3748P4486K44634k49130M2880J11868j53700
$$ 2969665 2840027 2967949 3012246 3085994 3160480 3405114 3155984 3198864 3310732 3157032
16139C157032n2580J78356K32142j38215j65840n1881J42149J15402k02621k20091
$$ 3157032 3104452 3282808 3514950 3376735 3210895 3159014 3301163 3416565 3213944 2993853
16129B993853N5147P7534j00879N2404o9833n7512K11311J91034Q7117o8418o9317
$$ 2993853 3049000 3126534 3025655 3078059 3008226 2950714 3162025 3353059 3440176 3371758 3302441
16118C302441P1756j36293n7p2477j0639k10709L8647J32384m9357q9604J88392
$$ 3302441 3374197 3237904 3237847 3165370 3154731 2944022 2982669 3115053 3065696 2976092 3164484
16107C164484p236P2924j01233m5621K14215J50390l21413j1721K44675k04616
$$ 3164484 3157248 3230172 3128939 3083318 3297533 3447923 3126510 3114789 3359464 3154848
16097C154848M8494Q6506k11059j27059K13360Q2092k4792L1116l6596J15289
$$ 3154848 3203342 3289848 3078789 2951730 3165090 3247182 3222390 3253506 3216910 3332199
16087C332199R1384k94141L09630K7161N2092J44369r1198p2425P3879k21541
$$ 3332199 3423583 3129442 3439072 3466233 3518325 3662694 3571496 3499071 3572950 3351409
16077C351409L41943j97402j49084J23477k95240k7093L50909l9848k71287R5901
$$ 3351409 3693352 3495950 3346866 3470343 3175103 3148010 3498919 3459071 3187784 3283685
16067C283685j26013l369J66264l3354m6703R054L1701j92136J73173M19771j19121
$$ 3283685 3157672 3154303 3320567 3287213 3240510 3249564 3281265 3089129 3262302 3682073 3562952
16056C562952o8687j9636q2962j52382l8438L16404j9002K9407K15394j08957
$$ 3562952 3494265 3474629 3391667 3239285 3200847 3517251 3498249 3527656 3743050 3634093
16046C634093j62298J53353k3160l6398J78311j97210k90365j1076J6445j7864
$$ 3634093 3471795 3625148 3601988 3565590 3743901 3546691 3256326 3245250 3261695 3243831
$$ [...]
##END NTUPLES=NMR SPECTRUM
##END=
