##TITLE=1H_CG-1148-D
 CDCl3, 8 sc, 
 8.07.2021
##JCAMPDX= 6.0         $$ Bruker NMR JCAMP-DX V2.0
##DATA TYPE= NMR SPECTRUM
##DATA CLASS= NTUPLES
##ORIGIN= UXNMR, Bruker Analytische Messtechnik GmbH
##OWNER= root
$$ XWIN-NMR		Version 3.5
$$ Thu Jul  8 11:54:31 2021 Russian Standard Time (UT+4h)  she@DPX200
##.OBSERVE FREQUENCY= 200.131506
##.OBSERVE NUCLEUS= ^1H
##.ACQUISITION MODE= SIMULTANEOUS
##.ACQUISITION SCHEME= undefined
##.AVERAGES= 8
##.DIGITISER RES= 18
##SPECTROMETER/DATA SYSTEM= spect
##.PULSE SEQUENCE= zg30
##.SOLVENT NAME= CDCl3
##.SHIFT REFERENCE= (INTERNAL, CDCl3, 0, 17.5032)
##AUDIT TRAIL= $$ (NUMBER, WHEN, WHO, WHERE, WHAT)
$$ ##TITLE= Audit trail, XWIN-NMR		Version 3.5
$$ ##JCAMPDX= 5.01
$$ ##ORIGIN= Bruker BioSpin GmbH
$$ ##OWNER= she
$$ F:/spectra/data/she/nmr/H-F/1/pdata/1/auditp.txt
$$ ##AUDIT TRAIL=  $$ (NUMBER, WHEN, WHO, WHERE, WHAT)
(   1,<2021-07-08 11:53:19.65 +0400>,<she>,<DPX200>,
      <created by zg, POWCHK disabled, PULCHK disabled
       configuration hash MD5:
       00 E9 B6 7A A2 85 ED C7 34 08 36 98 17 FE 4E 26
       data hash MD5: 16K
       A9 50 75 2E 5C B4 E4 1D 4C 55 81 79 70 B6 9A 81>)
(   2,<2021-07-08 11:53:22.60 +0400>,<she>,<DPX200>,
      <Start of raw data processing
       efp BC_mod = 2 LB = 0.24 FT_mod = 6 PKNL = 1 PHC0 = -12433.25 PHC1 = 12.80101 SI = 16K 
       data hash MD5: 16K
       43 17 98 D9 7E 72 A4 AF 70 69 96 74 F3 9A 9A 85>)
(   3,<2021-07-08 11:53:46.40 +0400>,<she>,<DPX200>,
      <pk PHC0 = -3.059861 PHC1 = 4.2 
       data hash MD5: 16K
       06 BA 1C 91 49 2C BB DD AC BF DC 4A 5D 1A 3C 02>)
(   4,<2021-07-08 11:53:49.87 +0400>,<she>,<DPX200>,
      <abs ABSG = 5 
       data hash MD5: 16K
       F8 72 BD EF 23 31 55 55 D2 E3 BC 3B 8B 27 A2 27>)
$$ ##END=
$$ 
$$ hash MD5
$$ 1E A6 79 44 CD D7 32 7A F6 E7 3D A9 AF 19 AE 1E
##$RELAX= 
##$RELAX= 
##$RELAX= 
##$RELAX= 
##$RELAX= 
##$RELAX= 
$$ Bruker specific parameters
$$ --------------------------
##$DU= <F:/spectra>
##$EXPNO= 1
##$NAME= <H-F>
##$PROCNO= 1
##$TYPE= <nmr>
##$USER= <she>
##$AMP= (0..31)
100 100 100 100 100 100 100 100 100 100 100 100 100 100 100 100 100 100 
100 100 100 100 100 100 100 100 100 100 100 100 100 100 
##$AQSEQ= 0
##$AQ_mod= 1
##$AUNM= <au_zg>
##$AUTOPOS= <>
##$BF1= 200.13
##$BF2= 200.13
##$BF3= 200.13
##$BF4= 200.13
##$BF5= 200.13
##$BF6= 200.13
##$BF7= 200.13
##$BF8= 200.13
##$BYTORDA= 1
##$CFDGTYP= 0
##$CFRGTYP= 5
##$CHEMSTR= <none>
##$CNST= (0..31)
1 1 145 1 1 1 1 1 1 1 1 1 1 1 1 1 1 1 1 1 1 1 1 1 1 1 1 1 1 1 1 1 
##$CPDPRG= <>
##$CPDPRG1= <>
##$CPDPRG2= <>
##$CPDPRG3= <>
##$CPDPRG4= <mlev>
##$CPDPRG5= <mlev>
##$CPDPRG6= <mlev>
##$CPDPRG7= <mlev>
##$CPDPRG8= <mlev>
##$CPDPRGB= <>
##$CPDPRGT= <>
##$D= (0..31)
0 1.2 0 0 0 0 0 0 0 0.06 0 0.03 0 0 0 0 0.0002 0 0 0 0 0 0 0 0 0 0 0 0 
0 0 0 
##$DATE= 1625730799
##$DBL= (0..7)
120 120 120 120 120 120 120 120 
##$DBP= (0..7)
150 150 150 150 150 150 150 150 
##$DBP07= 0
##$DBPNAM0= <>
##$DBPNAM1= <>
##$DBPNAM2= <>
##$DBPNAM3= <>
##$DBPNAM4= <>
$$ [...]
##$SUBNAM3= <"">
##$SUBNAM4= <"">
##$SUBNAM5= <"">
##$SUBNAM6= <"">
##$SUBNAM7= <"">
##$SUBNAM8= <"">
##$SUBNAM9= <"">
##$SW= 20.0188882624521
##$SWIBOX= (0..15)
0 0 2 0 0 0 0 0 0 0 0 0 0 0 0 0 
##$SW_h= 4006.41025641026
##$TD= 16384
##$TD0= 1
##$TE= 0
##$TE2= 300
##$TE3= 300
##$TEG= 300
##$TL= (0..7)
0 120 120 120 120 120 120 120 
##$TP= (0..7)
150 150 150 150 150 150 150 150 
##$TP07= 0
##$TPNAME0= <>
##$TPNAME1= <>
##$TPNAME2= <>
##$TPNAME3= <>
##$TPNAME4= <>
##$TPNAME5= <>
##$TPNAME6= <>
##$TPNAME7= <>
##$TPOAL= (0..7)
0.5 0.5 0.5 0.5 0.5 0.5 0.5 0.5 
##$TPOFFS= (0..7)
0 0 0 0 0 0 0 0 
##$TUNHIN= 0
##$TUNHOUT= 0
##$TUNXOUT= 0
##$USERA1= <user>
##$USERA2= <user>
##$USERA3= <user>
##$USERA4= <user>
##$USERA5= <user>
##$V9= 5
##$VALIST= <valist>
##$VCLIST= <CCCCCCCCCCCCCCC>
##$VD= 0
##$VDLIST= <DDDDDDDDDDDDDDD>
##$VPLIST= <PPPPPPPPPPPPPPP>
##$VTLIST= <TTTTTTTTTTTTTTT>
##$WBST= 1024
##$WBSW= 4
##$XGAIN= (0..3)
0 0 0 0 
##$XL= 0
##$YL= 0
##$YMAX_a= 200830
##$YMIN_a= -115944
##$ZGOPTNS= <>
##$ZL1= 120
##$ZL2= 120
##$ZL3= 120
##$ZL4= 120
##$ABSF1= 17.502
##$ABSF2= -2.517038
##$ABSG= 5
##$ABSL= 3
##$ALPHA= 0
##$AQORDER= 0
##$ASSFAC= 0
##$ASSFACI= 0
##$ASSFACX= 0
##$ASSWID= 0
##$AUNMP= <proc_1d>
##$AZFE= 0.1
##$AZFW= 0.1
##$BCFW= 0
##$BC_mod= 2
##$BYTORDP= 0
##$COROFFS= 0
##$CY= -3
##$DATMOD= 1
##$DC= 0
##$DFILT= <>
##$DTYPP= 0
##$F1P= 0
##$F2P= 0
##$FCOR= 1
##$FTSIZE= 16384
##$FT_mod= 6
##$GAMMA= 0
##$GB= 0
##$INTBC= 1
##$INTSCL= 1.334414e-10
##$ISEN= 128
##$LB= 0.24
##$LEV0= 0
##$LPBIN= 0
##$MAXI= 10000
##$MC2= 0
##$MEAN= 0
##$ME_mod= 0
##$MI= 1.114404
##$NCOEF= 0
##$NC_proc= -8
##$NLEV= 6
##$NOISF1= 3.799351
##$NOISF2= 2.8
##$NSP= 0
##$NTH_PI= 0
##$NZP= 0
##$OFFSET= 17.50322
##$PC= 1
##$PHC0= -12436.31
##$PHC1= 17.00101
##$PH_mod= 1
##$PKNL= yes
##$PPARMOD= 0
##$PSCAL= 0
##$PSIGN= 0
##$REVERSE= no
##$SF= 200.130006286162
##$SI= 16384
##$SIGF1= 3
##$SIGF2= 2
##$SINO= 5.538805
##$SIOLD= 16384
##$SREGLST= <1H.CDCl3>
##$SSB= 0
##$STSI= 16384
##$STSR= 0
##$SW_p= 4006.41025641026
##$SYMM= 0
##$S_DEV= 0
##$TDeff= 16384
##$TDoff= 0
##$TI= <>
##$TILT= no
##$TM1= 0
##$TM2= 0
##$TOPLEV= 0
##$USERP1= <user>
##$USERP2= <user>
##$USERP3= <user>
##$USERP4= <user>
##$USERP5= <user>
##$WDW= 1
##$XDIM= 16384
##$YMAX_p= 394898397
##$YMIN_p= -619326
$$ End of Bruker specific parameters
$$ ---------------------------------
##NTUPLES= NMR SPECTRUM
##VAR_NAME=  FREQUENCY,     SPECTRUM/REAL,   SPECTRUM/IMAG
##SYMBOL=    X,             R,               I
##VAR_TYPE=  INDEPENDENT,   DEPENDENT,       DEPENDENT
##VAR_FORM=  AFFN,          ASDF,            ASDF
##VAR_DIM=   16384,         16384,           16384
##UNITS=     HZ,            ARBITRARY UNITS, ARBITRARY UNITS
##FACTOR=    0.24454680195387, 1,            1
##FIRST=     3502.9194494751, 0,             0
##LAST=      -503.490806935165, 0,           0
##MIN=       -503.490806935165, -619326,     0
##MAX=       3502.9194494751, 394898397,     0
$$ Real data points
##PAGE= N=1
##DATA TABLE= (X++(R..R)), XYDATA
$$ [...]
7603 4205833 3898276 3961145 3826834 3949228 3960976 3883924 3797656 3462822 3535322 3735267
7593 3735267 3567309 3428794 3267371 3197064 3129049 2977755 2987439 2720784 2695143 2729038 2990270
7582 2990270 2978106 3088671 3066080 3416183 3119037 2577269 2750570 2635493 2854945 2837414
7572 2837414 2703155 2916345 2860380 2611610 2665330 2640197 2973828 2704222 2420330 2203656
7562 2203656 2528727 2480054 2328408 2127511 2140466 2241616 2016504 1870059 1754304 1893998
7552 1893998 1770244 1765991 1725048 1761243 1809740 1905936 1698626 1580280 1378652 1278451 1242818
7541 1242818 1521884 1644134 1628668 1513559 1589667 1623885 1477296 1345940 1541114 1681536
7531 1681536 1649504 1604834 1481367 1540636 1560944 1379132 1197269 1307960 1345188 1237745
7521 1237745 1340341 1145936 1168151 1196041 1182228 1154289 1103074 1143575 971101 980788 1147243
7510 1147243 1274012 1084382 886108 974325 913356 902559 936142 774792 789801 1015441
7500 1015441 1070487 973670 969174 813999 987392 1203042 1008609 1263027 1380369 1301210
7490 1301210 1100623 1199314 1097975 1050459 1259647 1125465 981134 882535 933654 925853 970263
7479 970263 863512 840842 981344 893789 970925 980789 965809 1120999 913757 988313 840940
7468 840940 1060959 1028779 853755 841193 1025838 1067737 1015521 1004546 947123 868256 917886
7457 917886 974227 891879 829263 1079603 1123160 1267914 1006063 732846 1046737 1041398 1038460
7446 1038460 1099244 1018367 1188664 1071541 930069 1154983 1073424 772521 708564 972786
7436 972786 1135484 1263160 1230046 1147499 1365582 1706914 1555757 1916841 2419170 2696425
7426 2696425 2693616 2356137 1925966 1781902 1402106 1340367 1160969 885209 1127572 1014449
7416 1014449 809666 765617 663058 594571 526252 545222 804170 800184 846479 865423 641928
7405 641928 576401 814330 817049 813121 592061 717635 766140 679136 755862 654751 775837
7394 775837 748137 853228 885929 663385 628673 864401 976826 906692 686959 798398
7384 798398 640136 470710 461249 547520 508041 487229 544208 492429 439325 516405 504000
7373 504000 573038 337723 319538 484499 450279 507393 560356 454557 307923 309778 496354
7362 496354 531609 627591 714899 860217 694699 384080 611339 600056 445424 365740 450999
7351 450999 688049 609721 404897 545898 887294 841713 809830 931154 872238 784679 640992
7340 640992 561327 497492 623667 849177 621252 777359 723542 592604 691420 564229
7330 564229 484707 449134 690653 727199 846161 761533 911325 686877 761219 772122 757097
7319 757097 824963 673330 550445 631575 809453 773718 711528 688708 583116 779170 743321
7308 743321 573821 544104 693570 737990 593110 500580 721291 902901 850094 519423
7298 519423 639296 364876 227550 669485 721086 602408 605722 753455 725321 836192
7288 836192 761463 805832 849163 704567 603646 496464 471707 721033 654660 664666 687439
7277 687439 773663 728764 713656 875429 832200 946420 638936 521634 760757 892883
7267 892883 991132 857903 761582 779408 538303 419189 314533 333924 288249 397686 389537
7256 389537 289655 369639 534746 466638 387981 494859 353153 569716 679173 729436 744290
7245 744290 826999 777691 839791 655678 586554 589492 606482 694982 612236 468866 554826
7234 554826 763494 760306 637202 492525 725046 961868 819539 717379 611121 762688
7224 762688 806394 778292 760524 469733 507471 629644 556033 388560 587768 668404 353792
7213 353792 436218 615604 584801 568989 619231 695154 790058 618818 517239 372127 478798
7202 478798 677163 789797 692051 471381 452713 419070 548571 469746 557850 651352 638849
7191 638849 565966 438964 461527 557140 900957 585407 501281 641715 567716 518430 818897
7180 818897 532690 402544 369750 518404 526243 592372 388561 388443 224303 458000 623718
7169 623718 13788 128672 304850 427360 137971 203146 266325 433213 429271 183882
7159 183882 327009 347330 376791 564117 535041 445267 373040 288745 185558 466426 395576
7148 395576 423124 255283 27479 107536 346758 378027 390720 315570 201183 244565 323391
7137 323391 186742 331737 172048 346128 465473 411227 267659 -65856 149593 351364
7127 351364 470914 368252 516679 344803 209344 505735 351003 437055 639703 547711
7117 547711 419476 428799 646052 826563 694279 491470 549001 875578 691035 482054
7107 482054 442600 420461 295229 195817 263150 406854 460634 657435 468058 289442 292154
7096 292154 290519 308688 250771 304238 136575 186053 220057 212607 302989 389735 221840 98058
7084 98058 311511 426516 622753 626804 581591 403258 364633 115986 -61916 212120 298048
7073 298048 453289 290511 192683 257942 181638 314281 546703 300897 289536 167872
7063 167872 209261 654641 595426 334068 304553 452922 646708 416089 497313 313670
7053 313670 263149 302541 197237 269356 307910 187686 271948 658191 598162 311867 428290
7042 428290 418265 352777 350552 278363 418807 526581 498671 447163 648620 474835 389304
7031 389304 297259 217049 445071 481406 337491 278355 237387 339005 451777 351791 198060
7020 198060 90020 166684 434661 188295 101633 426402 468567 526606 234456 224166 254236
7009 254236 433777 458383 363739 341645 474271 408393 147754 96237 48563 222251 530414
6998 530414 516896 385868 376896 375268 242158 230600 255198 378739 355731 388968 399957
6987 399957 476127 716842 619111 576896 588369 528057 469999 629361 663689 558016 635247
6976 635247 716043 678717 592223 700433 568765 493626 606479 449905 744977 875762
6966 875762 506200 421077 387065 418503 454149 404449 509628 563335 630344 609612 496973
6955 496973 494906 783836 774155 711092 814730 593103 534999 833263 613947 640552 736287
6944 736287 655973 891866 798035 668062 801242 916012 972479 699556 982763 1193930
6934 1193930 1084185 1283226 1439442 1513652 1486867 1367278 1303949 992735 876034 1025592
6924 1025592 917159 1227414 1278122 1186493 1009073 1000749 967549 916560 833076 829797 837280
6913 837280 582743 678084 755491 511369 397708 468583 425492 432752 400745 336301 244112
6902 244112 334995 538685 598364 672607 522853 291812 571093 525044 568522 475302 427034
6891 427034 575427 531033 468634 614235 536980 451827 702212 510308 436170 472381 472020
6880 472020 607506 708504 561059 519274 543530 552639 511147 739324 778083 794694 883321
6869 883321 870680 1172387 1027280 805291 759342 692145 691492 643387 738454 871892 889100
6858 889100 1209689 1236795 1217559 951758 683433 751318 886858 730408 761603 777369 836953
6847 836953 816256 766950 620150 523082 765372 623267 731579 642179 608670 568178 402140
6836 402140 320979 315033 488832 524793 404729 353004 418404 597879 493886 522987 633873
6825 633873 615701 599247 351452 305953 571408 741381 638993 472370 504610 438712 233614
6814 233614 399716 477707 606525 682415 643110 593025 733018 629580 798336 642885
6804 642885 516471 638842 499899 413885 590741 645170 811540 724757 491386 627603
6794 627603 623134 692184 545265 734059 786493 730360 392340 654410 654513 536170 730105
6783 730105 785861 622733 686875 755932 680330 740612 544596 351543 415031 560928 599603
6772 599603 418646 584909 530676 625466 509890 625735 544858 439779 621511 541819
6762 541819 599229 378661 431870 691981 574148 556730 527530 512597 416258 560328 578633
6751 578633 557068 725920 657943 716533 853564 723831 741673 801135 863826 811273 538108
6740 538108 608110 637084 570777 494294 479996 544786 823024 688025 513910 856209 753363
6729 753363 727613 572605 410017 647524 799075 847171 863064 761063 796965 872948 496386
6718 496386 409929 369902 415159 549633 606873 444069 510000 559836 560733 655340 696445 808698
6706 808698 650943 580013 576354 451975 534991 717868 598588 592751 853514 752630 898808
6695 898808 599579 785118 1009738 656165 887817 1207892 1126817 1134470 1166419 1097116 743482
6684 743482 955624 1061677 1102243 853502 1162068 1559998 1391072 1276118 1265791 1599169
6674 1599169 1628043 1671877 1898058 1796031 1583529 1570116 1800186 1614785 1896503 1846451
6664 1846451 1744627 1492756 1451957 1732840 1439661 1446393 1210565 1249615 1236088 1230312 968417
6653 968417 1000171 1047221 1088544 1189264 1274633 1135769 990181 923726 1072699 1237998 1207706
6642 1207706 1209219 1205713 1145839 1222208 1401237 1123207 1029611 1361806 1341090 977782 1137893
6631 1137893 1169839 1328452 1339469 1577426 1579983 1518733 1624230 1412565 1462804 1617230 1622808
6620 1622808 1661843 1793021 1824320 1825126 1646752 1709599 1751121 1809122 1703027 1504466 1567009
6609 1567009 1472794 1397001 1252415 1129288 1206972 1374821 1468963 1402274 1587314 1401393
6599 1401393 1624951 1533991 1080014 1032036 987711 1013231 1202581 1185862 1154843 1124135 1337702
6588 1337702 1573008 1331411 1237216 1230576 1068339 1170144 1081923 1190799 1209112 1223361 1052381
6577 1052381 1259468 1205350 1150719 1282294 1268624 1169308 1073994 967621 1212448 1107135
6567 1107135 1182892 1205457 1205899 1259538 1136975 987574 646972 865288 1213063 1292535 1190038
6556 1190038 1286427 1142840 1222294 1545881 1462766 1189338 1251332 1328733 1223441 1185001 1266148
6545 1266148 1130995 1279878 1263826 1333968 1300637 1829225 1962414 2001178 1993697 1998074 1960335
6534 1960335 1826342 2217923 2291631 2262837 2289702 2355643 2223486 2120490 2027960 2337683
6524 2337683 2413178 2441209 2513218 2307760 2327537 2065379 1938437 2028464 2128892 2070170 2127617
6513 2127617 1865872 1544281 1675190 1576075 1501941 1374876 1468358 1489456 1213854 1573030
6503 1573030 1368471 1229536 1320856 1019045 914452 970743 1240743 1181599 1258895 1224861
6493 1224861 1164253 1261301 1234353 933159 1106015 1148828 869633 1140591 1086937 1102330 1041703
6482 1041703 1092279 1041915 1128533 774666 568117 984719 944665 1157176 1254886 1018952
6472 1018952 1072022 1159689 1299478 1443094 1341829 1499325 1321449 1064372 1180762 1204735
6462 1204735 1267132 1156755 1065121 1219762 1186076 1186081 1278711 1208494 1113174 1295339 1210890 881668
6450 881668 933769 1144648 1334227 1172182 1190681 1053920 1047203 926756 1084982 1127909 1187237
6439 1187237 1155716 1162809 1004263 943856 1086813 973453 1080463 933371 847602 994977
6429 994977 1098586 1104356 1345613 1163956 878320 1074866 1029219 927416 702630 902156
6419 902156 1248368 1284032 1129092 1033073 995729 915943 929007 910407 1061970 1144153 1307925
6408 1307925 1015268 664319 634828 994205 1048179 1177588 1021930 713450 791849 925990
6398 925990 848114 905787 718608 898349 1038019 1034996 1094596 1039529 1100138 1153591 1059893
6387 1059893 998566 1064536 1241523 1039880 1097863 963156 928140 762225 729816 759787 897244
6376 897244 1033178 807777 1173991 1300037 1395406 1249168 1238386 1117470 1116128 1204889 1053749
6365 1053749 861327 1070891 1266718 1198028 1051129 941403 1072859 1254238 1414459 1224745
6355 1224745 1027503 915430 877364 929613 1056263 1190745 1000715 961439 1010695 925562
6345 925562 948677 1016146 947882 753335 1078115 1035317 667925 856051 1126596 1258134
6335 1258134 1026394 960643 1003547 1049945 1087294 1092792 1052894 1260532 1274744 1321477 1348729
6324 1348729 1243840 1388605 1376217 1234296 1134664 1301578 1372398 1290291 1159021 1327310
6314 1327310 1407557 1065882 1092516 1112555 1233561 1165235 1267311 1628074 1463548 1240669
6304 1240669 1102476 1521408 1513165 1375556 1178037 1285285 1405759 1439517 1650497 1456845
6294 1456845 1170196 1272879 1419861 1386116 1599826 1451150 1611935 1648351 1936447 1717670
6284 1717670 1382571 1315697 1499548 1630879 1619468 1774752 1767670 1759626 1942115 1989896 1961445
6273 1961445 1748227 2120662 2286011 2170775 2151248 2042361 2115276 1928430 1919690 1939508
6263 1939508 2187463 2216766 2180469 2200776 2270376 2375687 2304354 2197281 2319976 2315586 2282556
6252 2282556 2446469 2348658 2546398 2389870 2190614 2434231 2489705 2411211 2417009 2724529
6242 2724529 2554281 2582196 2349269 2123798 2296723 2220916 1934577 1908597 1887390 1882658 2156059
6231 2156059 2181950 1944997 2073059 2051431 1923171 2021841 1778555 1691199 1963885 1883721
6221 1883721 1856632 1855137 1524663 1493037 1748303 1768229 1823925 1606155 1845480 1958442 1661775
6210 1661775 1639620 1866902 1949382 1855726 2025437 2203873 2089904 2052725 1878485 1715059
6200 1715059 1953884 1931875 1999556 2117301 2147031 2026437 1982940 2100835 2117295 2034953 1976834
6189 1976834 1919677 2220931 1941540 2156035 2053635 1912980 2032649 2090170 2221539 2208990
6179 2208990 2293579 2064482 2046211 2190847 2154936 2156528 2293144 2299136 2715482 2705547 2507692
6168 2507692 2590503 2582583 2452780 2440200 2570509 2576665 2587599 2635048 2457032 2591963 2828657
6157 2828657 2928463 2762562 2516353 2889517 3032826 3061281 2961481 3016809 2919638 3080562
6147 3080562 3134208 3103688 2991241 3027946 3210995 3347145 3436231 3353423 3460506 3551457 3401095
6136 3401095 3242887 3429916 3821725 4080937 4030995 4126635 4327335 4496330 4665082 4825869
6126 4825869 4647098 4862694 4846436 4773060 4881584 5062047 5416095 5549117 5867283 6091316
6116 6091316 6183960 6308700 6433532 6883461 7172231 7434406 7754447 8222257 8542123 8948508
6106 8948508 9440405 9732889 10382580 10982199 11233508 11736864 12234951 12716516 13358480 14028756
6096 14028756 14577068 15097249 15593692 16374731 17117568 18015313 19046081 19689960 20371966
6087 20371966 21389670 22529939 23425947 24395808 25000787 25497723 26149533 26320266 26447798
6078 26447798 26260837 25896177 25112113 24547112 23612053 22375782 21499596 20572506 19422460
6069 19422460 18198682 17193336 16355792 15555239 14897438 14233764 13263232 12609603 12190825
6060 12190825 11582493 10904372 10548954 9873493 9189503 8905539 8678542 8398528 8223765
6051 8223765 7834109 7637311 7221045 6920185 6899771 6757316 6656217 6533918 6321957 6141988
6041 6141988 5718649 5398992 5113777 5023755 5226179 5085423 4753047 4547580 4508008 4417054
6031 4417054 4305934 4310249 4337934 4141248 3801774 3971543 4168193 3916468 3781269 3951218
6021 3951218 3884417 3763140 3572292 3418272 3323199 3265514 3237964 3361116 3316700 3315351 3426339
6010 3426339 3473820 3235106 3243633 3235711 3093634 3143678 3170582 3019121 2869833 2757591 2774958
5999 2774958 2906755 2910719 2750972 2444060 2544404 2485021 2495717 2598483 2456695 2167707
5989 2167707 2247509 2298056 2472789 2424171 2235629 2246278 2298790 2252148 2348407 2426576 2255498
5978 2255498 2192203 2176655 2153728 2071763 2046344 2013321 2096096 1963004 1861360 2028381 1817702
5967 1817702 1841943 1894062 1663313 1885786 1808564 1678887 1742268 1743714 1818718 1474170 1505260
5956 1505260 1717914 1656875 1542382 1448579 1566485 1366544 1467705 1549137 1497443 1332465
5946 1332465 1491255 1422230 1330307 1507502 1331141 1462845 1444186 1699201 1644204 1767502
5936 1767502 1899536 1580647 1530599 1895895 1987755 1704875 1619974 1493193 1380835 1451848
5926 1451848 1218926 1293096 1409007 1764964 1747632 1820737 1750006 1877269 1602651 1471170
5916 1471170 1769656 1759570 1560166 1348198 1684075 1568310 1634851 1868727 1905890 1729741
5906 1729741 1848787 1831002 2033421 1931587 2063156 2126843 2070296 1956533 2071289 2047029
5896 2047029 1851160 1937742 1948848 1848960 1955031 1694789 1604984 1725857 1725523 1580882 1444807
5885 1444807 1487930 1483730 1674845 1644357 1661907 1769400 1971245 1586702 1466510 1792128
5875 1792128 1798251 1507177 1805588 2111981 1822858 1701221 1805740 1668177 1700081 1724847
5865 1724847 1731282 1829288 1842872 1825814 1893559 1652087 1550356 1448360 1643807 1711806 1531683
5854 1531683 1693149 1620366 1729844 1835126 1598147 1554666 1643071 1479696 1480521 1525933 1462082
5843 1462082 1276110 1510904 1610431 1579961 1563793 1605955 1428585 1682204 1827113 1849874
5833 1849874 1912912 1685512 1639007 1657882 1482083 1536421 1380780 1486381 1489277 1514137 1597845
5822 1597845 1485193 1705090 1778015 1796597 1821113 1591412 1412830 1558982 1541955 1505250
5812 1505250 1457393 1637657 1673350 1661415 1521051 1354581 1448015 1588959 1576679 1609846 1748888
5801 1748888 1783870 1663792 1701179 1884336 1774849 1640093 1641152 1456561 1542758 1824696
5791 1824696 1774320 1813374 2010179 1781572 1826289 1727578 2025521 1955332 1619600 1731160
5781 1731160 1713451 1702368 1868589 1883100 1905662 1814840 1817546 1802060 1888058 1977417 1558744
5770 1558744 1751560 2219889 2257800 2328914 2221483 2039453 2008815 2033797 2037490 2128461 1996882
5759 1996882 1775685 1841086 1859475 2120034 2063509 2109399 1984511 2344005 2084889 2112637
5749 2112637 2099681 2185556 2491483 2428435 2566516 2539472 2775788 2755679 2473206 2638109
5739 2638109 2702976 2624950 2610407 2647418 2745425 2738182 2956581 2631505 2462985 2443940 2669714
5728 2669714 2775909 2636355 2722594 2982802 3014864 2770889 2801083 3008169 2907788 3155664
5718 3155664 2978085 2970970 3253468 3173755 3175736 3429535 3500915 3339833 3263856 3209610 3078721
5707 3078721 3169252 3125402 2904128 3056491 3216727 3549775 3556004 3527906 3407856 3531117
5697 3531117 3674761 3742822 3714997 3763805 3805160 3822605 4125941 4095151 4113896 4126547 4264056
5686 4264056 4549887 4535234 4634621 4727249 4699060 4730162 4929924 4747016 5012199 5304635
5676 5304635 5385863 5408621 5664671 5724387 6101527 6467719 6701831 6835493 6896978 6982258
5666 6982258 6770095 6849181 6771445 6819622 6655593 6479212 6645429 6873983 6950291 7067721
5656 7067721 7243338 7057554 7388637 7595034 7615376 8263945 8537099 8626451 9068681 9393174
5646 9393174 9380549 10156033 10720211 11450144 12018851 12283179 12671270 13139789 12971294 12962805
5636 12962805 13248221 13403453 13655326 14004024 14498015 15104259 16010233 16630696 17794144
5627 17794144 18939854 20061525 21599358 23712322 25702832 27786913 29868678 31351244
5619 31351244 32541750 32381715 31411435 29972097 28652964 27294231 26289729 25639322 24897640
5610 24897640 24545143 24207839 23896898 23865298 24254067 24949702 25990454 26859190 28163473
5601 28163473 30155040 32035016 34239697 37063524 40009988 43745699 48045050 51978398
5593 51978398 55450297 57094991 56514593 53715888 49289774 44317122 39891531 36176826
5585 36176826 32808833 30112581 28224658 26491613 24920451 23932101 23375868 22872121 22802887
5576 22802887 22796193 22847261 23154868 23653539 24467381 25409120 26666964 28058324 29562215
5567 29562215 30998601 32223749 32723156 32219453 30619429 28661635 25895274 23593382
5559 23593382 21415293 19699845 18033207 16809452 15709082 14653867 13954479 12868924
5551 12868924 12573546 11829741 11239557 10698030 10277333 9973776 9743485 9575346 9002317
5542 9002317 8727414 8670230 8653226 8417702 8035602 8045393 8071383 8077905 8146564 7850844 7908276
5531 7908276 7756190 7627961 7783008 7689317 7727883 7660729 7579185 7479681 7266906 6794516
5521 6794516 6836134 6680118 6525509 6748379 6563798 6545906 6204511 6087188 5991425 5898642
5511 5898642 6078958 6289564 5945979 6039827 6300278 6398009 6510938 6439098 6645559 6553522
5501 6553522 6650475 6577533 6626125 6437691 6323366 6305336 6084955 6087834 6012291 5828984 5736054
5490 5736054 5588210 5449859 5185056 5219165 5171580 5158241 5237785 5511069 5418850 5391300 5325254
5479 5325254 5074772 5177589 5256163 5097584 5067679 5247302 5422237 5527736 5412358 5002502
5469 5002502 5173068 5232233 4785093 4814742 4742501 4752213 4570918 4555695 4482366 4241241 4387162
5458 4387162 4403214 4444307 4312826 4212600 4145804 4085329 4059276 3967607 4199171 3919108 4286601
5447 4286601 4415919 4345715 4532624 4616132 4452035 4397000 4479924 4664302 4896942 4748153
5437 4748153 4832229 5080657 4868218 4963335 5112286 4884566 4763624 4713560 4922313 5278097
5427 5278097 5311251 5375682 5852226 6121972 5966269 6153401 6297565 6698718 6911354 7074834
5417 7074834 7593371 7947528 8214858 8445980 8467353 8532447 8280719 8108144 7770510 7441930
5407 7441930 7277161 7055026 7101253 7054957 7108230 6987520 7089669 7215037 7336684 7506249
5397 7506249 7680375 8117395 8273665 8421005 8769903 9070080 9631966 10204293 10872743 11267266
5387 11267266 12046682 12602310 12919906 12999315 12728649 12381762 11912493 11383871 10705881 10212880
5377 10212880 9926411 9590845 9138529 8479422 8273712 8132493 7923517 8014703 8015289 7719423
5367 7719423 7689986 7679378 7732788 7790008 7909790 8043534 8296741 8529426 8991083 9262229
5357 9262229 9774765 10058570 10112334 10151181 9852894 9570841 9237255 8966259 8562990 8133943
5347 8133943 7978178 7605561 7556119 7137801 6915516 6845655 6394719 6430593 6509690 6571551
5337 6571551 6215665 5913364 5832468 5775479 5946136 5894353 5523680 5569536 5631531 5661325 5345920
5326 5345920 5125936 5299398 5238069 5078582 5437383 5521351 5158714 5004348 5090997 5204890
5316 5204890 5385572 5478885 5590820 5490364 5216131 5076816 5128235 4788867 4763256 4743148
5306 4743148 4761519 4847700 4544165 4655002 4399622 4461432 4559814 4468730 4470556 4269924 4203723
5295 4203723 4224914 4028628 4074897 4082486 3978319 4188431 3933849 3832894 3801685 4012218
5285 4012218 4088314 4108396 4055736 4077702 4138143 4078701 4277107 4301806 4379694 4647503 4528379
5274 4528379 4488796 4312123 4243858 4374798 4338052 4112750 4013684 3830963 4009316 3890091
5264 3890091 3829831 3798703 3898111 3894769 3822379 3908417 3915846 4071284 3709129 3836980 3867818
5253 3867818 3685383 3778980 3869948 3855538 3594528 3839247 3730802 3899846 4167127 4048654
5243 4048654 3975633 3999544 3927108 3837407 4137347 3993744 3877035 3834676 3915145 3997019 4051244
5232 4051244 4039205 4062606 4059590 4274702 4430456 4418197 4221357 4216635 4307925 3992866 3982339
5221 3982339 4165563 4323343 4280868 4164658 4283036 4385236 4630724 4532629 4519542 4532085
5211 4532085 4639766 4424128 4549108 4539634 4576275 4745154 4627296 4694402 4874920 4840318
5201 4840318 5048432 5134168 5283961 5324065 5151962 5558451 5556863 5700215 5594769 5485142
5191 5485142 5754392 5568741 5636886 5610505 5704779 5684104 5760022 5946047 5961737 5990705 5905174
5180 5905174 6077334 5993784 6180343 6441172 6608763 6789655 6820238 7173330 7481871 7551202
5170 7551202 7802975 7930441 8004907 8063742 8607203 8799092 8856405 9168476 9544903 9803520
5160 9803520 10132500 10763497 11013575 11443514 12188355 12877557 13309848 14159876 15036975 16086137
5150 16086137 17174840 18087481 18769579 19046962 18898937 18772446 18473126 18192342 18305587
5141 18305587 18602038 19005242 19336266 19856894 20489565 20988476 21533528 22284535 23207533
5132 23207533 24036770 24502412 24739356 25628341 26429169 27148821 28524936 29817896 31368574
5123 31368574 33385137 35158075 35412989 34948350 33389310 31426277 29823044 28426361
5115 28426361 27232191 26229178 25627368 25257595 24599366 23948445 23414170 22621751 22220099
5106 22220099 22007246 21620549 21097774 20647519 20230402 20024225 20291650 20667668 20973177
5097 20973177 21286496 21392314 21381880 20960052 20010911 18938806 17857693 16933192 16484171
5088 16484171 16039649 15876173 15557192 14973412 14198940 13516584 13010461 12689767 12582542
5079 12582542 12492383 12498712 12310962 12030059 11602304 11318303 11423235 11676072 11567015 11586094
5069 11586094 11426254 11183727 11327849 11518740 11451012 11658946 11894241 11988623 12285819 12482434
5059 12482434 12676230 13153360 13226352 13239319 13122741 13132813 12932098 12969927 12910096 12727394
5049 12727394 13000213 12974207 13305884 13865560 13787071 13853543 14248146 14641148 14722203 15157442
5039 15157442 15477184 16016174 16569742 17105060 17599727 18110747 19087562 19979719 20938419
5030 20938419 22077852 23319915 24401587 25855120 27469355 29173801 30932596 32907143
5022 32907143 35003751 37281325 39523753 41765820 43834169 46096063 47864637 49304431
5014 49304431 50752762 52370829 53821112 55428622 57703959 60080135 62981800 66557950
5006 66557950 70253498 74207400 78293006 82172009 85616646 88723501 91418468 92591959
4998 92591959 91882584 89470652 85468084 80647175 75587130 70431454 65179200 60004261
4990 60004261 54939191 50018670 45275873 41014707 37439574 34237142 31441172 28864210
4982 28864210 26914892 25128918 23584833 22342157 21105130 20280266 19559766 18597819 17740659
4973 17740659 17166777 16755996 16188280 15505946 15374435 15015366 14466192 14093172 13691948
4964 13691948 13290046 13098850 12554140 12224580 12000478 11538077 11481969 11287679 10949235 10521768
4954 10521768 10395514 10128091 9959633 9855609 9700936 9525174 9155029 8940942 9247007
4945 9247007 9301098 8716774 8718831 8764482 8677981 8611365 8703801 8846688 8814393 8627749 8697647
4934 8697647 8638641 8805976 8948153 9266126 9438906 9552574 9883755 9942626 9747145 9597857
4924 9597857 8977194 8760611 8547262 8272504 8157965 7884112 7745216 7599497 7413820 7003998
4914 7003998 6761105 6948446 6831182 6338132 6459811 6417823 6280470 6297596 5906528 5795487
4904 5795487 5831058 5913408 5730279 5590356 5625725 5639914 5544043 5434786 5547846 5454660 5768118
4893 5768118 5652806 5569583 5595915 5867741 5800351 5712345 5741397 5711805 5922618 6001997 5966246
4882 5966246 6078429 6158822 6331961 6317421 6566025 6761665 7052841 7329960 7762151 8259240
4872 8259240 8627569 9408131 9940562 10827978 11946194 13066445 14178653 15387211 16339690
4863 16339690 15613226 13720421 11792005 10519894 9243267 8468776 7569879 7121252 6744921
4854 6744921 6440491 6337480 5973737 5884693 5950399 5547596 5284517 5389484 5388216 5175610
4844 5175610 5216913 5318688 5263770 5365547 5074424 4981288 5047610 5262325 5238012 4996734
4834 4996734 4905174 4834281 4805548 4762477 4832262 5062376 4923065 4885378 4990668 4826243 4743944
4823 4743944 5017188 4798159 4933433 4867238 4644154 4332209 4581024 4767052 4466296 4479599
4813 4479599 4418184 4393881 4497550 4613872 4567471 4695030 4784825 4958178 5019302 4862162
4803 4862162 4857254 4783546 4914789 5087385 5232108 5257238 5183851 5215333 5001175 4693159 4422922
4792 4422922 4442111 4393234 4493059 4616987 4670052 4559665 4749889 4765407 4558576 4472495 4390205
4781 4390205 4411674 4751319 4635808 4476192 4429412 4286247 4263067 4082468 4169136 4204803
4771 4204803 4326071 4233961 4016091 3908194 4149973 4107554 4100097 4013562 4303740 4275493 4262570
4760 4262570 4032100 4011794 4160808 4310409 3969790 3735579 3688237 3512579 3647202 3869099
4750 3869099 4004578 3925290 3921928 3939484 3843606 3616880 3618978 3713729 3932320 3926688 3988145
4739 3988145 3957538 3847832 4032231 4189555 4319022 4506118 4211074 4019735 4204313 4202987
4729 4202987 4194587 4253194 4146009 4132263 4301953 4296200 4328756 4577525 4716268 4653371 4420944
4718 4420944 4380506 4324430 4334645 4326452 4280850 4246829 4169796 4069677 4113153 3840818 3780799
4707 3780799 3935617 3961229 3753401 3652908 3905179 3969150 3917398 3929039 3925320 3903601 3823274
4696 3823274 3859603 3725523 3724935 3704992 3928948 4134980 3928415 4088499 4124980 4083106 4132383
4685 4132383 4048851 3957369 3873927 3854150 3870472 3733063 3763043 3749683 3920448 3703303 3713872
4674 3713872 3982088 3849544 3980318 3885072 3800824 3938633 3838995 4040807 4029814 3642997
4664 3642997 3868544 3780207 3860469 4035042 4111986 3937659 4078592 4059586 4223796 4305054
4654 4305054 4345813 4356536 4158452 4249008 4029201 4007016 4060958 4042655 4194885 4353292 4382161
4643 4382161 4314873 4190256 4469052 4714897 4815975 4909169 4771326 4922649 4822696 4701074
4633 4701074 4867184 5017814 5062364 4875656 4553939 4659273 5022806 4889221 5091926 5049791
4623 5049791 4986225 5113352 5017937 4934078 4944619 4933257 4905830 4657095 4576315 4615237 4797038
4612 4797038 4703239 4619449 4594698 4549440 4574124 4913133 4860537 4852331 4939420 4719918 4669170
4601 4669170 4718834 4745171 4657488 4855449 4851382 4691938 4652965 4834277 4820869 4695724 4760547
4590 4760547 4811593 4767725 4811757 4848945 4678970 4702633 4910740 5094181 4787733 4638550
4580 4638550 4877951 4940477 4990709 5113571 5263416 5110089 5269741 5234116 5163385 5519284
4570 5519284 5482168 5542716 5633428 5622564 5634166 5623341 5650922 5605994 5515777 5658703 5838547
4559 5838547 5626388 5685135 5706945 5616764 5653738 5811734 5806425 5626371 5736707 5552093 5416938
4548 5416938 5512042 5696037 5718462 5748269 5742061 5670961 5513043 5381692 5672327 6056455 6224614
4537 6224614 6305124 6187097 6240567 6151800 6039756 5917152 5894921 6132331 6220371 6185815 6223193
4526 6223193 6320974 6464165 6319640 6337417 6522685 6659463 6852615 6956744 7013531 7003086
4516 7003086 7013880 7028200 7268130 7060818 7158428 7185347 7136646 7252041 7482792 7775748
4506 7775748 8129458 8038219 8235308 8128738 8304014 8292597 8690414 8966710 8898401 9106373
4496 9106373 9220648 9511894 9752969 9917588 10092418 10126034 10447088 10613575 10685591 10948451
4486 10948451 10950042 11169395 11269524 11426345 11567739 11896981 11973480 12221628 12283192 12588582
4476 12588582 12669173 12649005 12892995 13005661 13398159 13492811 13375003 13567215 13480051 13599725
4466 13599725 13841582 13931878 13911133 14040772 14373035 14823226 15117711 15209995 15598491 15928992
4456 15928992 16439403 16817047 17124402 17743009 18337601 18863310 19433649 20133864 20617982
4447 20617982 21286203 21930480 22188891 22679832 23256537 23549153 23964568 24263635 25021678
4438 25021678 25900513 26375819 26860078 27440155 28235707 28973877 29572369 30616573 31379576
4429 31379576 32001030 32803992 33535947 34056447 34690417 35557063 36361621 37404701 38610647
4420 38610647 40115271 41720240 43647454 45930129 48137076 50562248 53025008 55595104
4412 55595104 58460790 61363636 64055689 66564673 69119060 71497758 73251421 74759990
4404 74759990 76574365 78702630 80599397 82736752 85315547 87791539 90631885 93611043
4396 93611043 97028084 100245175 103363564 106697718 109609718 112071766 114045433 115339708
4388 115339708 116349184 116973256 117392636 117334452 116600307 115472230 113873520 111899095 109067593
4379 109067593 105293509 100732595 95898020 91093049 86505417 82395282 78903150 76093814
4371 76093814 74229928 73331903 72961272 73378337 73663576 73101742 71321969 67873528 63570740
4362 63570740 59144314 54945718 51329242 48568064 46068237 44034737 42190947 40739392
4354 40739392 39467289 38435884 37572217 36742279 36214089 35545909 34950455 34298080 33750202
4345 33750202 33134917 32209507 31370816 30334945 29177650 28402457 27410951 26429123 25704154
4336 25704154 25009844 24309729 23759588 23260710 22782248 22380515 21700376 20857033 20428914
4327 20428914 19841884 19391095 18688127 18140840 17580018 17073938 16849696 16592458 16377765
4318 16377765 16277947 15979806 15693510 15368965 14813591 14759562 14733023 14453572 14381664 14210716
4308 14210716 14043752 14185936 13815022 13527516 13410945 13321937 13122062 13098564 13160731 13196867
4298 13196867 13193507 12942699 12883511 12787986 12809049 12698365 12684230 12491328 12313817 12323243 12340307
4287 12340307 12358470 12262055 12400007 12503888 12435907 12590591 12545261 12414632 12688174 12835445
4277 12835445 12741024 12854357 12764356 13156312 13384892 13573462 13738673 13760356 13532932 13230812
4267 13230812 13308349 13163683 13116763 13124081 13132142 12945141 13103957 13022106 12859239 12785893 12764656
4256 12764656 12964069 13129481 13090350 13204143 13017136 13168388 13362674 13405999 13492601 13704775
4246 13704775 13802769 13751808 13822138 14041554 14186854 14319754 14579966 14801083 14891469 15186432
4236 15186432 15204105 15558019 15526844 15484110 15902893 16010554 16113203 16078928 16221053 16253142
4226 16253142 16585004 16693179 16976218 17415347 17577115 17748629 18116501 18298726 18699182
4217 18699182 19026523 19363990 19933120 20541129 21192070 21995216 22890674 23416982 24075077
4208 24075077 24886164 25538410 26191734 27030774 27144391 27601928 28019529 27859208 27373605
4199 27373605 27203764 26976712 26719314 26624374 26485366 26502071 26496271 26901101 27269011 27560102
4189 27560102 28166228 28700634 29494354 30084572 31256961 32407219 33523785 34634733 35827646
4180 35827646 37134871 38270501 39386762 40059756 40858957 41216510 41489361 42062901 42507810
4171 42507810 43038376 43339002 43538274 44157390 44556586 45624175 46692829 47667181 48894944
4162 48894944 50548569 52395892 54699204 57115976 59927008 63075015 66192658 69640771
4154 69640771 73554963 78179154 83955403 90821129 98370661 106969979 116368140 126228374
4146 126228374 135960124 143750905 150108898 155857200 162890789 172275114 184486756 197548812
4138 197548812 206660419 207018657 197236461 179646633 158308378 138336507 121611846 107817798
4130 107817798 96483066 87129363 79587307 73365920 68152921 64056138 60310988 56914915
4122 56914915 53796968 51230591 48944320 47007986 45330803 43628136 42330546 41654848
4114 41654848 40725528 39854006 39159240 38634951 38364454 37870528 37601219 37258211 36961543
4105 36961543 36665810 36280422 36065097 36375471 36052205 36088059 36348108 36674392 37005166 37043953
4095 37043953 37267653 37836692 38154780 38417037 38972523 39569027 40640496 41585283 42884534
4086 42884534 44161821 45625243 47148417 48581612 50392239 52138839 54169267 55661685
4078 55661685 56419931 55839954 54126854 52175452 50126016 48606512 47228086 46437104 46055223
4069 46055223 45452830 45091904 45189869 45306276 46100308 47207522 48244693 49725112 51730287
4060 51730287 53883298 56014793 58286373 60654666 63406767 66705574 70238593 73630174
4052 73630174 76474411 77308928 75440080 71405099 66057804 60760070 56017169 51791166
4044 51791166 48405317 45504471 43272135 41716102 40186739 39199845 38839174 38298697 37707164
4035 37707164 37552900 37574676 38235985 38788707 39429995 40381588 41631526 43009150 44526897
4026 44526897 45683523 46730282 47014060 46335696 44554996 41869190 39165339 36497259
4018 36497259 34203415 32158769 30266384 28780133 27774636 26856257 25793214 25154016
4010 25154016 24823949 24423973 24017787 23516283 23161553 22886705 23056805 23236169 23261536 23620448
4000 23620448 23808815 23743948 23517852 23520058 22996419 22714139 22679847 22252707 21773891 21440957
3990 21440957 21142532 21090736 21472482 21726947 21651054 21858462 22334890 23102476 23509781 24152629
3980 24152629 24776823 24886367 25031692 25032446 25177970 25481131 25796910 26173062 26750044 27428217
3970 27428217 28290946 29433919 30876228 32468075 34487004 36870601 39227536 40698642
3962 40698642 40624494 39025623 36513309 33301484 30970979 29000557 27287454 26081358
3954 26081358 25198415 24501882 23709097 23421232 23324110 23114720 22816956 22774286 22491332 22323677
3944 22323677 22301384 21979152 22117562 21911930 21772834 21538044 21438516 21388665 21113565 20797288
3934 20797288 20856299 20809246 20630208 20467468 20462924 20429553 20557054 20610276 20715840 20968221
3924 20968221 21516618 21836814 22108357 22408170 22642099 23022342 23634589 24225492 24640542
3915 24640542 25496909 26101351 27107817 27758671 28054310 28791808 29410928 29909085 30819965
3906 30819965 31847304 33119167 34607941 35389338 35548676 35473801 35123183 34886414 34531723
3897 34531723 34577122 35034529 35717969 36468833 37674246 39127220 40683048 43148288 45750023
3888 45750023 49093700 52936328 56569977 57944969 56682314 53360725 49407399 46018630
3880 46018630 43703384 41866069 40596468 40279141 40456860 40200714 39942482 39425647 39611377
3871 39611377 40120253 40731708 42241675 43314199 43654143 42947161 41544169 39677960 37963273
3862 37963273 36377874 35196691 34313699 33853719 33449726 33436174 33787726 34022895 34152839
3853 34152839 34812082 35181676 34896324 34459224 33566373 32166874 30641790 29337099 28249903
3844 28249903 27082671 26656263 26029898 25693441 25408955 25708565 25653770 25876573 25994908
3835 25994908 25800577 26511425 26768726 26968906 26975759 26754937 27183851 27242079 27600119 27995417
3825 27995417 28219035 28617925 28846489 29351418 29323631 29628245 29765432 29652094 29422860 29657546
3815 29657546 29936391 29935129 30165390 30053883 30219045 30697700 30983043 31418278 31802377 32292046
3805 32292046 32712339 33129957 33312159 33412671 33746819 33872530 34041386 34208224 34540278
3796 34540278 34915677 35053764 34890930 34750016 34334370 34208244 33952713 33674015 33313718
3787 33313718 33245060 33077218 32977460 32907717 32742415 32889579 32844010 33048849 33062818 33289853
3777 33289853 33574474 33808069 33867748 33996392 34157694 34268567 34304028 34104055 33986977 33956374
3767 33956374 34332996 34922433 35512116 35619137 35985000 36750004 36824279 36962223 36861205 36741512
3757 36741512 36743307 36206780 35700400 35260828 35077484 35062944 35641524 36103117 36673981 37323633
3747 37323633 37502794 37662553 37292426 36474719 35447332 34510908 33841895 33162348 32682114
3738 32682114 32668102 32568509 32599086 32645017 32653083 32428100 31260449 29967819 28710653 27276589
3728 27276589 26332175 25267876 24426849 23966038 23486998 23059991 22695781 22012548 21596293
3719 21596293 20687823 20266972 19459616 18688768 17959776 17288061 16643950 16243267 15740323
3710 15740323 15299139 15211557 14892656 14688211 14365407 14050235 13883607 13858537 13350865 12896691
3700 12896691 12455944 12482943 12519038 12385459 12303030 12221974 12042626 11872783 11901247 11792948
3690 11792948 11574741 11373078 11365461 11284240 11232607 11114122 10833487 10724286 10789458 10844332
3680 10844332 10764389 10580338 10461641 10482215 10553150 10502603 10236617 10275558 10442332 10465799
3670 10465799 10324070 10633785 10783445 10666412 10476832 10498570 10315093 10188507 10409274 10462775
3660 10462775 10735460 10480562 10621661 10705415 10768617 10861913 10863253 10874312 10938025 11210615 11353922
3649 11353922 11469227 11532191 11749734 12052112 12014521 11999110 12251813 12552258 12504404 12661209
3639 12661209 13052333 13307350 13469788 13641939 13825035 13814033 14028472 14308147 14611855 15156779
3629 15156779 15546213 15708439 15695419 15652109 15932335 15957580 15895590 16117681 16232197 16200935
3619 16200935 16527958 16428062 16690356 17008713 17383057 17773112 18299247 18932074 19701310 20422285
3609 20422285 21601475 22363214 23255841 24296482 25228371 26145064 27241431 28981514 30575593
3600 30575593 31658197 31957190 31783357 31268598 30808991 30855797 30559134 30518227 31262848 32085063
3590 32085063 32849436 33924041 35063393 35727588 36465972 36903241 36961091 37256243 37598781
3581 37598781 38239131 38910457 39720024 41031225 42762610 44909001 47753309 50953468 52803883
3572 52803883 52625523 50872422 47704007 44535640 42176169 40636940 39679679 39140016 38695700
3563 38695700 38455966 38518668 38458871 38643387 39021455 38883107 38372689 37832512 37238145 36684691
3553 36684691 36285069 36405939 36463999 37319188 38300537 39246691 39960328 40325637 39826976 39077177
3543 39077177 37840219 36539205 35560407 34776526 33458729 32193963 31086931 30038611
3535 30038611 29083492 28120154 27150840 26226995 25548930 24741337 23951162 22928472 21983639
3526 21983639 21374664 20708880 20423401 20122131 19470918 19036161 18922026 18767000 18425240
3517 18425240 18287567 17938594 17546718 17362620 17485430 17044158 16644028 16240646 16093916
3508 16093916 15771961 15408967 15426737 15444221 15372933 15018019 14864361 14718758 14479115 14489815
3498 14489815 14244614 14083933 14317603 14149862 14206117 14080514 14053681 13865003 13739944 13420343
3488 13420343 13313865 13266570 13509241 13601385 13617961 13685009 13628113 13953900 13794294 13825833
3478 13825833 13771311 13842488 14030374 13921421 13937071 14151065 14098101 14145406 14187952 14010548
3468 14010548 14031926 14099220 14107953 14149218 14261956 14139839 14167485 14383653 14322119 14384163 14294819
3457 14294819 14547810 14710340 14620954 14598469 14658991 14722538 14709686 14918009 15132620 15483218
3447 15483218 15424702 15495543 15803872 15876425 16134093 16402836 16596291 16674554 16762800 16886835
3437 16886835 17335008 17616872 17690865 17879595 18071422 18360307 18513176 18440056 18423578 18529447
3427 18529447 18717059 18815811 18737963 18660174 19010703 19533611 19857041 20091095 20525231 20838959
3417 20838959 21042310 21582965 22383482 23094312 23482550 23911382 24766756 25592594 26348053
3408 26348053 27337491 28560261 29761834 30622738 31579005 32937117 34278715 35778603 37088411
3399 37088411 38890966 40569911 41985012 43777877 45062232 46498438 47684097 48854608
3391 48854608 50001894 51338548 52869892 54524780 56573656 58945636 61620367 64315697
3383 64315697 67376213 70882070 74310695 77999727 81415923 84661331 87629860 90036926
3375 90036926 91577556 92296231 92226425 91194658 90199785 88700547 87352032 85773379 84736988
3366 84736988 84150052 83521799 83157270 82588906 81484675 79802966 77675614 75142827 72298847
3357 72298847 68653289 64772845 61180635 57972507 54956689 52491675 50423736 48947325
3349 48947325 47607202 46431666 45654708 45139221 44481141 43532563 43005818 42468356 41994557
3340 41994557 41558013 41388965 41301466 41434020 41355642 41381031 41487597 41693237 41633051 41777159
3330 41777159 42019307 41750254 41348422 41163587 41080614 40772629 40706580 40628770 40649322 40635954
3320 40635954 40578758 40772797 40642585 40266720 39935602 39416984 38927330 38029147 37569809 36771187
3310 36771187 35874591 35122873 34426921 33908567 33314373 32675872 32141261 31672982 31198604
3301 31198604 31190239 31011874 30845418 30679915 30556822 30409197 30207333 30239784 30599595 30869748
3291 30869748 30693381 30923682 31182758 31459845 32018436 32447798 32704813 33017266 33385427
3282 33385427 33703093 33698090 34075997 34341429 34305747 34689223 34937202 35104904 35268767 35481374
3272 35481374 35638459 35701950 36036562 36338758 36542829 36721699 37035816 37104274 36920922 36716341
3262 36716341 36793016 36606172 36469217 36530003 36253636 36346449 36502244 36361478 36404264 36329837
3252 36329837 36562048 36880666 36798593 37123388 37086768 37559213 37861952 38386235 39221571 40164512
3242 40164512 41206849 42338032 43792285 45221302 46833523 48511151 50333731 52773969
3234 52773969 55343987 57927234 61048875 64804732 68966020 73295594 78082596 83329700
3226 83329700 89415171 96180451 103698787 112046886 121474215 131371252 142091925 153521222
3218 153521222 165569953 178092168 190283428 202089491 212254644 219478364 223493013
3211 223493013 223197805 218707210 210055425 198136880 184283866 169816184 155374861 141740476
3203 141740476 129897164 119181017 109770785 102019943 95495154 90060722 85229969 80952205
3195 80952205 77491508 74374329 71378431 69035997 67235339 65564739 64484200 63646718
3187 63646718 62924602 62556342 62213889 61770540 61413032 61471127 61681072 61942934 62507138 63087688
3177 63087688 63951782 65009245 65966392 67184820 68682984 70000021 71563624 72981698
3169 72981698 74837142 76797039 78717271 80527403 82135057 84026479 85387256 86343662
3161 86343662 87358746 88501358 89396515 89994166 90675155 90973317 91081564 91030756 91024497 90765824
3151 90765824 90174288 89802121 89102960 88339588 88003589 87721197 87368658 86987606 86830411
3142 86830411 86527302 86044345 86048883 86278521 86471699 86798628 87261828 88577176 90065056
3133 90065056 91960822 93818490 95797967 98470253 101202680 103565800 106311016 108717732
3125 108717732 111110398 113662950 115881729 118286084 120659190 123361804 126005783 129096014
3117 129096014 132472266 135709836 139349916 143464639 147286877 151239143 155554159 159784247
3109 159784247 164369797 168596572 172757670 176379853 179126233 181534401 183473109 184459645
3101 184459645 184738433 185137968 185536204 185924758 186499853 187873131 189265203 190463760 192121992
3092 192121992 193569429 194078357 194155937 193201340 191461455 188849269 185607143 181561814 176949819
3083 176949819 171965316 166813094 161393022 156400907 151923744 147797573 144138002 140940008
3075 140940008 137792087 134492779 130807866 127065375 122834738 118551781 114267045 110078894
3067 110078894 105986650 102260045 99054765 96272799 93881776 91638384 90129984 89092082
3059 89092082 88569864 88438201 88577938 89464664 90696405 91816303 92768908 92307550 91075724
3050 91075724 89174541 86829346 84306723 82556234 80819129 79311233 78312943 77256130
3042 77256130 76641441 76033202 75533591 74901794 74558031 74124489 73317983 72824741 72452313
3033 72452313 71629265 70828634 70079441 69046635 67991896 67452684 66776655 65946111 65035912
3024 65035912 64022759 62858937 61976804 61102830 59851329 58790020 57970207 57009519 56037968
3015 56037968 55308794 54415883 53708308 52873387 52535616 51973574 51395537 51373346 51281968 50923363
3005 50923363 50740078 50883896 51065751 51037005 51156433 51208237 51383308 51784092 51990656 52321984
2995 52321984 52631697 52974086 53367973 53425275 53935320 54612206 54964150 55424005 55833066 55710682
2985 55710682 55618342 55369405 55130281 55188088 55715518 56362960 57115179 58118402 59369732
2976 59369732 60560872 61899272 63309679 64792353 65875536 66758108 67937233 68908372
2968 68908372 69734298 70377550 70780374 71444655 72105482 73194433 74379492 75870785 77615759
2959 77615759 79561903 82195441 84756612 87026106 89106555 91115897 93687096 96838443
2951 96838443 100104073 104398554 108718992 113019039 117016736 120543290 123341632 125250963
2943 125250963 125780323 124515448 121802312 117693746 112351438 106262822 99190780 92546161
2935 92546161 86053013 79588321 73894814 68852121 64364281 60477349 57354917 54416399
2927 54416399 52119718 50198213 47875123 46044700 43672408 41534961 39767325 38167501
2919 38167501 36786824 35625461 34230579 33081324 32082883 31394841 30434251 29482921 28703855
2910 28703855 27894762 27235503 26535216 26185196 25766430 25129069 24773853 24537943 24248442
2901 24248442 24305214 23938170 23536697 23583731 23637235 23312109 22986817 22935600 22508849 21966203
2891 21966203 21809812 21620860 21533696 21172757 20670108 20216048 20017304 19794894 19541593 19297866
2881 19297866 18810876 18849875 18789481 18492469 18623294 18524238 18346218 17975026 17926577 17972895
2871 17972895 18012408 17740712 17556944 17327550 17385480 17593287 17499733 17174004 17348756 17298351
2861 17298351 17355774 17473335 17545696 17516446 17563523 17670554 17802236 17753690 17672812 17485688
2851 17485688 17966441 18131445 18401640 18691601 19189312 19260956 19400666 19908681 20435390 21316501
2841 21316501 21564787 22227307 22597523 23375832 24425971 25513764 26776789 28058168 28975128
2832 28975128 29038308 28653511 28227962 27575690 27124735 26580695 26514075 26425477 26623171 27059388
2822 27059388 27535022 28012226 28447337 29128773 30014004 31184587 32434577 34078601 35805024
2813 35805024 37623806 39363927 40364785 40878184 41106688 41955530 43074731 44946880 46864885
2804 46864885 48601477 50175363 50512116 49332927 47508397 45699559 44359735 43563512
2796 43563512 42915610 42629787 42963924 43328505 43773367 44904107 45802706 47415608 49122245
2787 49122245 50799899 52892896 54633877 55953711 56820644 57334877 57886712 58662611 59648808
2778 59648808 61017854 62789180 64934580 67296446 69904288 72066972 73739586 74980902
2770 74980902 75500805 76031084 76783372 77948708 79970373 82404544 85137584 88276187 91696619
2761 91696619 95108799 99213483 103758484 109453421 116198925 123514731 131510857 140181209
2753 140181209 148901227 158165115 168487992 179974750 192983627 207131610 221307109
2746 221307109 233993473 244232715 251628142 255519982 255080818 250145793 241942786 233082559
2738 233082559 226271068 221820991 219154219 218192077 217670420 216248662 212906035 207309179
2730 207309179 200077817 192742936 186313973 182055988 180095959 181046391 184100638 189394441
2722 189394441 196850622 206253431 218005729 232676494 250777321 272773717 299137222
2715 299137222 329186279 360333043 385114189 394898397 384583325 355990453 317238330
2708 317238330 276847267 241336351 212604027 189320214 170653367 155546968 142828458
2701 142828458 131930425 122503341 114264415 106826727 100339722 94415772 89029802 84539585
2693 84539585 80021293 76064789 72391122 69217445 66270343 63737312 61566108 59395351
2685 59395351 57188073 55212088 53363918 51426484 49759880 47955425 46637839 45626532
2677 45626532 44374672 43299681 42068007 40812550 40065038 39297613 38585580 38160049 37400586
2668 37400586 36678608 36373228 35635360 34694813 33548043 32371154 31183076 30167506 28956737
2659 28956737 27947390 26803912 25843973 25173572 24476452 23701144 23162045 22523916 21960196
2650 21960196 21383466 21112656 20760548 20286340 20029074 19803710 19590240 19151945 18561284
2641 18561284 18007659 17767626 17363053 16949889 16484301 16181179 15784806 15371793 15017482
2632 15017482 14549332 14217905 13983259 13753123 13384675 13101262 12660219 12155282 12001749
2623 12001749 11890338 11475671 10970017 10609222 10398944 10417272 10496952 10260389 9971716 10372373
2613 10372373 10226888 9600788 9424535 9320187 9225945 9043657 8928542 8799455 8507507 8276873
2603 8276873 8192037 8277652 8124324 7871308 7706682 7663328 7523649 7342235 7521587 7321445
2593 7321445 7375867 7293693 7226747 7144772 6954266 6687347 6492684 6641738 6420296 6535644
2583 6535644 6549850 6576448 6303158 6331609 6508639 6463041 6302670 6198710 6029786 5980959
2573 5980959 5752709 5523607 5238351 5361940 5418437 5420949 5273391 5224173 5236424 5020603
2563 5020603 4973347 4857772 4667002 4795897 4808681 5004457 4892753 4622759 4626541 4646505
2553 4646505 4920684 4858321 4573464 4607467 4466941 4500236 4483268 4396941 4462740 4258851 4393762
2542 4393762 4227874 4109018 3837368 3752730 3708143 3569626 3699828 3856959 3686367 3760041
2532 3760041 3792452 3654215 3740371 3860199 3741546 3656823 3679798 3640542 3632074 3623456 3619043
2521 3619043 3561997 3632848 3735686 3618906 3608065 3452945 3440678 3549471 3137787 3190863
2511 3190863 3276584 3208444 3314392 3039708 2909653 2880426 3436834 3593466 3368737 3116624
2501 3116624 3344225 3559735 3302226 3319916 3474788 3524564 3253680 3259079 3437329 3493121
2491 3493121 3509086 3409907 3223518 3640894 3487388 3422082 3543899 3605635 3522711 3272371
2481 3272371 3258471 3063110 3137819 3358056 3157246 2966122 3018160 3078966 2837044 2876429
2471 2876429 2956975 2985496 3220137 2856536 3047990 2989327 3242019 3274418 3152655 3178777
2461 3178777 3342868 3232183 3694735 3899705 4158525 4006123 3666174 3565599 3268176 3085210
2451 3085210 2987224 2891683 2631579 2568409 2492690 2678389 2572147 2496608 2223732 2260120 2083672
2440 2083672 2003388 2018538 2106310 1991926 2242052 2045380 2065804 1958684 1854068 1658773
2430 1658773 1803454 2062254 1735995 1893024 1853454 1504730 1534803 1687030 1775051 1569525
2420 1569525 1740380 1765097 1250785 1014613 1245570 1465007 1432039 1194657 1080923 1199218
2410 1199218 1117015 1325700 1275358 1351940 1270842 1263908 1319523 1474099 1489685 1293190 1303971
2399 1303971 1484827 1426416 1196532 1261687 1163507 982556 1102015 1033802 1067475 1310526
2389 1310526 1381068 1107159 1074071 1164859 1209544 1055055 1103901 1165768 1135534 1173505 1070015
2378 1070015 1214015 1271654 1126774 1209069 1153945 978871 1003151 1069825 939081 934111 947985
2367 947985 760673 955466 1188134 1126654 1010242 915728 614882 950033 1002667 726094
2357 726094 784156 706251 943600 985843 979732 826286 847211 881634 943718 860802 857677 913577
2345 913577 908555 1114505 970965 981980 1111493 973195 835704 899767 939960 930903 1081070
2334 1081070 1201293 879377 774248 609166 692876 818067 798897 707787 625089 660283
2324 660283 832245 878023 785457 913993 940036 883876 745037 795740 923392 968119 1009374
2313 1009374 966758 678531 943524 1198299 898253 826826 836258 1100604 1088334 1266642
2303 1266642 1164074 1189036 1092424 1050798 1047186 927986 1083811 915571 641581 770119
2293 770119 833426 922785 951828 1257279 1061509 1109305 1197135 994456 906694 975704 881325
2282 881325 727835 782528 831424 790541 526554 759957 622425 585308 599725 833135 872355
2271 872355 735308 635531 768909 777667 730231 790961 905984 922864 1148952 989470 928060
2260 928060 879782 1063906 1011855 980289 874077 1011642 1043600 716632 729739 664993 834399
2249 834399 799707 958036 957747 671228 598263 679897 620555 690800 621338 708483 990832
2238 990832 769234 869849 946164 853479 682365 543598 543973 611433 863270 1096617 1040957
2227 1040957 1035077 1152659 1014998 1031338 912932 950489 950397 777428 739196 743871 777366 785512
2215 785512 965355 1002703 769398 801295 850949 906943 747862 1031127 940353 907259 1067456
2204 1067456 903414 916258 1023590 1054732 984264 785493 692551 644768 406122 683816
2194 683816 992433 993716 1016988 1047119 746631 805937 956704 931246 835496 584522 544794
2183 544794 728366 871785 900324 860819 992756 998030 1043745 1127791 1232477 1320976 1205877
2172 1205877 1143700 1156971 1140671 1146114 1207190 1377146 1120619 1010303 1294833 1568472 1538288
2161 1538288 1310449 1213556 1271551 1195817 1245347 1142085 1248224 1324753 1668006 1499770
2151 1499770 1530307 1719972 1477581 1556055 1836574 2107799 2129680 2030924 1893115 1837070
2141 1837070 1695346 1892759 1791802 1722323 1892766 1969763 1656679 1860888 2072032 1994780
2131 1994780 1547957 1571044 1536280 1603532 1733932 1710594 1682353 1938870 2226617 2123645
2121 2123645 2050730 2131016 2245614 2098003 2033995 2039888 2098674 1990258 2042578 2170735 1979006
2110 1979006 2058963 2153489 2428706 2336720 2314320 2563273 2291498 2296463 2472247 2427102 2394033
2099 2394033 2317116 2811185 2871766 2748921 2812912 2956896 3187500 3212827 3482666 3515303
2089 3515303 3524134 3765707 4006168 4411042 4811257 4895174 5114487 5526904 5972954 6739780
2079 6739780 7301863 7901317 8392202 8925655 9726344 10551837 11757961 13187593 14398322
2070 14398322 15745910 17050963 18759907 20540111 23124648 26155335 30150183 35031982
2062 35031982 40851427 49787310 61344492 68450470 66492925 59658189 47880171 37395769
2054 37395769 30444169 25572997 21733554 18555279 16384586 14768484 13403313 12441369
2046 12441369 11777184 11339675 10633468 9710369 8868369 7965824 7469243 6886999 6643822
2037 6643822 6243995 5756600 5699240 5503207 5480606 5303328 4967034 4858339 4685971 4546673
2027 4546673 4274873 4229818 4115718 4023719 3822876 3723440 3659771 3519121 3473212 3289277
2017 3289277 3100949 2782779 2652362 2772494 2631797 2636701 2448922 2402788 2563155 2517989
2007 2517989 2328481 2298222 2104509 1981682 1899142 1744687 1788497 1827085 1969932 1956758
1997 1956758 1656891 1656181 1623215 1471124 1534656 1530782 1694558 1714405 1611525 1588984 1479280
1986 1479280 1445646 1585734 1568006 1599390 1376007 1290107 1244952 1361195 1223939 1405953
1976 1405953 1298604 1074735 1201718 1140775 1200242 1111452 968737 923331 953062 796687
1966 796687 799317 946751 769494 565675 877726 711550 990149 1131967 902053 935838
1956 935838 1042113 999294 889774 979549 964626 715559 754167 710676 600930 612524 799387
1945 799387 715896 794499 789587 640004 792417 773960 850993 830568 885674 995649 861993
1934 861993 736089 759564 769913 684535 555248 637418 543961 597181 595140 654764 710099
1923 710099 499920 567921 791617 758696 679660 767445 614368 633474 498951 495719 459606
1912 459606 469825 471602 398092 575179 659189 687062 627013 532633 431800 416606 338092
1901 338092 461924 404673 366274 770555 805377 608955 716154 644012 428792 576584
1891 576584 595507 486015 539213 487296 691577 756875 718948 657694 559063 386460 488592
1880 488592 493932 182932 328181 545409 483291 501404 579796 376421 130394 175381 437878
1869 437878 798896 570074 536244 455049 394707 540045 447240 405728 653464 521087 555692
1858 555692 584388 582628 545556 666931 561852 429640 767838 597165 570285 593762 677130
1847 677130 375879 298450 268353 571991 602461 486214 410982 503673 285746 362667 346126
1836 346126 342010 419439 447881 296467 115722 299548 259221 392842 456899 341235 402443
1825 402443 394467 542657 482341 474516 633306 645700 572221 752186 828484 699814 971374
1814 971374 734281 558180 506608 471003 452431 511391 497430 257516 91437 374141 567985
1803 567985 430263 452646 561396 371420 426427 397623 374244 477742 283113 282232 433083
1792 433083 543014 527222 503575 339206 291978 103758 108867 138686 120050 238706 168132
1781 168132 207885 -64024 370364 214203 96781 368963 422111 447446 420498 330162 347421
1770 347421 248229 147189 225831 117517 68551 3311 164239 391075 267064 97787
1760 97787 9096 155832 234380 344329 493514 538527 465613 215932 233942 352425 344161
1749 344161 251148 212625 310892 277105 263180 195540 128023 186141 320395 296880 150017
1738 150017 284166 234158 216155 461861 341980 311750 270389 592506 481014 172844
1728 172844 341080 255559 393983 117939 112266 148815 137141 296575 256596 271936 312561
1717 312561 129303 347649 427926 271137 155558 193086 437706 439944 300207 349924 285865
1706 285865 -90034 37824 238524 293215 170305 63237 278269 276866 135334 67851
1696 67851 234674 185116 281771 290721 389459 331993 191557 145567 326888 275813 136261
1685 136261 346054 383618 304218 149936 121987 208432 36745 145631 256204 239842 241235
1674 241235 157321 44952 101717 96030 76538 211702 256384 73245 21505 -3335 -44344
1663 -44344 127256 259777 233393 -172424 -347704 84298 176770 -5641 31288 -108385
1653 -108385 -248343 -34634 292428 310734 173644 360933 405059 128269 65482 177123
1643 177123 23806 125958 395372 94012 166430 193662 -15454 128450 65466 31658
1633 31658 35129 -193977 31434 104079 275616 390229 201204 -79270 268449 554643
1623 554643 462200 260233 233072 197232 296782 333287 345047 218063 192558 242816 306840
1612 306840 207731 62022 272146 337531 344075 228850 -95435 190422 111221 -32335 -13040
1601 -13040 162766 175116 158738 323879 258348 309084 255452 69547 -81047 122326 161918
1590 161918 377991 319403 -83068 -236092 1826 121100 28365 -849 283821 85816
1580 85816 184900 165737 -14832 99699 295847 393182 168086 71792 119749 337537 508098
1569 508098 623381 303970 54673 105727 150024 39422 -145960 -20817 80554 91145
1559 91145 -66199 -116966 123403 480800 93620 31022 242673 128494 103044 53359 242945
1548 242945 493829 245792 246684 209541 144503 64501 185347 48625 -156438 127373 85789
1537 85789 -12169 112964 277008 389242 362040 363015 244788 173054 257111 124485 313805
1526 313805 145479 279518 205606 137457 254158 230077 217582 -24102 -178629 44041
1516 44041 -106410 -114814 248456 248129 262993 143965 -5591 -40162 233097 226365 163851 223628
1504 223628 74487 185328 284079 102858 68149 171585 282971 147996 242728 52912
1494 52912 11077 -15031 -279558 -143254 115952 290933 88088 -49519 7462 359243
1484 359243 267666 69692 175101 266044 203359 282145 255516 76219 -14323 102743 -67247
1473 -67247 -7098 182872 163678 -32822 2754 229054 282341 337114 315045 104031 261409
1462 261409 96617 -71085 227288 75612 -97076 -98888 -130981 4944 158340 194065
1452 194065 208315 -135589 -23130 185947 218301 364167 220475 139657 198829 314609
1442 314609 229072 -82771 23981 116091 127032 12852 69491 57431 110620 305969 160820
1431 160820 98014 32150 -375684 -86143 296405 101504 207030 270807 161746 149301
1421 149301 30483 146233 224506 107377 124058 119752 165730 59726 -47661 -22592 -202411
1410 -202411 81099 112430 -6302 -6845 204369 181783 108964 231712 237123 21681 -105856
1399 -105856 31398 -90853 -67282 95054 37236 -96448 32979 163136 135961 158659
1389 158659 403118 324276 243823 118028 60473 188082 237945 139337 90036 -83370 142724
1378 142724 248351 339871 380377 128644 33493 335 -219123 829 278503 181591 -60331
1367 -60331 81289 118026 -67487 115184 5816 -45671 211465 -33364 -153990 173250
1357 173250 123664 -4504 -181660 -96949 -134513 -219492 -457270 -275407 84596 40646 166145
1346 166145 -121834 -307511 -31184 -275787 -54209 228288 290727 111568 23825 149542
1336 149542 173129 333849 240723 292641 454205 350112 226071 114803 43383 -35471 110420
1325 110420 86775 51578 235551 141572 222559 214608 74245 112728 32347 148591 73235
1314 73235 312232 234022 121944 -30281 21375 278285 253838 262371 -15344 62238 217279
1303 217279 193356 17387 170622 206998 -37919 -109553 17099 -18658 322992 192486
1293 192486 -38891 -24039 1917 97281 30445 -179378 55446 418611 261942 40437
1283 40437 63241 58836 24781 129340 179446 60632 112242 291075 146623 250987 236871
1272 236871 -20196 29358 94913 61640 -9638 262488 221903 71401 236 -274896 -53845
1261 -53845 225650 205721 67258 83542 110302 129484 105173 -14597 83952 25038 75001
1250 75001 198861 124355 56590 17555 -114233 49410 -133016 -107210 168140 135230 14534
1239 14534 137097 31065 97266 114013 -27352 -108277 -340743 -84532 -100660 -107014 62642
1228 62642 156690 50067 -2801 43806 24316 98593 23000 -150414 -39401 34954 -122064
1217 -122064 46494 -8862 -255314 -88243 30985 50109 63278 278083 -127734 -36091
1207 -36091 193515 96434 311230 220908 -89954 138192 -138322 -70427 6256 -59940 53800
1196 53800 31560 46466 -102125 90435 79897 -36988 -168299 -42575 178171 83371 -241730
1185 -241730 -92549 98358 71559 -105646 -60649 80073 -48405 -19075 -171844 13775
1175 13775 103701 109842 8841 -177200 -157460 49629 36582 -90783 -14691 79219 49427
1164 49427 38648 -69299 -45621 -65723 1243 1831 -105456 -285143 -55003 118333 175377
1153 175377 200531 17258 -103058 -136975 -88301 -115524 -127958 -209427 1789 -99278 83469
1142 83469 48493 -611 9965 65207 -22971 -5888 -53178 48315 211013 408792 231203
1131 231203 252235 164759 22367 82494 97184 208896 35945 49943 -10106 26763 268486
1120 268486 126803 -13142 -188412 -72029 15361 156872 315910 -84257 -33522 80443
1110 80443 26113 200040 94971 -438 -48629 -31195 -26673 -101566 -26079 215918 157183
1099 157183 37793 112383 -34729 -80492 74442 176387 321001 209292 -71747 -86606
1089 -86606 -188538 -43738 -89919 139100 -93214 -13751 129739 117076 65867 29697 -27665
1078 -27665 -70559 -128293 -137336 -65503 260474 461686 310880 151155 14941 157352 153910
1067 153910 57364 208421 74549 96983 59810 186989 136145 -34480 -23940 -157980 -40267
1056 -40267 113180 4357 -272733 -48181 132053 217220 -7872 27033 -51866 22966 217240
1045 217240 -33440 -39405 -7504 -233935 8821 132123 225815 179104 16574 -122909 -268588
1034 -268588 -128204 48305 267671 278140 -18326 -61105 7356 -34407 145593 218263 -51506
1023 -51506 109930 176308 116898 152802 214410 9597 -29025 64335 -177325 -152368 50926
1012 50926 31641 -13911 24619 -136669 -144973 -106809 -68229 44024 66623 -22432 -110870 -10613
1000 -10613 -175998 -232984 -190144 58285 270520 174918 102983 -97230 -69319 -286180 -272791
989 -272791 -263963 -44545 -1119 -3953 32584 200526 178738 -102530 -130546 -135400 187256 227561
977 227561 249805 174114 225654 -64778 78754 106651 -67216 -198034 -152752 62827 -84355
966 -84355 -277063 -419574 -936 461685 332764 226837 -224752 -252242 -21855 -108571
956 -108571 21052 -81351 63919 49177 -190082 -206877 63883 -5715 5933 -207783 95536
945 95536 42854 -116134 8013 -7325 44119 -45777 -124187 -64336 98481 104943 154640 122515
933 122515 -15502 78111 -153683 -250510 -111600 -59205 -234686 -283010 -65700 -209582 -10735
922 -10735 94710 -174439 -124525 90491 272662 141535 -58872 -156044 -304518 -151154
912 -151154 28408 97635 18880 -7837 114813 49450 101604 18672 -108521 -213687 -104079
901 -104079 67606 -147440 -294106 -67220 137267 -61889 57847 78058 -190678 -31328
891 -31328 243396 122535 -33460 -123767 -66986 -156613 -130295 159893 -139573 -95059 32205
880 32205 -44432 -127656 -127139 -44474 -169720 -230889 -331416 -273903 -342072 -281139 -291835 -225559
868 -225559 35729 35763 37713 -93400 -180620 -40680 -10788 -117682 -120317 132571 303189 -82036
856 -82036 -66256 103521 264298 325251 81022 -85349 -58075 22533 -153793 46094 101923
845 101923 84283 109239 -5969 -89073 21722 146721 106549 179117 132171 20370 -131071
834 -131071 -48275 76205 -193166 -153072 -38337 -128975 -87228 -47269 -159092 -16502 97924
823 97924 2495 -37755 81294 109025 233083 158000 -178614 -79051 57474 99799 -80489
812 -80489 -169991 -55435 -90161 119379 70676 252016 -9045 -5338 31067 25482 -111733
801 -111733 1311 44813 -117887 5045 -123329 -244315 -28174 -127200 -92876 85123
791 85123 145139 -137851 -283592 -43380 -328127 -145994 -73782 28917 -32527 -89647 36695
780 36695 34520 -85387 -25697 30852 -102767 -135489 -196446 -322111 -270297 -27074 254645
769 254645 239485 40659 76936 75749 104857 -79261 -236010 -125127 -45759 34815 21784
758 21784 -60966 -80636 114669 -63414 -150378 -42850 -40371 54291 84905 10036 -179682
747 -179682 36304 -133821 -80649 -143858 -292177 -50469 -249748 20468 97249 27967 -137794
736 -137794 16246 -111243 -358235 -127770 28465 12906 68325 -90421 29667 -74938
726 -74938 121646 -11943 14502 -99191 -148677 32571 -145546 -278175 -292302 -311711 -227496
715 -227496 34239 -56413 -141297 -131691 -123024 -241035 -222171 -260910 -60333 15877 -275400
704 -275400 -312012 -180002 -204079 -273589 -150799 -123953 123079 -25964 -114588 69584 179535
693 179535 -78999 -115195 99369 -107461 -318332 -122327 -183444 -460486 -270977 -80041
683 -80041 -13550 -14435 -134532 -233846 -126066 138683 216705 -127525 97329 323366 229220
672 229220 -39201 -140151 -161739 -11847 -72465 -100132 -234173 -239588 -66533 143201 20322
661 20322 -303225 -323926 -207491 -263746 -178110 -84921 -181835 126400 73452 -70440 -64096
650 -64096 -34859 1913 -14815 -75315 -99300 47726 191460 -47133 -231553 33714 -49051
639 -49051 -25116 110152 -99195 -139455 175627 -202459 -198724 -67115 36708 21879 44003
628 44003 -17106 -215028 -246520 -209221 -151709 67116 204746 32206 -195954 -255811 -376522
617 -376522 -385390 -230122 -192770 34162 -100984 -464043 -378872 -203538 -58294 166174 85428
606 85428 -9191 184539 -24091 -91962 -84566 -239651 -130037 -224907 -268431 -195615 -59591
595 -59591 -47586 -281838 -350229 -330047 -157240 -80431 -34443 -261732 -343652 -237465 -123807
584 -123807 -39150 -32844 -175128 -336785 -109911 -210302 -333363 -22666 -145294 -494302
574 -494302 -364585 -56237 -174147 55592 56976 55214 -30713 5920 37127 -322769 -367939
563 -367939 -227569 -105730 -274122 -307989 -455369 -205740 -256626 -395751 -362642 -311478 -174650
552 -174650 -71490 -169655 -109760 -294396 -65221 -61271 -289261 -377196 -322920 -287449 -151546
541 -151546 -203062 -39153 -95342 -152368 -59110 -81096 1580 68140 -26794 -175427 -284938
530 -284938 -103564 -237018 -272592 -247552 -121376 -73718 -108507 -123310 63824 -126621 -259869
519 -259869 -31214 -5339 -245078 -166362 -165182 -133716 -351505 -238191 -51178 -73807 -111811
508 -111811 -93100 124235 109717 -85141 -215821 -110265 117624 55903 -214130 -31149
498 -31149 -5424 83118 -89446 -57002 60566 189150 22915 -151062 -303888 -106665 -288051
487 -288051 -339280 -324492 -183721 -33567 -81818 -103918 -60535 -27318 -209761 -299344 -31945
476 -31945 86712 -67049 -112780 -175500 -140862 -215041 -151168 208032 193854 76518 93871
465 93871 310389 -21071 79228 113598 -78627 -49417 15203 205129 68747 -132540 -208850
454 -208850 -103102 198202 116054 -54146 -176493 -201035 -18104 52509 -121999 -282831
444 -282831 -288865 -72962 1814 51696 -153685 -197480 -30181 -106008 -46825 -11041 -49539
433 -49539 -337589 -351524 -386618 -235485 -95121 -332244 -284126 -306741 -14670 71722 146627
422 146627 -203463 -159484 180653 -126016 -336131 -60270 -48228 -149671 -192024 -306590
412 -306590 -158003 -199440 -375382 -335517 -38101 53497 -272613 -481044 -454435 -279588 -210618
401 -210618 -150141 -193513 -288188 -536215 -352663 -68553 -226711 -428331 -457614 -375901 -450053
390 -450053 -499449 -681648 -369925 -462576 -186424 -317558 -301429 -362923 -373708 -220149 -351821
379 -351821 -285293 -231977 -577523 -406166 -164511 -309889 -94639 -169184 -395373 -305377 -247497
368 -247497 -255214 -116110 -126765 -329000 -233441 -258011 -324233 -337082 -317748 -303620 -313864 -403081
356 -403081 -364354 -242944 -126620 -201402 -174980 -154085 -301078 -365436 -500331 -193812 -247483
345 -247483 -333233 -351835 -569457 -552510 -301539 -126403 -217476 -134060 -306326 -247663 -181245
334 -181245 -81448 -190560 -272888 -517287 -322284 -322661 -419794 -234705 -145937 -179932 -303194
323 -303194 -190976 -342093 -317543 -322863 -212655 -246300 -130275 -405047 -612863 -419888 -354856
312 -354856 -293215 -197542 -180381 -453174 -362856 -365701 -577578 -510804 -590903 -321762 -84067
301 -84067 4260 -58007 -60282 -163143 -149952 -109228 -35829 -111753 -211546 -74228 -113543 -344436
289 -344436 -540065 -478574 -574844 -253611 -175687 -263723 -327479 -262463 -287492 -360578 -381672
278 -381672 -607962 -414471 -518353 -614779 -734233 -494159 -256188 -263859 -530211 -453855 -574086
267 -574086 -356233 -416151 -313828 -339711 -413471 -258036 -436924 -306664 -385940 -389477 -359342
256 -359342 -430631 -325611 -227918 -370529 -333746 -432260 -583798 -546917 -292315 -164719 -288861
245 -288861 -159231 -334305 -810935 -675173 -320289 -13337 -134888 8138 -117507 -207113
235 -207113 -323182 -332965 -276282 -392272 -334319 -345503 -362161 -191462 -462412 -368574 -302786
224 -302786 -434377 -167041 -208221 -252060 -340844 -378156 -408950 -294567 -319824 -447515 -399084
213 -399084 -343236 -288913 -301453 -391951 -456746 -360889 -297311 -576840 -519462 -683780 -672583
202 -672583 -320406 -81436 -134957 -366315 -536117 -384655 -5192 -330777 -288687 -251640
192 -251640 -177258 -311327 -303561 -73360 -255249 -340875 -665678 -516407 -475169 -323816 -370023
181 -370023 -600266 -224658 -59062 -170376 -16622 -116794 -54863 -133937 -116926 -224637
171 -224637 -441686 -323183 -192058 -141300 -263847 -387547 -545738 -378574 -363600 -338564
161 -338564 -255409 -121299 -372916 -598925 -451154 -332910 -138458 -298406 -342270 -434708
151 -434708 -396248 -420235 -505756 -423267 -291529 -64681 -122885 -188672 -478944 -344867 -296274
140 -296274 -317973 -367876 -711003 -574775 -388315 -294545 -420680 -249859 -330226 -281523 -189286
129 -189286 -346425 -231374 -252031 -266018 -515584 -504781 -461130 -364473 -175038 -128383 -468127
118 -468127 -480430 -525778 -411900 -460116 -519547 -520100 -308828 -439804 -342009 -129025 -362341
107 -362341 -365209 -444404 -355321 -357284 -424333 -368337 -463168 -331399 -385429 -238363 -69887 -173566
95 -173566 -445763 -503331 -333637 -342868 -376514 -453201 -183133 -320024 -310027 -85432 -243950
84 -243950 -304138 -349332 -331046 -156580 -286944 -399631 -287433 -234774 -356827 -238189 -217209
73 -217209 -264438 -340301 -478392 -269726 -277895 -511769 -492995 -402042 -358723 -408080 -378615 -303006
61 -303006 -221330 -533896 -456844 -637658 -306386 -193027 -360590 -466599 -399301 -289739 -561818
50 -561818 -393758 -372396 -362175 -302847 -449526 -632407 -550072 -440837 -383533 -283257 -415923
39 -415923 -570820 -603161 -450959 -428786 -458669 -373567 -348716 -352950 -387673 -282174 -245546 -385212
27 -385212 -309722 -330152 -442760 -418212 -476643 -344838 -222234 -201922 -265645 -162429 -341755
16 -341755 -423655 -257329 -263223 -189547 -266949 -450811 -314419 -406796 -382771 -223305 -369148
5 -369148 -381696 -316941 -433054 -442963 -453616
0 -453616
$$ Imaginary data points
##PAGE= N=2
##DATA TABLE= (X++(I..I)), XYDATA
16383 -3333880 -3466164 -3543582 -3449640 -3383149 -3250029 -3120328 -3088194 -3088197 -3151818 -3091747 -3084880 -2916759
16371 -2916759 -2967452 -2895937 -2657854 -2706417 -2915702 -2766608 -2570553 -2635235 -2505681 -2579429
16361 -2579429 -2493308 -2365550 -2328226 -2382462 -2344554 -2173247 -2241545 -2241191 -2036950 -2030934 -1976605
16350 -1976605 -1966927 -1909429 -1850268 -2184306 -2089782 -1852196 -1642852 -1572864 -1723440 -1653521 -1619168
16339 -1619168 -1631127 -1714345 -1522419 -1629766 -1603409 -1552732 -1509695 -1408700 -1299906 -1517728
16329 -1517728 -1463038 -1339501 -1241744 -1064729 -1005129 -931857 -1026585 -778971 -682707 -814385
16319 -814385 -648236 -580466 -534467 -475276 -551621 -776724 -722967 -762697 -655533 -410012 -354606
16308 -354606 -253163 -299383 -241832 -117551 -50958 -30251 -117008 -146862 59035 -36363 -127623
16297 -127623 -43438 86447 153538 128238 342154 339006 211931 371531 344206 398937 413810
16286 413810 363220 303587 448516 485823 503978 440211 506654 523623 669388 618670 857162
16275 857162 730826 835619 952541 1039247 964988 908895 976738 990301 1068682 945071 878127
16264 878127 751615 820968 1007873 1200335 1455952 1446871 992176 1103429 1333001 1534518
16254 1534518 1471648 1439397 1413153 1282643 1539542 1426966 1344662 1395874 1409605 1601318
16244 1601318 1496038 1520858 1386084 1373954 1544295 1738312 1690909 1790514 1674315 1772061
16234 1772061 1879223 1969049 2008107 2023479 2029394 1956575 1979052 2078300 2029832 1999954 1837955
16223 1837955 2149241 2243883 2145707 2288536 2210919 2196136 1994669 2054608 2162572 2261067
16213 2261067 2266676 2339920 2455895 2349667 2238229 2309049 2373226 2343512 2302820 2349491 2213995
16202 2213995 2338759 2177193 2376041 2360393 2227979 2456747 2507630 2574909 2568426 2560461 2606720
16191 2606720 2502975 2399675 2488124 2597949 2546007 2572741 2673743 2477124 2509263 2665273
16181 2665273 2706221 2685529 2581367 2741342 2812466 2817400 2778084 2892820 2863299 2868052 2769538
16170 2769538 2901289 2802574 2949595 3043875 2876328 2961412 3067703 3271405 3084894 3071367
16160 3071367 3224372 3231558 3042106 2923118 2724696 2773030 2732167 2987493 3058391 3081791
16150 3081791 3168960 2926503 3123982 3172930 3274906 3442674 3452887 3384941 3086821 3280477
16140 3280477 3493178 3483441 3162270 3134943 3266580 3174695 3111364 3307730 3061281 2974288
16130 2974288 2972506 2911573 2992016 3065152 3155557 3288036 3310102 3256345 3339223 3277729 3281798
16119 3281798 3109844 3247936 3150023 3033331 3213133 3114841 3382076 3375059 3182321 3155030
16109 3155030 3333679 3248480 3077599 3231096 3307904 3314877 3351924 3584378 3223277 3328798
16099 3328798 3345134 3188870 3429056 3474960 3338478 3206369 3254969 3331658 3343419 3233818
16089 3233818 2994413 3020348 3130372 3123263 3164016 3224248 3277602 3327077 3344911 3382261 3615096
16078 3615096 3493878 3580314 3402012 3342725 3249548 3316347 3433166 3341566 3456288 3349707
16068 3349707 3310084 3348738 3396201 3260743 3262946 3073177 3166100 3290143 3337516 3320855 3321700
16057 3321700 3415012 3454724 3359482 3226264 3362279 3514349 3415016 3375324 3500874 3415263
16047 3415263 3223835 3333796 3554804 3495323 3521119 3225212 3201369 3284940 3147348 3287915
16037 3287915 3184998 3195425 3395992 3305541 3308608 3125157 3260937 3495063 3345821 3307929
16027 3307929 3244648 3168069 3471478 3354829 3317046 3315051 3196893 3431745 3413270 3433927 3211304
16016 3211304 3210964 3225210 3199908 3117324 3266791 3350195 3551422 3356318 3374590 3157616 3594104
16005 3594104 3618121 3474949 3505042 3356800 3496754 3491064 3538311 3544355 3321276 3184998 3324100
15994 3324100 3330327 3651105 3474678 3458468 3558832 3387092 3450633 3419964 3317347 3330574
15984 3330574 3387772 3405084 3339152 3365990 3359330 3442634 3365326 3516295 3576760 3421553 3338734
15973 3338734 3240858 3102860 3263991 3397519 3452680 3458177 3515915 3316826 3458164 3464791 3484030
15962 3484030 3492220 3410820 3372726 3283290 3152206 3203433 3272431 3367944 3233069 3344067 3452972
15951 3452972 3279957 3499055 3455384 3367179 3370387 3391056 3569569 3500687 3463427 3394613 3306934
15940 3306934 3315516 3478137 3327507 3324622 3574498 3444055 3480472 3330050 3533137 3499586
15930 3499586 3657307 3503307 3433001 3600545 3600465 3559244 3455442 3329185 3408363 3526543 3594720
15919 3594720 3497735 3264256 3308755 3232388 3412911 3582933 3548367 3397354 3437458 3237175
15909 3237175 3374493 3410985 3314060 3378282 3469540 3605792 3597101 3670105 3731645 3810189 3659373
15898 3659373 3521339 3656438 3571746 3437585 3509911 3481302 3564625 3666489 3662090 3506648
15888 3506648 3438490 3135340 3291687 3478768 3694383 3622946 3441074 3254201 3037162 3320550
15878 3320550 3519155 3598843 3512246 3480635 3506063 3561375 3597077 3619403 3479668 3521645 3673962
15867 3673962 3561377 3372910 3341558 3491242 3478533 3256129 3391935 3543882 3535749 3496556
15857 3496556 3694445 3539864 3470934 3357074 3537774 3572686 3397745 3303947 3620937 3695481
15847 3695481 3318284 2975136 2989188 3232714 3305263 3372771 3469492 3407160 3325833 3335634 3463222
15836 3463222 3500804 3326052 3515181 3411503 3257639 3208124 3399021 3403924 3499506 3387467
15826 3387467 3518653 3565211 3608993 3642127 3729524 3600896 3597571 3657490 3819379 3773581 3510567
15815 3510567 3413437 3678802 3573895 3501236 3230046 3100017 3145482 3333857 3352864 3448915
15805 3448915 3746141 3799068 3785313 3725592 3551577 3571330 3621076 3506478 3357658 3338475
15795 3338475 3379895 3401456 3476700 3171089 3201638 3259063 3497400 3390558 3414920 3402139 3579445
15784 3579445 3514816 3358228 3307621 3482252 3546336 3460087 3422892 3412490 3424436 3429191 3437622
15773 3437622 3546410 3489109 3406982 3144540 3295104 3764142 3742878 3386239 3356235 3549893
15763 3549893 3635023 3584735 3536179 3557124 3339759 3401825 3463392 3630209 3697189 3718630 3751220
15752 3751220 3485540 3383835 3602447 3578427 3631382 3609787 3553369 3588582 3474289 3501335
15742 3501335 3228266 3254245 3666571 3747648 3617520 3718221 3673964 3737298 3411446 3241480
15732 3241480 3330301 3419436 3465840 3377112 3394631 3470007 3428943 3553974 3349829 3316452 3443666
15721 3443666 3476320 3683727 3782857 3837876 3580206 3545019 3529712 3565418 3464669 3372085 3342160
15710 3342160 3384416 3441192 3502029 3337371 3245205 3387990 3384594 3435338 3460470 3374239 3368191
15699 3368191 3376812 3504352 3554097 3406804 3422765 3359789 3391362 3667649 3433113 3325303
15689 3325303 3465655 3480864 3605729 3772367 3561603 3636114 3557786 3337129 3519852 3564068
15679 3564068 3505883 3320888 3380636 3435538 3393660 3637311 3412520 3379357 3374980 3396586 3378052
15668 3378052 3415276 3552100 3351643 3429876 3539571 3336284 3464310 3305049 3370180 3530721
15658 3530721 3559349 3723919 3630337 3646054 3626236 3664907 3704132 3789202 3867272 3930160 3764040
15647 3764040 3707363 3709029 3956941 3876833 3748442 3709599 3553759 3562578 3514846 3477995 3507599
15636 3507599 3548495 3553488 3530516 3363243 3478348 3578074 3545573 3813601 3536346 3442582 3428401
15625 3428401 3574333 3553859 3588316 3489961 3365127 3532377 3306562 3439863 3415499 3320658
15615 3320658 3328582 3388765 3535514 3482014 3447850 3549060 3462800 3606289 3651166 3914717 3502719
15604 3502719 3355110 3422132 3507818 3620195 3658846 3587966 3512695 3607549 3551836 3318628 3345923
15593 3345923 3639111 3428704 3469394 3557457 3821168 3583232 3714389 3686705 3540960 3602014
15583 3602014 3620939 3808941 3793597 3476955 3671917 3798226 3814173 3728138 3528132 3798212
15573 3798212 3436506 3441001 3418870 3477140 3474315 3529963 3664551 3385400 3464257 3500616 3664305
15562 3664305 3673979 3503597 3562592 3759452 3748802 3640691 3590056 3601262 3632493 3673195 3615338
15551 3615338 3669864 3495128 3269261 3605580 3666864 3710340 3899249 3708635 3766597 3445754
15541 3445754 3447292 3497117 3416393 3555571 3588854 3558026 3654571 3267560 3204992 3455805 3482595
15530 3482595 3680320 3799211 3676102 3565901 3613136 3547558 3709342 3648422 3743763 3857807
15520 3857807 3786239 3495814 3647750 3478514 3781224 3937024 3551202 3483881 3500064 3401948
15510 3401948 3453571 3706640 3680184 3654342 3798068 3573701 3577752 3547854 3350515 3467459
15500 3467459 3478213 3550379 3482538 3441555 3552667 3598715 3722921 3721225 3729288 3676523 3554424
15489 3554424 3636536 3605017 3509227 3441026 3718314 3550199 3554108 3722509 3557292 3676903
15479 3676903 3772685 3709572 3609417 3682252 3618394 3471639 3377532 3533304 3725691 3727091 3660599
15468 3660599 3655986 3756815 3653562 3768471 3765551 3783466 3578471 3441861 3367700 3419849 3515499
15457 3515499 3322053 3341768 3439830 3577628 3666698 3500155 3550917 3493657 3403996 3464377 3411276
15446 3411276 3599146 3335500 3318110 3521439 3668418 3564554 3489065 3334924 3640514 3937322
15436 3937322 3767488 3720253 3679803 3762238 3792822 3722332 3671281 3418814 3233792 3291343 3504533
15425 3504533 3617649 3627312 3590572 3567743 3552622 3541334 3735674 3611168 3312781 3283632 3654653
15414 3654653 3748998 3780010 3822693 3786767 3721969 3626401 3835967 3663458 3424578 3863854
15404 3863854 3766747 3716736 3427298 3477785 3591078 3604537 3640185 3575457 3659979 3711256 3589608
15393 3589608 3456566 3473783 3627856 3661709 3742128 3876433 3773642 3836414 3844202 3722176
15383 3722176 3788304 3794500 3581661 3396254 3558351 3861592 3766891 3519570 3527160 3531829 3641405
15372 3641405 3476597 3644976 3678884 3561054 3687079 3786823 3785622 3509650 3376458 3540713
15362 3540713 3807030 3617869 3680539 3594485 3648987 3442206 3377407 3649094 3842545 3849667
15352 3849667 3800889 3581525 3740970 3885245 3832002 3772657 3821175 3510376 3474407 3702540
15342 3702540 3778642 3738832 3703568 3805615 3889622 3891731 3997617 3661189 3538533 3481222 3852789
15331 3852789 3927602 3654873 3447853 3214991 3676705 3640830 3635003 3516448 3519952 3528217 3626107
15320 3626107 3365232 3496292 3740481 3780566 4020901 3837899 3760981 3613789 3425546 3452561
15310 3452561 3625162 3697024 3740934 3774454 3763807 3612539 3619145 3689683 3647443 3625194 3766144
15299 3766144 3786847 3719041 3746197 3828891 3587458 3487078 3742748 3656407 3781048 3615572
15289 3615572 3446984 3463015 3590363 3718376 3748023 3801388 3714066 3804848 3910224 3597488
15279 3597488 3546270 3561073 3744263 3659556 3539696 3647434 3939720 4029390 3980583 3709281
15269 3709281 3725471 3694897 3653895 3650163 3752657 3771124 3473925 3770156 3745627 3577824 3639092
15258 3639092 3477669 3365655 3462629 3552315 3617178 3761730 3682559 3618622 3794719 4104946
15248 4104946 3942234 3817887 3789630 3625107 3487530 3354064 3464836 3540196 3772378 3826605
15238 3826605 3637004 3576483 3579232 3532627 3651831 3760935 3798235 3851457 3832239 3751420 3848679
15227 3848679 3709612 3779737 3974115 3800205 3688951 3631290 3610562 3697688 3768611 3861350
15217 3861350 3916245 3887207 3871514 3606116 3460784 3614396 3851141 3869211 3796195 3873574
15207 3873574 3870931 3612325 3513313 3523770 3533837 3414885 3434349 3342960 3397044 3663998 3658822
15196 3658822 3744415 3755166 3687532 3474106 3714568 3601963 3613793 3589820 3708587 3472314
15186 3472314 3455131 3708034 3728720 3656022 3716446 3476254 3676831 3657258 3454144 3790017
15176 3790017 3591399 3440397 3511881 3743204 3741342 3557937 3934194 3776812 3612713 3569307
15166 3569307 3519386 3496400 3560782 3602460 3797526 3774229 3661138 3841869 3820324 3922682
15156 3922682 3676002 3649082 3474132 3665374 3673042 3763956 3772169 3623357 3653639 3635405 3575829
15145 3575829 3689621 3419647 3307726 3293471 3619139 4076253 3950444 3901736 3697111 3649625
15135 3649625 3680522 3509409 3691926 3752798 3899400 3755538 3753069 4012937 4080300 4070275
15125 4070275 3915080 4016400 3658043 3508439 3468922 3475786 3491964 3576017 3695084 3802391
15115 3802391 4016079 3796273 3910454 3938377 3824909 3829743 3839437 3889569 3712623 3568337
15105 3568337 3454371 3410109 3384365 3579329 3860317 3703099 3665298 3578672 3860313 3596350
15095 3596350 3653193 3625830 3642876 3701415 3484570 3653716 3706509 3940875 3787368 3653398
15085 3653398 3689066 3766219 3627044 3569860 3741898 3794752 3645896 3602423 3679652 3680527 3617484
15074 3617484 3562259 3423360 3194680 3516154 3717979 3789538 3849494 3768222 3724278 3806318
15064 3806318 3779304 3780941 3837426 3940415 3973550 3927038 3737706 3568801 3820104 3756055 3646618
15053 3646618 3553593 3680900 3750374 3835086 3555444 3502230 3562276 3844051 3747796 3709652 3775790
15042 3775790 3612287 3715018 3638334 3737066 3762753 3712556 3865411 3708477 3781566 3866308
15032 3866308 3785128 3635520 3527279 3650431 3561994 3539237 3630868 3922748 3801084 3735113
15022 3735113 3833247 3704434 3760188 3782940 3991371 4041789 3715406 3581070 3894592 3888494
15012 3888494 3679815 3675873 3754229 3653952 3484084 3752006 3957903 3736755 3928505 3883263
15002 3883263 3715817 3662046 3519645 3779230 3887810 3785268 3876401 4012088 4016795 3768269
14992 3768269 3687287 3852718 3920695 3907749 3708984 3909817 3843689 3587246 3565059 3767289
14982 3767289 3756523 3805371 3818770 3755111 3783839 3914017 3780399 3780589 3922766 3904968 3666093
14971 3666093 3727316 3891477 3664939 3772924 3906924 3684541 3632803 3679850 3769793 3615063
14961 3615063 3559408 3629190 3766452 3709927 3799020 3978821 3733507 3556325 3608551 3767039
14951 3767039 3812920 3792070 3839837 3892446 3617915 3834776 3660549 3711967 3863119 3878418
14941 3878418 3973258 4103169 3966770 3923453 3913076 3936443 3766126 3594943 3606452 3718801
14931 3718801 3870250 3576739 3594012 3881149 3991294 3638292 3721251 3905969 3890211 3784863
14921 3784863 3765057 3761059 3657957 3999097 3934437 4009097 4100577 4160113 4082039 4031318 3947358
14910 3947358 3927479 3933562 3786299 3777020 3664249 3801901 3762830 3819541 3630039 3747780 3992171
14899 3992171 3858730 3844801 3760172 3693051 3745303 3672659 3879400 3924556 3963903 3888745 3660146
14888 3660146 3654366 3539738 3567387 3623017 3481994 3866215 3972712 3792250 3639129 3859641
14878 3859641 3800761 3844234 3850274 3847851 3791789 3616045 3646948 3774987 3871017 3887241 3650749
14867 3650749 3647515 3978814 4041957 4023079 3952169 3801403 3616289 3791713 3881869 3837954 3869563
14856 3869563 3966678 3838024 3843738 3986451 3708714 3844064 3883949 3669841 3806379 3976070
14846 3976070 3982062 4011187 3866896 3659639 3499446 3660739 3831297 3695883 3916904 4094477
14836 4094477 4063977 3849747 3856451 3577077 3844493 3944515 3742343 3658362 3806951 3792455
14826 3792455 3837668 3780858 3747734 3652618 3742481 3691254 3626095 3647858 3727794 3693477 3774974
14815 3774974 3746982 3627535 3669594 3649507 3700839 3775549 3616488 3732422 3604279 3589580
14805 3589580 3428364 3508611 3628665 3693785 3901104 3899963 4172717 3787555 3675321 3541316
14795 3541316 3622236 3694202 3953534 3866353 3617366 3831798 4088300 3839007 3711640 3841079
14785 3841079 3744608 3743895 3630425 3613980 3852828 3864576 3882578 4039383 3835356 3803305 3817439
14774 3817439 3980918 3987648 4064869 3918597 3899693 3804008 3940530 4067673 3777115 3978663
14764 3978663 3711544 3780702 3735109 3767907 3796958 3840296 3740954 3477272 3742524 3690218 3674604
14753 3674604 3882254 3938005 3925013 3700289 3890958 3661166 3590811 3747484 3639809 3338266
14743 3338266 3430787 3532023 3716956 3679984 4020125 3990710 3839561 3897025 3646546 3713847
14733 3713847 3875168 3892830 3764472 4012327 3924862 3772674 3809910 3921359 3927953 3943253
14723 3943253 4018063 3863313 3836190 3828469 3635676 3678001 3809259 4001363 3904705 3877388 3642086
14712 3642086 3755123 3788667 3833027 3855325 3904822 3531716 3611759 3861492 3856623 3763448 3512992
14701 3512992 3630303 3872258 3858159 3489570 3828842 3775591 3777104 3908297 3884519 4015433
14691 4015433 3855802 3813200 3963185 3855265 3856930 3538480 3892129 3963425 3907486 3804977
14681 3804977 3860022 3818898 3721009 3858118 3818687 3585817 3604269 3614564 3503572 3770736
14671 3770736 3821529 3814958 3944684 3907570 3683683 3757229 3766003 3898074 4091899 4096027 3761883
14660 3761883 3536617 3566950 3914992 4023305 4115991 4253257 3913707 3744316 4017963 3885036
14650 3885036 3949610 3987468 3968681 3741335 3802285 4063741 4129551 3961335 4009507 4138194
14640 4138194 4082775 3867301 3862875 3949333 3774663 3962522 4016877 4037746 3961602 4069320 4115783
14629 4115783 4080330 4044113 4113494 4301144 4068491 4080892 3906795 4039186 4090419 4289332
14619 4289332 4018774 3914014 4158411 4125307 4079924 3973902 3895907 4098187 4161948 4024784
14609 4024784 3929012 3775134 3712547 3856260 3942419 3753016 3961397 4136912 4036404 3986471
14599 3986471 4250472 4219354 3871088 3976207 3912945 4007808 4152411 4083868 3950053 3766344
14589 3766344 3967470 4131222 4088304 4026439 3935218 3914116 3856597 3635558 3969292 4063568
14579 4063568 3986615 3993394 3915387 4033618 4174983 4108437 4260355 4114459 4096915 4072402 4025471
14568 4025471 3999401 3849022 3772963 3635145 3494938 3605326 3787871 3798817 3795798 3845199
14558 3845199 3643945 3946297 3970920 4116749 3808989 3667695 3975739 3976005 3897707 3693652
14548 3693652 3735515 3592803 3803691 3856234 3694489 3880473 3922577 4012080 3930591 3810446
14538 3810446 3919570 4026542 4031361 3867404 3697278 3959896 4133845 3913761 3887016 4125098
14528 4125098 3988279 3965911 4106983 4049528 3857581 3827158 3796862 3787837 3951985 4082696
14518 4082696 4039885 4140463 4086725 3979508 3695203 3668864 3868848 3607394 3731802 3910441
14508 3910441 4005128 4021098 3991743 3807857 3688964 3653840 3658750 3710787 4009855 3982669 3918761
14497 3918761 3829152 3908680 3888081 3924129 3807992 3955561 4154900 4092616 4098291 4117926 3950731
14486 3950731 3902709 4032288 4170144 4044300 4055621 3991327 4082154 4220021 4167829 4172216 4130583
14475 4130583 4006122 3870732 3941562 3786386 3786841 3875384 3720323 3870639 3975319 3925554
14465 3925554 4005749 3894115 3969945 3926245 3954459 4076190 3966819 3884092 3836029 3710317
14455 3710317 4027589 4070006 3859773 3983907 3836766 3655308 3898831 4210894 4093803 3979725
14445 3979725 4118824 4134862 3955031 4049843 3964438 4083178 3797312 3816078 3917431 3761480
14435 3761480 3977208 3989488 3957748 3785212 3795588 3996393 3934901 3993010 4005011 3877549
14425 3877549 3824611 3802020 3844133 3975896 3946702 4018708 4087865 3926753 4073417 4200956
14415 4200956 3965718 3900761 4009605 3882393 3725239 3720510 3809822 3902216 3919922 3856933 4000510
14404 4000510 4072157 4195905 4196735 4038969 3999657 3974733 3740469 3782658 3995003 4169124 4234794
14393 4234794 4500174 4145002 3944082 3730538 3572718 3669405 3661057 3892289 3969735 3960983
14383 3960983 4110335 3957467 3918558 3817246 3730787 3564392 3724100 4070250 3962670 3907187
14373 3907187 3916051 3920702 4017367 3857878 3959907 4030605 4057490 4075459 3933953 3908071 3923971
14362 3923971 3900942 4061530 4201589 4031500 4042346 4187883 3993368 3850010 4017905 3820386
14352 3820386 3943180 4283662 4063036 3851016 3855381 3775287 4067331 3865706 3798354 3978084
14342 3978084 4005358 4059287 4157130 4148468 4056500 4077726 4178710 3883935 3805510 3983885 4008843
14331 4008843 3987698 4041557 3832755 4158806 4213877 4069991 3967399 3770358 4017532 4113930
14321 4113930 4285590 4337034 4392915 4236791 4221815 4217409 4012734 4126814 4034064 3799514
14311 3799514 4077527 3931831 3701424 3746377 3720994 3917257 4015102 4056647 4115373 3994440
14301 3994440 3750266 3919236 4035803 4324042 4157481 4202263 4149506 4054492 3978136 3898143
14291 3898143 3912610 3812810 3846424 3758269 4125862 4107148 4095258 4236763 4173993 4106810 4217168
14280 4217168 4121255 4050557 3899021 3920014 3999007 4085364 4242506 4058516 4212900 4253995
14270 4253995 4151519 4135839 4198327 4291033 4078108 4153949 4141967 3970878 4034539 3869107
14260 3869107 3884473 3731265 3884078 4023453 3901843 3735110 3714609 3794656 3882381 4149958
14250 4149958 4145616 4102167 4040460 4075945 4255525 4236716 4096303 4110211 4199270 4263602 4278668
14239 4278668 4264431 4194621 4257259 4220151 4336914 4213626 4203294 4049895 4140770 4111197 3978002
14228 3978002 4163063 4332329 4392987 4194657 3996880 4019403 4000103 3979252 4049704 4051184 3990640
14217 3990640 4190078 4206599 4076508 3747771 3770515 3955712 3835448 3993313 4108024 4089503
14207 4089503 4095647 4036011 3957357 4050041 4184715 4103123 3923775 3861010 4264589 4445795 4164587
14196 4164587 4024042 4187776 4041327 4026292 4258227 4263072 4515239 4256275 3963868 4136009
14186 4136009 4147314 4215685 4234407 4038158 4171475 4178807 4091766 3873837 4088586 4138204 4189548
14175 4189548 4289704 4074595 4182748 4173287 4247410 4089980 3692179 4026561 4267028 4156780
14165 4156780 3994642 3935918 4098378 4160574 4137362 3986681 3952075 3855737 3916833 4252280
14155 4252280 4188791 4145068 4230340 4108712 3925659 3996002 4108367 4260688 4089173 3961177
14145 3961177 3863683 4084984 4232269 4006709 3999163 3995249 4114073 4071411 4014438 4062109 4023780
14134 4023780 4012806 4076357 4167423 4082428 3998920 3805925 3947455 4061182 4077198 4182999
14124 4182999 4358753 4170012 4191790 4233687 4206180 4312559 4077905 4055503 4080582 4110586
14114 4110586 4346893 4250112 4105637 4179438 4277977 4146906 4013156 4239310 4067960 4240500
14104 4240500 4258517 4153199 4071352 4103097 4013395 4014014 4172398 4393080 4132716 4144126 4247696
14093 4247696 4250665 4114386 3981945 4131139 4016368 4134295 4238396 4289516 4292624 4134374
14083 4134374 3983767 4072213 4194122 4237264 4011879 3834785 3782465 4178103 4559258 4541173
14073 4541173 4250080 4358265 4333030 4207710 4160109 4201333 4000337 4069317 4080154 4145310
14063 4145310 4226237 4121243 3918804 4253404 4337877 4260541 4119327 4137595 4289137 3945781
14053 3945781 4122008 4180562 4150540 4074119 4167521 4150043 4141605 4022166 4106035 3989403 4230067
14042 4230067 4082235 3935134 4028962 4227420 4146027 4108575 3775525 3806784 3994972 4069629
14032 4069629 3874017 4073615 4022972 4016808 4042415 4004693 4017259 4159430 4057768 4308170
14022 4308170 4483689 4051651 3931495 3943672 3906589 3973318 4361485 4012588 4063029 4130471
14012 4130471 4159721 4202652 4253214 4218676 4209263 4382091 4350604 4073125 4116229 4237275 4312806
14001 4312806 4282283 4254645 4110454 4307602 4401082 4484161 4321556 4037712 4161303 4245375
13991 4245375 4092013 4175262 4210771 4223830 4153168 4164212 4072291 3895194 3851926 3964697 3939243
13980 3939243 4037531 4140567 4117666 4078683 4360165 4138795 4212557 4122645 3962385 4016145
13970 4016145 4080953 4048840 3975391 3960583 3859971 4317633 4169526 4318471 4135202 4321502
13960 4321502 4341182 4216145 4289478 4288702 4139405 4025692 4189562 4423250 4330810 4135566
13950 4135566 4174655 4090362 4030901 3931939 3990275 4250539 4277143 4236176 4137069 4158260 4121342
13939 4121342 4176364 4155424 4047863 4010251 3956238 4031148 4076082 4119157 3989934 4058491 4136055
13928 4136055 4239337 4188277 4211565 4176000 4171728 4171380 4493761 4359509 4182836 4132360 4283032
13917 4283032 4202773 4188208 4113703 4229285 4433177 4459999 4310451 4272936 4238844 4158723 4037007
13906 4037007 4077242 3902328 3802449 4066657 4079105 4055612 4066854 4170279 4061199 4157819
13896 4157819 4212502 4296747 4318152 4312871 4114786 4202321 4091928 3916257 4137336 4158204 4096144
13885 4096144 3914915 4029381 4158341 3975324 4263793 4002137 4017301 4130721 4020628 4266476
$$ [...]
##END NTUPLES=NMR SPECTRUM
##END=
