##TITLE=1H_CG-1148-D-3
 CDCl3, 8 sc, 
 9.07.2021
##JCAMPDX= 6.0         $$ Bruker NMR JCAMP-DX V2.0
##DATA TYPE= NMR SPECTRUM
##DATA CLASS= NTUPLES
##ORIGIN= UXNMR, Bruker Analytische Messtechnik GmbH
##OWNER= root
$$ XWIN-NMR		Version 3.5
$$ Fri Jul  9 12:15:07 2021 Russian Standard Time (UT+4h)  she@DPX200
##.OBSERVE FREQUENCY= 200.131506
##.OBSERVE NUCLEUS= ^1H
##.ACQUISITION MODE= SIMULTANEOUS
##.ACQUISITION SCHEME= undefined
##.AVERAGES= 8
##.DIGITISER RES= 18
##SPECTROMETER/DATA SYSTEM= spect
##.PULSE SEQUENCE= zg30
##.SOLVENT NAME= CDCl3
##.SHIFT REFERENCE= (INTERNAL, CDCl3, 0, 17.5142)
##AUDIT TRAIL= $$ (NUMBER, WHEN, WHO, WHERE, WHAT)
$$ ##TITLE= Audit trail, XWIN-NMR		Version 3.5
$$ ##JCAMPDX= 5.01
$$ ##ORIGIN= Bruker BioSpin GmbH
$$ ##OWNER= she
$$ F:/spectra/data/she/nmr/H-F/1/pdata/1/auditp.txt
$$ ##AUDIT TRAIL=  $$ (NUMBER, WHEN, WHO, WHERE, WHAT)
(   1,<2021-07-09 12:13:42.07 +0400>,<she>,<DPX200>,
      <created by zg, POWCHK disabled, PULCHK disabled
       configuration hash MD5:
       00 E9 B6 7A A2 85 ED C7 34 08 36 98 17 FE 4E 26
       data hash MD5: 16K
       D8 F7 4E 9A 66 61 B2 94 7A 2F CE 9E CA AF 81 53>)
(   2,<2021-07-09 12:13:46.62 +0400>,<she>,<DPX200>,
      <Start of raw data processing
       efp BC_mod = 2 LB = 0.24 FT_mod = 6 PKNL = 1 PHC0 = -12279 PHC1 = 15.40101 SI = 16K 
       data hash MD5: 16K
       E9 45 CA 38 1E 23 29 7C 2C FD DE B1 1F 79 3C 7D>)
(   3,<2021-07-09 12:14:07.87 +0400>,<she>,<DPX200>,
      <pk PHC0 = 1.567099 PHC1 = -2 
       data hash MD5: 16K
       FD 18 72 06 1C A2 79 4D 8E 39 FC F8 8F AF 36 7F>)
(   4,<2021-07-09 12:14:12.06 +0400>,<she>,<DPX200>,
      <abs ABSG = 5 
       data hash MD5: 16K
       EB CE FD 15 E4 ED 7D C2 BC 8F 60 8E D2 BD 3B 8F>)
$$ ##END=
$$ 
$$ hash MD5
$$ 78 3A 28 5B 3B C3 80 9F 93 D3 83 90 B9 72 F7 64
##$RELAX= 
##$RELAX= 
##$RELAX= 
##$RELAX= 
##$RELAX= 
##$RELAX= 
$$ Bruker specific parameters
$$ --------------------------
##$DU= <F:/spectra>
##$EXPNO= 1
##$NAME= <H-F>
##$PROCNO= 1
##$TYPE= <nmr>
##$USER= <she>
##$AMP= (0..31)
100 100 100 100 100 100 100 100 100 100 100 100 100 100 100 100 100 100 
100 100 100 100 100 100 100 100 100 100 100 100 100 100 
##$AQSEQ= 0
##$AQ_mod= 1
##$AUNM= <au_zg>
##$AUTOPOS= <>
##$BF1= 200.13
##$BF2= 200.13
##$BF3= 200.13
##$BF4= 200.13
##$BF5= 200.13
##$BF6= 200.13
##$BF7= 200.13
##$BF8= 200.13
##$BYTORDA= 1
##$CFDGTYP= 0
##$CFRGTYP= 5
##$CHEMSTR= <none>
##$CNST= (0..31)
1 1 145 1 1 1 1 1 1 1 1 1 1 1 1 1 1 1 1 1 1 1 1 1 1 1 1 1 1 1 1 1 
##$CPDPRG= <>
##$CPDPRG1= <>
##$CPDPRG2= <>
##$CPDPRG3= <>
##$CPDPRG4= <mlev>
##$CPDPRG5= <mlev>
##$CPDPRG6= <mlev>
##$CPDPRG7= <mlev>
##$CPDPRG8= <mlev>
##$CPDPRGB= <>
##$CPDPRGT= <>
##$D= (0..31)
0 1.2 0 0 0 0 0 0 0 0.06 0 0.03 0 0 0 0 0.0002 0 0 0 0 0 0 0 0 0 0 0 0 
0 0 0 
##$DATE= 1625818421
##$DBL= (0..7)
120 120 120 120 120 120 120 120 
##$DBP= (0..7)
150 150 150 150 150 150 150 150 
##$DBP07= 0
##$DBPNAM0= <>
##$DBPNAM1= <>
##$DBPNAM2= <>
##$DBPNAM3= <>
##$DBPNAM4= <>
$$ [...]
##$SUBNAM3= <"">
##$SUBNAM4= <"">
##$SUBNAM5= <"">
##$SUBNAM6= <"">
##$SUBNAM7= <"">
##$SUBNAM8= <"">
##$SUBNAM9= <"">
##$SW= 20.0188882624521
##$SWIBOX= (0..15)
0 0 2 0 0 0 0 0 0 0 0 0 0 0 0 0 
##$SW_h= 4006.41025641026
##$TD= 16384
##$TD0= 1
##$TE= 0
##$TE2= 300
##$TE3= 300
##$TEG= 300
##$TL= (0..7)
0 120 120 120 120 120 120 120 
##$TP= (0..7)
150 150 150 150 150 150 150 150 
##$TP07= 0
##$TPNAME0= <>
##$TPNAME1= <>
##$TPNAME2= <>
##$TPNAME3= <>
##$TPNAME4= <>
##$TPNAME5= <>
##$TPNAME6= <>
##$TPNAME7= <>
##$TPOAL= (0..7)
0.5 0.5 0.5 0.5 0.5 0.5 0.5 0.5 
##$TPOFFS= (0..7)
0 0 0 0 0 0 0 0 
##$TUNHIN= 0
##$TUNHOUT= 0
##$TUNXOUT= 0
##$USERA1= <user>
##$USERA2= <user>
##$USERA3= <user>
##$USERA4= <user>
##$USERA5= <user>
##$V9= 5
##$VALIST= <valist>
##$VCLIST= <CCCCCCCCCCCCCCC>
##$VD= 0
##$VDLIST= <DDDDDDDDDDDDDDD>
##$VPLIST= <PPPPPPPPPPPPPPP>
##$VTLIST= <TTTTTTTTTTTTTTT>
##$WBST= 1024
##$WBSW= 4
##$XGAIN= (0..3)
0 0 0 0 
##$XL= 0
##$YL= 0
##$YMAX_a= 576998
##$YMIN_a= -600908
##$ZGOPTNS= <>
##$ZL1= 120
##$ZL2= 120
##$ZL3= 120
##$ZL4= 120
##$ABSF1= 17.513
##$ABSF2= -2.506039
##$ABSG= 5
##$ABSL= 3
##$ALPHA= 0
##$AQORDER= 0
##$ASSFAC= 0
##$ASSFACI= 0
##$ASSFACX= 0
##$ASSWID= 0
##$AUNMP= <proc_1d>
##$AZFE= 0.1
##$AZFW= 0.1
##$BCFW= 0
##$BC_mod= 2
##$BYTORDP= 0
##$COROFFS= 0
##$CY= -3
##$DATMOD= 1
##$DC= 0
##$DFILT= <>
##$DTYPP= 0
##$F1P= 0
##$F2P= 0
##$FCOR= 1
##$FTSIZE= 16384
##$FT_mod= 6
##$GAMMA= 0
##$GB= 0
##$INTBC= 1
##$INTSCL= 1.334414e-10
##$ISEN= 128
##$LB= 0.24
##$LEV0= 0
##$LPBIN= 0
##$MAXI= 10000
##$MC2= 0
##$MEAN= 0
##$ME_mod= 0
##$MI= 1.114404
##$NCOEF= 0
##$NC_proc= -6
##$NLEV= 6
##$NOISF1= 3.799351
##$NOISF2= 2.8
##$NSP= 0
##$NTH_PI= 0
##$NZP= 0
##$OFFSET= 17.51422
##$PC= 1
##$PHC0= -12277.43
##$PHC1= 13.40101
##$PH_mod= 1
##$PKNL= yes
##$PPARMOD= 0
##$PSCAL= 0
##$PSIGN= 0
##$REVERSE= no
##$SF= 200.130004085994
##$SI= 16384
##$SIGF1= 3
##$SIGF2= 2
##$SINO= 5.538805
##$SIOLD= 16384
##$SREGLST= <1H.CDCl3>
##$SSB= 0
##$STSI= 16384
##$STSR= 0
##$SW_p= 4006.41025641026
##$SYMM= 0
##$S_DEV= 0
##$TDeff= 16384
##$TDoff= 0
##$TI= <>
##$TILT= no
##$TM1= 0
##$TM2= 0
##$TOPLEV= 0
##$USERP1= <user>
##$USERP2= <user>
##$USERP3= <user>
##$USERP4= <user>
##$USERP5= <user>
##$WDW= 1
##$XDIM= 16384
##$YMAX_p= 521901224
##$YMIN_p= -254709
$$ End of Bruker specific parameters
$$ ---------------------------------
##NTUPLES= NMR SPECTRUM
##VAR_NAME=  FREQUENCY,     SPECTRUM/REAL,   SPECTRUM/IMAG
##SYMBOL=    X,             R,               I
##VAR_TYPE=  INDEPENDENT,   DEPENDENT,       DEPENDENT
##VAR_FORM=  AFFN,          ASDF,            ASDF
##VAR_DIM=   16384,         16384,           16384
##UNITS=     HZ,            ARBITRARY UNITS, ARBITRARY UNITS
##FACTOR=    0.24454680195387, 1,            1
##FIRST=     3505.12077688145, 0,            0
##LAST=      -501.289479528814, 0,           0
##MIN=       -501.289479528814, -254709,     0
##MAX=       3505.12077688145, 521901224,    0
$$ Real data points
##PAGE= N=1
##DATA TABLE= (X++(R..R)), XYDATA
$$ [...]
7792 11614438 12493111 13581347 14737592 15964275 17321494 18711804 19673000 19953827 19694370
7783 19694370 18946590 18062401 17698058 17729238 18099957 18673192 19324345 19547148 19139729 17954811
7773 17954811 16121604 14045191 12113997 10504645 9382706 8442931 7652759 7061852 6604001
7764 6604001 6297462 5967507 5629509 5401021 5283150 5093459 4983977 4756556 4560541 4381359
7754 4381359 4305883 4246920 4209198 4183342 4032560 4046170 4008035 4023724 4005952 3895181 3942554
7743 3942554 3825593 3680276 3577341 3650186 3669257 3764437 3832132 3828446 3837506 3877579 3891080
7732 3891080 3877390 3956264 3975469 3998078 4149776 4236606 4372149 4367592 4366705 4495999 4662469
7721 4662469 4901054 5002258 5239906 5377082 5502634 5761844 6082143 6427702 6799350 7189390
7711 7189390 7735197 8352395 9012677 9823916 10643618 11699167 12672965 13626259 14714246
7702 14714246 15514149 15797203 15441714 14639893 13880368 13510909 13394860 13631797 13997236
7693 13997236 14378748 14624799 14579075 13988614 12986634 11863133 10997167 10373417 9959841
7684 9959841 9663904 9514331 9506055 9576727 9616549 9861018 10139537 10385260 10915579 11456451
7674 11456451 12070220 12892437 13849471 14884779 16231091 17686095 19177295 20778396 22333448
7665 22333448 23384454 23876672 23593529 22510702 21386647 20503381 20074802 19957534 20250742
7656 20250742 20655569 20793728 20479179 19558191 17977450 16113333 14205402 12593472 11554592
7647 11554592 10672475 10058999 9598909 9216665 8892444 8644688 8395054 8251331 8357942
7638 8357942 8500201 8737020 9000771 9282932 9691435 10225044 10722451 11337043 11899477 12398684
7628 12398684 12873705 13038875 12683255 11915795 11118152 10602344 10355495 10266790 10295254 10417379
7618 10417379 10603604 10553151 10094439 9226457 8112297 7083953 6278581 5593483 5193912
7609 5193912 4929339 4543680 4265457 4125568 3899933 3707124 3617734 3494404 3250514 3114699
7599 3114699 3083862 3101968 2985022 2814542 2840547 2749047 2689426 2503487 2397431 2376213 2283795
7588 2283795 2241775 2329933 2363124 2246258 2192802 2180143 2137907 2176438 2155191 2027299 1975124
7577 1975124 1831903 1778380 1620341 1515777 1513834 1487394 1353164 1427119 1412722 1355899 1232658
7566 1232658 1189572 1222973 1296079 1306536 1304935 1306738 1308053 1313525 1321824 1286798 1304696 1182104
7554 1182104 1224984 1146737 1062620 1080860 1093212 1031520 964907 925996 898273 915778 977164
7543 977164 1023409 873192 871178 836772 771191 781195 740378 675964 721639 643716 645453 693869
7531 693869 645755 659409 633418 660805 722055 697842 739921 718351 690991 650605 672674 647881
7519 647881 684682 679804 683205 655546 605559 548204 585842 596867 614868 702960 700824 567934
7507 567934 482300 460336 609809 607344 490890 567978 671193 577669 631967 683381 608739
7496 608739 599990 652023 614272 670239 734869 756420 798748 865206 918487 933564 896572 862336
7484 862336 820784 735908 753177 766954 737929 681289 641618 575694 524389 561898 666720
7473 666720 721795 657575 667739 749600 710580 776250 883274 789050 594647 682755 712100
7462 712100 632173 682251 620643 564420 593539 658339 749040 733098 662303 616295 578096 599701
7450 599701 669767 673392 700140 603761 514383 526154 499107 529933 428131 407265 434186 464953
7438 464953 418191 459312 567572 555617 562276 588133 554134 585443 547588 544142 574891 542257
7426 542257 576947 485241 441582 434786 411233 360629 346086 340254 267128 235756 241496 249605
7414 249605 236738 241676 337452 261043 166317 154414 172525 214869 219170 147282 207522 170703
7402 170703 103060 141133 165670 156289 194178 213304 236846 193390 182111 182680 165291 171816
7390 171816 187705 132185 155117 141132 153483 227210 215344 130557 221280 153662 84436 174977
7378 174977 255279 257903 159597 160453 124394 92422 10093 90091 137065 184821 129166 185788
7366 185788 207464 190473 233308 179247 189238 190028 168465 110582 202870 165576 141074 83948
7354 83948 112038 154235 142678 113429 107957 178115 170437 105344 112040 103999 138394 205865 140897
7341 140897 164101 161811 160586 133891 198939 174279 145137 173071 226966 210497 112803 181550
7329 181550 186051 131497 310947 305911 246727 219127 199357 153662 229227 244769 241465 259771
7317 259771 203606 215910 238802 264982 286919 182370 205102 156951 150032 130442 224739 243439
7305 243439 255186 243068 187141 192089 204651 206867 248619 363377 323556 312778 300466 268098
7293 268098 224911 223620 235089 185023 157875 254642 185370 162616 166134 228940 256344 257153
7281 257153 195852 177177 160449 241886 301031 301863 220961 206928 201816 153067 186897 123005
7269 123005 87637 130854 84282 180038 200207 108420 98416 136552 140994 135114 125625 128166
7257 128166 103300 70897 -17066 153452 191679 131296 115969 102942 185491 159975 200071
7246 200071 154433 173375 48035 18258 61303 124996 152871 219168 171494 251922 228152
7235 228152 68373 130644 221695 121446 75994 158936 196903 162690 59699 72321 86876
7224 86876 99886 69886 16610 57366 76781 67998 64252 94692 79556 48173 4572 98341
7212 98341 27041 10672 93221 8470 41013 30591 116550 17324 -38020 2019 13925 18169
7200 18169 27899 -32081 48760 84772 -15159 -12824 96080 110805 62397 47758 12109 54680
7188 54680 -10355 29836 14853 -4726 8934 5092 17949 -36754 -132783 -122575 -166544 -131175
7176 -131175 -54101 -20352 65885 -16184 -7654 -96871 -174285 -46568 58700 24111 61336
7165 61336 7678 -11851 -72737 -4881 34650 -37448 -61758 -3331 -54074 -36733 -21580 65095
7153 65095 61633 -12668 58522 4411 -35597 6685 44179 71922 48744 43270 115870 70237
7141 70237 -28845 14431 -13370 -57258 54381 27364 23851 71038 80213 68855 99924 855
7129 855 5138 30810 36373 -88949 -77568 -17463 5773 25650 45157 3927 23400 -62301
7117 -62301 -51 71674 68724 26210 -417 33280 44628 32611 26263 8577 -5337 -26821
7105 -26821 -94453 -24167 57506 42898 43982 314 -16291 15246 -6124 -17569 -57749 -3542
7093 -3542 34566 44483 20334 -62121 -73693 33673 54319 -1308 7550 -45767 3039 -36884
7081 -36884 -50715 -62981 43306 94299 25867 -58349 -30703 102653 72816 64291 73669 47405
7069 47405 -3036 9347 38920 50364 80363 26729 4712 70798 71712 41109 103399 205145
7057 205145 110010 -5946 28431 100579 61718 128364 174529 161094 40617 23492 11639
7046 11639 30154 50274 139408 189820 149354 137590 146624 154079 239146 168853 148744 212833
7034 212833 225796 271475 351548 270848 287702 310061 276865 272195 291099 324522 308607 230824
7022 230824 201420 175057 190892 188734 197094 179829 185617 213269 204767 214832 115887 174962
7010 174962 152117 176336 214548 192128 176231 126165 142226 112027 188419 107272 138053 193888
6998 193888 159890 115541 153499 223181 224816 175912 169907 209110 121774 109465 59842 76161
6986 76161 25729 121827 154574 190268 188657 204964 210564 187167 177364 109980 81890 -18232
6974 -18232 -32816 24313 114911 127060 89509 -4311 -42482 57780 50086 131823 171877 130530
6962 130530 42871 -2360 -15693 23694 173195 105357 70178 35912 28417 19188 -2913 10937
6950 10937 -28243 -3660 1543 86315 28096 44354 126983 108751 46813 19449 54143 93620
6938 93620 66723 104129 106252 187774 145808 105286 56211 173708 192878 219900 209268 139794
6926 139794 233284 288542 230089 184018 236472 286639 293350 200353 192261 225998 222070 160836
6914 160836 139224 192641 136544 194515 145265 109719 111092 119466 155232 62605 78504 74166
6902 74166 104472 95719 35161 25040 48320 12852 100363 139190 73148 -18382 22694 55187
6890 55187 17350 10326 54585 48890 49926 35436 12598 76847 141915 91397 113593 80793
6878 80793 -21250 78012 63891 -40417 -9244 39587 59627 8371 45043 70604 156951
6867 156951 199075 231627 228445 276566 206030 168317 160708 107749 141741 210409 225411 232951
6855 232951 305746 229777 280794 289792 189320 226245 281587 257778 260314 292537 250894 209108
6843 209108 216353 116100 95294 71566 51357 109902 131106 124570 86202 170584 178698 175151
6831 175151 131587 73634 76841 91349 17781 59147 48325 20676 94681 105463 45505 18777
6819 18777 73123 71980 107625 117340 114720 39037 22026 67823 72009 67425 26144 136043 89381
6806 89381 120249 105431 97795 89179 155961 90435 35254 66131 83925 81264 41234 99890
6794 99890 62970 133116 75290 53112 -23994 -66407 -78045 8591 -2145 127955 55945 21256
6782 21256 85491 -6349 -2055 78325 169627 125259 66582 106983 71593 76623 104950 4030
6770 4030 7143 143043 188303 158162 207039 155055 68169 74664 60417 100645 91081 62650
6758 62650 113471 105084 66334 60917 87180 134696 174927 151471 61178 61229 32334 75991 121605
6745 121605 57898 32062 12481 123070 108181 126569 148737 182262 203412 182547 123006
6734 123006 4418 40086 69860 61837 -17299 52288 18855 55496 107350 116923 141044 129561
6722 129561 121338 141412 111946 107472 141394 158067 132786 118654 64509 54500 181077 150027
6710 150027 167572 164807 120364 108549 66587 64562 125318 75942 109498 220639 203345 142793
6698 142793 112962 43313 -4455 5906 88183 120450 124950 150559 108778 15613 77042 112083
6686 112083 122002 218234 246719 184597 182902 175302 131549 70744 122801 104894 216078 256272
6674 256272 249453 329490 255746 249774 171736 252420 305516 268528 214235 315748 283195 220650
6662 220650 337590 368534 321764 398748 412233 441438 556316 584626 547569 463500 396152
6651 396152 500043 517853 438637 446356 361098 261372 310107 307277 336103 323574 260920 212086
6639 212086 162627 215369 274738 216673 168347 266326 196883 244104 243985 266153 239917 287354
6627 287354 279056 267886 222470 323975 314703 180799 203045 234373 172663 204170 214103 252871
6615 252871 276671 324436 326466 369658 383415 346788 386494 364439 408785 400396 354884 334063
6603 334063 474551 509683 444321 396870 336371 360730 274912 227672 123766 175378 249596
6592 249596 269567 260472 195566 202684 181919 141900 85008 184664 191996 179690 189505 225907
6580 225907 183753 177536 93255 198659 198532 222253 248498 305844 299343 221961 211101 233586
6568 233586 159961 164238 239547 147679 150646 97023 156776 246062 152306 147262 142132 193862
6556 193862 176163 255410 236691 172776 217333 186391 116305 165130 200927 109595 58259 57169
6544 57169 193441 168505 226624 193672 98039 158696 232354 171816 126419 161209 162656 84218
6532 84218 205491 228305 149318 224702 143710 187432 119688 127591 181906 237743 224036 166180
6520 166180 219801 218689 288827 329085 360272 448812 398624 301063 280625 246680 254070 234833
6508 234833 266485 273703 248346 201445 178220 158452 112678 131209 158989 198026 145328 191907
6496 191907 249411 251574 267130 197773 210678 257478 309736 232867 211813 229328 173425 273670
6484 273670 295641 366352 242127 159689 178548 185117 248169 238906 257895 283690 325417 255429
6472 255429 231986 216904 198386 202643 185273 208932 219446 195409 191342 218037 260753 206928
6460 206928 219895 180986 163880 174081 153839 147716 256961 221029 146542 234871 288717 247183
6448 247183 205529 236969 220843 199159 270038 214720 165815 109116 149546 170997 172410 178387
6436 178387 207899 143572 149772 141829 157469 137222 73790 124049 107617 107914 154189 149535 183943
6423 183943 138021 40794 160793 188034 167884 164015 222479 213198 222933 163376 69085 164819
6411 164819 204243 164530 137144 208467 274577 193833 223010 194381 177560 215359 298190 272248
6399 272248 308148 310311 301615 324815 305913 260520 223299 222378 234792 172219 138227 194363
6387 194363 298228 216235 201786 141419 127788 134125 87091 224870 181007 131040 106606
6376 106606 105167 103870 103288 140886 170254 180465 176271 242956 176754 164367 71604 37377 100420
6363 100420 114826 102243 63039 151062 151580 91895 97884 125114 230712 177752 146678 115889
6351 115889 100661 156545 56480 153322 183036 188953 149193 213599 134816 127043 114034 91932
6339 91932 104854 80352 120478 95082 175965 102174 149933 106577 132359 132206 56312 32417
6327 32417 48486 91611 -6916 1980 117574 201746 182265 104644 63590 76896 89316 93219
6315 93219 105958 115090 51310 131464 133104 209199 184435 113750 47565 59264 163234 287874
6303 287874 243006 202737 232592 128117 87511 138394 51086 98437 116253 146786 191764
6292 191764 235676 238529 164950 177566 171973 174257 158822 137971 115313 202808 250566 216116
6280 216116 172503 237333 232157 258620 222337 218750 258449 231106 187683 154085 163145 157685
6268 157685 158105 231004 243622 149667 171705 181930 193244 211701 192660 247518 220265 138902
6256 138902 112465 167832 173685 147310 286866 268559 243994 248588 256381 263297 121024 190294
6244 190294 246011 243451 210763 219370 178517 150535 230915 254948 258622 198733 279557 287971
6232 287971 129067 222458 241005 189166 179686 172031 80583 138967 165662 188170 206362 239673
6220 239673 221537 255003 243193 190488 174596 192514 242707 185258 273759 350997 367503 326331
6208 326331 285827 302366 317051 280842 305295 327075 340731 240699 216489 308263 231946
6197 231946 374602 438306 360685 297057 328387 260233 294847 363393 307232 334250 367706
6186 367706 378995 411147 430960 408512 448679 386086 457873 473009 428616 422433 382219 412293
6174 412293 423737 405360 410998 445188 498346 521578 544939 533237 527946 520362 484083 447379
6162 447379 506657 535703 568964 531503 569990 640354 661806 589579 703255 691926 661639
6151 661639 691981 753492 833386 875284 812501 748996 841190 826849 865736 995693 973163
6140 973163 1012332 1067088 1022309 1135571 1100536 1099579 1214864 1296398 1306752 1350014 1426839 1472836
6128 1472836 1477551 1469616 1650766 1689411 1646744 1680991 1770995 1821514 1898866 2014825 2225058
6117 2225058 2329585 2371624 2461532 2599152 2625807 2635548 2680555 2710291 2656347 2590025 2613772
6106 2613772 2514665 2452046 2426989 2279503 2113313 2115469 2089033 2093459 2024839 1907636 1797120
6095 1797120 1636313 1612723 1523381 1346009 1364314 1255904 1211628 1193300 1084861 1087881 1059259
6084 1059259 1048258 1058287 994885 949188 912013 901296 979309 954572 948725 990638 932240 911766
6072 911766 886942 836494 838685 842828 789224 848893 838983 882631 837959 829802 855006 897878
6060 897878 806332 689742 752608 768157 701153 678874 668037 733466 647831 630735 643242
6049 643242 631887 580791 521363 519207 500255 562687 421445 391864 461506 479817 470829 540375
6037 540375 569524 518340 481690 435682 398061 294339 395338 478776 420740 396305 415362
6026 415362 492524 438250 356444 426857 422796 381991 304984 329747 322846 192296 286958 319759
6014 319759 311115 336337 348069 365249 398653 333596 345740 347890 370870 438867 385879 374969
6002 374969 363924 369809 343397 342443 468468 456321 355472 393820 406343 450229 383406 321887
5990 321887 407934 395846 430211 369899 362316 319099 259003 292776 299893 372328 331478 236188
5978 236188 203638 225010 228842 310488 253915 186340 335684 322533 306267 350897 338244 271090
5966 271090 233776 255191 245331 190081 261774 281942 307981 304425 336591 272772 276100 283718
5954 283718 261114 325884 358673 279942 228330 219044 286486 330334 239402 201375 308674 283373
5942 283373 226808 279825 208498 115127 228178 347814 345655 277376 310233 395514 466408
5931 466408 325592 202656 306247 305965 194656 195660 209178 218029 306958 242307 231543 375100
5919 375100 366314 180202 273509 249908 247431 204785 248811 252285 242411 287502 288198 332277 426621
5906 426621 350221 365313 458933 404379 390896 453017 337836 337126 502702 475943 486665 504725
5894 504725 599100 491534 502221 551197 512915 502529 429566 534635 556575 480142 555241
5883 555241 546437 491834 423059 461512 525002 493304 544262 494924 465362 373888 367757 444152
5871 444152 396870 353035 366006 351839 392279 396567 391687 357293 289976 311258 353957 372179
5859 372179 432735 385672 354194 450180 453147 386508 518164 485530 443403 483049 539536 499356
5847 499356 400997 326333 325129 385073 406430 401166 381455 351938 373537 441418 434705 424335
5835 424335 325843 289822 288178 286235 304658 373040 399063 455044 399646 330549 301335 357942
5823 357942 397703 410328 296232 293956 357396 370553 293539 361467 363904 430731 423796 396540
5811 396540 402447 397649 438439 443657 400050 297444 342999 426743 428379 391114 366997 359929
5799 359929 388258 455924 421372 425677 419736 393671 437438 459137 478619 480788 402068 384896
5787 384896 377054 315184 368113 373063 397090 340664 343272 355568 311363 399695 454802 412755
5775 412755 389999 400496 452087 312217 333613 417322 399375 351390 328389 373875 444326
5764 444326 448597 453293 486210 464902 473094 437452 496514 543178 510899 546792 491340 521766
5752 521766 483762 571575 473792 429267 398217 408637 436376 546989 606735 534918 528437 568089
5740 568089 597796 545477 616832 568087 522769 543832 498841 511615 574925 567553 631185 600041
5728 600041 580252 590462 560645 498161 506909 535580 559700 610683 608232 600822 535541 546166
5716 546166 623292 567487 593249 603179 560237 513274 694734 590140 676290 736633 742675 611612
5704 611612 691052 710460 633260 727133 711102 713146 670788 721655 698639 768233 704367 732848
5692 732848 739424 781330 671305 776693 763757 728215 771739 872482 862586 763596 862722
5681 862722 866054 784994 768768 752666 706529 765915 732903 678622 791566 862140 931833 925343
5669 925343 823100 877873 921603 991935 973854 1050991 1182737 1192527 1147856 1163008 1178879
5658 1178879 1154142 1181224 1240911 1254513 1303752 1295328 1259039 1276877 1248537 1203512 1282763 1306002
5646 1306002 1275407 1309531 1346535 1396731 1386858 1442113 1422685 1519482 1580811 1540604 1557283 1554288
5634 1554288 1605422 1670847 1701232 1742692 1825633 1833257 1814874 1871440 1896244 1874350 1942545 2017911
5622 2017911 2107172 2161089 2145407 2228240 2373780 2450623 2647379 2683565 2840131 2999358 3266892
5611 3266892 3420361 3570481 3764341 3889292 4018511 3984759 3940906 3889533 3759597 3651605
5601 3651605 3539592 3436265 3490764 3439426 3351955 3456869 3426524 3417051 3491237 3495931 3778602
5590 3778602 3965956 4078000 4269060 4533830 4814240 5137917 5462978 5853551 6084781 6362575
5580 6362575 6557672 6513505 6270248 5875457 5568773 5149319 4841751 4608612 4418206 4310172
5570 4310172 4039884 3897085 3812307 3866968 3876122 3838465 3809224 3909687 3985095 4120611 4287164
5559 4287164 4418176 4509209 4712710 4862255 4989375 5240970 5363921 5470366 5451107 5370904
5549 5370904 5330986 5410839 5474021 5584824 5667862 5751055 5791098 5924680 5872611 5590778 5436889
5538 5436889 5215560 4869096 4742037 4496759 4324117 4280009 4094035 4034047 3967481 3992646
5528 3992646 4091339 4154267 4278321 4457482 4655186 4930247 5217212 5543997 5786001 6255734
5518 6255734 6748194 7206788 7664822 7915806 8147807 8212213 8128260 7922428 7616916 7229161
5508 7229161 6694981 6266431 5848155 5360360 5032827 4871898 4730939 4624572 4389248 4271346
5498 4271346 4324539 4279649 4370288 4441726 4542839 4622754 4703355 4916346 5201956 5402904 5628558
5487 5628558 5790786 6062520 6175420 6206649 6258137 6130451 5848724 5478674 5092260 4728061
5477 4728061 4524965 4445164 4291560 4239607 4106006 4021078 4102822 4122299 4080524 4172096 4325026
5466 4325026 4304408 4351994 4436534 4597586 4750425 4953733 5152073 5324949 5479659 5503608
5456 5503608 5456664 5305280 5158177 5046305 4943199 4863674 4765495 4777192 4784987 4812748 4805430
5445 4805430 4909119 4977305 4999003 5176240 5420900 5584901 5756132 5903965 6124399 6368929
5435 6368929 6652958 6957486 7208904 7557380 7800387 8017811 8287033 8507403 8589611 8736146
5425 8736146 8880919 8897326 8855018 8930631 9063865 9164561 9301092 9464812 9685502 9910707
5415 9910707 10160535 10539292 11026275 11616391 12281465 12979097 13934869 14949765 16072133
5406 16072133 17345128 18690740 19937292 20990235 21888168 22252125 22265211 21775167 20911506
5397 20911506 19969643 19093348 18200079 17402916 16806391 16397426 16162937 15857024 15883157 16134730
5387 16134730 16313648 16771826 17375996 18106535 19132151 20309322 21558197 23096586 24891606
5378 24891606 26756732 28596938 30463657 32196843 33522828 34401982 34670767 34194444 32926513
5369 32926513 31072715 28911845 26694869 24592038 22754280 21045908 19607626 18356427
5361 18356427 17292403 16429133 15685606 15186610 14864750 14683059 14706060 14785286 14951739 15286436
5351 15286436 15782617 16417458 17136812 17962657 18870591 19812115 20500764 20979340 21102932
5342 21102932 20690139 19735169 18431283 16913453 15349971 14008667 12858741 11862480 11035901
5333 11035901 10218451 9462030 8918622 8345503 7911055 7515087 7115219 6837337 6390115
5324 6390115 6136971 5872936 5576143 5345705 5151008 4957026 4763590 4691870 4568167 4398910
5314 4398910 4224262 4211171 4138297 4058336 4016534 4088486 4019091 4056191 3982965 3970765 3845522
5303 3845522 3833707 3825823 3747003 3631679 3470139 3352755 3256143 3138050 2886315 2851180 2753307
5292 2753307 2719293 2611149 2630317 2642425 2531334 2472787 2416638 2367206 2416261 2417681 2339902
5281 2339902 2318045 2388537 2391502 2393740 2346151 2306802 2241863 2158726 2163196 2182949 2168670 2081078
5269 2081078 1997670 1978577 1895929 1907388 1853350 1848025 1761145 1767121 1750231 1659433 1665258 1671714
5257 1671714 1806796 1706446 1712802 1551444 1487464 1553779 1628136 1581808 1539025 1572826 1491797
5246 1491797 1496242 1501878 1463836 1565818 1555175 1529551 1516999 1528350 1583846 1549547 1520008 1564643
5234 1564643 1544347 1436055 1403498 1319741 1429743 1440622 1406357 1334762 1446663 1405141 1473744
5223 1473744 1498122 1505172 1543836 1552651 1558903 1513238 1542106 1562438 1537732 1496273 1447608 1441657
5211 1441657 1500530 1377265 1397630 1366769 1409737 1367350 1337426 1407031 1446264 1504988 1411933
5200 1411933 1379733 1502419 1507318 1452574 1471936 1459881 1521936 1663836 1632662 1651203 1657268
5189 1657268 1545442 1472427 1478029 1489273 1532218 1556974 1498711 1471341 1518552 1556993 1481854
5178 1481854 1389531 1388776 1458757 1499436 1528877 1476649 1505547 1539112 1569029 1545951 1515833 1496742
5166 1496742 1475174 1495678 1538174 1584404 1662941 1684093 1641010 1578264 1663634 1655619 1660482 1711675
5154 1711675 1626625 1606273 1635068 1721333 1687467 1683674 1710227 1696260 1662645 1613171 1656618 1598680
5142 1598680 1590603 1622100 1664068 1764469 1786249 1823122 1767186 1794951 1808024 1772412 1815037
5131 1815037 1838764 1780972 1762609 1833464 1784012 1838849 1912926 1921961 1973514 2017398 2053052 2032339
5119 2032339 2078950 1994893 2037320 2108982 2178777 2204803 2167652 2233183 2178575 2180222 2323282
5108 2323282 2341845 2308512 2374848 2412571 2454760 2484428 2454773 2526032 2613055 2658285 2666323 2722392
5096 2722392 2721241 2745583 2789434 2828010 2808473 2799619 2879373 2926885 2928360 2952066 2962627 2942007
5084 2942007 2943092 2986008 3005940 3147253 3138752 3107475 3199697 3199434 3225313 3348607 3475581 3576903
5072 3576903 3645941 3719791 3823538 3893706 3984270 4192914 4291446 4428997 4473163 4519983 4728024
5061 4728024 4834909 4878134 5003214 5179930 5378845 5544617 5693716 5980004 6086305 6247548
5051 6247548 6467250 6646090 6750129 7067683 7212309 7435091 7719872 7948458 8084844 8230899
5041 8230899 8500787 8826380 9063934 9362114 9699579 9920002 10184726 10610982 11026268 11414129
5031 11414129 11998705 12515061 13155983 13986280 14641819 15475562 16372046 17255644 18477628
5022 18477628 19770002 21224932 22854482 24822950 27010198 29559924 32288637 35347395
5014 35347395 38744995 42453097 46444077 50637338 54707326 58629825 62344134 65421205
5006 65421205 67910986 69412487 69718540 68829510 66783519 64007545 60819187 57575789
4998 57575789 54252203 50732077 47099470 43593519 40430390 37573325 35075615 32938104
4990 32938104 31075786 29316821 27737920 26286889 24837017 23448182 22120796 20694822
4982 20694822 19384134 18176099 16996931 15868130 14858643 13870056 13003881 12189593 11505024
4973 11505024 10917288 10304981 9688379 9323746 8952194 8584355 8334662 8074013 7795266
4964 7795266 7477848 7318791 7106743 6859831 6727508 6544479 6371677 6174015 6097240 5952475
4954 5952475 5855073 5673558 5490263 5472161 5313989 5145304 4991155 4859853 4690471 4623125
4944 4623125 4577321 4391236 4250869 4182667 4130495 3998544 3971622 4006347 4014127 3925433 3787162
4933 3787162 3800504 3727021 3574445 3560363 3499144 3530474 3553967 3524651 3464800 3451354 3503479
4922 3503479 3512518 3522699 3523664 3645726 3718561 3702864 3671814 3701117 3680848 3638467 3438252 3226774
4910 3226774 3119130 3131391 3025200 2879156 2813181 2719604 2618360 2452209 2452332 2471751 2385011
4899 2385011 2311101 2231903 2191503 2223604 2219975 2219869 2212488 2123929 2132364 2074333 2102521 2090043
4887 2090043 2090668 2016187 2098324 2007520 1939525 1911936 1936309 1906075 1885609 1881128 1915718 1936403
4875 1936403 1958972 1976289 1901692 1882095 1896789 1808702 1820779 1818583 1771022 1805950 1726074 1670509
4863 1670509 1609423 1568153 1617913 1558691 1515870 1537247 1525285 1516281 1454873 1487475 1602123
4852 1602123 1539288 1440055 1529622 1521449 1493547 1501206 1516460 1487675 1451484 1482125 1549696 1547669
4840 1547669 1562884 1585390 1580088 1657212 1498238 1523150 1637534 1628599 1600388 1534917 1662247
4829 1662247 1704608 1717494 1765080 1796269 1936674 2067907 2151094 2287083 2351274 2512413 2516779
4818 2516779 2550352 2661749 2909655 3143280 3209838 2967042 2658460 2465651 2224234 2124296
4808 2124296 2070704 1981764 1955705 1845699 1837125 1751380 1798043 1712560 1801758 1792098 1730277 1742139
4796 1742139 1685594 1641681 1579212 1603061 1668051 1626514 1585339 1632177 1639916 1639447 1720544 1669064
4784 1669064 1661593 1632455 1642119 1717667 1567747 1673520 1799869 1821436 1864941 1783292 1824639
4773 1824639 1915760 1998283 2011457 1919779 1900104 1918322 1847923 1749320 1760407 1668352 1533013
4762 1533013 1558931 1616668 1558635 1546289 1390105 1335635 1369292 1371028 1411938 1432981 1460135
4751 1460135 1505477 1567132 1602005 1605105 1646298 1601533 1597995 1630865 1646586 1561548 1520791 1589226
4739 1589226 1551580 1536367 1572345 1559092 1543156 1586646 1603910 1598327 1671888 1714668 1717802 1641894
4727 1641894 1563142 1618936 1507284 1530996 1517126 1543663 1495212 1494558 1595442 1505561 1638279
4716 1638279 1602799 1508977 1482131 1423031 1410479 1400307 1360433 1385630 1410195 1459018 1390146
4705 1390146 1366264 1358228 1441053 1424538 1428190 1395601 1359688 1455531 1407360 1396119 1396632 1368218
4693 1368218 1387472 1330499 1458029 1434608 1462013 1454128 1450404 1459978 1434520 1481328 1469837 1538417
4681 1538417 1595345 1526258 1564944 1608823 1619133 1613439 1618492 1661913 1641201 1622529 1686018 1760358
4669 1760358 1816466 1759371 1755835 1788099 1816949 1791966 1830020 1900685 1927135 1828442 1741629 1799207
4657 1799207 1783868 1715720 1703560 1724911 1664042 1760921 1718971 1705270 1659229 1629962 1666447
4646 1666447 1666844 1663471 1664128 1693719 1674932 1778964 1784986 1718924 1789249 1774406 1830252 1735176
4634 1735176 1772502 1776801 1803375 1891170 1892132 1954582 1884635 1805916 1716690 1619128 1785854 1809346
4622 1809346 1746087 1784498 1848950 1803174 1893280 1827812 1828200 1841073 1863172 1851058 1798119 1727458
4610 1727458 1798458 1882674 1788634 1806221 1823121 1816153 1855863 1935443 1908461 1862044 1867203 1910489
4598 1910489 1878502 1893997 1899176 1889558 1917948 1993838 1908446 1976003 1953152 1946636 1954122 2016373
4586 2016373 2100477 2088688 2171301 2173510 2094820 2124030 2202834 2264303 2322413 2405938 2455739 2415350
4574 2415350 2407242 2384900 2337976 2202438 2193589 2223274 2236447 2188712 2244305 2197241 2178410 2217423
4562 2217423 2254793 2223028 2326529 2341082 2391472 2369234 2320180 2318435 2234480 2325816 2374484
4551 2374484 2348533 2280733 2364143 2339042 2256694 2212113 2216123 2275908 2248422 2228279 2241322 2312170
4539 2312170 2392380 2335203 2294805 2337596 2334242 2338728 2424095 2367871 2380069 2427129 2517054 2547830
4527 2547830 2575041 2627415 2617993 2631578 2717067 2740445 2810189 2781222 2799824 2923169 2871079
4516 2871079 2907654 2882975 3021195 3145313 3121691 3134354 3128156 3179259 3239983 3265141 3223594
4505 3223594 3323567 3397834 3447732 3594306 3639660 3636786 3776122 3858836 4017033 4039801 4211723
4494 4211723 4412415 4553144 4668220 4847659 5043266 5205420 5372565 5512817 5690237 5830649
4484 5830649 5984246 6036109 6123439 6132106 6164531 6313702 6312213 6447424 6558596 6639876 6769119
4473 6769119 6921423 7015403 7101068 7228352 7229648 7299025 7352306 7419974 7546544 7707234 7942039
4462 7942039 8085483 8249379 8499241 8772275 8955562 9132768 9385295 9534451 9732601 9951291
4452 9951291 10160046 10416602 10682889 10695594 10923242 11074540 11280297 11537286 11727836 12064099
4442 12064099 12431795 12630181 12893535 13192893 13437282 13781121 14046659 14359472 14727509
4433 14727509 15093518 15459084 15836758 16269646 16717620 17172675 17603931 18050610 18647035
4424 18647035 19164883 19754941 20493400 21044676 21648293 22327058 22900608 23588914 24196257
4415 24196257 24718090 25294399 25900530 26596829 27356933 28184152 29098327 30165704 31361128
4406 31361128 32569390 33976221 35502321 37021860 38782789 40676591 42585370 44607307
4398 44607307 46614150 48669702 50844684 53099618 55442495 57830039 60274241 62683230
4390 62683230 65138385 67682223 70274945 73080953 76049902 79195866 82511214 85761722
4382 85761722 88947955 91855699 94372094 96355049 97432940 97827155 97356106 96042614
4374 96042614 93838257 90807767 87049963 82863563 78747823 74820803 71469143 68594618
4366 68594618 66150684 63938348 61821305 59549165 56968451 53868559 50398415 46744840
4358 46744840 43171753 40025410 37260320 34946647 33144123 31525332 30101847 28791368
4350 28791368 27519230 26265046 25195347 24388809 23538076 22768940 22101602 21528193 20844317
4341 20844317 20255170 19629907 18992958 18318186 17725467 17213624 16675132 16236510 15741682
4332 15741682 15374180 14992334 14554138 14110335 13681413 13304647 12912226 12560317 12144027
4323 12144027 11706971 11404389 11094711 10718485 10357299 10098543 9804398 9550570 9192945
4314 9192945 8922347 8698268 8530934 8306030 8021838 7908859 7880042 7783838 7499885 7323767
4304 7323767 7284078 7180147 7006151 6934980 6863556 6760396 6646426 6522068 6475793 6404095
4294 6404095 6337166 6252693 6257303 6138683 5966850 5894731 5923763 5955108 5827705 5877771 5875981
4283 5875981 5727754 5706141 5808573 5853671 5886426 5908455 5840364 5807788 5839232 5748055 5826473
4272 5826473 5858940 5820959 5881380 5900948 5801628 5894734 6027956 5912814 5830553 5925432 6075928
4261 6075928 6077855 6139479 6248521 6235013 6362550 6486166 6525995 6704980 6768017 6843557 6927710
4250 6927710 7057257 7205909 7244757 7363633 7512009 7855698 8041543 8256731 8474093 8654640
4240 8654640 8869737 9088189 9212975 9476471 9539184 9510092 9535628 9621886 9584774 9721681
4230 9721681 9842059 10010425 10264399 10448490 10759057 10987711 11370604 11786354 12117006 12432896
4220 12432896 12863059 13341820 13718704 13979521 14361891 14779971 15280444 15710915 16134002
4211 16134002 16701885 17127542 17470407 17803283 17977446 18294023 18382966 18540239 18860991 19199753
4201 19199753 19703367 20362404 21210547 22166699 23280948 24613928 26148971 27818116 29427652
4192 29427652 31047109 32654928 34050573 35044729 35596641 35567139 35256490 34676634 34071908
4183 34071908 33464547 33147862 32931747 32789136 32637028 32473654 32458900 32488864 32628187 33078086
4173 33078086 33905088 34795313 35983538 37530517 39372648 41565642 43919136 46570293
4165 46570293 49507677 52547513 55624991 58340462 60558962 62077410 62423784 61608410
4157 61608410 60277725 58864563 57707899 57181534 57196121 57631065 58397953 59436871 60891248
4148 60891248 62857411 65477661 68928016 73312162 78577552 85092279 92875541 102002546
4140 102002546 112831055 124936472 137177387 148909175 159501486 167804243 169663269
4133 169663269 162508278 149381841 134325204 120140051 108215724 98792218 91207730
4126 91207730 84996696 79458755 73871139 68232027 62999027 58103768 53655228 49705223
4118 49705223 46274404 43257162 40622781 38249065 36245583 34560534 33067228 31839149
4110 31839149 30929589 30175617 29471252 28991684 28523777 28308521 28043889 27773061 27484378
4101 27484378 27143207 26820699 26351386 25901492 25463277 25108459 24976503 24890952 24871538 24924377
4091 24924377 24939483 24885774 24621841 24392806 24158122 24001495 24179380 24519486 24990013 25502279
4081 25502279 26257806 26943721 27634046 28123467 28308103 28028041 27372943 26576720 25912868
4072 25912868 25324399 24595660 23884157 23234032 22712197 22198227 21778020 21381564 21154540
4063 21154540 21054216 21062745 21197880 21366353 21705128 22101859 22599686 23043978 23388729 23705303
4053 23705303 24025769 24148945 23921526 23335328 22445752 21672835 20967027 20444590 20018204
4044 20018204 19724851 19482656 19296246 19161189 18607467 18081680 17523960 16710216 15915707
4035 15915707 15267631 14810084 14331683 13940141 13637627 13393955 13141830 13001160 12758864
4026 12758864 12550803 12482808 12268282 12164678 12023349 11998000 12010472 12125429 12146985 12252731
4016 12252731 12352143 12456472 12515946 12564671 12501755 12257210 11985519 11621523 11323575 10882935
4006 10882935 10602258 10381615 10172403 10069962 9890046 9766223 9744685 9715631 9691946 9604519
3996 9604519 9605228 9729066 9864257 9963196 10040446 10032139 10166962 10326392 10488649 10708928 10944552
3985 10944552 11040104 11240228 11517091 11980093 12433789 12895481 13456765 14136380 14976960 15965243
3975 15965243 17076298 18402992 19871423 21472232 23166279 25123091 27182482 29175595
3967 29175595 31028386 32527357 33943111 34844935 34210394 32067060 29389901 26725112
3959 26725112 24513345 22927242 21790551 21001093 20403187 19752581 19168790 18629932 18203402
3950 18203402 17660628 17119806 16735218 16347000 15890913 15570259 15106368 14824321 14534741
3941 14534741 14175377 13920679 13579827 13431856 13275737 13004363 12866500 12830829 12795091 12727973
3931 12727973 12733860 12779293 12792784 12856406 12931050 13051857 13174014 13366690 13355652 13459591 13734782
3920 13734782 13996902 14079298 14249395 14502958 14726102 15034262 15443717 15877068 16374702 16842586
3910 16842586 17498075 18250380 19083153 20044128 21164346 22497362 23817447 25195904 26749775
3901 26749775 28247622 29615140 30532633 30878317 30879663 30736305 30624485 30830605 31395622
3892 31395622 32013458 32722809 33769675 35176128 36864436 38948353 41537709 44660026
3884 44660026 48281584 52507203 57554592 64060936 71705539 80189725 88634673 96430367
3876 96430367 103864280 108726476 105830302 96357845 85037080 74630915 66620002 61156491
3868 61156491 57722090 55542424 54179978 53271781 52451553 51380825 49355631 46565593
3860 46565593 43675401 41150686 39050993 37381895 35999811 34602982 33339213 32372403
3852 32372403 31623985 30995835 30335613 29673849 29124971 28496285 28005421 27720805 27468425
3843 27468425 27298721 27308758 27381917 27495232 27497345 27063719 26313120 25437024 24566393 23940942
3833 23940942 23365375 23047751 22948632 22894840 23153539 23471337 23946624 24548208 25274499 26020409
3823 26020409 26896843 27873532 28618213 29236652 29534363 29402201 28973604 28497370 28099487
3814 28099487 28029664 28178235 28379901 28586249 28813638 29221981 29636717 29956702 30490892 31044095
3804 31044095 31757194 32453933 33343718 34275339 35316587 36190816 37136616 38032040 38906977
3795 38906977 39566093 40216240 40935948 41650195 42425593 43166382 43965013 44872932 45564381
3786 45564381 46031837 46394949 46521288 46510685 46456670 46633325 46824627 47168978 47578477 48118338
3776 48118338 48652293 49055655 49133323 48873195 48209374 47509326 46766393 45849935 45138416 44584884
3766 44584884 44031992 43598396 43111824 42462170 41489360 40185535 38565758 36821772 34995970
3757 34995970 33309909 31716165 30300859 29110962 28057621 27182823 26389950 25602988 24785104
3748 24785104 23972121 23030506 21941193 20939906 19945440 18977368 18023746 17249359 16735712
3739 16735712 16168526 15676894 15302973 14868254 14361352 13877697 13399953 12887025 12397472
3730 12397472 11960571 11624418 11289902 11006767 10710574 10589459 10438213 10188140 9975009
3721 9975009 9722657 9502327 9186798 8946524 8688713 8390271 8177557 8114629 7958309 7871187
3711 7871187 7747255 7644508 7480913 7264889 7094645 6986177 6818369 6663999 6599768 6588975
3701 6588975 6398081 6277397 6206415 6199522 6214859 6173546 6099619 6041596 5998051 5906871 5814736
3690 5814736 5771559 5817516 5777062 5690447 5582323 5505211 5494548 5492478 5465587 5511639 5500225
3679 5500225 5440050 5410940 5494790 5551809 5448695 5355352 5420163 5367685 5371372 5458763 5473218
3668 5473218 5433352 5478250 5483140 5485159 5496003 5509778 5484520 5413728 5527317 5589358 5598978 5517023
3656 5517023 5468117 5498013 5552579 5587405 5596498 5594309 5570229 5551876 5638100 5702318 5683123 5740782
3644 5740782 5842564 5922137 5994738 6015833 6070112 6240788 6336878 6389761 6468228 6553212 6555840
3633 6555840 6668122 6774479 6869043 6883132 7040144 7122884 7249131 7398925 7483118 7553956
3623 7553956 7788719 7875868 8051353 8234165 8386517 8517857 8746065 8959438 9118994 9307484
3613 9307484 9574399 9853656 10100250 10393542 10731710 11130752 11701875 12249047 12653927 13170817
3603 13170817 13623352 13950606 14178472 14412798 14522078 14510792 14443088 14396334 14452863 14456903
3593 14456903 14604160 14891053 15108749 15597762 16091646 16457456 17103640 17790965 18315649
3584 18315649 18948796 19583773 20464503 21244905 22041779 23017075 24086799 25035004 26024930
3575 26024930 26972869 27735859 28302638 28634370 28483141 28173334 27611721 26854320 26026058
3566 26026058 25362747 24799286 24370197 24017825 23931510 24020206 24136189 24400009 24847682 25413462
3556 25413462 26170523 27124605 28096637 29226806 30569421 32051270 33777118 35585881 37443601
3547 37443601 39326529 41162899 42695068 43979841 44722247 44915081 44559342 43720110 42595908
3538 42595908 41366387 40101858 38875740 37646964 36540556 35629432 34883092 34295296 33975086
3529 33975086 33858079 33755785 33638828 33465478 33274666 33052309 32965583 32707062 32523459 32168218
3519 32168218 31873930 31639797 31254927 30802662 30153353 29328578 28188320 26755694 25314907
3510 25314907 23815338 22496352 21126425 20035938 19110468 18303532 17470779 16885628 16395131
3501 16395131 15966128 15552087 15300656 15132105 14927015 14866755 14727537 14584845 14635478 14723355
3491 14723355 14681716 14544756 14588138 14649259 14533728 14313868 14110128 13757816 13332465 12905615
3481 12905615 12507028 12110214 11839974 11514819 11311097 11126363 10902225 10766156 10666104
3472 10666104 10685759 10609939 10559331 10430671 10319300 10303693 10281527 10158670 10185996 10177560 10042390
3461 10042390 9963577 9962310 9859181 9794260 9696817 9693825 9686940 9664791 9681108 9643200 9643027 9555555
3449 9555555 9554747 9607320 9606280 9621125 9558335 9486359 9581533 9687884 9730825 9782872 9930709 10025244
3437 10025244 10115800 10234233 10423053 10576192 10808574 11069274 11186887 11391981 11535619 11772713
3427 11772713 12023727 12116705 12143477 12206398 12232073 12238234 12243624 12205365 12206871 12270490 12285180 12312144
3415 12312144 12312210 12341952 12405150 12554677 12747979 12864035 12934323 13154021 13418048 13667359 13906247
3404 13906247 14181963 14418989 14617344 14960052 15255201 15723309 16243086 16673901 17217157
3395 17217157 17756024 18370255 19078092 19858526 20730416 21688365 22756258 23991335 25440484
3386 25440484 27135976 28936095 30957507 33024424 35214442 37460849 39517468 41367818
3378 41367818 43061038 44458623 45554433 46241450 46389028 46182538 45591076 44554282 43226928
3369 43226928 41745911 40098264 38498111 36787829 35023048 33320140 31754046 30409542
3361 30409542 29079760 27910072 26772241 25886134 25026229 24281324 23483151 22898595 22300983
3352 22300983 21652253 21072217 20446708 19963733 19487121 18985586 18544110 18329902 17947318
3343 17947318 17578784 17319391 17083034 16854559 16680098 16549339 16372499 16212681 16066678
3334 16066678 16065537 16052571 15952440 16006809 16085260 16034234 16022201 16073509 16134091 16248880 16383299
3323 16383299 16444297 16548091 16676424 16726785 16841646 16927672 17001127 16932135 16985424 17105863
3313 17105863 17142300 17188280 17265455 17334697 17350445 17533014 17628407 17722507 17963981 18112566 18283610
3302 18283610 18454020 18656830 18762996 19012410 19334113 19543848 19806867 20073056 20243876
3293 20243876 20508339 20696860 20962164 21180967 21386292 21421391 21400880 21305904 21385050 21458857
3283 21458857 21592478 21725650 21987858 22324610 22663032 23000952 23479661 23914142 24463586
3274 24463586 25076482 25673894 26359471 27179368 28024115 28773579 29773257 30891607 32052194
3265 32052194 33157760 34327995 35305259 36054882 36714308 37079091 37356405 37565238 37563021
3256 37563021 37546075 37524143 37569405 37519640 37646122 37813094 38159742 38289336 38381767 38360846
3246 38360846 38216989 38086186 37890909 37766480 37666078 37694806 37760493 37996033 38281426 38645825
3236 38645825 39269687 40040883 40804258 41818380 42676669 43509041 44452064 45448871 46492559
3227 46492559 47541873 48752815 50057663 51628198 53568747 55912084 58601479 61698522
3219 61698522 65167055 69060341 73321060 77989849 82991610 88390083 94085779 99838734
3211 99838734 105633280 111217131 116355825 121103909 125147472 128219428 130200772 131275768
3203 131275768 131256314 130515622 129131064 127427753 125484021 123569827 121575686 119647358
3195 119647358 117556319 115252406 112678087 109714424 106413220 102623705 98266234 93641755
3187 93641755 88757244 83856373 79095194 74686717 70666592 67150827 64091657 61407718
3179 61407718 59125595 57363815 55874598 54546358 53673122 52963380 52538779 52268696 52142359
3170 52142359 52152484 52298089 52407871 52656712 52865002 53138530 53469764 53788304 53947687 54138029
3160 54138029 54389039 54535928 54723738 54833409 55002567 55257304 55407310 55574988 55891361
3151 55891361 56209884 56590555 57192868 57655244 58181837 58666648 59105698 59395235 59715747
3142 59715747 60008139 60422532 60858451 61221131 61686284 62265437 62869375 63695806 64475503
3133 64475503 65393437 66360142 67455753 68669867 69996076 71445561 73005602 74874585
3125 74874585 76864133 79042967 81537775 84293975 87257149 90386597 93721606 97281932
3117 97281932 100824987 104454268 108218787 111889581 115709400 119782397 124033993 128457999
3109 128457999 133082837 138206020 143627572 149390740 155748384 162581797 169887005 177892024
3101 177892024 186761565 196437556 206749621 217640241 228763861 239596642 249660886
3094 249660886 258296276 265043759 269803525 272635794 273654317 273087808 271632665 270026978
3086 270026978 268863956 268164821 268038731 268108145 267758537 266394502 263511339 258694398 252066424
3077 252066424 243773984 233780513 222509168 210620308 198846599 187532583 177000258
3070 177000258 167231650 158219604 150231441 143419583 137653215 132768903 128739108 125372311
3062 125372311 122614328 120347528 118038477 115165398 112236627 109897549 108233950 107343262
3054 107343262 107112397 107617399 108657777 110358648 112780939 115787485 119508722 123679471
3046 123679471 128205290 132988554 137867994 142602830 147218497 151845051 156460402 160900160
3038 160900160 164767578 168084031 170809660 173132351 175017509 176570616 177867476 178910048
3030 178910048 179723809 180221513 180195173 179747237 178849470 177301530 175392510 173102257 170497182
3021 170497182 167436057 164047804 160128510 155773889 150935887 145658804 140271709 134777393
3013 134777393 128995743 123163592 117318981 111687755 106251144 101137454 96502353 92313480
3005 92313480 88632706 85415255 82774111 80331516 78243406 76513503 74794521 73442527
2997 73442527 72316242 71319042 70413608 69491827 68635300 67623627 66713823 66026039 65638671
2988 65638671 65414882 65367435 65412666 65410309 65637705 65991966 66463907 66900585 67314188 67704315
2978 67704315 68078435 68277226 68410222 68429141 68211812 67825388 67412123 66923134 66416246 65861353
2968 65861353 65453296 65156021 65055476 65048302 65223732 65641157 66217532 67118997 68388179 69862276
2958 69862276 71546918 73668779 76263486 79091896 82167664 85396161 88646759 92146207
2950 92146207 95524240 98954648 102339602 105334175 108166805 110876576 113044233 114963550
2942 114963550 116381371 117565445 118697821 119570782 120085022 120063521 119289487 117865694 115920905
2933 115920905 113423832 110075838 105951419 101169185 95864168 90073054 84219196 78324384
2925 78324384 72649169 67275558 62487036 58077367 54163349 50684463 47503441 44650541
2917 44650541 42249535 40081930 38161041 36490036 34935076 33638871 32368153 31196444
2909 31196444 30029664 29106126 28205575 27437203 26600076 25995276 25449080 24911835 24508273
2900 24508273 23985073 23582433 23246258 22966407 22630933 22436449 22252374 22044291 21893416
2891 21893416 21746960 21615980 21489836 21557366 21605931 21598373 21579218 21573831 21500212 21380820 21130574
2880 21130574 20863365 20466430 20046033 19533712 19122840 18645835 18208043 17784575 17279120
2871 17279120 16878647 16501516 16223125 16043061 15863178 15564393 15268368 15026660 14853586
2862 14853586 14807238 14576077 14359592 14228163 14072100 14086931 14053712 13957120 13956978 13942078 13903559
2851 13903559 13870147 13813102 13906682 14028948 14127211 14192278 14278845 14510849 14648615 14735677 15028103
2840 15028103 15234371 15451616 15743679 16053342 16405330 16816274 17137255 17560358 18020095
2831 18020095 18479148 19056379 19678333 20387750 21212797 21955643 22697851 23250421 23758934
2822 23758934 23774088 23339594 22710819 22065101 21647909 21287686 21137975 21091073 21172339 21327445
2812 21327445 21622686 22001839 22402033 22693082 23146377 23655020 24265971 24796682 25503094
2803 25503094 26300643 27182835 28256963 29453362 30979135 32552997 34361022 36290002
2795 36290002 38027664 39523636 40382487 40517134 39962998 39333424 38684885 38431153 38476182
2786 38476182 38647716 38972947 39516004 40122743 40718478 41465941 42400067 43522993 44660815
2777 44660815 45919783 47339038 48886940 50458131 52087970 53803128 55753808 57890811
2769 57890811 60037501 62252794 64589286 67112191 69571222 71834745 73995528 76110886
2761 76110886 78023228 80016086 82210430 84678935 87617611 90867776 94529723 98390800
2753 98390800 102687379 107628048 113200656 119556690 126867657 135297447 145012194 156077048
2745 156077048 168926248 183636965 200872671 220662894 243380577 269139023 297403784
2738 297403784 327679708 358934247 388779860 416517504 443758579 468800197 488849259
2731 488849259 505446653 519522129 521901224 506999340 482702932 457609964 436313925
2724 436313925 419125687 400586890 374231087 340204719 303598063 268576587 237626261
2717 237626261 211756496 190783660 173778114 159784705 148193122 138309170 130283955
2710 130283955 123712260 118425523 114386184 111440495 109132279 107162860 105259417 102994537
2702 102994537 99947791 95553634 89841199 83659311 77586246 72156452 67440115 63290585
2694 63290585 59839960 56763800 53919941 51287559 48962056 46912179 44989143 43280733
2686 43280733 41677450 40292264 39047394 37929592 36922057 35842115 34923669 33929952
2678 33929952 32968016 32004980 30873527 29944936 29088000 28214334 27436189 26648718 25895007
2669 25895007 25104141 24486804 23887853 23313336 22756252 22138440 21569124 21052274 20492808
2660 20492808 19938179 19377981 18882586 18376667 17895838 17456161 16974910 16429302 16035052
2651 16035052 15593728 15015777 14609500 14188839 13847901 13569575 13189793 12789726 12403323
2642 12403323 12056850 11734954 11426635 11200034 11119760 10811933 10615622 10370940 10051552 9888976
2632 9888976 9786675 9532114 9446174 9269434 9083500 8930859 8789490 8611245 8442093 8306641
2622 8306641 8137344 8010014 7833221 7680604 7662207 7525582 7343387 7349785 7217050 7076655
2612 7076655 6990701 7001597 6947081 6944300 6869268 6804480 6733665 6534288 6487661 6476962 6394055
2601 6394055 6287120 6118760 6113390 6001323 5913182 5650092 5624981 5509818 5347663 5400562
2591 5400562 5262718 5204704 5091308 5038069 4921476 4845286 4816890 4868654 4779549 4658543 4517527
2580 4517527 4561637 4600063 4517819 4383870 4330671 4327002 4255504 4239675 4129453 4124031 4032146
2569 4032146 3985765 3926464 3795696 3784097 3753542 3654809 3591468 3521974 3525614 3438301 3403300
2558 3403300 3309183 3271987 3220349 3155851 3089324 3028225 2926649 2810265 2785653 2823225 2852223
2547 2852223 2782862 2710492 2686546 2628524 2563661 2558988 2539906 2586705 2493705 2480984 2516265 2436506
2535 2436506 2428594 2466541 2534349 2549914 2519795 2518855 2656664 2708146 2678942 2644819 2679628 2720025
2523 2720025 2704776 2712282 2648647 2666122 2651505 2600651 2540161 2505796 2507098 2528992 2492387 2533753
2511 2533753 2555109 2609696 2660506 2631322 2629098 2636563 2585719 2566160 2564353 2589345 2562343 2501488
2499 2501488 2519768 2509017 2609664 2633805 2670871 2746094 2793619 2764887 2712190 2771925 2861483
2488 2861483 2943665 3137452 3234913 3247883 3400303 3614113 3675407 3880027 3957966 3978423 4052662
2477 4052662 4145709 4288179 4293459 4382873 4335737 4189904 4162314 3963447 3803675 3676930 3480456
2466 3480456 3334827 3169665 2955249 2786076 2682085 2547883 2443819 2342475 2291301 2177957
2456 2177957 2154560 2084248 2046638 2022914 2015669 1976016 1920066 1879266 1886425 1784939 1808328 1836353
2444 1836353 1799367 1743401 1663133 1629336 1623024 1619688 1454251 1398564 1325334 1351172 1349319 1392188
2432 1392188 1309232 1305784 1303818 1240117 1237656 1357338 1316377 1228104 1225275 1175508 1312927 1286838
2420 1286838 1169647 1137208 1088108 1085494 1006398 1009040 1092966 1029234 998864 972681 993690 917408
2408 917408 940340 951708 962620 952642 924250 855187 911629 841213 828146 794970 842143 792611
2396 792611 849284 888545 826826 758224 741478 810362 835681 749266 798669 747811 724790 759195
2384 759195 698964 723669 714115 828784 738914 693729 690419 682461 669036 727244 801890 775031
2372 775031 639706 791621 853110 716446 691694 726669 716729 737333 712342 728415 757789
2361 757789 744091 750197 734500 724685 724422 654741 647269 624902 638562 620932 598875 599543 575294
2348 575294 578739 550544 593095 665662 592628 574650 520032 458975 484963 542491 517415 500091
2336 500091 572142 530850 595743 618440 562019 573177 519061 460916 510068 580730 636925 609716
2324 609716 559925 554030 538885 512756 448967 578111 582435 568619 557032 542359 561812 585244
2312 585244 516915 574434 567070 540379 579528 521493 371148 358615 382458 447160 575930
2301 575930 524974 623619 601512 591012 630534 587503 561534 521973 474236 557638 546924 472412
2289 472412 532871 546643 520225 532782 533345 449715 538161 527048 489401 549105 490392 403638
2277 403638 342294 388505 349354 379623 406583 426632 345964 307923 313304 304557 331089 347104
2265 347104 415967 324458 197236 272442 283687 305350 284659 234870 216674 281569 276752 287112
2253 287112 341778 333137 356612 418037 306924 324761 376209 355529 255434 350927 402797
2242 402797 465771 449114 388998 356464 281097 270234 317200 372989 367349 406591 389615 320345
2230 320345 347297 336504 313038 392230 371530 391908 379756 393458 427397 335176 280485 205433
2218 205433 269413 301929 254888 332914 309682 327145 345577 307294 257713 417348 320379
2207 320379 300099 263204 259237 309913 250373 287207 353056 350638 382732 363153 375307 349372
2195 349372 317217 350789 390574 410301 412605 348069 345904 325979 356638 384112 340681 317344
2183 317344 311402 296246 325161 357572 350059 344113 360246 352437 283426 252897 290670 333250
2171 333250 353943 377055 309736 267344 364358 362800 297590 325351 401444 392496 305479 305288
2159 305288 377175 388911 272435 348900 455612 405603 407854 446953 423355 459418 426115
2148 426115 491944 467814 480286 432673 427416 452962 479977 441641 445899 458854 553192 622537
2136 622537 486178 449072 426126 450037 480148 498579 517550 536916 508410 565019 593381
2125 593381 582927 577395 609486 694277 632405 660008 661599 716592 680217 780461 907559 924056
2113 924056 927018 760860 811124 852459 839050 931400 921473 937329 893768 872633 975507 991256
2101 991256 961692 1022249 1056674 939973 1050925 1056491 1072788 1100187 1170464 1173346 1237590 1290543
2089 1290543 1234668 1354843 1344799 1318075 1403221 1394697 1496005 1573795 1704246 1821750 1881135
2078 1881135 1891711 1976014 2063709 2189107 2358978 2417442 2591409 2853136 3013663 3207659
2068 3207659 3477796 3783184 4090015 4413456 4834024 5266204 5661675 6151086 6848059 7809286
2058 7809286 8856128 10169341 11812368 14033283 16762293 19438255 21438181 24216399
2050 24216399 25654957 22210095 18239551 14780245 11664746 9581026 8063650 6975400
2042 6975400 6207565 5573503 5016346 4589804 4274544 4044918 3724192 3406802 3125353 2894521
2032 2894521 2670270 2473263 2302391 2119835 2014233 2011935 1887587 1811913 1670065 1650273
2022 1650273 1593630 1409537 1384485 1345488 1245961 1219219 1162926 1141438 1069294 1032403 1057962
2011 1057962 986332 972845 929793 800097 767996 800322 759645 689496 727391 781961 766078
2000 766078 777750 762487 752682 714275 635480 693369 622460 582586 583158 567796 558044 496166
1988 496166 512466 485957 536568 501362 594744 494711 457100 459538 394222 395249 357834 364232
1976 364232 354457 313542 337548 285531 371114 430093 268092 244707 272017 296650 351415 375521
1964 375521 329220 321045 241051 269521 265430 333372 342414 313727 302132 310664 278276 171332
1952 171332 113380 140405 211461 255727 188154 215488 253332 270314 302550 385481 331979 281692
1940 281692 242508 197750 152154 249327 179723 241662 267143 294083 326576 206388 172281
1929 172281 162357 227929 137296 101436 189201 150286 66274 94034 155942 178822 136360 115912
1917 115912 209360 231919 129377 155575 142938 262057 193332 140250 146444 135351 201658
1906 201658 179770 78745 47104 151611 222904 140249 122177 158071 198511 192089 174692
1895 174692 92364 125480 84014 88309 132610 142020 130466 86891 127418 199676 138995 136755
1883 136755 116692 60840 28094 65831 211279 256917 175533 174598 48295 104487 105508 29478
1871 29478 111467 84017 126346 57303 42519 155204 156653 124406 35347 5433 33468 -4774
1859 -4774 106397 107447 150230 75911 11902 86715 147311 72861 92936 101190 224755 169760
1847 169760 106763 58517 45357 67345 71592 78460 10497 44134 88502 83193 85243 62253
1835 62253 55796 144734 65900 49470 28389 116786 147220 35203 14425 58475 92468 50844
1823 50844 116638 184478 74277 136132 215660 176708 108112 106399 174836 224467 189451 174813
1811 174813 116187 117912 249257 276767 275970 259674 233294 189307 100969 41936 62131 59393
1799 59393 37219 60288 87919 50311 4820 49720 91033 73770 119084 153205 181633 175643
1787 175643 29059 44438 94045 81045 18152 76112 59784 30409 27198 28126 70370 140085
1775 140085 100833 112512 205337 193140 66906 -19186 5654 11639 85488 -36029 -14560
1764 -14560 2390 5621 5474 -96961 -118269 -16305 60877 163392 165756 136203 5752 29645
1752 29645 42257 112238 60624 -5135 -51597 68341 60535 72148 93140 -5725 -37068 51969
1740 51969 -29819 -50984 59296 -15953 -7349 15669 -15756 -58710 25014 32431 100754 -17255
1728 -17255 -54146 16085 53033 56844 81143 51555 4842 -99972 -51854 -6304 -34148 -88905
1716 -88905 -32813 7020 5842 36308 -35576 8441 70789 23281 -5453 28353 -39047 7373
1704 7373 40406 55397 35118 -3231 30807 17271 -15874 -62409 -11592 6734 25849 -25483
1692 -25483 27554 -28128 -5218 -49428 -36216 -14691 -102865 -45726 -72353 -94859 7223 67394
1680 67394 103036 -7417 -122160 -87528 -73488 -165162 -90971 70814 164081 54512 28
1669 28 -85842 -15214 25685 65122 78033 43641 44443 70339 101228 -88346 -70524 43401
1657 43401 -29273 21673 83366 33195 8256 18747 79394 20428 54680 3955 -157338 -101392
1645 -101392 -20175 -73562 14004 26858 93634 11422 -58944 -12854 51135 -31239 43614 12711
1633 12711 -31840 -54897 14055 151538 111961 70032 23064 -15320 30966 51519 -8449 -7196
1621 -7196 54507 30241 -39284 -16504 94626 71745 107303 174955 99368 40640 34633 37720
1609 37720 68445 15123 -35326 4670 33883 111308 73071 18571 -21375 58947 28148 4089
1597 4089 7845 -5061 13922 -32493 30391 6656 106334 50628 71851 65817 38578 -40596
1585 -40596 -67957 -12462 -61166 -2285 41448 99716 76464 101363 51860 35447 1311 44608
1573 44608 55235 171517 134389 -23865 13868 62055 15202 -24798 -63062 -73149 -21694
1562 -21694 -21679 -26389 -42057 -84522 -82433 25811 -5593 -41607 14598 33458 -20315 -49159 -108839
1549 -108839 -13987 -10294 -72885 -66347 -6328 65134 6985 10721 22384 10716 -48536 25520
1537 25520 51366 -12292 -73280 -15341 -32565 -9293 28515 51117 -18386 -68545 -100177 -121407
1525 -121407 -104755 13790 35937 -54286 46059 -15725 3064 -4932 17960 24225 -6126 63238
1513 63238 100600 81085 21216 -72936 -24032 58503 -20319 -31353 36800 30295 57173 67832
1501 67832 31949 -16956 -49596 26464 36414 117743 168772 120179 75757 65450 62046 84857
1489 84857 65545 144790 173913 74820 9281 -50360 36572 121375 61074 74903 56515 90893
1477 90893 70848 28739 -68801 32905 51962 104946 30256 5501 134799 -15054 97385
1466 97385 40535 51097 73417 -13495 -56003 -77290 -71380 -106538 -131669 -103209 -64103 64981
1454 64981 132732 57054 30504 -8996 22992 -969 -50580 64371 94386 -330 -33874 28279
1442 28279 71649 120387 54121 -27020 -19698 -25942 -52220 -2441 22074 -26095 13864 37171
1430 37171 -22930 69469 81939 87831 82018 66751 53287 69231 50743 62834 63135 37701 -13702
1417 -13702 -79059 -58266 -18976 -4291 -92237 -108133 -57202 -10382 -51804 -47711 -59683 -10025
1405 -10025 42733 22598 82467 75644 41695 -6606 -7604 44098 33122 12511 -44349 2867
1393 2867 40558 94692 47209 318 4120 29381 85964 78038 96156 52811 50113 96625 199800
1380 199800 77852 59297 -32012 -2636 54199 17189 -17283 5178 37835 -23025 64462
1369 64462 101514 68284 -12651 -44459 8941 51484 -30860 18946 16249 21951 36776 6084
1357 6084 35217 40812 -20378 -37177 -59148 12520 60065 -11789 -33241 48383 103129 63061
1345 63061 24472 -23151 -90838 -24235 45177 43673 42478 -22447 -55258 -61347 -14950 7578
1333 7578 104018 124803 19660 -59307 -103458 -59836 -8872 38345 41854 103823 122541 84016
1321 84016 6005 30670 41545 -8704 -47964 -41097 -28749 -38975 20709 -18512 -15392 81341
1309 81341 51014 14796 -29163 -16756 6336 11601 -39018 -33651 44856 -17463 -63435 -38860
1297 -38860 -52044 -27785 -136 -1782 66231 41310 57411 30619 -23283 -26243 -21593 -29579 -70852
1284 -70852 -57277 -60875 -92170 5762 -41069 7872 52184 8175 -22501 -84469 -24614 -71104
1272 -71104 -35099 5427 5809 -1274 58168 66292 94168 76316 33682 36902 64410 -57333 -81296
1259 -81296 15728 24819 5303 60807 57147 -106859 -69992 -117941 -84171 -22620 15080 -18554
1247 -18554 19906 23745 -110781 -16311 -29195 -11149 114062 115465 49282 -22937 -36130 26733
1235 26733 11596 -75195 -16008 -81214 25870 -5060 -85959 -40644 24344 61902 88821 38854
1223 38854 3864 -5198 -19540 11101 42979 -22549 -22991 -16110 24273 -33020 -159843 -98097
1211 -98097 -48836 -85732 -75943 42001 -618 -8194 58788 156207 148153 118513 72446 24379
1199 24379 75662 19789 9186 32953 -63636 -17036 37460 83485 66529 -20684 78103 17935
1187 17935 20788 -22261 -99576 -81866 -116431 -89177 -107109 -15545 -33802 -44104 -43594 -101272
1175 -101272 -157654 -62609 -58185 18154 116805 21004 -31830 -51962 -124088 -70555 -92541 -47417
1163 -47417 -14073 -58521 -65557 -39534 80992 97469 -28999 6933 28835 -13103 38702 88272
1151 88272 14438 -35493 -51142 -11562 27695 5980 78734 79942 -29902 30281 -10238 -13653
1139 -13653 -9329 -17931 -38355 -32540 -9103 -75104 -34198 -46650 14675 -5318 31280 -25801
1127 -25801 -98804 -10210 35027 -72190 -82210 48492 32638 -35988 -39633 -6329 62315 34842
1115 34842 -19630 -50860 -4288 47951 78847 71358 2092 -39125 -5028 11627 81356 -7901
1103 -7901 -69071 -37316 -19239 24378 -66051 -57335 64965 136569 56975 -59901 -222 15538
1091 15538 -28511 -27001 -3350 -36678 16282 -12381 -21404 -19065 73148 57655 113685 115660 56459
1078 56459 61059 21822 5537 -4434 6695 -26438 84866 -18227 -46604 -153165 -146648 -38075
1066 -38075 -37354 -53621 -2252 2441 -36912 -14769 -26024 20735 5649 -9830 -43098 -53073 -23254
1053 -23254 54708 -2043 -19003 -50021 -10795 96433 76604 82393 75000 37436 52999 -58134
1041 -58134 -45732 -12857 -76877 -70654 30212 16030 -1001 -560 -48653 -95490 -70533 30125
1029 30125 27008 25336 -41663 5481 1678 -44695 -78494 -43997 -39706 75488 87803 13866
1017 13866 27917 7710 527 -87070 -137033 -66760 49690 -18304 -11923 -19307 -12453 39067
1005 39067 -42449 -133422 -161621 -81024 -15619 11405 -45662 32152 91168 -5190 -5556 45820
993 45820 -10928 63889 2018 12062 -4172 5531 -11830 -79187 -72526 -19126 18783 -921
981 -921 24269 54903 -35811 -44676 -13789 -28319 19112 33839 81036 17605 2443 11411 27179
968 27179 -5288 -20664 3008 -12289 5225 -26624 155 48372 29992 2186 11072 10831 -33880
955 -33880 -30314 16191 -6091 69740 55941 83900 44171 44359 76140 77566 68435 -22213 -58013
942 -58013 -64285 29147 44143 -40830 -71286 -73916 -21803 -53480 -128645 -127827 -50181 -28300 -40642
929 -40642 62800 7477 46088 -8329 46888 -4066 -73953 -48535 32837 59794 94753 15117
917 15117 -26485 -44552 -52393 -68142 3117 7197 -52129 23133 -3141 71499 -28933 -31019
905 -31019 -11692 -40051 -1043 -13076 46565 31503 53479 -45014 18342 64400 -18987 -15769
893 -15769 3445 17947 -97840 -92182 -6549 89867 -1602 16076 7238 19169 455 -40198
881 -40198 -4636 82567 42062 37120 2088 -24087 29395 43454 28712 52245 17659 -110354
869 -110354 -185471 -19465 41604 -38079 52986 -52032 -37207 43556 85545 53116 -80175
858 -80175 5190 131356 -35531 -51859 -15485 9612 -24845 -16890 -23836 -41581 -53793 -2267
846 -2267 79041 46774 1357 71494 8792 1955 -21525 15989 20894 -29805 -56239 5527 -31601
833 -31601 -44901 -38203 -33902 -38988 36432 146174 103720 -37568 -89564 -107335 -72776 -24885
821 -24885 15961 39999 107093 201228 83226 52837 -63899 -58295 -36765 16802 158086 87554
809 87554 46712 50533 -72639 -100420 -45757 -85650 -81489 -8697 -46372 -30115 -95132 -122194
797 -122194 -98670 -91363 -83054 68168 13307 -13176 18716 62350 47103 12378 13909 49752
785 49752 -24876 -55900 -62425 -38674 14446 57512 -725 102324 34037 -13429 70907 40435
773 40435 94414 95408 41452 4385 44028 58508 -54195 -6600 -76737 -26520 10697 -16496
761 -16496 55606 62813 37963 65207 53525 29505 -15680 52668 175605 137736 65689 1164
749 1164 24364 -49930 -39117 -33904 38294 111161 29586 5689 41561 -49069 -9190 27410
737 27410 -8854 3124 -15239 -49177 -110450 -133668 -24432 -37160 -28094 -61242 -23095 -36004
725 -36004 -43162 -27688 3161 20996 -82976 -79553 -108612 -136280 -48591 -2870 -26952 13875
713 13875 13365 -62658 -88152 17638 -4943 -28781 31180 17521 117074 19766 18483 -29054
701 -29054 24909 32404 -40871 -1521 54370 56609 13696 -41914 31623 -7160 -27557 -2813
689 -2813 -58831 -37068 -7113 -14054 14155 2871 -12218 106823 16618 -41157 -50920 9250
677 9250 112078 171631 35975 -28955 -23465 -18707 -30823 -26107 -70465 64102 123588 14593
665 14593 -47536 2861 63813 -27569 -2732 -136924 -113997 -129066 -38600 -25209 82249 73091
653 73091 17691 -6457 -48340 71407 90773 48938 16121 -42196 73321 39333 7530 -46911
641 -46911 -150625 -112507 -28371 -20517 -121121 -45231 -108232 -80072 -40945 -13164 -58054 -6173
629 -6173 15381 -38769 14812 42420 7180 14256 52742 9685 47223 50649 -35109 -64228 -9981
616 -9981 -49399 16831 73698 -13079 9458 41877 -3035 19658 25742 -9515 -5074 -15538 29057
603 29057 -51900 10573 5983 65492 105109 66061 44738 46880 -6350 37327 86945 44580
591 44580 16306 38978 -32330 3974 -55000 -108022 -24983 -104473 -38611 45945 85720 86084
579 86084 36474 58249 24766 36964 -10818 -54248 -59723 -53960 46534 -22180 -56161 -2490
567 -2490 2785 -17615 29097 -17039 -57973 -31641 -62687 -44609 48895 97739 40664 34761 10780
554 10780 -28048 -7583 -83054 -84361 -36267 -31316 -27246 31355 62665 -52644 -130217 -66424
542 -66424 25400 -11152 70381 70508 13409 17451 -60258 -68911 -53002 -83268 -27939 -55638 -99174
529 -99174 -48541 -96066 -82459 23018 -43047 -38386 -39897 38067 19095 10719 -75315 -99216
517 -99216 -15737 -104348 -54238 -19945 -544 -61086 -90884 -38364 -64881 -67942 -94802 -25218
505 -25218 -62588 -163204 -32913 10302 101770 94534 46339 6988 70335 37038 60989 84435
493 84435 55979 -6945 -33213 48872 18346 30524 94414 -19072 -65856 -7671 22963 -50690
481 -50690 -63493 -41891 -26684 70659 56477 -8332 -42079 -24448 109 -90446 30601 65015
469 65015 27467 101106 98903 58430 15960 -1609 40302 24724 -7644 89979 -3036 -71568
457 -71568 -58279 -8258 -36965 -17194 -11511 -40389 -51475 -11351 4903 -44337 31800 116578
445 116578 170345 80172 33896 26261 114360 110374 24442 80086 14728 -56761 -59049 -56868 -58796
432 -58796 -117297 -84841 -61107 -32158 -68886 -25283 -42469 7620 32555 6392 52959 86337
420 86337 31938 43173 19129 8189 -39053 -70810 -53317 -75730 -10662 73704 80099 30650
408 30650 49570 -16047 16692 16621 31812 37254 26411 -37105 -58400 -10494 13276 18941 69161
395 69161 15630 -60147 -31716 -39099 -26153 829 -34853 9513 37939 -36996 55578 73157
383 73157 43097 -1334 36009 26806 33518 51424 41093 37547 -49658 4528 75832 44213 -12443
370 -12443 12431 -31861 -49787 74280 98922 40612 44413 -24710 -60960 -82527 -7831 -26093
358 -26093 -45254 30254 84915 7311 -11515 -19526 -25269 -11494 41154 -91320 -41275 23944
346 23944 -42531 66561 115616 82229 49223 39314 4298 60542 59189 51650 86714 59039
334 59039 21035 -9086 46302 72413 103972 37194 14613 4733 34688 23846 119819 111666
322 111666 3651 4534 -33056 -27403 -21672 -41177 12522 -18985 6858 44570 14763 6657 -59838
309 -59838 27013 80465 49530 58925 9241 -34891 2620 17249 -56013 -34569 37109 68907
297 68907 96554 -19270 38641 36994 -37206 44781 46243 -51094 -36467 -55280 -129701 -31904
285 -31904 -7108 -92715 -85561 -38970 6291 123686 37563 -66392 -7333 -106882 -103145 -42895
273 -42895 -80531 -86189 -49351 -48975 -63310 38807 80239 97100 53003 29185 42148 -70331
261 -70331 -34315 5540 -31654 -16941 4935 -36618 31025 -12983 293 3718 40113 48505
249 48505 62380 19289 18154 -76882 -41747 79201 121381 113881 83185 150753 77481 -25284
237 -25284 26252 44056 63226 44319 -34524 -8775 38263 237 71321 96193 77561 4967
225 4967 -21352 71549 71022 -1316 -165 -16549 21061 18033 -44902 -30330 8277 -62731 -57197
212 -57197 -62390 -35191 71080 98555 18970 21656 26206 16155 67402 27391 4171 28413
200 28413 18321 -5944 -4405 4386 67672 109374 36237 -36468 14461 9075 23110 -10480 49075
187 49075 94548 80577 92380 75291 34402 -13119 12887 96581 80318 63606 73570 64832
175 64832 -27409 -56618 -32504 -114529 -69258 -85768 -107771 -35590 -17591 -60862 -25609 42660
163 42660 571 77125 41405 34448 -44703 -34178 36444 6153 -1290 11757 -21261 13049
151 13049 43786 72884 45663 98688 66843 76022 51645 48859 45966 -29776 -59205 -8549 -4754
138 -4754 49715 24376 -8508 1183 42281 -14434 -49362 -47391 -37408 60052 37875 4479 -19941
125 -19941 8659 70364 39143 11978 -51658 48464 42661 -20666 -46482 14990 39223 48023
113 48023 70690 -5542 48180 33478 10586 9021 -27548 -101220 -45099 -8924 11904 -23058
101 -23058 -32461 -37874 -66052 -36675 -8965 84772 95443 14626 6142 5279 44333 83521 53592
88 53592 30020 15426 -98429 -61615 9941 8159 22387 16019 -65081 40490 22868 -39503
76 -39503 -28485 -18934 -23051 23006 29705 10642 -4937 -18749 27394 -32537 -31640 4585 -35454
63 -35454 16639 40569 -17584 3703 35240 77297 70393 47493 52807 2449 -2122 41791 39932
50 39932 4598 51870 53996 46189 68679 102177 77787 54030 50050 38659 24855 37229 25425
37 25425 36107 32214 -7843 13642 11396 -25002 13409 -2488 -27260 7283 -1837 13338 -44904
24 -44904 13472 -8496 -52375 -6254 -32768 41982 35139 52620 14226 -34507 17283 -12582
12 -12582 45427 111046 25474 45194 64842 -27651 -54039 -26699 -33775 -29092 22250 51639
0 51639
$$ Imaginary data points
##PAGE= N=2
##DATA TABLE= (X++(I..I)), XYDATA
16383 -3225825 -3187208 -3138278 -3069295 -3003649 -2911779 -2860001 -2914700 -2826110 -2770253 -2721775 -2735729
16372 -2735729 -2759657 -2708686 -2597648 -2488310 -2419081 -2450521 -2400520 -2423672 -2447891 -2361311 -2364962
16361 -2364962 -2350549 -2286957 -2244202 -2204959 -2179149 -2127704 -2079446 -2048152 -1983308 -2010259 -1926813
16350 -1926813 -1920284 -1843999 -1822745 -1757343 -1779954 -1721360 -1719046 -1667751 -1641343 -1571343 -1528349 -1459429
16338 -1459429 -1414156 -1415882 -1408278 -1377440 -1351226 -1279086 -1246303 -1203541 -1193255 -1160820 -1096348 -1022435
16326 -1022435 -1039141 -1027364 -1065966 -1012404 -988840 -937316 -856984 -850353 -829643 -774399 -769470 -730895
16314 -730895 -685905 -660258 -590913 -569012 -615180 -566570 -533758 -426337 -432369 -425824 -402075 -333770
16302 -333770 -324454 -342683 -317356 -252952 -180684 -134520 -126344 -163263 -43031 -27943 -41035 -47480
16290 -47480 22672 58264 149654 150962 231725 219631 157269 205379 314993 286181 327981 356969
16278 356969 413139 418468 430494 411666 434740 457042 489746 478429 574251 593625 609176 643508
16266 643508 744906 696925 709227 687519 777167 829964 847328 958589 956822 907089 911669
16255 911669 879940 962521 1005400 981243 1064770 1184580 1194068 1241596 1174935 1179513 1161631 1176389
16243 1176389 1171805 1223356 1243920 1195278 1221590 1220403 1307830 1345300 1375308 1412009 1432350 1437238
16231 1437238 1475835 1533531 1499918 1491243 1496585 1509700 1548791 1603347 1637251 1597821 1611092 1648294
16219 1648294 1709241 1710084 1718678 1665201 1710390 1698724 1682340 1715153 1840744 1843490 1844608 1866771
16207 1866771 1871533 1790111 1811531 1844170 1798584 1731819 1806225 1872788 1926331 1904551 1965601
16196 1965601 2032883 2015891 1974278 2039000 2058691 2040209 2070234 2117355 2109824 2117271 2119551 2084042
16184 2084042 2177969 2142729 2130031 2204161 2178893 2172079 2131961 2128224 2184515 2185303 2256666 2266403
16172 2266403 2195633 2237550 2376482 2299553 2268703 2231559 2243442 2291442 2308914 2372980 2316168
16161 2316168 2311881 2422819 2386183 2318641 2378857 2334164 2289975 2313371 2304397 2289423 2364186
16150 2364186 2427198 2350965 2338674 2411535 2465063 2427624 2418429 2461676 2434532 2451275 2468369
16139 2468369 2473095 2563900 2493392 2495936 2454254 2443587 2520043 2528862 2545092 2423900 2455712 2471789
16127 2471789 2490939 2490353 2495609 2532553 2531481 2412762 2509668 2624707 2568236 2608473 2613997 2526945
16115 2526945 2566420 2540375 2454232 2463330 2537495 2690421 2676285 2616950 2617983 2648321 2680893
16104 2680893 2653835 2668203 2740219 2735234 2679273 2694365 2684713 2757277 2743208 2694295 2651168 2688309
16092 2688309 2654907 2733830 2712285 2713797 2628050 2666891 2746558 2736666 2709652 2705521 2684301 2714309
16080 2714309 2673863 2681428 2790194 2656923 2709895 2756694 2715764 2697675 2807439 2770088 2780927
16069 2780927 2733466 2712721 2708484 2688764 2717609 2731822 2715489 2751258 2646839 2713391 2714487
16058 2714487 2631828 2722768 2748649 2786277 2794914 2701934 2736385 2742771 2746018 2788745 2700995 2748453
16046 2748453 2713118 2631101 2734081 2759070 2798748 2810401 2844241 2672989 2584436 2731118 2705657
16035 2705657 2677412 2688977 2744797 2817498 2747474 2717345 2679448 2614568 2672286 2791303 2747219
16024 2747219 2772838 2793297 2706388 2700584 2739681 2689794 2747361 2701002 2731758 2789652 2765544
16013 2765544 2771489 2793642 2769114 2741694 2747105 2718107 2718629 2775320 2691963 2774656 2779652 2697403
16001 2697403 2697923 2689661 2700642 2755523 2807334 2729538 2794502 2790858 2729532 2616975 2705571 2757061
15989 2757061 2697185 2758956 2786356 2843142 2821497 2736209 2727716 2756462 2719857 2844688 2936422
15978 2936422 2828757 2862958 2802259 2765302 2814247 2868696 2787677 2759099 2805151 2735830 2721668
15967 2721668 2787215 2794516 2814961 2758771 2805361 2862584 2845369 2740218 2731324 2751096 2795136
15956 2795136 2747866 2709146 2771454 2773409 2733837 2763031 2831882 2755668 2749760 2733079 2813935 2734250
15944 2734250 2789995 2698342 2637831 2711103 2790670 2813672 2756537 2817709 2825530 2760139 2702376
15933 2702376 2759748 2779105 2782943 2771139 2854074 2757558 2722432 2669025 2735454 2823014 2822994 2771918
15921 2771918 2821968 2762081 2744347 2760146 2763176 2759606 2754941 2696736 2740547 2746650 2757154 2848584
15909 2848584 2869201 2754139 2729093 2710671 2774934 2792213 2737147 2745173 2773797 2748486 2685101
15898 2685101 2697304 2757363 2851058 2834713 2782399 2836685 2872794 2724637 2741927 2872996 2849539
15887 2849539 2779970 2743789 2711750 2723897 2685471 2707895 2819324 2843428 2769228 2863549 2873081
15876 2873081 2746076 2635766 2733171 2715268 2796082 2808812 2789351 2769833 2780507 2725231 2741223
15865 2741223 2788960 2823615 2847252 2865466 2866446 2840144 2852031 2830097 2734291 2783445 2803807 2766883
15853 2766883 2762811 2742929 2819218 2764273 2827896 2861112 2920662 2787646 2866661 2895521 2858305
15842 2858305 2896342 2825255 2827416 2847683 2877601 2800345 2790139 2825217 2773559 2758756 2820566
15831 2820566 2763909 2783697 2802953 2782633 2786121 2689608 2714556 2771070 2734606 2704666 2797799
15820 2797799 2828187 2684731 2740064 2871535 2891210 2821316 2805418 2836065 2823792 2807968 2752864
15809 2752864 2711540 2756811 2766840 2829339 2863366 2892889 2836864 2777389 2710040 2735692 2753716
15798 2753716 2810088 2896238 2859379 2885766 2894910 2854719 2852183 2841925 2828043 2771195 2816585 2799431
15786 2799431 2806766 2803895 2836164 2821939 2756655 2726366 2784078 2837944 2831359 2748837 2766971 2776405
15774 2776405 2781020 2730413 2781958 2899665 2753487 2697439 2681489 2834633 2805225 2811855 2834538
15763 2834538 2792602 2816018 2820823 2813171 2883661 2796016 2866633 2910885 2857890 2871534 2814881 2819021
15751 2819021 2855377 2808453 2733220 2769689 2824797 2835548 2804251 2886783 2884007 2856499 2839652
15740 2839652 2720562 2761539 2794449 2867686 2827669 2791049 2871214 2854988 2859246 2816626 2794220
15729 2794220 2773177 2746091 2746114 2801237 2804192 2830576 2833633 2818651 2845361 2810468 2773723 2703710
15717 2703710 2800589 2749841 2687563 2722891 2795093 2756319 2698799 2723351 2801020 2800234 2746272 2792609
15705 2792609 2836912 2767523 2696945 2747512 2681936 2711390 2756633 2837925 2943128 2856918 2815335
15694 2815335 2860481 2877704 2888215 2857317 2778914 2806897 2719143 2833591 2850412 2805294 2802188
15683 2802188 2885119 2865261 2777045 2881284 2805184 2807707 2821832 2815293 2804666 2800563 2866273 2903815
15671 2903815 2846798 2829846 2844799 2858725 2855824 2833857 2850677 2846280 2726872 2742025 2764006
15660 2764006 2843928 2896518 2894761 2909796 2878183 2848663 2803683 2784484 2813098 2829937 2857569
15649 2857569 2881038 2917688 2818902 2779428 2780950 2759350 2780869 2766695 2816016 2869610 2820341
15638 2820341 2827387 2751142 2736815 2798581 2861821 2856982 2832794 2869693 2793706 2811659 2772270 2831711
15626 2831711 2845421 2867501 2909385 2943782 2879947 2814237 2878663 2902223 2837282 2736356 2784049
15615 2784049 2843072 2879247 2855032 2831327 2825460 2837689 2806059 2847748 2818225 2781692 2915959
15604 2915959 2815412 2797291 2814226 2785533 2859641 2846160 2840478 2883034 2711518 2812885 2932901
15593 2932901 2844808 2841829 2791512 2849969 2797166 2815511 2800719 2845144 2969404 2970859 2923561
15582 2923561 2871538 2923720 2862080 2796429 2858306 2798111 2858367 2846813 2791788 2789457 2891893
15571 2891893 2816858 2730020 2783251 2840796 2859803 2790986 2809633 2802847 2888831 2917347 2869387
15560 2869387 2897630 2840579 2763648 2824041 2956622 2877716 2885750 2951927 2850553 2830757 2831220
15549 2831220 2913927 2994114 2938834 2936385 2995629 2871691 2870906 2855048 2824450 2853799 2912380 2804034
15537 2804034 2748333 2879107 2885833 2797500 2793641 2921144 2916552 2819132 2806091 2822796 2858264
15526 2858264 2749007 2868482 2936539 2845282 2835987 2865078 2954286 2935241 2868579 2804588 2910810
15515 2910810 2873613 2853843 2852949 2861313 2884345 2937076 2848545 2872041 2912197 2947710 2931251 2907961
15503 2907961 2848787 2911614 2912874 2876667 2949119 2868283 2827020 2835578 2964588 2913512 2827320
15492 2827320 2818401 2834962 2838262 2839115 2792072 2785431 2837821 2819828 2855573 2871496 2870799 2932443 2940495
15479 2940495 2913781 2874913 2853909 2820785 2925536 2835409 2837655 2840692 2902398 2908078 2843171 2827641
15467 2827641 2858016 2793402 2833624 2855621 2827166 2902047 2879927 2822707 2856121 2853365 2801810
15456 2801810 2839052 2788712 2835329 2915519 2931297 2916080 2835069 2828124 2871584 2781961 2810047
15445 2810047 2849058 2816112 2885487 2853760 2813529 2909019 2940947 2949008 2888597 2876872 2908003
15434 2908003 2833567 2774492 2840435 2844163 2888558 2853608 2855557 2870841 2807076 2829802 2884463 2903825
15422 2903825 2908378 2925658 2927265 2835477 2766400 2913724 2984908 2973166 2915157 2879724 2865353
15411 2865353 2851113 2826893 2857576 2892538 2870901 2891200 2856088 2860010 2883794 2939587 2935355 2970363
15399 2970363 2904538 2906085 2895585 2899693 2899097 2942180 2981636 2865260 2707519 2835000 2949622
15388 2949622 2931489 2935683 2883552 2890841 2885111 2924973 2915934 2862444 2863528 2835585 2879781 2976912
15376 2976912 2872233 2798875 2834832 2915010 2857573 2762530 2869706 2895899 2878603 2921339 2827177
15365 2827177 2943950 2977496 2949738 2917008 2979516 2965591 3030211 3050734 3001563 2941918 2923563
15354 2923563 2912623 2862049 2833840 2881345 2858946 2828759 2902786 2894382 2873383 2788646 2870320
15343 2870320 2958687 2916943 2859170 2871364 2838909 2932018 2963613 2858948 2910147 2873502 2850553
15332 2850553 2899619 2936915 2936072 2896249 2922857 2881135 2916301 2972969 2918989 2938094 2973020 2938164
15320 2938164 3002323 2965954 2946545 2845100 2856777 2958092 3000997 2962329 2985919 2920745 2795885
15309 2795885 2809149 2822249 2831098 2905803 2947266 2943683 3004983 2982089 2916713 2819271 2827822 2782599
15297 2782599 2853814 2904557 2889689 2954877 2928742 2915620 2907656 2918502 2950520 3020721 3057699
15286 3057699 3080324 2968429 2868366 2866202 2834792 2853559 2922771 2937188 2957484 2928198 2921423
15275 2921423 2907304 3006618 2975088 3005635 2979932 2924091 2885345 2940017 3035333 2992073 2929322
15264 2929322 2904382 2926942 2860412 2942452 2964110 2853116 2841435 2919008 2970639 3021810 2973042
15253 2973042 2992165 2965674 2910588 2985836 2952492 2908372 2923066 2877879 2948638 2899016 2948608
15242 2948608 2968229 2979004 2961724 2960064 2937586 2909682 2844814 2887221 2958525 2823870 2828496
15231 2828496 2981734 3059755 2961091 2988061 2970506 2933096 3001266 2984174 2912581 2927249 2926472
15220 2926472 2963096 2956573 2921025 2946129 2943077 2940094 2977386 2954319 2936474 3022538 2980849 2934847
15208 2934847 2928528 3061970 3106160 2965774 2975782 3013116 2997037 2987915 2989327 2949054 2940577 3042409
15196 3042409 3018725 2980625 2974571 3007243 3051955 3042497 2993098 2979164 2933010 2943461 2933253 2909775
15184 2909775 2933412 2943751 2963782 2983050 2970885 2904554 2952003 3040798 3029415 2975348 2953470
15173 2953470 3028352 2871448 2864216 2940067 2982724 2932787 2902829 2906135 2975296 3001072 3046470
15162 3046470 3040874 2964871 2958099 2984087 3012415 2918143 2880010 2908860 2985336 2941876 3020093 3017620
15150 3017620 2980833 2949431 2937457 2888736 2901936 2908518 2925978 3029788 2964395 2923654 3036721
15139 3036721 2988690 3008524 3033400 3076478 3138681 3101222 3043390 2983052 2884790 2905313 2933305
15128 2933305 2950267 2960786 2871430 2988483 3032033 2997104 2898524 2846491 2967550 2898054 2758119
15117 2758119 2780509 2851462 2926893 2969104 2962882 2903703 2890870 2936286 2916033 2898718 2905977 2945438
15105 2945438 2935371 2981412 2962507 2924095 2915728 2876439 2909664 3019005 3018380 3066066 3024432 3043964
15093 3043964 3089512 3116438 3130874 3118273 3084148 3040295 3027439 3016150 2967974 2954284 3005346
15082 3005346 3023939 2966038 2975921 2935885 2931581 2915950 3030829 3032025 3006591 2974319 3004963 3014406
15070 3014406 3037376 2947129 2912008 3077465 3052982 3039941 3049205 3018395 3046062 3019070 2941970
15059 2941970 3019913 2983967 2993426 3000779 3054294 3083651 3135380 3100424 2987532 3006477 3036295
15048 3036295 3021749 3025630 2969069 3096940 3107676 2991923 2950816 2965093 2944626 3019384 2949589
15037 2949589 2931440 2912093 2886317 3005882 2951918 2949657 2918258 2924011 2938419 3034260 3070622
15026 3070622 2968405 2924002 2878393 2896001 2932200 2939234 2915247 2947856 2943902 2945598 2973156 3002737
15014 3002737 3031317 3022088 2963217 3020767 3130072 3063432 3030239 3002803 2892808 2925362 2979559
15003 2979559 3028509 2931414 2966609 2999973 2970039 2931187 2996098 2924959 2951881 2983091 3046468
14992 3046468 2989684 2980928 2948905 2895931 2881466 2875339 2950358 2979606 3093118 3017212 2960750
14981 2960750 3004538 2991246 2990362 2987891 2956858 2988442 2958955 2972578 2969756 2939253 2902888 3009542
14969 3009542 3086894 2946267 2949481 3007424 2966335 2971496 3013585 2996314 3042001 3009059 2953736
14958 2953736 3017961 3000197 3102864 3124882 3023366 3038784 3036098 3002066 2995804 3034667 3029176
14947 3029176 3022144 3087840 3019881 3028369 3069199 2990761 3037319 3124371 3020999 3013087 3036772 3007392
14935 3007392 2935112 3015453 3013909 2998487 3021105 2993547 3008964 2991309 3041355 3071443 3096242
14924 3096242 3139977 3123520 3027285 3023934 3046771 2952881 2998631 3049773 3066091 2989830 3011503
14913 3011503 2972382 3055614 3060239 2999758 3051228 3037343 2969771 2971176 2964791 2980493 3067004 3133568
14901 3133568 3088432 3068017 3041119 3131278 3143415 3013981 3029115 3046703 3037203 3010388 3044938
14890 3044938 3049786 2995513 3037823 3025166 2985353 3008357 3084915 3118654 3131257 3087392 3019881
14879 3019881 3073832 3021812 2979344 3097338 3057741 3031044 3086409 3103638 3125225 3106649 3067976
14868 3067976 3063755 3046228 3039267 3110010 3027111 3031014 3022865 3039319 2983241 2947775 3007618 3068422
14856 3068422 3087235 3054417 3060690 3088544 3045398 3065934 3080047 3111943 3117020 3107792 3140126 3148731
14844 3148731 3142147 3110898 3037350 3051604 3092987 3072933 3065017 3024987 3009414 3008860 2960065 3049203
14832 3049203 3076228 3030505 3056978 3003131 2988909 3023016 3059505 2993811 2972757 3059674 3079925
14821 3079925 3057106 3033775 3034889 3006533 3070012 3031984 2980846 3047098 3029288 3083769 3063427
14810 3063427 3014223 3062781 3084918 3099765 3137868 3136295 3091564 3025001 3009180 2984156 2958093
14799 2958093 3050789 3007239 2967724 3054755 3111309 3039856 3118282 3151293 3080162 3058119 3029818
14788 3029818 3093530 3066975 3061564 3083959 3086846 3032124 2991839 3086960 3129088 3140175 3101168 3148890
14776 3148890 3130864 3123905 3080183 3136221 3134113 3030591 3057438 3111837 3115735 3038838 3025128 3028880
14764 3028880 3005982 3039734 3059292 3046028 3167582 3103058 3086537 3051956 3010711 3134160 3118492
14753 3118492 3116193 3053784 3112426 3117979 3144903 3148579 3126091 3041270 3078623 3156578 3061118 3104925
14741 3104925 3146477 3155543 3048477 3040838 3083526 3120066 3155663 3143807 3162809 3127159 3013017
14730 3013017 3063558 3130704 3215208 3234876 3087124 3088105 3105662 3106104 3151098 3132434 3135130 3135713
14718 3135713 3128814 3137664 3051971 3073206 3116841 3081062 3037292 2944444 3025077 3100075 3063696 3084988
14706 3084988 3153038 3186409 3180192 3138062 3141437 3085461 3085812 3096440 3180110 3166579 3223915 3213939
14694 3213939 3176657 3114889 3057243 3115708 3097369 3035155 3089857 3073376 3124173 3179526 3136653
14683 3136653 3134728 3099632 3172909 3124511 3176396 3079452 3053991 3111919 3062165 3062480 3097857 3075497
14671 3075497 2985416 3057658 3085985 3023536 3097616 3178649 3107179 3101857 3107353 3136735 3059671 3076055
14659 3076055 3110090 3167622 3131658 3090060 3039083 3036131 2964889 2988703 3031694 2974234 3090839
14648 3090839 3101884 3097879 3123844 3127372 3092542 3118203 3161676 3065941 2976173 3034484 3133565 3080817
14636 3080817 3116341 3185028 3076386 3065776 3054859 3087317 3184682 3168372 3139010 3107636 3055047
14625 3055047 3074726 3089277 3083595 3098616 3054848 3091546 3077692 3086735 3092585 3036846 3053666 3042878
14613 3042878 3068742 3092673 3149003 3053283 3004643 3113949 3121295 3116556 3169855 3125375 3088999
14602 3088999 3076013 3155788 3134543 3131173 3091313 3088736 3133658 3228639 3222891 3226814 3092658 3089484
14590 3089484 3170717 3057719 3076394 3149510 3193338 3155703 3109254 3175214 3179224 3218065 3136634
14579 3136634 3130821 3169071 3207662 3169421 3181941 3137222 3077218 3076729 3097014 3106645 3078100 3024333
14567 3024333 3030655 3132440 3109247 3141548 3181745 3084442 3199374 3213157 3087019 3084349 3093951
14556 3093951 3228986 3235539 3171167 3150092 3146021 3152410 3149416 3093594 3067876 3064280 3113210 3080641
14544 3080641 3177409 3112295 3090301 3107144 3149150 3053830 3121777 3112444 3085509 3078594 3081678 3106201
14532 3106201 3116844 3220590 3124979 3065575 3083876 3046086 3029601 3064650 3061843 3061253 3092565 3070635
14520 3070635 3025623 3094530 3118656 3141809 3101415 3132438 3281642 3208893 3187955 3161734 3206289
14509 3206289 3188227 3082213 3133664 3125594 3206099 3167793 3190132 3179081 3173455 3129489 3109416
14498 3109416 3149350 3149300 3194431 3193356 3148673 3132503 3196749 3228036 3237965 3225157 3270569 3239626
14486 3239626 3213603 3170269 3064159 3068656 3085483 3195164 3166307 3220777 3189319 3117549 3089010
14475 3089010 3183889 3252899 3161148 3099113 3124274 3171021 3172864 3179729 3214706 3218400 3179334 3182400
14463 3182400 3244190 3158446 3122681 3223385 3162817 3152764 3155218 3220621 3182322 3191829 3191443 3116426
14451 3116426 3011888 3163945 3171235 3195971 3224510 3193513 3174523 3215594 3258721 3247184 3134294
14440 3134294 3148294 3284639 3294937 3287201 3208859 3122387 3110242 3061887 3109933 3259506 3249429
14429 3249429 3195282 3177468 3143426 3236879 3152838 3212510 3216331 3125824 3170401 3207907 3261431
14418 3261431 3291016 3290807 3279931 3271768 3072877 3227865 3345828 3187735 3171312 3193086 3156852
14407 3156852 3232217 3219065 3197639 3092520 3098949 3121253 3145662 3268599 3245500 3155135 3177956
14396 3177956 3181169 3180572 3119024 3076785 3128076 3149509 3147543 3110588 3086506 3133002 3150057 3179603
14384 3179603 3221709 3217304 3216524 3290786 3318937 3291393 3234684 3204428 3222109 3086174 3132008 3137723
14372 3137723 3181515 3227932 3150677 3138943 3212736 3172682 3090568 3127928 3201444 3279806 3238621
14361 3238621 3265428 3277749 3212221 3249555 3322002 3252454 3213173 3196666 3261108 3154508 3143387
14350 3143387 3167385 3132060 3193595 3174855 3120883 3163437 3219983 3191669 3150540 3129251 3093857
14339 3093857 3138221 3242394 3255704 3223441 3188885 3149674 3209675 3146310 3151053 3140543 3215268
14328 3215268 3263854 3257810 3249455 3226724 3272002 3213174 3140121 3129957 3186505 3184150 3141322 3258226
14316 3258226 3321767 3205593 3224988 3202362 3162027 3217824 3208696 3183916 3264374 3235876 3214917
14305 3214917 3284663 3215147 3192872 3271844 3181390 3148526 3139225 3193397 3305076 3235248 3161550
14294 3161550 3206619 3172279 3125049 3111992 3125566 3138962 3197540 3210682 3225477 3294303 3264196
14283 3264196 3220318 3208917 3189560 3280649 3212157 3268744 3270141 3215229 3238901 3228853 3201996
14272 3201996 3239462 3251805 3219952 3211738 3302267 3348162 3259502 3289413 3188137 3186029 3195880 3261983
14260 3261983 3216266 3276335 3217524 3135870 3286271 3272669 3173774 3201411 3190045 3225775 3238081
14249 3238081 3134504 3182207 3283534 3307944 3277496 3259725 3218460 3241841 3202543 3236622 3137660
14238 3137660 3183709 3203891 3237202 3195262 3221503 3208211 3140269 3171817 3263966 3312292 3206402
14227 3206402 3231802 3222794 3188830 3201162 3164670 3238852 3323846 3290784 3288237 3197674 3207918 3159518
14215 3159518 3105058 3166326 3146701 3188615 3195355 3144117 3156877 3172127 3220523 3162314 3143713
14204 3143713 3140076 3141046 3213544 3122107 3197814 3323257 3270070 3238382 3223359 3293834 3376116 3304603
14192 3304603 3342383 3301112 3347638 3407724 3289840 3201838 3155165 3233401 3283631 3350497 3329948
14181 3329948 3272396 3162704 3209787 3200815 3202616 3234274 3274492 3256052 3230984 3244063 3190727
14170 3190727 3265449 3211958 3263685 3354787 3315032 3237160 3184672 3210390 3213500 3176997 3275298
14159 3275298 3252917 3265548 3297693 3225864 3206830 3200255 3195512 3218211 3180954 3171983 3228124 3233324
14147 3233324 3210774 3092930 3233007 3166229 3183439 3257760 3260375 3250021 3224550 3157825 3144682
14136 3144682 3126311 3181923 3299358 3256469 3294632 3331527 3305767 3373180 3340701 3258007 3265705
14125 3265705 3335242 3377603 3312219 3225208 3197650 3286666 3293040 3220179 3240162 3310257 3209773
14114 3209773 3152672 3270798 3281939 3207585 3240886 3281909 3297995 3273991 3304320 3297757 3217450
14103 3217450 3252876 3272888 3374537 3317265 3180158 3241441 3260812 3237400 3215835 3202159 3228923
14092 3228923 3190642 3220248 3195776 3162680 3194769 3216690 3190144 3208126 3213301 3211241 3204448 3240929
14080 3240929 3233129 3235555 3345304 3328646 3219935 3198152 3172998 3193080 3308551 3269503 3245276
14069 3245276 3187806 3129795 3156129 3197787 3228686 3194528 3247427 3322923 3314819 3387262 3299907
14058 3299907 3276620 3271389 3214487 3199911 3257368 3254699 3273477 3273564 3241538 3213340 3268212 3203261
14046 3203261 3236041 3371629 3326172 3345192 3381737 3377728 3341403 3257542 3329006 3332739 3305227
14035 3305227 3285666 3299242 3321775 3240111 3272318 3362280 3308013 3243512 3265978 3233254 3341339
14024 3341339 3306032 3238507 3279690 3317701 3286451 3263781 3353477 3310863 3270960 3354077 3434054
14013 3434054 3408935 3269131 3293238 3363910 3275390 3306480 3288069 3355543 3356012 3374938 3384554 3386764
14001 3386764 3353314 3337492 3294760 3383653 3376237 3275875 3305505 3329059 3281426 3323498 3307871
13990 3307871 3271322 3340269 3308163 3316523 3333972 3394928 3291071 3230898 3340972 3364291 3301323
13979 3301323 3294213 3383912 3464924 3427593 3345862 3334592 3312767 3303078 3310968 3359282 3365429 3336285
13967 3336285 3306953 3337146 3366254 3403204 3400319 3330854 3354445 3468477 3380982 3307150 3306880 3227740
13955 3227740 3289016 3291317 3369893 3318815 3371164 3288935 3301431 3351208 3368061 3290635 3220664
13944 3220664 3241595 3289495 3254436 3266469 3275395 3241984 3338940 3298537 3319063 3331623 3324519 3374869
13932 3374869 3314283 3347954 3339133 3389519 3353873 3329307 3340976 3309800 3246385 3253479 3295729 3307176
13920 3307176 3253991 3322922 3320669 3290289 3342263 3441589 3334097 3322349 3386534 3368398 3357462
13909 3357462 3369170 3365193 3342448 3332291 3346164 3308964 3355065 3385897 3380683 3471900 3347240
13898 3347240 3290646 3338048 3341744 3306485 3345590 3323860 3319792 3292716 3288074 3315214 3424172 3403845
13886 3403845 3370714 3347238 3359359 3330902 3378106 3410493 3381250 3365762 3274194 3301207 3356543
13875 3356543 3433732 3471579 3472404 3470326 3408096 3349914 3367832 3336004 3329626 3377841 3300877 3339115
13863 3339115 3314988 3413133 3465011 3387022 3390547 3426907 3415820 3423052 3420102 3418927 3400432 3423373
13851 3423373 3373049 3392866 3328012 3269925 3307294 3318117 3257519 3279839 3324610 3373838 3336630
13840 3336630 3327139 3357646 3382002 3407489 3355522 3365608 3373394 3296661 3358886 3359642 3337771 3354632
13828 3354632 3429401 3410821 3437892 3355212 3323403 3368801 3352499 3363984 3385179 3416121 3342563
13817 3342563 3334021 3326230 3398977 3406506 3386716 3390438 3305674 3281475 3342368 3304380 3412048 3347394
13805 3347394 3336927 3358648 3297515 3300562 3386521 3378028 3264363 3269811 3352380 3344465 3258800 3284757
13793 3284757 3282624 3338134 3363220 3336449 3362163 3445337 3489070 3477360 3486611 3407765 3447252 3445747
13781 3445747 3392972 3375306 3384539 3305370 3412448 3440521 3381917 3365223 3407624 3528352 3421319
13770 3421319 3367804 3431529 3452230 3352273 3292381 3328574 3334054 3320401 3282373 3360869 3401924
13759 3401924 3358583 3274430 3365291 3355987 3340566 3345888 3404257 3406296 3378686 3425939 3417920 3318620
13747 3318620 3365468 3425429 3416874 3435515 3387256 3335188 3305158 3418148 3443551 3505799 3452630
13736 3452630 3447898 3491088 3451227 3442926 3389025 3358705 3468040 3455596 3397476 3455729 3483684
13725 3483684 3544714 3445700 3360401 3303179 3366974 3390984 3400661 3347398 3360161 3386010 3379299 3366650
13713 3366650 3394722 3332432 3393197 3455766 3382880 3316416 3367707 3428081 3422288 3488598 3370102
13702 3370102 3340891 3370060 3387188 3359375 3332652 3393741 3485461 3459126 3428233 3399097 3451052
13691 3451052 3342491 3411793 3407423 3439783 3374993 3375899 3395693 3487995 3490672 3486528 3406563 3369743
13679 3369743 3322515 3333097 3341329 3343034 3320284 3348624 3489107 3455819 3461924 3425792 3363326 3462581
13667 3462581 3543443 3463354 3452699 3365982 3467640 3409086 3381298 3357312 3352562 3372773 3398295
13656 3398295 3468256 3399328 3363768 3331300 3324447 3360905 3369154 3420165 3331334 3302527 3296527 3443107
13644 3443107 3422670 3429544 3436060 3531762 3396601 3363738 3467800 3431187 3465228 3395264 3343241
13633 3343241 3361805 3455403 3424909 3457617 3414923 3433635 3414719 3476555 3414929 3450737 3517899
13622 3517899 3471551 3539337 3485810 3370087 3407112 3357029 3397523 3310187 3347594 3417244 3405326
13611 3405326 3473258 3487987 3400981 3429747 3476507 3413544 3507094 3465664 3439738 3389766 3405349
13600 3405349 3421694 3337727 3397746 3429778 3416766 3458711 3485912 3445269 3368027 3423737 3507003
13589 3507003 3512461 3493980 3499701 3570669 3483750 3462982 3488699 3481486 3496888 3495594 3440222 3456491
13577 3456491 3480534 3452259 3530448 3462766 3396687 3417664 3421917 3423703 3497054 3442985 3529941 3568373
13565 3568373 3462565 3393612 3413067 3359879 3446254 3447549 3439326 3381801 3393889 3427249 3457222
13554 3457222 3494813 3462530 3519390 3454748 3441287 3496602 3408297 3419919 3485799 3480175 3487441 3552162
$$ [...]
##END NTUPLES=NMR SPECTRUM
##END=
