##TITLE=1H_CG-1148-C1
 CDCl3, 8 sc, 
 9.06.2021
##JCAMPDX= 6.0         $$ Bruker NMR JCAMP-DX V2.0
##DATA TYPE= NMR SPECTRUM
##DATA CLASS= NTUPLES
##ORIGIN= UXNMR, Bruker Analytische Messtechnik GmbH
##OWNER= root
$$ XWIN-NMR		Version 3.5
$$ Wed Jun  9 11:51:02 2021 Russian Standard Time (UT+4h)  she@DPX200
##.OBSERVE FREQUENCY= 200.131506
##.OBSERVE NUCLEUS= ^1H
##.ACQUISITION MODE= SIMULTANEOUS
##.ACQUISITION SCHEME= undefined
##.AVERAGES= 8
##.DIGITISER RES= 18
##SPECTROMETER/DATA SYSTEM= spect
##.PULSE SEQUENCE= zg30
##.SOLVENT NAME= CDCl3
##.SHIFT REFERENCE= (INTERNAL, CDCl3, 0, 17.546)
##AUDIT TRAIL= $$ (NUMBER, WHEN, WHO, WHERE, WHAT)
$$ ##TITLE= Audit trail, XWIN-NMR		Version 3.5
$$ ##JCAMPDX= 5.01
$$ ##ORIGIN= Bruker BioSpin GmbH
$$ ##OWNER= she
$$ F:/spectra/data/she/nmr/H-F/1/pdata/1/auditp.txt
$$ ##AUDIT TRAIL=  $$ (NUMBER, WHEN, WHO, WHERE, WHAT)
(   1,<2021-06-09 11:49:06.71 +0400>,<she>,<DPX200>,
      <created by zg, POWCHK disabled, PULCHK disabled
       configuration hash MD5:
       00 E9 B6 7A A2 85 ED C7 34 08 36 98 17 FE 4E 26
       data hash MD5: 16K
       60 52 AF 06 50 82 25 9E 4E 35 86 78 6E C8 BC 47>)
(   2,<2021-06-09 11:49:09.68 +0400>,<she>,<DPX200>,
      <Start of raw data processing
       efp BC_mod = 2 LB = 0.24 FT_mod = 6 PKNL = 1 PHC0 = -11491.37 PHC1 = 22.00101 SI = 16K 
       data hash MD5: 16K
       96 5E 71 22 4F A5 F8 5E 1F BF 9B 05 4A 32 93 EB>)
(   3,<2021-06-09 11:49:33.81 +0400>,<she>,<DPX200>,
      <pk PHC0 = -0.3406965 PHC1 = -2 
       data hash MD5: 16K
       D5 91 AA 36 AD E6 DA D3 CC 72 E7 4D 8F A8 FF BC>)
(   4,<2021-06-09 11:49:37.68 +0400>,<she>,<DPX200>,
      <abs ABSG = 5 
       data hash MD5: 16K
       D6 2B 2A D8 BF 67 09 D4 4F 68 42 1A DE B0 20 A2>)
(   5,<2021-06-09 11:50:32.56 +0400>,<she>,<DPX200>,
      <abs ABSG = 5 
       data hash MD5: 16K
       07 3C 1D B7 DB 3F A4 C1 CB F4 D5 44 C7 85 E4 97>)
$$ ##END=
$$ 
$$ hash MD5
$$ 7C 58 77 2A F0 D9 3B 15 66 1A F8 91 2E 32 18 28
##$RELAX= 
##$RELAX= 
##$RELAX= 
##$RELAX= 
##$RELAX= 
##$RELAX= 
$$ Bruker specific parameters
$$ --------------------------
##$DU= <F:/spectra>
##$EXPNO= 1
##$NAME= <H-F>
##$PROCNO= 1
##$TYPE= <nmr>
##$USER= <she>
##$AMP= (0..31)
100 100 100 100 100 100 100 100 100 100 100 100 100 100 100 100 100 100 
100 100 100 100 100 100 100 100 100 100 100 100 100 100 
##$AQSEQ= 0
##$AQ_mod= 1
##$AUNM= <au_zg>
##$AUTOPOS= <>
##$BF1= 200.13
##$BF2= 200.13
##$BF3= 200.13
##$BF4= 200.13
##$BF5= 200.13
##$BF6= 200.13
##$BF7= 200.13
##$BF8= 200.13
##$BYTORDA= 1
##$CFDGTYP= 0
##$CFRGTYP= 5
##$CHEMSTR= <none>
##$CNST= (0..31)
1 1 145 1 1 1 1 1 1 1 1 1 1 1 1 1 1 1 1 1 1 1 1 1 1 1 1 1 1 1 1 1 
##$CPDPRG= <>
##$CPDPRG1= <>
##$CPDPRG2= <>
##$CPDPRG3= <>
##$CPDPRG4= <mlev>
##$CPDPRG5= <mlev>
##$CPDPRG6= <mlev>
##$CPDPRG7= <mlev>
##$CPDPRG8= <mlev>
##$CPDPRGB= <>
##$CPDPRGT= <>
##$D= (0..31)
0 1.2 0 0 0 0 0 0 0 0.06 0 0.03 0 0 0 0 0.0002 0 0 0 0 0 0 0 0 0 0 0 0 
0 0 0 
##$DATE= 1623224946
##$DBL= (0..7)
$$ [...]
##$SUBNAM3= <"">
##$SUBNAM4= <"">
##$SUBNAM5= <"">
##$SUBNAM6= <"">
##$SUBNAM7= <"">
##$SUBNAM8= <"">
##$SUBNAM9= <"">
##$SW= 20.0188882624521
##$SWIBOX= (0..15)
0 0 2 0 0 0 0 0 0 0 0 0 0 0 0 0 
##$SW_h= 4006.41025641026
##$TD= 16384
##$TD0= 1
##$TE= 0
##$TE2= 300
##$TE3= 300
##$TEG= 300
##$TL= (0..7)
0 120 120 120 120 120 120 120 
##$TP= (0..7)
150 150 150 150 150 150 150 150 
##$TP07= 0
##$TPNAME0= <>
##$TPNAME1= <>
##$TPNAME2= <>
##$TPNAME3= <>
##$TPNAME4= <>
##$TPNAME5= <>
##$TPNAME6= <>
##$TPNAME7= <>
##$TPOAL= (0..7)
0.5 0.5 0.5 0.5 0.5 0.5 0.5 0.5 
##$TPOFFS= (0..7)
0 0 0 0 0 0 0 0 
##$TUNHIN= 0
##$TUNHOUT= 0
##$TUNXOUT= 0
##$USERA1= <user>
##$USERA2= <user>
##$USERA3= <user>
##$USERA4= <user>
##$USERA5= <user>
##$V9= 5
##$VALIST= <valist>
##$VCLIST= <CCCCCCCCCCCCCCC>
##$VD= 0
##$VDLIST= <DDDDDDDDDDDDDDD>
##$VPLIST= <PPPPPPPPPPPPPPP>
##$VTLIST= <TTTTTTTTTTTTTTT>
##$WBST= 1024
##$WBSW= 4
##$XGAIN= (0..3)
0 0 0 0 
##$XL= 0
##$YL= 0
##$YMAX_a= 966770
##$YMIN_a= -974488
##$ZGOPTNS= <>
##$ZL1= 120
##$ZL2= 120
##$ZL3= 120
##$ZL4= 120
##$ABSF1= 17.54598
##$ABSF2= -2.473059
##$ABSG= 5
##$ABSL= 3
##$ALPHA= 0
##$AQORDER= 0
##$ASSFAC= 0
##$ASSFACI= 0
##$ASSFACX= 0
##$ASSWID= 0
##$AUNMP= <proc_1d>
##$AZFE= 0.1
##$AZFW= 0.1
##$BCFW= 0
##$BC_mod= 2
##$BYTORDP= 0
##$COROFFS= 0
##$CY= -3
##$DATMOD= 1
##$DC= 0
##$DFILT= <>
##$DTYPP= 0
##$F1P= 0
##$F2P= 0
##$FCOR= 1
##$FTSIZE= 16384
##$FT_mod= 6
##$GAMMA= 0
##$GB= 0
##$INTBC= 1
##$INTSCL= 1.334414e-10
##$ISEN= 128
##$LB= 0.24
##$LEV0= 0
##$LPBIN= 0
##$MAXI= 10000
##$MC2= 0
##$MEAN= 0
##$ME_mod= 0
##$MI= 1.114404
##$NCOEF= 0
##$NC_proc= -5
##$NLEV= 6
##$NOISF1= 3.799351
##$NOISF2= 2.8
##$NSP= 0
##$NTH_PI= 0
##$NZP= 0
##$OFFSET= 17.54598
##$PC= 1
##$PHC0= -11491.71
##$PHC1= 20.00101
##$PH_mod= 1
##$PKNL= yes
##$PPARMOD= 0
##$PSCAL= 0
##$PSIGN= 0
##$REVERSE= no
##$SF= 200.129997728255
##$SI= 16384
##$SIGF1= 3
##$SIGF2= 2
##$SINO= 5.538805
##$SIOLD= 16384
##$SREGLST= <1H.CDCl3>
##$SSB= 0
##$STSI= 16384
##$STSR= 0
##$SW_p= 4006.41025641026
##$SYMM= 0
##$S_DEV= 0
##$TDeff= 16384
##$TDoff= 0
##$TI= <>
##$TILT= no
##$TM1= 0
##$TM2= 0
##$TOPLEV= 0
##$USERP1= <user>
##$USERP2= <user>
##$USERP3= <user>
##$USERP4= <user>
##$USERP5= <user>
##$WDW= 1
##$XDIM= 16384
##$YMAX_p= 371566416
##$YMIN_p= -748505
$$ End of Bruker specific parameters
$$ ---------------------------------
##NTUPLES= NMR SPECTRUM
##VAR_NAME=  FREQUENCY,     SPECTRUM/REAL,   SPECTRUM/IMAG
##SYMBOL=    X,             R,               I
##VAR_TYPE=  INDEPENDENT,   DEPENDENT,       DEPENDENT
##VAR_FORM=  AFFN,          ASDF,            ASDF
##VAR_DIM=   16384,         16384,           16384
##UNITS=     HZ,            ARBITRARY UNITS, ARBITRARY UNITS
##FACTOR=    0.24454680195387, 1,            1
##FIRST=     3511.4770282972, 0,             0
##LAST=      -494.933228113057, 0,           0
##MIN=       -494.933228113057, -748505,     0
##MAX=       3511.4770282972, 371566416,     0
$$ Real data points
##PAGE= N=1
##DATA TABLE= (X++(R..R)), XYDATA
$$ [...]
7775 6169986 5873594 5725369 5713122 5853222 5909288 5911663 5775227 5953357 5896749 5979912 6293121
7764 6293121 6195710 6323781 6722779 7171663 7392969 7889779 8274284 8756108 9083122 9142238
7754 9142238 9196516 8885827 8440985 8489039 8625709 8679010 8894263 9324214 9113696 9052925
7744 9052925 8847790 8275133 7713310 7067888 6546790 6087520 5485729 5213774 4940156 4638580
7734 4638580 4561682 4436186 4191471 4245188 4352792 4243702 3887900 4058928 4081820 3813282
7724 3813282 3909052 3569690 3610169 3622397 3418103 3329848 3378542 3225128 3128815 3216537 3345130
7713 3345130 3145202 3131009 3259011 3128579 3191852 3162856 2998630 3220688 3401636 3498066
7703 3498066 3570610 3513112 3793321 3833760 3818102 3859987 4013033 3879917 4136667 3978157
7693 3978157 4005857 4090650 4227391 4672711 4705869 5058441 5107769 5565587 5745298 6070254
7683 6070254 6473823 6956539 7535401 8274072 8711881 9411284 10040465 10521041 10930112 11133136
7673 11133136 10874451 10154250 9891233 9822039 9824267 10038630 10419621 10628560 10778434 10605722
7663 10605722 10298786 9806154 9122403 8678937 8263694 8002555 7763817 7826706 7870106 8091214
7653 8091214 8229472 8404760 8719094 8980744 9322358 9652964 9963930 10492977 11008423 11751890
7643 11751890 12603062 13435106 14444997 15502067 16048605 16578593 16738179 16257200 15565849
7634 15565849 14649536 14443530 14235450 14414873 14519922 14755843 14723300 14349608 13654220 12890384
7624 12890384 11811295 10628419 10075163 9283019 8905946 8368237 8328262 8347331 8392131 8100273
7614 8100273 7967857 7951688 7941021 8135092 8330326 8451539 8542804 8931822 9341305 9924114
7604 9924114 9842502 9895351 10144508 10288354 10275572 9845700 9010219 8446600 8022501 7969620
7594 7969620 7699338 7923208 7980840 7903406 7864811 7621775 7073263 6184652 5540378 5398459
7584 5398459 5137384 4820890 4596042 4502675 4366706 4146993 4115950 4215017 4180339 3998082
7574 3998082 4026793 4041057 3750928 3407065 3400559 3259415 3200884 2851749 2558908 2504945 2354292
7563 2354292 2230905 2210545 2291465 2229765 1987125 2157778 2299468 2119093 1979993 2019606
7553 2019606 1856790 1846033 1777501 1496873 1415646 1560982 1691488 1623258 1591984 1489499
7543 1489499 1540444 1496657 1096522 1193158 1387520 1206824 1036035 1019797 1414415 1311611
7533 1311611 1313914 1306969 906536 977394 1049132 835954 919162 812434 896123 814501 833787
7522 833787 882139 689866 686398 869277 775390 875717 995096 767832 639765 452520
7512 452520 508589 411056 325268 532315 634920 613347 586200 537305 609923 582442 408962
7501 408962 215955 294576 267877 663799 712461 602210 476697 625535 808843 387277
7491 387277 474333 462678 604664 403711 67617 410378 401147 420648 230872 383729 519836
7480 519836 639884 593392 508828 521943 428136 406026 358271 522798 427356 503197 540985
7469 540985 576242 731611 619319 498056 480382 696159 824701 682512 851328 961157
7459 961157 1205290 1044643 820225 1332563 992120 1047739 1382660 1278153 1079622 986750
7449 986750 996051 961338 914467 967240 1159165 986032 850216 1033707 1051437 844396 592888
7438 592888 825460 1082981 1139298 1170282 1342464 1340667 1229310 1079898 1060279 857184 964145
7427 964145 938313 649394 663498 398601 512729 653745 906725 850695 962600 842918
7417 842918 1084720 1053251 904402 741929 933580 639404 625838 401329 360134 468981
7407 468981 359082 473595 546291 588646 458882 830264 575100 698647 826517 894422
7397 894422 928817 832269 762091 681198 445897 457242 421976 317185 165095 501176 245220
7386 245220 193804 317461 115739 249814 307902 163471 297180 360210 124327 201067
7376 201067 110213 49722 -56296 -102753 127293 333283 394252 260871 76286 76342 -99842
7365 -99842 -25462 -7779 -99697 -67532 -123166 82773 170799 220215 133057 131528 74444 -61327
7353 -61327 97531 -121013 -109759 -172789 -241593 70415 162558 -15713 -107448 -21926 78872
7342 78872 34104 59538 -54936 -82596 -66592 -162324 -168042 172772 130587 -70617 49430
7331 49430 87717 -23508 87582 226246 -86429 118455 66752 -326821 -247986 -24642
7321 -24642 153587 -103394 -77314 52710 -70449 -139801 -68688 -178904 -91082 210880 145511
7310 145511 -252128 -142121 -68009 -160927 -210994 -43524 -116512 -95687 13973 -119082 -293803
7299 -293803 -279431 -96284 46992 -119863 -195582 8755 -87263 -81230 -290859 -199857 20606
7288 20606 10300 69921 304470 -66826 -104453 120164 4823 -271105 -366799 -248586 -390832
7277 -390832 -196744 -245999 -359737 -143263 40913 188013 165280 -94467 -74268 -119229
7267 -119229 -280419 -23526 -138045 -232644 -160503 74317 219737 476762 149852 40160
7257 40160 127048 4944 -24881 -204053 -110410 -106536 -43792 170617 178041 -19617 -134202
7246 -134202 -142953 -92766 -72934 102179 106374 -319686 -373324 -262016 -159906 -127917 -206681
7235 -206681 -153472 -256595 -263617 -356240 -398815 60200 -223879 5289 -181054 -61099 -226541
7224 -226541 -328605 -347974 -235863 -152108 -335249 -25028 -36288 115095 159618 153052 -81736
7213 -81736 -285980 -301775 -271730 -228450 22714 45017 163328 4979 123210 -181740 -144429
7202 -144429 -323441 -383667 -397970 -380773 -345668 -245942 -220634 -76163 213475 41056 184027
7191 184027 76005 40889 -99815 -168008 -227029 -154561 -39335 97235 -38786 45913 69524
7180 69524 -68847 227626 334019 224076 -77810 -226805 -443958 -278003 -90013 -154948
7170 -154948 -96713 -93596 44723 -44915 -27201 -74759 -159600 -135261 -137510 -102102 -217134 -286679
7158 -286679 -234793 -90708 -161344 -227750 -14635 77529 175941 151672 -7224 -72090 -326684
7147 -326684 -224035 -445715 -289293 -320093 -414730 -493361 -534706 -457390 -168524 -657842 -651470
7136 -651470 -448400 -464247 -225325 -12587 -103299 -372010 -222977 -60164 -122764 -330652
7126 -330652 -210193 -268719 -274142 -308702 -231168 -462786 -364196 -241732 173003 56696 -113433
7115 -113433 114845 -96032 -395163 -218975 -222538 -294550 -294358 -119639 -111234 -71271 -194
7104 -194 214286 50004 -236910 -268907 -282198 -93311 -324864 -223020 -117340 -403847 -215080
7093 -215080 -2934 -40141 -14788 -40219 -51095 -147383 20113 -168835 -176493 -65612 77086
7082 77086 -326187 -441091 -196253 -446642 -328178 -239586 -159433 -264001 -316207 -95786
7072 -95786 -352143 -431600 -272887 -229041 -60215 -228244 -394233 -454445 -261060 -355606 -62493
7061 -62493 -156575 67144 -41801 -251799 -170464 -137840 -112201 -28055 -97805 -229414 -169170
7050 -169170 -260522 -480999 -259452 -142166 -201079 -79562 -257293 -400068 -555349 -401918
7040 -401918 -281413 -153282 -235883 -296652 -254145 67697 59452 -132028 -122924 -90183 -137804
7029 -137804 -34889 -17890 -333914 -350053 -276571 -198189 -304080 -568376 -306992 -132226
7019 -132226 -183589 -189253 -164470 -416669 -415370 -423603 -219760 -209034 -118874 -281054 -163063
7008 -163063 84834 135511 -369197 -306190 -178626 -543010 -429378 -125766 -247217 -183494
6998 -183494 -231878 -268840 -411204 -556429 -401305 -349150 -484256 -429832 -307664 -385333 -406030
6987 -406030 -476434 -510347 -554414 -297576 -550971 -395464 -291938 -473788 -382320 -177619
6977 -177619 -581914 -329528 -213930 -226668 -316563 -151183 62665 37929 -54315 -100556 -70418
6966 -70418 -270160 -384456 -336842 -354067 -453469 -349757 -326832 -212622 -116126 253 -264405
6955 -264405 -71315 -87528 -57228 20456 -236555 -408955 -438145 -71652 -232190 -402239
6945 -402239 -200304 -272164 -47622 18551 -146575 -302339 -230635 -250214 -261020 -346471 -497313
6934 -497313 -237267 -344807 -101550 -302651 -235891 -180305 35082 -312020 -191652 -185659
6924 -185659 -200990 -219984 38907 -341249 -395665 -124896 -305332 -286249 -522909 -449490 -325339
6913 -325339 -143746 -186048 -28057 -61075 -17493 -200725 -81526 -113846 -188406 22163 170499
6902 170499 33763 -124920 -229209 32555 -384995 -185210 -187539 -265575 -86187 -167471
6892 -167471 -17460 -261604 -137158 74062 -167334 -423478 -241034 -201028 -120843 52499
6882 52499 36251 58773 26461 -44726 -60643 -340694 -333488 -271865 -143306 105385 -195771
6871 -195771 -287925 -125 55711 163454 193843 -215832 -531788 -490467 -345122 -283714 -35604
6860 -35604 -59916 -134855 38888 29650 -372647 -186034 -402988 -719938 -593632 -348845 -625215
6849 -625215 -508952 -197404 -192886 -116421 -268338 -291615 -359548 -243081 42105 24413 -57419
6838 -57419 -83532 -16438 -68603 -414877 -319381 -364528 -345405 -385415 -404536 -286310 -241783
6827 -241783 -62607 -108908 -200539 -11665 50507 14888 135719 131205 211662 -89886 -97909
6816 -97909 -204473 -303060 -493344 -433097 -284956 -349453 -334650 -155129 -116478 -396913 -234336
6805 -234336 -78461 -308280 -400868 -199772 -251295 -124705 -20115 79381 49985 -242413
6795 -242413 -124522 -170402 -117700 -74875 -159591 -24371 -10367 269061 334363 247022 183599
6784 183599 170287 123690 -42799 -54924 40257 -86103 44977 102458 42727 -34348 177960
6773 177960 -92367 -33890 -180374 -41872 -69346 -104593 -223046 -253792 -234799 -380322 -290718
6762 -290718 -291334 -243624 -86843 120462 112578 105656 -7025 -127115 -128114 -80062 -15522 -183505
6750 -183505 -70983 39067 -161817 48490 44394 -80517 -66656 -33380 -248624 -240383 -81567
6739 -81567 -347841 -88324 -59233 -30704 94181 242226 157028 176087 23309 70622 -117606
6728 -117606 -101558 -209538 -398370 -281673 -291221 162158 196949 176991 12883 -147020 55377
6717 55377 82016 -12815 15101 78632 200141 -42473 63166 120296 -125331 -215697 -17970
6706 -17970 -89832 79100 100690 264800 240217 111244 -47315 -20275 -132224 -1259 37192
6695 37192 97416 -4597 75880 -118843 189801 156858 118029 272688 163943 93992 31412
6684 31412 30310 -157339 39071 192836 23199 115500 261698 48191 33553 299340 432746
6673 432746 355488 369587 238226 85674 -75200 98810 298341 121605 286819 368663
6663 368663 161312 95218 116986 -113736 -86332 256980 209211 146142 247195 238704 208246
6652 208246 138171 119040 -978 -115924 -31108 -359419 -38863 -86200 38670 -61603
6642 -61603 -172826 -270477 -228839 83983 -126650 -211207 -156582 92864 15571 53578 -13688
6631 -13688 -69510 -11264 -17624 168709 -6504 -175279 89901 115912 11550 257069 -73560
6620 -73560 15452 15345 -72124 -153701 -79140 44090 107626 85718 -69597 20078 -153371 -110588
6608 -110588 203973 32616 120563 122895 45741 -238327 -417405 -648334 -426702 40446
6598 40446 -39314 -9641 -109154 -201356 -419713 -383273 -466152 -220516 -299812 -82703 77598
6587 77598 165654 262058 397290 42831 -134737 -82893 -342797 -90678 32033 -30293 -5333
6576 -5333 17162 64627 153495 -122672 43578 120061 -80691 -51115 -158403 162269 73620
6565 73620 -53199 -139579 -71127 -159460 -58292 -252986 -272954 -109637 -274220 -109845 1146
6554 1146 -82953 -248675 -181408 -64825 236201 32184 174236 81162 69603 -25350 -241174
6543 -241174 -307537 -402756 -528044 -335372 -122725 -84245 60606 -9840 174599 49662
6533 49662 -46085 -153705 -88674 -287091 -546124 -342668 -164564 -201450 -316045 74928
6523 74928 -229493 -269426 -160791 -349766 -411411 -303985 -396134 -194431 -106194 100269 217744
6512 217744 126023 216 -17730 -23150 30550 29046 -103174 -364519 -232744 -268519 -175247
6501 -175247 -153659 -211683 -419355 -268249 -25147 38677 -60151 -381434 -153927 -211717 -191775
6490 -191775 -22084 -27532 -239969 -371634 -330307 -200636 -420167 -255860 -265748 -125028 -191587
6479 -191587 -79852 -33227 143995 -193122 -237879 -20246 134785 -100731 67651 -78534
6469 -78534 -114629 -259355 -254647 -137174 -302871 -159040 -58363 18299 -180126 42808 -14269
6458 -14269 -348199 -111926 -169789 -91456 395811 71937 -56455 -101650 -169795 -177485 -149340
6447 -149340 -220549 -175270 -93150 -278156 -126627 -116710 -367656 -307691 -31535 -160630 -266788
6436 -266788 -113347 -108128 -98498 -16762 -121619 -59954 61215 -135816 -84570 -212199 -308452
6425 -308452 -161136 -108756 -344668 -473156 -460093 -384594 -348373 -66034 1491 -193378 -175401
6414 -175401 -177273 -95648 -111394 -92015 -225614 -127253 -63802 -50401 -84100 68822 -109845
6403 -109845 -164878 13588 -23845 -83535 -264800 -85287 -204921 -199566 -123048 84566 -57354
6392 -57354 77931 -5675 -169322 -137266 -22521 -24312 11878 -76961 271513 197663 122644
6381 122644 298976 149038 70391 -118289 -123094 -356627 -207081 -124389 -24043 124216
6371 124216 57549 32327 97882 -26871 -28695 81491 -38377 -147280 -230073 117351 -59058
6360 -59058 -155673 -9227 -141197 68005 -42530 -295052 -158683 -147558 -401116 -44868
6350 -44868 184480 115471 -8209 126707 127655 -148673 -135267 -127507 -168557 -161003 129050 371
6338 371 -205116 -66144 -45211 94303 -9847 -15421 -15267 167340 197201 152292 149693 66876
6326 66876 129472 40803 -56443 -328640 -307397 -227466 38848 128313 265579 451512 184173
6315 184173 -116834 19308 25526 -132818 -18678 -139238 -345677 -396587 -466087 -437659 -173414
6304 -173414 -13709 43684 -189426 -287933 15981 -57140 -192986 -22359 -51497 -65336 -146714
6293 -146714 -67081 -288807 -189065 -179119 -392077 -363940 -232252 -248153 -68810 106905 19707
6282 19707 -73973 30083 6443 38640 -43618 -242095 28181 25238 -65625 -91055 115921
6271 115921 -18853 105611 13213 -87739 109013 43698 40061 -6071 -97942 -289013 -48014
6260 -48014 -311519 -441569 -101181 -204021 -171675 -163945 -55649 -180129 -26876 -80742 -177563
6249 -177563 -332398 -326869 -225333 -325837 44091 -90347 -331907 -113178 -87698 1943
6239 1943 -30374 -124462 -67194 -258993 -310933 -147795 -384439 -452061 -123220 -205886 -176668
6228 -176668 -155970 -23616 -24833 -198339 -119329 -53272 -86534 -315260 -162034 75818 -21168
6217 -21168 -170140 -259343 -123233 -152189 -172311 -323686 -15060 -88140 -147508 -59370 -330849
6206 -330849 -119048 -47287 -253218 -192237 -46524 244665 125773 -2170 74788 -217415
6196 -217415 -403804 -205584 -77205 -354819 -271347 -196781 9571 -7885 -43830 -117143 -220843
6185 -220843 -189497 48544 -57690 -110348 -95959 -150442 -23492 -53522 -237880 -204045 -303072
6174 -303072 -62301 4060 -220206 -236697 -95467 -196445 -56856 126369 102792 -29797
6164 -29797 -393738 -150112 -282340 -194795 -140978 -199190 -5055 -104441 -281047 -48709 -192245
6153 -192245 -23881 -256678 -279666 -337221 -122256 -56318 -417290 -294127 -151420 -76700
6143 -76700 -268466 -291535 -12974 -359371 -386105 -309543 -284314 -249665 -33708 46752 -274879
6132 -274879 52180 -3750 95192 -137422 -76310 -157084 -61495 10025 18945 257338 319167
6121 319167 37302 290689 290578 -133383 92964 -37598 95802 -276100 -352223 -107362
6111 -107362 -135433 -31105 -125278 19403 -137756 39204 18465 59640 163747 75439 88022
6100 88022 153205 234419 232700 277075 335637 233506 123007 126420 -31194 2456 -77089 -15461
6088 -15461 27485 -222866 -214739 -19477 -132154 -211293 -213281 71363 18118 -196581 -219498
6077 -219498 -191547 -253783 -76311 -196544 -153193 -348665 -251663 -61629 1313 94648 -26408
6066 -26408 -99654 184862 140341 -157968 53932 -86628 -39520 -304990 -116802 -213099 -132705
6055 -132705 -94424 -174732 -26417 61816 -186003 -48287 -7871 93779 52847 -79264 23111
6044 23111 55621 -43640 8752 163692 140673 -50963 -285608 -108662 136859 276308 22670
6033 22670 123445 279431 191414 414585 406935 304893 78477 69977 137928 172433 185832
6022 185832 365055 266618 212617 135944 -172115 -133633 -34836 52006 -54605 140450 4041
6011 4041 956 9538 87228 -48618 -201630 -215754 -148603 14302 163099 -16074 54210
6000 54210 37255 -140308 50300 178533 43828 -388 156214 226785 188164 177411 229715
5989 229715 -69394 -287114 -434984 -201328 -166925 -174799 -63269 -34291 134604 127407 122696
5978 122696 -49808 16917 -97099 -58060 -126401 -141188 -87209 -36537 46063 259992 105128
5967 105128 -16122 -90181 20352 132533 47039 46148 36056 108161 52866 -150860 154579
5956 154579 196471 -120016 17378 134579 11020 -216700 -72784 148204 115524 235300
5946 235300 139667 156345 126245 193578 138190 -83385 -184007 -168444 -46754 -89569 -170678
5935 -170678 -111111 -130612 -443394 -85199 -55092 -214111 -366874 -144886 -243407 109834
5925 109834 291493 84569 41898 52039 -130248 -295261 -84447 -86523 -278882 -137303
5915 -137303 64817 104620 -62434 53121 245193 185452 298058 112105 -4713 130928
5905 130928 86511 -154880 97757 275872 163724 -167087 66360 509138 142983 18983
5895 18983 33269 141755 -27255 47407 207952 225455 32723 -125972 44892 239030
5885 239030 308907 329800 372074 149343 -120652 4279 112002 -28095 130365 49115
5875 49115 -46301 56874 389918 140166 104725 273749 -14502 -120101 -74031 -144269 -43754
5864 -43754 -17001 32399 203659 233269 275968 13694 22440 87320 331768 202062 200334
5853 200334 152921 125842 242546 411539 314145 110435 199692 260396 33818 98891 253884
5842 253884 -83418 7442 -96753 -233319 -179881 -174265 -158063 179515 298737 271414 -17304
5831 -17304 -3293 107955 16706 38269 -3958 187605 156585 135592 140525 406075 493131
5820 493131 311362 311747 102751 33121 -27122 58994 142991 -11377 44538 290406 329256
5809 329256 258665 312770 157140 -27748 234831 32981 -205269 -9952 59083 -128377
5799 -128377 117161 245435 274160 218658 174397 273049 126413 -46905 -85356 -33021 58796
5788 58796 98853 -45928 9340 179567 98932 220673 167529 246668 267909 69439 171206
5777 171206 156717 81196 283729 151674 161381 112268 -48600 299960 399729 218510 346522
5766 346522 216592 51280 203420 107302 325088 372558 314444 327204 293068 269768 358730
5755 358730 374705 176626 292651 188140 302704 499346 248701 212326 59057 201232
5745 201232 220405 323663 295279 155449 201390 248957 189804 254488 172992 210123 512899
5734 512899 534470 351236 359820 387325 198357 335948 378369 425333 621397 465964 417211
5723 417211 412652 492716 492188 610137 440780 416074 304898 93655 116981 364681 300419
5712 300419 211361 367487 395020 395079 630101 638027 329232 535319 383710 315858 191316
5701 191316 347926 564695 410967 473386 750210 539160 433876 668078 658474 578418
5691 578418 524652 664282 646474 506639 390826 439133 487204 674293 576630 355358 518879
5680 518879 463260 536900 487476 310083 367607 435772 359610 366226 371291 446687 600500 755575
5668 755575 521766 249896 512065 634674 711406 549201 611180 706304 549241 797127
5658 797127 713533 630956 683533 815701 797360 733383 540767 437116 400574 525407 717493
5647 717493 738596 509485 483422 646539 657929 707995 972761 924205 939609 853069 831444
5636 831444 791942 701888 607430 932305 1127506 999432 1011442 1118945 959430 782322
5626 782322 741232 968375 919727 571111 724714 909798 827778 944176 1056532 1066790
5616 1066790 989903 910143 1069550 842656 937375 865220 907338 1126271 1216944 1033581 1136503
5605 1136503 936010 1158009 990243 978861 1090172 1092101 750054 924826 980803 886919
5595 886919 870977 1044570 1108808 979115 1202517 1205848 1201984 1595178 1382060 1150550 1223081
5584 1223081 1059957 970926 1055387 949369 919897 1358689 1516871 1279752 1227933 1443039
5574 1443039 910108 1202332 1309371 1317239 1263102 1297730 1468464 1311761 1274407 1256329 1462688
5563 1462688 1548121 1790538 1434857 1475442 1592663 1435099 1363052 1334934 1347645 1556396
5553 1556396 1643874 1671286 1771133 1576133 1698922 1431080 1560837 1718684 1642748 1716741
5543 1716741 1719816 1576744 1439875 1460668 1474108 1040053 1423720 1682520 1612863 1481468
5533 1481468 1487115 1498628 1469992 1649119 1611133 1768110 1830323 1863235 1828812 1532090 1581778
5522 1581778 1651900 1742540 1698021 1637803 1524760 1610440 1669435 1752306 1826027 1767055 1717622
5511 1717622 1926121 1735750 1803183 1939306 1834758 1784081 2020798 1925005 1815277 2038900
5501 2038900 2067228 2255008 2056171 1980254 2014574 2066134 2048457 2054085 2371326 2249526 2360053
5490 2360053 2337638 2278436 2430772 2521417 2384130 2616034 2720087 2560698 2639921 2371060
5480 2371060 2717287 2489158 2544638 2856215 2874963 2854330 3021782 2883750 2955664 2997634
5470 2997634 3031034 2881132 3046733 3131282 3209720 3447224 3324242 3317671 3489500 3792431
5460 3792431 3960332 3969393 4209072 4082853 4128588 4326245 4478280 4572748 4378369 4686018
5450 4686018 4722210 5252440 5845555 5963754 6364910 6828301 6883242 7094073 7510285 7757564
5440 7757564 8292110 8581183 9132668 9266668 9471053 9384347 9210887 8854139 8368498 8278471
5430 8278471 8212256 7918323 7868666 7919160 7920723 8013214 8214817 8543565 8615411 8847968 9188070
5419 9188070 9674204 9759607 10178819 10649393 11298250 11688682 12283181 12791019 13144951 13456965
5409 13456965 13879237 14028485 13894802 14083868 14091386 13970845 13620806 13478440 12890499 12239939
5399 12239939 11849430 11271944 10965596 10685335 10397003 10208151 10096903 9760821 9745776 9858901
5389 9858901 9837984 10033370 10372961 10449692 10396251 10737866 11078956 11545886 12039326 12522167
5379 12522167 12932721 13416342 13708273 14058508 14394340 14207630 14552568 14672726 14498223
5370 14498223 14875459 15183127 15076176 14998103 14689377 14614676 14302619 13671346 13210271 12517441
5360 12517441 11906035 11301669 11116595 11077695 10833191 10821326 10952518 10921573 10974905 11431970
5350 11431970 11620806 11830697 12552122 13065866 13580475 14502989 15193312 15727157 16630496
5341 16630496 17191088 17998836 18379944 18384957 18420564 18326600 17556868 16848316 15910795 14755405
5331 14755405 13692641 12561995 11818332 11079060 10763858 10008119 9716784 9673061 9251365
5322 9251365 9053487 9129845 8963180 8964666 8971867 9152785 9476298 9798719 9828080 10093015 10416551
5311 10416551 10562466 10896040 10759115 10704000 10480465 10044493 9489741 8722503 7820922 7259338
5301 7259338 6710215 6296837 5891694 5494855 5119882 4529725 4350211 4389335 4207491 3780135
5291 3780135 3674144 3420992 3345754 3231531 3500057 3272495 2889642 3144219 3096123 3184030
5281 3184030 2921551 2643719 2564094 2707021 2727403 2640905 2446932 2208786 2329583 2344835
5271 2344835 2353447 2251602 2084609 2138173 2292001 2244738 2042506 1907068 1628645 1827029
5261 1827029 1876363 2025119 1825654 1772832 1978653 1767329 1854529 1886307 1848854 1841739 2108578
5250 2108578 1951273 1858177 2060262 1868534 1729367 1684085 1551592 1263938 1433272 1474666
5240 1474666 1548521 1594788 1834220 1895177 1480642 1391218 1382225 1317831 1521801 1552920 1208466
5229 1208466 1318365 1404445 1157213 1396020 1440897 1267206 1320945 1444174 1491732 1316068
5219 1316068 1586748 1400252 1130907 1397735 1367732 1140605 1495383 1671702 1422875 1583796
5209 1583796 1504875 1289237 1041806 1091443 1133722 1128185 1156205 1172356 1242324 1368288 1361871
5198 1361871 1232112 1245553 1283029 1289632 1046888 1132044 1332500 1232090 993129 1266387
5188 1266387 1348571 1416677 1325279 1448019 1421136 1564889 1434262 1479744 1284518 1042322
5178 1042322 1259463 1210199 1403712 1485750 1425742 1563836 1698156 1538057 1436833 1412110
5168 1412110 1387230 1331663 1415564 1471431 1176182 1137830 1183132 1223320 1217984 1155611 1377916
5157 1377916 1659895 1650297 1657698 1767073 1531976 1299512 1527144 1736012 1490946 1538356
5147 1538356 1614249 1766133 1706599 1780062 1622128 1405086 1609107 1873179 1807220 1885508
5137 1885508 1890947 2063398 2200874 2076319 2076893 1889667 2010267 2165078 2198575 2147084 2171527
5126 2171527 2210517 2513464 2367384 2356661 2395157 2569406 2824259 2962828 3227275 3339303
5116 3339303 3440711 3587660 3805899 3666671 3900813 3752882 3662376 3480777 3695285 3514202
5106 3514202 3173220 3139917 3066639 2980609 3307787 3217198 3119922 3566471 3768507 3918080
5096 3918080 4458779 4690702 5089191 5403936 5339833 5808874 5856379 5753355 5395156 4934526
5086 4934526 4695581 4300658 4052883 3710013 3656889 3394567 3307919 3505196 3454317 3401818
5076 3401818 3512176 3267851 3479590 3588128 3803732 3963791 3979543 4106134 4088618 4431585
5066 4431585 4444506 4388392 4120015 3895702 3617772 3463839 3280081 3461068 3110395 3085865
5056 3085865 3187143 3161807 2833862 2948664 3020890 2923365 3061592 3327372 3329257 3383678 2971167
5045 2971167 3007695 3027129 2944870 3179602 3110062 3261021 3426910 3390849 3472484 3347890 3081681
5034 3081681 3298233 3349350 3639817 3807345 3695213 3777598 3979477 4007843 4094734 3962469
5024 3962469 4108509 4286280 4312962 4456720 4630468 4990828 5282499 5265949 5218934 5451473
5014 5451473 5381313 5579613 5837696 6076744 6138356 6226587 6144135 6395886 6293273 6530447
5004 6530447 7091187 7417698 7648921 8106401 8506202 8533557 8983459 9298466 9568442 10471776
4994 10471776 11116455 11805747 12522276 13355096 14515253 15569809 16497087 17877006 19384841
4985 19384841 21081825 22928731 24569978 26315952 27920295 29710909 31182339 32672844
4977 32672844 33414926 34077306 33968093 33862369 32842334 31435742 30381456 28485173 27231724
4968 27231724 26069967 24724927 23807416 22889041 21898078 21309374 20766457 19764319 19415322
4959 19415322 18786190 18302384 17790623 17183193 16673602 16556471 16219366 15768440 15596937
4950 15596937 15135303 14025040 13109509 12593949 11841764 11361089 10867304 10591087 10092884
4941 10092884 9820861 9586781 9336127 9037163 8457382 8509748 8466616 8341524 8140776 7956939
4931 7956939 7791389 7788839 7939437 7713207 7315051 7197817 6722704 6519756 6263662 6031047
4921 6031047 5654472 5416225 5420947 5308234 5308515 5165203 4824589 4648265 4597687 4358060 4092729
4910 4092729 4082119 4125363 3797739 3940939 4010434 3954453 3831383 3856519 3759365 3845269 3999913
4899 3999913 3794155 4104426 3895175 3561899 3700019 3684499 3479948 3630401 3557374 3319975
4889 3319975 3214376 3087104 3105645 2937590 3070487 3026743 2839574 2661313 2537544 2492966
4879 2492966 2880295 2718967 2385981 2714957 2955973 2776044 2470486 2720936 2645905 2296895
4869 2296895 2554839 2499181 2400133 2442877 2316937 2433989 2432466 1984335 2325040 2364557 2019636
4858 2019636 2290286 2317858 2158286 2217041 2117128 2137896 2224439 2154004 2019525 1936186 2081787
4847 2081787 2205033 2162743 2323084 1808145 1793645 1755861 1591949 1797670 1914314 2092474
4837 2092474 1935139 1901996 2086215 2102956 2072255 1959793 1996489 2017140 2057643 1979666 1791061
4826 1791061 1941329 1817006 1700990 1779335 1622134 1813334 1841642 1876687 1910317 1910799 1760814
4815 1760814 1903890 2060392 1924579 1997186 1932789 1663920 1880948 2039406 2052889 2158989
4805 2158989 2113833 2188852 2354492 2542725 2624730 2721105 2600744 2780449 2918576 3104782
4795 3104782 3425753 3570808 3889437 4129243 4533912 5012169 5198873 5509600 6025353 6615359
4785 6615359 6690538 5451626 4476148 3966179 3356121 3056328 2696269 2425487 2487005 2364179
4775 2364179 2306580 2113110 1961323 2113086 2111404 1853327 1822183 1877172 1800271 2263389 2079405
4764 2079405 2060718 2022800 1931520 1827193 1882678 1615789 1774758 1634642 1758012 1600665
4754 1600665 1744679 1759721 1815119 1606880 1933234 1999242 1657519 1717647 1532970 1524661 1341433
4743 1341433 1454686 1433935 1469475 1525846 1644178 1537177 1436072 1611727 1552855 1494699
4733 1494699 1536434 1617422 1544897 1470885 1603390 1811315 1730088 1720052 1863455 1829445 1678844
4722 1678844 1745215 1977603 1778306 1834654 1712866 1733771 1587470 1732063 1608240 1635504
4712 1635504 1521860 1404597 1858791 1834424 1626998 1494431 1502277 1669402 1770250 1754441
4702 1754441 1648534 1630411 1678743 1962725 2151572 1982851 1917195 2008003 1851515 1792091
4692 1792091 1905687 2018411 1974494 1909988 2046198 1842489 1979523 2258507 2284924 2192498
4682 2192498 2041817 2165243 1998791 1999966 2151455 2034687 1930772 1987350 2039902 2023973
4672 2023973 2048933 2097737 2326910 2406145 2026934 2133115 2107012 2230805 2278145 2384743
4662 2384743 2541813 2241229 2025049 1836157 2061114 1990284 1997656 1928373 1851953 1809777 2124898
4651 2124898 2284233 2373548 2202264 2279373 2252210 2394548 2384116 2215893 2199077 2341226
4641 2341226 2418273 2265021 2593997 2621700 2546228 2578349 2709400 2492274 2385649 2627667
4631 2627667 2663643 2448529 2594954 2515607 2317364 2268116 2236544 2021067 2173421 2094958
4621 2094958 2310137 2432969 2657879 2564774 2560967 2358433 2319834 2188768 2353699 2297550
4611 2297550 2450490 2407229 2556175 2617472 2267933 2407051 2422883 2326683 2277155 2284764 2305279
4600 2305279 2489362 2610041 2621987 2283943 2203325 2409531 2636264 2705548 2666859 2336546
4590 2336546 2375549 2389167 2402137 2559080 2477002 2660685 2817530 2765434 3103559 3029070 2941480
4579 2941480 2657664 2942363 2824375 2697012 2752218 2645998 2715192 2843501 2612614 2763804
4569 2763804 2884373 2555794 2777781 2686094 2608043 2841975 2627454 2524280 2578367 2452257
4559 2452257 2380958 2481048 2606775 2811371 2851286 2793437 2877235 2873812 2917220 3002407 3104234
4548 3104234 2967572 2813721 2714924 2974224 2919542 2795812 2759135 2636594 2682527 2823470
4538 2823470 2876694 2860230 2960149 2914895 2812688 2719509 2788661 2592786 2492927 2763440 2892657
4527 2892657 2807176 2694472 3015455 3043284 2729649 2795398 2865544 2643494 2491083 2980276
4517 2980276 2921958 3114629 3117091 3304565 3473927 3505200 3370214 3326991 3378692 3554785 3692303
4506 3692303 3719665 3804211 4012911 4080606 3936050 3945540 3890717 3761461 3716402 3896398 3879021
4495 3879021 3956006 3999255 4222495 4414105 4244811 4662253 4804845 4752803 4998413 4772681
4485 4772681 4542775 4697065 4985634 5335318 5333740 5460591 5701472 5499033 5727659 6120289
4475 6120289 6155025 6337850 6667950 6866253 7097753 7592636 8073634 8260303 8811030 9125616
4465 9125616 9410525 10004010 10380316 10517194 10892831 10601777 10398357 10524089 10248480 10092902
4455 10092902 9891769 9911285 9673063 9482709 9705487 9640470 9882827 10157452 10157817 10421350
4445 10421350 10843883 10962279 11246759 11465948 11607347 12145649 12691078 12679529 13054388 13192267
4435 13192267 13599728 14006440 14106656 14207470 14316940 14242457 14304665 14253622 14620786 14283173
4425 14283173 14211613 14276827 13919723 13645745 13644151 13504620 13523769 13678113 13513883 13887280
4415 13887280 14031140 14040026 13958015 14009245 13941197 13792413 13983622 14054936 14182872 14473438
4405 14473438 14561456 14776748 14912151 15184576 15918446 16098550 16519485 17290636 17473760 17686549
4395 17686549 18153793 18579535 18721546 18573336 18574459 18023983 17540953 17188777 17040098 16883437
4385 16883437 16398833 16389517 16586688 16772090 16921383 17355855 17546349 17750797 18271990 18970910
4375 18970910 19355506 19887679 20463495 21338900 22039805 23027111 23833157 24699338 25625730
4366 25625730 26738961 27620511 28558375 29484021 31003856 32114066 33232270 34611622 35771623
4357 35771623 37250747 38706510 40198681 41572133 42665521 43619573 44403230 44968446 44864591
4348 44864591 44317185 43206256 42116219 40746990 38688171 36992717 35579425 34187952
4340 34187952 32952578 32081771 31140016 29857123 28961965 28215614 26728047 25275772 24079563
4331 24079563 22864343 21759450 21153738 20299967 19604858 19148949 18612220 18170046 18019872
4322 18019872 17795205 17242840 16905606 16822071 16784112 16663730 16793627 16927255 16779736 16375120
4312 16375120 16405753 16196082 16074062 15962933 15936676 16284117 16033257 15694966 15444498 15153007
4302 15153007 14834352 14242586 13781982 13338353 12908297 12610172 12419899 12421627 12302712 11938365
4292 11938365 11838312 11678114 11402648 11175624 10763487 10735821 10464618 10257424 9998761 9833037
4282 9833037 9701470 9843031 9590910 9674274 9382845 9271176 9141577 9187952 9500480 9181883
4272 9181883 9025835 8937337 8818445 8624275 8474706 8441935 8528068 8484903 8511470 8716365
4262 8716365 8876051 8988548 8818997 8851031 9049091 8879493 8713250 8921523 8810480 8796980
4252 8796980 9056324 8915835 8981400 8631046 8815276 9074241 9133030 9290305 9117190 9404898
4242 9404898 9379893 9672856 9659463 9609989 9583104 9639658 9646058 9782470 9951385 10013247 10006985
4231 10006985 10049515 10208999 10256377 10404924 10460008 10757063 10808259 11157639 11230467 11280758
4221 11280758 11383237 11442609 11710366 12127736 12140497 12342313 12719787 12901498 12982601 13388333
4211 13388333 13688575 14241628 14463130 14704091 15031114 15445010 15813749 16325307 16975405
4202 16975405 17508330 18034452 18822437 19462684 19566394 19650720 19769842 19797226 19579170 19507216
4192 19507216 19409837 19645043 19728035 19888924 20048697 20524514 20927632 21206896 21736996 22612309
4182 22612309 23402457 24176742 25292932 26101652 27031652 28307480 29674744 30783781 32187595
4173 32187595 33896998 35384655 36895835 38105764 38919558 39235921 39227243 39033716 38636482
4164 38636482 37843124 37062318 36134048 35124055 34015124 33077812 32361993 31725733 31219009
4155 31219009 31121090 31280242 31457155 31871971 32499136 33133329 33819705 34486046 35347103 36174919
4145 36174919 37388086 38629352 39384342 40463413 41357210 41938532 42165045 41926879 41306767
4136 41306767 40446134 39153261 37906157 36849635 35285783 34291491 33651553 33183469 32988819
4127 32988819 33017664 33032735 33059988 33514198 33791171 34654620 35698312 36402711 37518673 38772198
4117 38772198 40199197 41952149 43724427 46007380 48265752 50861527 54057865 57369224
4109 57369224 60763339 64589640 68552296 72704170 76256486 79290459 81445790 81886934
4101 81886934 80050059 76324741 71553930 67601853 64664470 62797279 61675981 60543791
4093 60543791 59297019 57943550 56301293 53706692 50218253 46921190 43835724 40916902
4085 40916902 39004554 36905796 35421316 33841495 32775992 31823187 31134046 30302905 29668671
4076 29668671 29479337 29141391 28952104 28616683 28591234 28175465 27997141 27938780 28052013 27861902
4066 27861902 28234647 28337096 28285243 28458622 28561146 28806211 29143333 29759989 29966256 30503018
4056 30503018 30842207 31158027 30957073 30782096 30394756 30048564 29778221 29244918 28917706
4047 28917706 28511367 28326302 27996374 27959543 28057031 28130165 28044801 28281708 28489979 28515857
4037 28515857 28325533 28582286 28564312 28660169 29312845 29720572 29797215 29879852 29743956 29581689
4027 29581689 29895363 29797958 29977240 29976377 29837322 29975080 30256103 30128802 30238134 30324996
4017 30324996 29981178 29805258 29588953 29227516 28907809 28946861 28640121 28171098 27726160 27193771
4007 27193771 27017613 26716035 26550728 26308058 26210667 26212856 25951467 25689420 25562079 25471740
3997 25471740 25457438 25473048 25678736 25639585 25822870 25904546 26165273 26384624 26757452 27134635
3987 27134635 27127260 27362012 27215697 26976803 26410943 25867188 25454186 25122660 24856553 24505731
3977 24505731 24236825 24239062 24197291 24015063 24172231 24285935 24459655 24539355 24534704 24642792
3967 24642792 24886237 25104027 25335426 25360321 25656279 25988211 26272773 26766383 27141737 27570152
3957 27570152 28483805 29362720 30358463 31591252 32626399 33952778 35392638 37213973 39185668
3948 39185668 41280819 44048391 47325086 51105282 55166373 59603243 64696961 70343567
3940 70343567 76251115 81528158 86016194 89462763 90130508 86513476 79557464 71260202
3932 71260202 63768462 57468301 52915884 49563645 46841262 44545526 43152085 41880049
3924 41880049 40901608 40424950 39997538 39830718 39351566 38785421 38544487 37882360 37151017
3915 37151017 35994980 35001674 33925095 32691750 31396718 30024551 29314987 28466213 27794206
3906 27794206 27229635 26564267 25943775 25552390 24856584 24281744 23919202 23483082 23026070
3897 23026070 22825016 22523543 22357942 22111358 21998765 22371565 22290917 22513659 22406232 22285741
3887 22285741 22241079 21890178 21898987 21608491 21515864 21600312 21700674 21864179 21818003 21929250
3877 21929250 22283420 22672852 22928067 23252371 23716555 23927825 23850633 23714709 23614883 23291263
3867 23291263 23233085 23402387 23431635 23329953 23195347 23402655 23710825 23440646 23663472 23598786
3857 23598786 23722254 23859620 24178312 24710685 25059532 25841589 26573956 27500820 28320773
3848 28320773 29502851 30708393 32352340 34023459 35973928 38374729 40789724 43989379
3840 43989379 47822459 51927190 56436472 60908378 64849147 67563702 69013566 67645672
3832 67645672 62723025 56148205 50361400 45509189 41538720 38454258 36042144 33836799
3824 33836799 32461761 31326957 30093730 29417358 28976291 28338248 28319439 28081800 27574579
3815 27574579 27866528 27571844 27992582 28292165 28413565 28705009 29429339 29872166 30658449
3806 30658449 31589512 32575614 34120872 35704048 37088414 39049388 41423405 43916325
3798 43916325 46821327 49743478 52628127 55268887 57561769 57768084 56505004 55610601
3790 55610601 54148583 49902404 44447686 40927744 38640589 36944669 35917359 35551558
3782 35551558 35198350 35154926 35470879 36019716 36636773 37559037 38615532 40109529 41748357
3773 41748357 43349102 45420675 47353612 49510789 51617946 53523122 54983372 55595862
3765 55595862 55045591 52995328 50403962 48374579 46635881 45422879 44610814 43815895 42997513
3756 42997513 42583816 42527631 42531060 42641610 42837488 43210945 43348863 43815185 44283564 44357817
3746 44357817 44168236 43754608 43873570 43925567 43542771 43511980 43639843 43326916 42821000 41822333
3736 41822333 40710126 39032767 36943445 35171608 33364906 31687823 29998127 28634364
3728 28634364 27683613 26653475 25632127 24671869 23814892 23046771 22471873 21767332 20894034
3719 20894034 20045219 19158817 18154932 17760318 17106662 16376068 15760518 15418056 15039119
3710 15039119 14657891 14395592 13698260 13538297 13276360 13055477 12821964 12495171 12105864
3701 12105864 11772668 11411841 11175001 11013976 10862565 10734765 10376862 10432080 10656150 10486986
3691 10486986 10493112 10304729 9830930 9860877 9658854 9488048 9696652 9842206 9622890 9942012
3681 9942012 9791927 9566593 9480896 9584220 9627787 9623978 9731151 9842587 9828729 9577969
3671 9577969 9854299 9966657 10096497 9944546 10195935 10412665 10259198 10731429 10899093 10769449
3661 10769449 10758453 10795612 10926043 11055506 11161459 11216374 11451902 11849463 12171948 12334970
3651 12334970 12769728 13054943 13380145 13825751 14365597 14739753 15671279 16269976 17159341
3642 17159341 18202980 19285523 20554453 21927923 23876479 25795577 27925700 30059847
3634 30059847 32560767 35392245 38935502 43441772 48682337 54780852 60963886 66589523
3626 66589523 71509787 74606043 73526657 66690667 56803062 47522852 40506402 35398320
3618 35398320 31664846 28898995 26817570 25070612 23597604 22802208 22360336 21828744 21410880
3609 21410880 21246021 21083670 20654736 20302181 20519150 20182091 19828491 19884801 19780773 19826526
3599 19826526 19489920 18975904 18664807 18508870 18282978 18090423 18069905 18121098 17951623 17751194
3589 17751194 17717672 17520445 17411113 17358090 17398157 17328971 17424293 17741641 17734939 18265389 18577267
3578 18577267 18927132 19330058 19980578 20806645 21213066 21857245 22466158 23286855 24018710
3569 24018710 24521249 25636628 26923178 27757134 28666832 29788315 30870267 31912409 33388594
3560 33388594 35083477 36886930 38882489 41171287 43735538 46717684 49832395 53312281
3552 53312281 56409322 58825421 60436494 59984187 57566261 53438928 48355794 44061548
3544 44061548 40567369 38360533 36341351 34957616 34030103 33169377 32591246 32113914 31891024
3535 31891024 31069554 30763171 30711903 30131887 29565706 29117672 28672566 27688180 26898017 25998997
3525 25998997 24822094 24167943 23520783 22702498 22387963 22077288 21776955 21627348 21447086
3516 21447086 21380898 21255396 21462813 21598608 21894327 21763533 21499282 21607196 21841667 21876730
3506 21876730 21549707 21291438 20875696 20605893 20237466 19676800 19243202 18310425 17840960
3497 17840960 16975652 16423915 15743823 15094011 14416598 14064819 13545011 13017432 12695091
3488 12695091 12581482 12362674 12309802 12379741 12042793 12097332 12112324 12041253 12068324 12065425 12014564
3477 12014564 12020913 11880449 11874412 11825183 11659695 11251523 11027955 11194756 10707311 10417101
3467 10417101 10286223 9944397 9658417 9380369 9179454 8991727 8997751 8730958 8700387 8761125
3457 8761125 8826672 8846896 8852704 8857604 9027807 9100288 9181984 9254534 9358876 9186587 9394767
3446 9394767 9449853 9275038 9122945 9166178 8831921 8621822 8358610 8141957 8181953 8047890
3436 8047890 8182475 8187350 8049065 7989301 8086484 8175928 8366158 8135786 8231500 8471206 8704588
3425 8704588 8692619 8684571 8627471 8467237 8660324 8627635 8707460 8573124 8540978 8668982 8901345
3414 8901345 8864436 8655076 8715704 8757308 8726409 8839548 9087361 8740493 8673532 8791045
3404 8791045 8825070 8740150 8583952 8792717 8981555 9040371 8773474 8950440 8798973 8659106
3394 8659106 8718315 8864007 8787410 8734967 8939101 8877516 8846414 8869643 8969697 9156571 9088522
3383 9088522 8980300 8937744 9193767 9448383 9519595 9918708 9950190 10388270 10579735 10856858
3373 10856858 11171920 11233629 11254507 11498543 11348935 11239435 11418711 11597563 11835937 11874704
3363 11874704 12064013 12253568 12445898 12575304 12728299 12675953 12504066 12396896 13079775 13165388
3353 13165388 13255613 13440245 13680187 13931211 14287257 14658162 14567275 14206508 13869329 13254340
3343 13254340 12992117 12794156 12175541 12167803 12093772 11948626 11844252 11854176 11511762 11295499
3333 11295499 11512580 11457035 11000515 10904682 10955691 11107833 11057995 11042534 10791278 10853065
3323 10853065 10637026 10455702 10527768 10398636 10072885 9812296 9935946 10005171 9876956 9938328
3313 9938328 9862669 9642026 9571263 9839063 9664511 9511724 9464017 9424185 9526955 9389259
3303 9389259 9523194 9478565 9312421 9319705 9425019 9476952 9264257 9139276 9258066 9609624
3293 9609624 9790458 9756186 9820701 9811789 9968426 9959008 10036278 10146147 9828684 9787425 10071925
3282 10071925 10400395 10434514 10533880 10665357 10768948 11101969 11245228 11282646 11130679 11293929
3272 11293929 11536225 11583638 11852013 12108960 12203251 12333256 12276182 12603268 12814398 12953022
3262 12953022 12880766 13007177 13026479 13069356 13222579 13450948 13604981 13717562 13842635 14023961
3252 14023961 14023387 14228177 14473013 14689406 14943750 15266146 15398686 15330568 15765111 15853133
3242 15853133 15862244 16236702 16293554 16542966 17161438 17468470 17846006 18324716 18605113 18582222
3232 18582222 18806275 19171388 19535136 20100427 20532551 21078496 21546278 22090333 22781394
3223 22781394 23623760 24452639 25411644 26425187 27377958 28733123 29373528 30908033 32631454
3214 32631454 33950752 35544083 37438331 39073904 40770319 42882084 44457025 46101128
3206 46101128 47647530 49175941 51092686 52910622 54680789 56834742 59038766 61546907
3198 61546907 64251560 66583771 69105576 71483625 73183573 74463684 75351677 75601219
3190 75601219 75799999 75850683 75581777 75718472 75814832 76234092 77008018 77326392 77633035 77462285
3180 77462285 76817448 75828710 74289438 72541681 70740109 68887605 67177609 65940117
3172 65940117 64817326 63796520 63131485 62803110 62678706 62811577 63229247 63567553 64513497
3163 64513497 66330229 68260681 70710786 73495455 77583927 82659062 88949982 97028808
3155 97028808 105806378 117206601 129698730 139865887 148373531 157097667 158126517 142573013
3147 142573013 119828559 100733298 86543024 76435041 68935544 62803401 58223343
3140 58223343 54386355 50981177 48248385 45969203 44248065 42759097 41565241 40400408
3132 40400408 39332528 38199885 37597518 37432341 37109124 36783469 36300521 36433123 36393008
3123 36393008 36165184 36126788 36028525 36145582 36434062 36725013 36814572 36892394 36863698 37203617
3113 37203617 37371571 37795543 38243914 38664217 39198561 39359762 39905145 40595948 41183384
3104 41183384 41831553 42737712 43445748 44329388 45528450 46482215 47585657 48754441 50083565
3095 50083565 51504723 53020698 54792809 56430892 58642859 60779169 62926229 65473319
3087 65473319 67925276 70836478 74147355 78084376 82091186 86211728 91144980 96435649
3079 96435649 101670994 107484802 113557876 119369655 125476163 131919801 138533139 145115865
3071 145115865 151738873 158499255 165627722 172310009 178527093 183875700 188398110 191786391
3063 191786391 193790287 194776491 194894938 194172566 193242451 192137448 191195130 190432542 189614114
3054 189614114 188774661 187441772 185846028 183533937 180912286 177323739 173719386 169310726
3046 169310726 164450851 159830634 153631155 146374219 139879238 135177242 132106244 130785608
3038 130785608 130265790 130186277 131422645 132960811 134490609 136533775 138082559 138702382 139387043
3029 139387043 139952101 140472168 141246414 141382720 141424272 141543334 141255397 140486390 139573178
3020 139573178 138902361 137856532 137051489 136020817 135412850 134786282 134028102 133051027 131738820
3011 131738820 130556726 128887231 126722476 123910448 120890200 117664526 114603826 111292929
3003 111292929 108270620 105147955 102105242 99613103 97299272 95453328 93824941 92387689
2995 92387689 91847766 91377478 91491937 92384344 93658419 95825532 97622765 99095953 100222651
2986 100222651 101013997 98356086 90931616 82712988 75877476 70813392 67237652 64440542
2978 64440542 62160465 60317659 59089030 58351556 57605751 56853460 56496458 56318898 56108276
2969 56108276 56312766 56384043 56349552 56036430 55462475 54618753 54138070 53770147 53692024 53474182
2959 53474182 53265394 53464510 53691504 54100258 54673977 55615843 56452134 57910641 59515498
2950 59515498 61055940 63084002 65378246 68216313 71151752 74608963 78471725 83103263
2942 83103263 88869724 95567857 103614510 113351832 124994574 138055827 150484405 161058754
2934 161058754 170327129 175142646 168763901 152279108 134624451 120906764 111322170 104938446
2926 104938446 100936575 98157353 96293998 95522802 94850568 94802743 95369159 95952976 97094396
2917 97094396 97981606 98819181 99790576 100305787 100432954 100163197 99606666 98481147 96703809
2908 96703809 94690792 91967157 89063567 85719437 81704275 77765589 73763854 69403951
2900 69403951 64808249 60660447 56549753 52511979 48917919 45933416 43086380 40510393
2892 40510393 38457153 36451016 34640938 33161038 31757138 30431135 29421216 28261740
2884 28261740 27443177 26345553 25360496 24467089 23956266 23436043 22928331 22665308 22331671
2875 22331671 21738611 21553065 21455535 21137079 21169801 21111213 20986276 21151455 21118086 21237943
2865 21237943 21175384 21180805 21262934 21121965 20612566 20385852 20184416 19591866 19016500 18319344
2855 18319344 18087423 17439368 16752028 16326238 15980363 15481333 15070177 14619285 14371978
2846 14371978 13789670 13271599 12930195 12498076 12196315 11876592 11673397 11447055 11248072
2837 11248072 11176756 11078131 10989094 10926506 10628205 10517650 10807698 10805815 10999168 10627685
2827 10627685 10482848 10341012 10283542 10119224 10127833 10142846 9901079 9926757 9793030 9820817
2817 9820817 10010127 9996005 9916235 10124533 9979849 10101902 10180647 10215685 10580045 10689772
2807 10689772 10629597 10849177 10768190 10716123 10808228 10718767 10827244 10859536 10812806 11142785 11274282
2796 11274282 11231695 11149854 11199709 11126985 11170756 11674947 11895527 11777749 11980218 12075869
2786 12075869 12157369 12481614 12714722 12749117 12925546 13364188 13412890 13885561 14042368 14202964
2776 14202964 14331190 14686814 15108888 15168038 15706926 16068954 16461112 16734720 17153670 17497489
2766 17497489 17591882 17885552 18345609 18760491 19136243 19590375 20041561 20236273 20695853 20976044
2756 20976044 21551496 21862221 22279351 22895008 23188511 23872231 24501803 25039186 25745858
2747 25745858 26227851 26955695 27777075 28419526 29298339 30008927 30837311 32000836 33406583
2738 33406583 34403652 35758113 37103551 38528192 39943850 41624416 43366676 45004806
2730 45004806 47072411 48943006 51132391 53901258 56108943 58875908 62263862 65316441
2722 65316441 68976062 73476117 78435776 83815320 89969429 96937796 104559752 112879098
2714 112879098 122928416 134529592 147248285 161525482 178245430 197179772 217850888
2707 217850888 240881314 266386730 293439379 319834083 342969520 360542364 371566416
2700 371566416 371413244 355786794 330138111 304227406 282086908 261752314 239951221
2693 239951221 216417182 192720269 171539566 153147472 137524195 124606506 113671278
2686 113671278 104444478 96554722 89614344 83871866 78753012 74172206 70383709 66500197
2678 66500197 63274003 60263944 57606653 54689683 52418384 50030062 48015069 46119243
2670 46119243 43996924 41930056 40314969 38715263 37018490 35810354 34291047 32745600
2662 32745600 31566180 30183484 28871708 28084854 27106358 26206285 25211311 24416043 23829402
2653 23829402 23157520 22343231 21715675 20986441 20472890 20009841 19546348 19122185 18567255
2644 18567255 18202272 17665006 17046890 16410778 16170894 15601503 15090968 14733778 14155301
2635 14155301 13502015 13067488 12743563 12504653 12431011 12148988 11854140 11693834 11334560 11033900
2625 11033900 10763008 10634606 10292336 9842937 9774901 9406666 9194776 9013525 8600155 8275207
2615 8275207 8099781 7621853 7511267 7295009 7049046 6674125 6501698 6469914 6230930 5757974
2605 5757974 5662792 5739368 5584090 5567764 5586996 5416582 5358927 5194287 5168409 5406044 5203795
2594 5203795 5084042 5028328 4724250 4521693 4588366 4593367 4525038 4403388 4352643 4635620 4610614
2583 4610614 4462261 4458561 4450954 4167767 4450837 4365433 4099557 4098540 3941645 3796321 3643476
2572 3643476 3807472 3666456 3590681 3378416 3379161 2987310 2933837 2843287 2714406 2475660 2752529
2561 2752529 2913209 2830156 2823107 2838662 2658095 2510692 2642481 2527706 2517231 2547850 2561429
2550 2561429 2491327 2507483 2321268 2239720 2143314 2435158 2470110 2379462 2342984 2284313 2197880
2539 2197880 2143100 1927777 1706968 1591921 1543041 1440251 1743201 1694596 1625983 1694827
2529 1694827 1792464 1838964 1949753 1846428 1723392 1599594 1599885 1716684 1403628 1382122 1399194
2518 1399194 1522122 1505103 1365745 1528292 1453281 1297811 1327496 1139767 1199524 1110192
2508 1110192 1154933 903423 905975 811669 814689 940023 1282142 1114711 1302000 1487496 1300815
2497 1300815 1214585 1359492 1166345 1011958 918371 934786 1215191 1182673 1097005 1367359
2487 1367359 1635213 1272997 1123628 1382684 1303934 960011 1178115 1104471 1265321 1214703
2477 1214703 1087006 1073153 1186043 1131102 1270837 1190228 896523 1029013 1167537 1093856
2467 1093856 1158706 879151 921739 1055411 888115 1079751 1258205 1471127 1372829 1291776
2457 1291776 1375250 1341354 1349477 1556026 1743162 1611951 1846639 2069792 2196173 2241699
2447 2241699 2244495 2229620 2324085 2378647 2509281 2150165 1791809 1867536 1677300 1320080 1184181
2436 1184181 1258276 1214988 1136739 1183457 1156442 898805 815812 755036 786837 608428 453177
2425 453177 484141 681774 638368 489865 403590 417548 297907 242718 490566 461781 451537
2414 451537 415435 440188 372913 461239 607604 497825 376808 604995 824072 629371
2404 629371 657853 523334 578352 628812 531526 392675 323975 414859 498848 351785 444190
2393 444190 352587 261748 405849 400186 320168 209921 315829 369707 214453 306738 347975
2382 347975 373960 502130 332502 103146 188552 189852 352998 374001 270154 302743 253368
2371 253368 330490 458749 460317 213131 270201 358617 198852 205132 331178 241921 220942
2360 220942 263673 337242 252616 145288 210866 371352 445281 347338 385275 434889 391160
2349 391160 147678 75478 80659 71836 52910 43567 285577 283119 144805 268067 138004
2338 138004 171553 248714 -2863 -99684 -278224 -182439 -100675 -142670 -251581 -242608 -202124
2327 -202124 -180550 -72161 24071 -248029 -12176 136368 269341 154670 64246 39958
2317 39958 1294 -35949 -171388 -88171 -213840 16920 12491 105298 35359 -19092 -2922
2306 -2922 25725 -95677 -146646 -173880 -269593 -97482 -153797 -239291 -158390 -59275 -149667 -191926
2294 -191926 -246566 -78311 114401 -60097 -139312 -111312 -72276 -176290 -182345 -35358 -60193
2283 -60193 -24924 -62657 -149491 -260098 -54025 -120382 -110733 -128073 -293913 -266848 -278761
2272 -278761 -278742 -278850 -278788 -40916 158066 -199348 -61049 -140042 -225164 -83923 -260341 -477358
2260 -477358 -209607 -188159 -370393 -272666 -330584 -392365 -351538 -113626 -196743 -357555 -168617
2249 -168617 -163684 -269307 -124263 -180848 83636 228945 -108715 13464 -70297 2749 -168298
2238 -168298 -316485 -246493 -429141 -305948 -164448 -193419 -213626 -249057 -124439 85304
2228 85304 -73885 -148650 104811 -63230 -118780 -129942 -147249 -303666 -286885 -321888 -345442
2217 -345442 -155549 -59858 -40268 -102612 -150645 -252572 -341393 -397184 -208191 -71480 -175156
2206 -175156 -253048 -124664 -180698 65472 14790 -160851 -344579 -220209 -238428 -123524
2196 -123524 -117032 17240 93330 124285 -101520 -255145 -314848 -233136 125012 41240 -97721
2185 -97721 -320437 -168230 -190073 52438 58447 118070 42912 801 84471 -41183 -344286
2174 -344286 -364196 -321167 -80514 -10844 -203158 -172694 -137777 -72564 -7780 -56086 -172240
2163 -172240 -248694 -441102 -490576 -511901 -260599 -227582 -275584 -198540 55779 121943 10537
2152 10537 -207336 -185727 -275775 -305762 -132347 -179165 -233594 -10555 188220 -31816 -143169
2141 -143169 -77747 -65621 -203357 -244783 -114606 -226292 -345213 -110606 19007 -64894
2131 -64894 -280720 -294966 -49050 -132578 -301266 424 -260185 -321849 19349 -40714 -133471
2120 -133471 -201293 -80412 -176393 -186448 74676 135148 64411 139099 135819 308538 176132
2109 176132 237800 152212 -59099 28826 18212 -181182 -133157 -106002 -222140 -236443 -135359
2098 -135359 68363 133618 205982 102384 1379 -45048 58607 15075 43962 -34126 218615
2087 218615 133947 -2732 13991 146128 209422 241952 165666 10825 7112 66767 338373
2076 338373 657383 362144 331306 191537 395499 406439 483905 587682 645525 944882
2066 944882 818405 681335 647024 481187 371905 719857 678462 689697 705303 651335 525696
2055 525696 654679 780204 746344 538152 896563 1075379 1244338 1266128 1258978 1497821
2045 1497821 1417455 1534952 1794814 1843740 2019191 2090598 2369889 2946456 3347861 3726022
2035 3726022 3969625 4401065 5163108 5811137 6947219 7855184 9142362 10968280 12201876
2026 12201876 13368700 15113732 15763672 13353923 10201984 8014762 6623970 5694963
2018 5694963 4815828 4142723 3630283 3256880 2948017 2655633 2297647 2314948 2365064 2060741
2008 2060741 1847720 1705877 1499246 1411992 1668416 1710824 1190688 1173731 909271 1019784
1998 1019784 1067769 882488 882882 600623 912314 810938 543373 631165 666783 608731 658456
1987 658456 344929 399393 357056 273878 310765 395700 176517 332053 356702 505697 562414
1976 562414 197932 258855 253067 476789 277711 315758 348910 202087 345735 188900 140809
1965 140809 363338 174345 172020 354489 238636 202687 -73956 230442 338661 -104944
1955 -104944 -145665 20476 -218185 -146262 -122995 -154399 90648 -149227 -36259 -44327 167055
1944 167055 10364 11949 173726 61694 186692 -208216 44790 38318 51719 -35228 -9461
1933 -9461 -20155 -320602 -212905 -340711 -313496 -175431 -249559 -334825 -261968 -287399 -286931 -342212
1921 -342212 -84191 78647 -94539 -86003 126034 68429 130252 18757 -5697 -31656 187651
1910 187651 149996 232028 -158285 -146850 234561 79227 -39555 -36026 -62297 -1572 24926
1899 24926 -126906 -102245 35906 -44406 -191717 69915 150444 172346 173663 228901 64982
1888 64982 -117188 -113185 -118236 -362691 -210893 59938 67258 40481 -57155 -25478 118624
1877 118624 -51646 28727 7077 -263196 -228504 234317 215654 114882 119478 -182249 -178760
1866 -178760 -13526 948 32816 17998 52436 269987 64734 -20750 -50931 -225616 -245810
1855 -245810 -186240 -138979 -8539 -76790 96150 290755 157422 209975 310819 248283 -31655
1844 -31655 -4056 -15183 7701 14122 85290 -94574 -71689 -114826 116147 45 -87933
1833 -87933 -16698 -44816 -269862 -369625 -108772 -92273 -75483 -109768 41708 -176381 -91003
1822 -91003 21246 -16546 -85467 -51598 -105950 -146096 -187049 -169915 -211937 -259560 6618
1811 6618 -46867 -201615 -211718 -223264 -267706 -324512 -27763 78142 -428139 -210881 -186535
1800 -186535 -312884 -266185 -86504 130515 65694 -257652 -334952 -102637 -246672 -161881
1790 -161881 -283624 -313342 -149515 -253492 -289353 -224662 -313284 -227542 -242282 -243811 -116576
1779 -116576 -394337 -348490 -338735 -245006 -110535 -415382 -219277 38046 43638 -38727 -81570
1768 -81570 -130197 -53246 -299207 -165569 -194278 -84432 -197467 -205999 -277239 -230633 -405969
1757 -405969 -88207 40639 67581 44681 148569 137334 -232948 -92018 14782 -184248
1747 -184248 -211405 -94878 -100312 17051 -280814 24018 56809 -98159 -98117 20537 91249
1736 91249 71487 -126181 -30430 -150699 -236673 -293337 -250270 -46905 -106035 -94864 15102
1725 15102 -96803 -288812 -122571 -125659 -202003 -296494 -211179 -166091 -136714 -7160 -28511
1714 -28511 -215068 -217077 -51056 -24740 -268460 -32185 308318 -37876 234510 -62401
1704 -62401 -290821 -337973 -289993 -236797 -94263 -29701 32616 -51782 -5591 -39930 -218597
1693 -218597 77152 13402 -235683 -108158 12811 -243468 -251265 -84494 -84179 -218535 -5629
1682 -5629 137506 -10030 141198 112896 -27197 -110483 -86476 27032 -261768 -126536 -57032
1671 -57032 -205165 114319 47934 -14537 -87424 94399 -8980 -15642 20256 -21748 67144
1660 67144 21808 88600 234852 241364 -140704 -15927 88540 165238 -408 -157513 1052
1649 1052 140015 -145639 -357920 56188 264604 57467 -96780 81558 51625 128815
1639 128815 85706 -6568 -90457 -5754 -222260 -286455 -156668 -174964 -245285 25767 139074
1628 139074 131487 -51925 172943 292086 67635 14796 106954 113039 -46099 -27167 -91617
1617 -91617 -102746 -111414 86752 -61383 151238 -61356 137608 44150 83193 10398 190118
1606 190118 18772 -18261 62142 -111600 -264139 -147401 141120 414589 163497 37278
1596 37278 189084 -76987 -179528 -20978 -95246 -40832 210384 75602 -96734 -80147
1586 -80147 38825 71304 17115 -111497 -88253 109281 13528 -123663 239407 -45877 -105067
1575 -105067 7506 -94895 34777 92911 25570 50627 -262708 -408494 -193664 -60548
1565 -60548 -25116 85256 97411 -103240 -44905 -21804 -12665 -146650 -105734 42186 234342
1554 234342 158024 -28700 52894 48689 42848 -35543 94704 5763 36074 46839 -60110
1543 -60110 -29173 109880 -122591 6933 96482 26704 270128 139465 159452 272636 181021
1532 181021 -111559 73943 67441 -101676 154578 171583 45436 -137971 -198761 -103100 -10157
1521 -10157 -128031 -147037 6157 92429 -60814 -66485 -135365 -188262 -221435 -85769 -102692
1510 -102692 -99761 -63314 -34730 -62014 -16068 -1642 -35809 -43962 34906 -44 -9662 -36441
1498 -36441 -225162 -151644 -330556 -350507 -88025 213286 116131 100551 258480 43739 -84255
1487 -84255 150951 -50242 -412063 -169229 -260695 -229951 -119862 -261011 -258881 -364042 -282720
1476 -282720 -141332 -330539 -76073 -31362 -121834 -22433 77543 -39682 -158417 -316002
1466 -316002 -286822 -248783 -594186 -517930 -403515 -339381 -321157 -189694 -301165 -359717 -311852
1455 -311852 -46752 -38161 -47884 -17435 -366691 -293771 -438136 -166093 -204644 -201461 -255951
1444 -255951 -207331 -69798 -71455 105134 178754 239087 -60032 7521 -44778 -103024 -20592
1433 -20592 227964 1863 -180135 -239420 -28352 58284 -7434 91574 -42999 51421 21591
1422 21591 14488 231024 4469 -80206 55475 -51193 -134682 -68724 -121731 112152 262109
1411 262109 272505 -25909 577 -53365 -245811 -297654 -112910 -190060 -135096 -72873 -244165
1400 -244165 -61457 4600 -137448 -117002 -73941 -304452 -276062 -337440 -8456 -100496 -36976
1389 -36976 232366 116007 47782 46115 10068 36498 -56901 -208013 -90538 -68242 67906
1378 67906 277451 403177 156903 130838 216474 7273 206488 220161 281982 164287 -33425
1367 -33425 38000 -126949 -151860 -17362 -122182 -191815 -3329 17988 477 50625 -131986
1356 -131986 -169049 -103391 -188879 112303 179030 -108149 88904 206129 -302178 -245097 -262968
1345 -262968 -187945 -11928 150088 23823 -43178 -100301 -80173 -11099 -68292 76822 58807
1334 58807 231294 -61506 143605 126491 -205091 -374813 -246228 -24112 -11134 191040
1324 191040 160005 68720 -150637 49352 18360 -90841 -9864 -284683 45551 195006
1314 195006 121195 120145 -73894 68440 114300 -157677 60334 -111082 74707 123227 155795
1303 155795 82851 -138678 -152116 -43144 -224228 -30996 6794 -11064 90011 21201 -275496
1292 -275496 -217728 -112386 -33729 -70467 -303374 44514 166575 208655 224231 273470 -1542
1281 -1542 56244 29409 -58288 -244914 -122051 -69329 -167439 7573 -57689 -248577 -246398
1270 -246398 -154243 -202909 -183392 -132971 -166505 -70241 -32492 -6614 -75693 -61081 -74361 47051
1258 47051 127377 57939 -790 -50355 -336878 -69148 -236780 -22987 143000 -124211 -85817
1247 -85817 -4661 72229 24430 -55817 11795 42254 -195545 111230 142725 41787 14853
1236 14853 -173492 -189698 -86304 -212954 52370 -164245 -337236 -163267 -95420 -243957
1226 -243957 10646 -55050 61351 88633 114873 243964 141868 45236 161260 136785 -113401
1215 -113401 67223 -38758 168786 37230 -133760 20046 -69276 -266406 -222903 -354935
1205 -354935 -230552 -21495 61508 -168624 -121506 -140987 -39439 -23437 -313269 -169194
1195 -169194 -197932 -259761 -258067 -323157 -138618 46387 44701 145675 59403 -43227 -44263
1184 -44263 -136909 -14659 -241053 47885 7237 46530 5526 14326 129569 85582 -30335
1173 -30335 105802 -100939 -368135 -206005 -421162 -389707 -404245 -286836 -491603 -351129
1163 -351129 -359855 -430539 -418184 -208101 -199307 -338504 -270623 53238 -258522 -350398 -267808
1152 -267808 86318 -75969 -68288 87908 -119795 213096 181074 247943 51815 -162482
1142 -162482 92879 39911 45571 -177969 -446934 -214665 -416250 -281997 -280743 -527112 -462023
1131 -462023 -295970 -166771 122678 -90706 -91947 -138757 -334094 -245746 -468116 -447926 -379154
1120 -379154 -173290 -46476 94679 52736 223855 389532 136574 -6303 -99069 -243017
1110 -243017 -97973 17873 4098 -4004 -159927 -183472 4172 198041 170900 87640 -34815
1099 -34815 99515 107173 -78474 -134435 -68360 -215998 -111813 -46083 -289642 -160260 -151474
1088 -151474 -185139 111401 256249 3370 -52601 -163286 -46834 -106073 -239535 -167420
1078 -167420 -69067 -252401 -315778 -31456 -33808 -205479 -67610 -176758 -296362 -160260
1068 -160260 -71504 -195818 -269938 -226229 -273304 89190 -336284 -642817 -254419 -115380
1058 -115380 -246151 -84540 -70046 -78830 -11648 147718 327060 112972 -192549 -300235
1048 -300235 -351945 -265268 -192445 -268065 -423010 -155963 -94789 -90855 138188 171029 143491
1037 143491 103993 52268 -55329 -250928 -380100 -208485 -244673 -147387 -24361 -266572
1027 -266572 -183151 -386145 -441198 -248914 -427395 -433066 -454243 -177682 -113827 -219906 -202748
1016 -202748 -37233 -49769 -80099 -171362 -351524 -212252 -116958 -103191 1110 29691 119308
1005 119308 -26334 -29266 -89309 -383590 -228319 11904 272719 126605 -82425 -2454
995 -2454 129226 90333 135875 302148 -20802 -265470 -354268 -547312 -312782 -280596 -484113
984 -484113 -488778 -444744 -224976 105112 -221789 103881 -37800 -205368 78485 81063 19593
973 19593 -296779 -96664 74254 128984 177070 300282 -65299 -59279 152991 42802 -288956
962 -288956 -187191 -30819 -3815 1004 -93737 -43535 -19621 -84737 -111419 -37914 -22742 -161200
950 -161200 -161414 14135 27821 42793 4543 18764 172936 105075 270041 129279 55837
939 55837 73055 133820 84832 48475 121829 -52065 -87131 -55303 -87224 -60466 -92041 -10643
927 -10643 -8430 -285249 -154599 -20354 284667 179588 113961 -106382 100424 52872 -86447
916 -86447 7851 17301 -83242 -106266 23501 44189 123314 2881 208019 -25673 59397
905 59397 -9054 13308 94667 3671 56341 123062 -28662 -486357 -337464 4333 -33593
894 -33593 -67806 26794 -80782 -102987 -228786 -239373 -132892 -139712 14686 -11907 179459
883 179459 352077 317858 233032 65077 -203368 -299566 -249770 -333683 -171990 -148266 -79746
872 -79746 98068 49797 127582 132481 156277 164593 165813 3938 111285 -23827 -173619 -117614
860 -117614 33390 211694 143662 72159 -38978 235287 108982 304748 192510 141380
850 141380 61701 -2484 59418 218778 127618 -194282 -119568 -77475 -79829 65089 21723
839 21723 24894 69810 -52498 -158898 -155613 -192564 -318959 -47082 135023 246243 27474
828 27474 3994 195521 -76495 -126162 73969 -5314 -141915 1713 119838 249399 73055
817 73055 145106 32935 -40650 1070 -218667 -277144 -345276 -160714 4415 -110779 8065
806 8065 213491 239642 359901 106175 -166912 -127217 -441486 -483146 -199935 18161 89285
795 89285 -204988 -133426 -200389 -197406 -2759 -94141 -81893 -106110 -122958 61221 -245696
784 -245696 -89692 14159 -35108 -89120 -82078 -53799 9059 226000 320967 303033 4012
773 4012 -115162 -145558 -133390 -58057 -57117 22193 -42608 -191085 -325229 -20313 -38137 -355562
761 -355562 -141221 181457 146963 330051 431383 99810 173821 318554 205259 179440
751 179440 239181 114555 296415 175832 -112928 90115 -58308 -178351 -42666 25086
741 25086 -210817 -231035 -94784 -64068 -195336 -208090 99029 150381 -62246 44221 173572
730 173572 343895 351001 248647 364039 297614 184171 158181 158340 -293207 -138463 -118400
719 -118400 -116326 -27089 -169470 205876 61835 -208910 -8322 10992 101383 313984 9337
708 9337 -13589 -183340 -133632 89277 120889 154681 223809 206579 89918 159014 198061 391505
696 391505 -62391 -157583 -39818 25603 -91135 146987 271377 44194 46568 -31882 -80543
685 -80543 81783 130958 85635 227998 225307 -14370 204319 72753 132437 171064 113052
674 113052 130396 -141969 -373458 -107318 127242 147612 159819 -162732 -126111 93937 180164
663 180164 209091 140672 -119965 -182404 -255210 -34109 -123274 -535579 -221689 -4657 35861
652 35861 325573 73348 44574 -127413 23427 139439 157599 18446 -203124 -238941 -207845
641 -207845 124032 356573 328943 182914 311069 248254 329796 256529 -36295 -109417 -78604
630 -78604 40157 -204352 -149600 -69361 36460 94310 47656 245282 189804 204014 210100
619 210100 377181 99196 69075 65252 35233 -233888 -222967 -41320 -189543 -153499 134283
608 134283 90460 -15637 99472 59408 -83599 152305 42683 -33486 28592 -85359 187762
597 187762 206497 119471 -88138 95718 38030 -70201 -135310 -12759 140150 72669 183126
586 183126 21722 -21092 11803 91057 145285 -93159 25739 -13102 37650 7056 19022
575 19022 109521 157369 11595 279929 194148 44382 213524 331849 3567 -136749 -46494
564 -46494 -283556 -202184 -157303 -54903 23154 29179 63269 771 198133 316552 327353
553 327353 256172 141861 8307 217495 440125 -44153 146951 134598 113403 205372 65454
542 65454 99049 114586 48637 -55117 324400 277975 38203 112475 93935 30479 187258
531 187258 153489 14785 61403 183452 289792 87800 60162 237743 272657 94110 300363
520 300363 185965 97313 137665 206505 350382 203487 176761 130218 79136 242971 236667
509 236667 -136574 -35051 232420 152107 158889 350836 320381 260879 412016 348056 278017
498 278017 182811 346873 334180 139678 102199 134090 214684 186552 142575 338388 54765
487 54765 265984 -17884 -135178 -159860 -327775 -286555 -75891 118121 -184921 202473
477 202473 259843 339475 125814 170780 306476 398388 369281 221832 374528 140772 101239
466 101239 220413 119113 170694 254779 98362 -48936 147249 109500 -96775 -184372 171610
455 171610 101512 273492 237139 334624 147590 179779 503585 485429 568628 522803 607957
444 607957 324159 -14177 69384 -112500 -269260 -78638 29547 437229 417490 485835
434 485835 193688 351905 175319 12277 318658 -156309 -61734 81912 -100929 242215
424 242215 323999 273265 335976 177334 151905 92845 95489 118118 250526 333614 90483
413 90483 210364 17577 146701 40807 -65539 -84683 182627 164061 -40835 180161
403 180161 180831 -48673 -61008 -10207 -298777 -98433 71274 -81259 63525 22128 61479
392 61479 56827 80477 163907 135825 178782 -141867 -280571 -140098 1177 -16084 24020
381 24020 170647 258229 265159 219614 148159 377149 261213 92899 58349 89426 -67931
370 -67931 -143770 205145 10042 41612 69625 -181604 -273876 -289312 63517 129887 104807
359 104807 255787 422389 180160 -76505 -40738 307730 142877 36537 220287 157946
349 157946 -44810 -85564 -225603 -2818 -147482 -239684 -22245 -134351 131876 98414
339 98414 115029 222461 23286 -104797 104746 116012 -28899 296295 93004 -188023
329 -188023 -34003 -119298 -113648 -125101 -17404 89476 -4395 -94766 -131138 -86190 -1667
318 -1667 102759 -13989 -59583 -213404 164250 127326 36210 192659 123382 98484 149747
307 149747 197645 190083 264243 277988 420798 169856 80468 16460 61552 361884 145506
296 145506 63362 222791 187158 127068 293998 328611 257730 96383 -17640 254870 255940
285 255940 30298 -31255 67420 90324 100073 113145 229506 212261 112 44335 -41581
274 -41581 -70808 -140224 -157223 108486 -120846 -156346 14685 7666 -1041 -50416 68687 138841
262 138841 -60208 182341 13449 160879 234239 118609 145603 220275 246879 230162 264376
251 264376 150971 -38085 157772 -9348 137678 84750 -55880 -189890 -122856 -36215
241 -36215 -127130 -50741 24641 277472 319284 209164 210628 268441 -79511 -121655 57318
230 57318 211450 234578 426959 314351 229224 151504 32831 281587 105657 -10550 43214
219 43214 145568 -94475 -255002 -30003 1276 -252995 -100881 -100246 1793 214723 -200211
208 -200211 -58574 72006 -46365 64940 314836 113044 -166367 -197011 -282378 -134227
198 -134227 -63366 -39541 -11649 -208674 -63655 24659 213727 405530 422423 95331 -39487
187 -39487 188576 239970 208936 382936 191106 46217 354739 277278 334372 340663 170672
176 170672 2197 117356 436395 319739 200166 176465 237127 255041 455823 271078
166 271078 40716 -229543 -118682 65287 329022 107281 55600 148671 224133 36259
156 36259 315959 234875 146533 261887 258947 164529 -63233 32244 28533 -101407 -263266
145 -263266 75840 17930 -4696 153120 303609 174693 151481 186899 88979 -5555 69981
134 69981 26088 2476 92809 188973 39743 50206 74045 36611 290018 366671 324911 478570
122 478570 397275 393951 133739 474027 319197 106610 88433 209293 297534 324373 482877
111 482877 134227 -24353 236471 80861 -8877 133566 -55892 -19633 -156423 -62725
101 -62725 14295 -125614 -216385 -80477 31499 131524 99141 96097 147111 126127 20063
90 20063 93485 -39842 81185 -180695 -137326 7465 -18967 66429 104343 233324 325818
79 325818 353704 187894 330509 200509 267734 282212 356216 262688 321121 334827 225875
68 225875 106325 92974 213743 323584 240434 324003 309484 341142 313148 177632 43709
57 43709 7636 -120644 4002 141234 261878 328418 106556 202789 161702 37811 132112
46 132112 170480 114820 223895 12275 266031 273224 -20112 81121 217283 81499 13890
35 13890 45516 84804 80551 185174 100223 182331 33250 118820 205455 154072 336381 136655
23 136655 65555 -43668 -47060 55655 66702 204365 291276 157404 254547 236355 252512
12 252512 192337 141119 103116 119510 152590 308262 150204 -12517 196226 301213 410174
1 410174 260110
0 260110
$$ Imaginary data points
##PAGE= N=2
##DATA TABLE= (X++(I..I)), XYDATA
16383 -2357869 -2449729 -2470341 -2239192 -2365340 -2397867 -2116643 -2095616 -2007972 -2089989 -2271785
16373 -2271785 -2129641 -2122210 -2168621 -2041095 -2151491 -2314460 -1894833 -1842913 -1964272 -1848674
16363 -1848674 -1737550 -1784509 -1934320 -1834975 -1913136 -1957574 -1895496 -1715037 -1760714 -1710283 -1543423
16352 -1543423 -1643514 -1827565 -1860841 -1706056 -1558515 -1513504 -1616778 -1726922 -1518557 -1429036
16342 -1429036 -1327590 -1263391 -1428006 -1190047 -1449117 -1462921 -1341614 -1418175 -1516413 -1257835
16332 -1257835 -1273278 -1099904 -1023953 -1179217 -972872 -954948 -867930 -829758 -848177 -927800 -1002863
16321 -1002863 -881972 -1012980 -961545 -939137 -958799 -909077 -835887 -594928 -545888 -536986 -694549
16310 -694549 -679997 -742902 -639931 -503009 -293927 -450593 -152309 -132128 -387523 -526450
16300 -526450 -516018 -598845 -406966 -252907 -290704 -455379 -398499 -369851 -271746 -220407 -314209
16289 -314209 -391206 -292614 -36119 19717 4052 -76278 -65222 -23489 58832 9749 74854
16278 74854 -165964 -247703 -41487 87115 -77641 -174690 50166 215202 97051 237980
16268 237980 186788 287410 320727 368898 400021 366536 375507 343002 371362 238901 186013
16257 186013 341970 287186 223611 164937 226543 301164 262895 257299 355455 419991 345996
16246 345996 481685 643829 635196 691191 655842 658041 824643 702931 728043 786366 749048
16235 749048 612141 747241 865565 921753 774891 607479 872181 850940 575704 644277
16225 644277 662813 767020 760964 785704 851943 904734 872420 932061 1033381 1110746 896224
16214 896224 950538 946761 634831 589735 749792 885695 918238 1130443 1081027 923227 1011756
16203 1011756 1061284 983350 993904 1086352 1022177 804980 1089234 975656 876571 1011486
16193 1011486 1297983 975585 822032 1075531 1133480 971156 1023883 1139826 1014191 956441
16183 956441 1217123 1098658 1062302 1030924 1183173 1186059 1186442 1214147 1177553 990713 1082201
16172 1082201 1076699 1113673 1298132 1108921 938677 881637 1122131 1191160 1218644 1019818
16162 1019818 1062026 1084061 1303894 1226060 1153465 1271829 1369906 1560078 1625226 1588789 1409294
16151 1409294 1311529 1399738 1175741 1075924 1210251 1286718 1253251 1491501 1703324 1595968
16141 1595968 1391112 1435945 1398225 1298560 1318084 1416561 1381015 1539512 1463039 1334029 1578568
16130 1578568 1752829 1611782 1644072 1521168 1601167 1473168 1450258 1335267 1353586 1329854
16120 1329854 1464066 1510848 1470971 1732829 1424239 1553293 1617681 1518622 1530392 1700871
16110 1700871 1704158 1560112 1624804 1395121 1499939 1414893 1666297 1454895 1254062 1442419
16100 1442419 1638215 1644961 1558479 1631893 1445655 1407881 1207431 1482195 1471396 1346853
16090 1346853 1533149 1932273 1449299 1683153 1822884 1680382 1558249 1514069 1491095 1642955
16080 1642955 1599050 1383488 1378706 1217015 1388849 1580100 1647925 1735747 1847614 1760257
16070 1760257 1305878 1328158 1484107 1313698 1378086 1521420 1505849 1464027 1555629 1541621
16060 1541621 1498705 1526764 1410576 1401520 1399680 1131375 1238278 1440029 1552727 1512542 1532077
16049 1532077 1614928 1452717 1422916 1252816 1368379 1680270 1618814 1555522 1606951 1484924
16039 1484924 1354118 1434973 1576082 1468155 1386421 1368041 1384052 1520670 1736005 1580680
16029 1580680 1480085 1524786 1582837 1611057 1440663 1572132 1590666 1716941 1606790 1724301
16019 1724301 1491163 1366538 1376468 1240899 1403015 1366018 1307287 1234403 1189114 1407579
16009 1407579 1395940 1196465 1430117 1460714 1314414 1288999 1182172 1185761 1447073 1374454
15999 1374454 1506246 1559503 1504886 1387478 1226013 1633439 1448951 1591563 1668095 1418239
15989 1418239 1423135 1537070 1310034 1111820 1277463 1338750 1338574 1373729 1493801 1393987 1165269
15978 1165269 1383682 1406960 1481125 1599254 1377940 1658256 1732967 1718113 1646130 1487604
15968 1487604 1232062 1326193 1626670 1806749 1605036 1474890 1609329 1588869 1625211 1796655
15958 1796655 1543164 1373899 1237142 1606874 1566173 1761735 1819488 1757835 1785681 1590971
15948 1590971 1863322 1454035 1274935 1533282 1468800 1394241 1746912 1672027 1513594 1444497
15938 1444497 1506002 1378340 1433769 1307305 1554173 1557817 1740521 1534060 1596296 1553057
15928 1553057 1468523 1599146 1833659 1760146 1554850 1481744 1523993 1251876 1066010 1382477
15918 1382477 1456430 1803213 1812087 1692153 1711613 1888125 1569287 1444404 1452443 1535023 1507029
15907 1507029 1623782 1508936 1431718 1449108 1450826 1511714 1350827 1398539 1538717 1732350
15897 1732350 1608132 1489511 1456157 1387150 1358579 1522109 1479885 1571239 1444380 1562557
15887 1562557 1778197 1504928 1474524 1438302 1331541 1461216 1506358 1642834 1655832 1279343
15877 1279343 1623646 1642560 1492077 1503928 1586935 1482157 1801649 1708487 1839382 1507598
15867 1507598 1468227 1664401 1522792 1564678 1629468 1514768 1486590 1756923 1367107 1312127
15857 1312127 1457842 1435414 1464537 1624622 1695522 1626391 1669509 1559919 1571650 1441865
15847 1441865 1677843 1569200 1179352 1310071 1557262 1526826 1620847 1693116 1661050 1720303
15837 1720303 1484228 1738191 1873423 1861896 1658171 1703329 1637301 1677495 1560239 1378228
15827 1378228 1561765 1384767 1744184 1937570 1775335 1565170 1557548 1595864 1514764 1581149
15817 1581149 1493467 1380601 1483100 1517655 1763661 1864868 1934194 1733358 1719457 1954028
15807 1954028 1955120 2029087 1592116 1621663 1656532 1442475 1481445 1426370 1425234 1507712 1600265
15796 1600265 1583211 1703777 1690779 1623448 1567969 1715886 1738516 1674352 1487970 1545076 1515840
15785 1515840 1462312 1758647 1733629 1911142 1999065 2074138 1955848 1643958 1612738 1669316
15775 1669316 1565345 1784827 1461015 1593318 1481887 1335131 1434423 1647845 1533777 1575718
15765 1575718 1591526 1649436 1569672 1636674 1760616 1543448 1444167 1588679 1739161 1692766
15755 1692766 1577053 1547636 1504334 1575276 1621328 1641484 1295935 1366016 1660639 1657833 1421165
15744 1421165 1576229 1622832 1635025 1765445 1996097 1957374 2056648 1999237 1751797 1722443
15734 1722443 1595982 1768286 1661965 1671081 1518318 1583607 1509632 1543536 1648965 1629911
15724 1629911 1461381 1643420 1582763 1512379 1531413 1697609 1529646 1637691 1780127 1727874
15714 1727874 1633736 1676566 1675859 1587850 1540377 1680472 1594875 1407599 1193979 1242949 1342881
15703 1342881 1362883 1646234 1782425 1671205 1758771 1724780 1506472 1619134 1626632 1448481
15693 1448481 1356081 1398961 1686363 1791986 1833315 1895117 1808423 1744566 1667213 1522252 1557227
15682 1557227 1589207 1566851 1675700 1704825 1480247 1432779 1743214 1679517 1364281 1377993
15672 1377993 1609043 1628776 1441913 1657885 1419916 1508028 1545426 1496893 1576133 1594338
15662 1594338 1511320 1476978 1539311 1474638 1325115 1241999 1309213 1260620 1176004 1495894 1697186
15651 1697186 1590585 1655849 1783476 1804540 1690674 1820270 1768655 1564814 1635683 1764417
15641 1764417 1548564 1708134 1596331 1748703 1720903 1760745 1676499 1627678 1560802 1570780 1359348
15630 1359348 1372591 1520359 1374700 1688184 1637509 1595202 1571194 1762643 1770363 1599641
15620 1599641 1664531 1713236 2052044 1799926 1618688 1524335 1682723 1641355 1574559 1504799
15610 1504799 1414757 1693272 1832609 1870031 1696403 1641668 1665559 1924555 1673585 1568753
15600 1568753 1784953 1766838 1657857 1698584 1763105 1748250 1687456 1754850 1646348 1685613 1656109
15589 1656109 1887314 1856136 1826708 1621235 1771369 1936452 1779323 1684189 1541392 1691503
15579 1691503 1433150 1673332 1771031 1811938 1751615 1912665 1876583 1777922 1643577 1430077
15569 1430077 1546041 1825434 1468044 1652904 1581965 1391454 1368207 1449814 1402963 1358687
15559 1358687 1590212 1535085 1368516 1520979 1388826 1373672 1607165 1562743 1583992 1558793
15549 1558793 1427844 1386417 1462127 1698077 1681639 1606446 1999435 1582987 1482338 1743132
15539 1743132 1750275 1480902 1628819 1613594 1812305 1600956 1633997 1698100 1592215 1453527
15529 1453527 1474398 1503308 1341967 1497364 1940709 1858735 1867091 1713344 1650255 1851460
15519 1851460 1694622 1715071 1766717 1665991 1506779 1843596 1933478 1749319 1614392 1747420
15509 1747420 1781907 1764951 1497161 1602972 1837782 1830172 1823483 2118072 1584439 1460867
15499 1460867 1756109 1652956 1530121 1709773 1664260 1450599 1775305 1859655 1735059 1472047
15489 1472047 1634231 1579608 1341496 1461452 1450027 1738919 1691362 1701307 1705167 1775994 1827124
15478 1827124 1797580 1737897 1601203 1526167 1573711 1868800 1627543 1722753 1540629 1492559
15468 1492559 1468474 1500175 1462729 1629268 1488877 1522082 1627939 1463488 1845261 1896190
15458 1896190 1617083 1506492 1437346 1437073 1503963 1556611 1652796 1566893 1573214 1930441 1837020
15447 1837020 1904744 1779050 1697589 1925927 1723390 1586535 1923243 1895207 1723527 1857139
15437 1857139 1938371 1613942 1367378 1592734 1634975 1623493 1660876 1581512 1474742 1497010
15427 1497010 1611047 1698918 1670874 1819398 1695913 1565227 1810345 1862052 1769717 1812754
15417 1812754 1598063 1640736 1653704 1640216 1742195 1769208 1795429 2017129 1862811 1764674
15407 1764674 1740492 1717965 1603862 1754701 1743077 1537990 1432489 1584494 1800175 1695492
15397 1695492 1520199 1455158 1583735 1573357 1523645 1756094 1956823 1363454 1455143 1774602
15387 1774602 1924734 1717636 2012879 2031171 1936549 1913410 1668184 1383372 1679286 1757317
15377 1757317 1603475 1819805 1738036 1760774 1622807 1841450 1758338 1594485 1692301 1645718
15367 1645718 1514889 1724953 1703870 1575735 1634623 1659861 1673974 1721771 1925532 1700046
15357 1700046 1798208 1655469 1569051 1761609 1661604 1868358 1863048 1944679 1794867 1696451
15347 1696451 1703862 1916928 1719561 1927457 1818043 1780626 1630883 1826953 1900780 1908617
15337 1908617 1844299 2115757 2164768 1865735 1833593 1443335 1476065 1583441 1476247 1709649
15327 1709649 1827621 1708733 1850374 1819581 1733695 1620310 1708871 1656101 1608619 1572836
15317 1572836 1511623 1670409 1600089 1470014 1540880 1451714 1438191 1546499 1768455 1700014
15307 1700014 1541904 1235538 1394963 1685485 1580415 1465692 1831921 1691425 1515920
15298 1515920 1690624 1871554 1799872 1772805 1984483 1810857 1698770 1676949 1574701 1701995
15288 1701995 1786646 1788753 1851505 1693308 1817561 2089098 1777950 1810516 2080563 1815505
15278 1815505 1743292 1900599 1926863 1898399 1838731 1512856 1689144 1858539 1933747 1816782
15268 1816782 1621397 1513783 1539764 1675723 1652097 1571219 1565526 1530401 1414802 1735983
15258 1735983 1690342 1730286 1775790 1819605 1739475 1575961 1572322 1555535 1413039 1702269 1933797
15247 1933797 1876861 1688044 1605744 1770784 1974427 1788006 1961665 2015210 1713241 1550279
15237 1550279 1779044 1745276 1521112 1448697 1422955 1750447 1646300 1635638 1812120 1708859
15227 1708859 1877143 1999740 1758388 1593519 1747036 1737883 1740598 1712053 1775570 1698460 1656760
15216 1656760 1668480 1967372 2026907 1925873 1883940 1832464 1810061 1607046 1704875 1639436 1453615
15205 1453615 1590322 1651814 1557261 1489227 1507727 1684062 1609738 1680455 1710817 1667508 1791492
15194 1791492 1765954 1561878 1751998 1847075 1779735 1670701 1888747 1862857 1744649 1549852
15184 1549852 1452522 1656277 1548055 1370733 1692433 1438986 1540959 1672225 1804797 1677544
15174 1677544 1776416 1820785 1688520 1820533 1671107 1803551 1822265 1714002 1825597 1840323
15164 1840323 1840021 1833563 1763476 1662665 1618048 1573284 1679239 1807053 1937569 1753891 1830765
15153 1830765 1926937 1957701 1744463 1532631 1532249 1562213 1744254 1596063 1929129 1640959
15143 1640959 1616408 1555676 1236197 1451464 1837191 1769297 1906446 1971417 1973685 1818003
15133 1818003 1673359 1762114 1475394 1715159 1957977 1748686 1700300 1904573 1953422 1735359
15123 1735359 1583675 1790400 1800354 1694696 1783930 1744412 1598189 1773765 1585610 1736341
15113 1736341 1553947 1322312 1567099 1551510 1581846 1791511 1697436 1604063 1716184 1665204
15103 1665204 1626152 1882270 1979244 1891258 1892914 1747885 1694622 1800020 1757586 1734654 1567559
15092 1567559 1623504 1857490 1621866 1977025 1985692 1697627 1721829 1750295 1673982 1591625 1683564
15081 1683564 1794551 1579788 1537516 1643740 1728664 1903735 1879232 1952307 1877751 1893764
15071 1893764 1871539 1522833 1498493 1655349 1417929 1592295 1590171 1594403 2004771 1958647 1856137
15060 1856137 2069204 2078750 1676487 1771021 1695433 1699813 1721087 1720047 1631364 1903511 1789722
15049 1789722 1831109 1762077 1600233 1711934 1497006 1416792 1785755 1696388 1793675 1828176
15039 1828176 1829686 1796479 1834808 1964287 1805680 1797466 1896057 1818275 1781296 1872793 1774433
15028 1774433 1805722 1880979 1828462 1676763 1445565 1626109 1547464 1628529 1792100 2125154
15018 2125154 1952778 1994378 2118702 2018335 1823943 1844739 1996444 1839005 1895900 1750429
15008 1750429 1762026 1624155 1842020 1904312 1669352 1481099 1772213 1871254 1882255 2033449
14998 2033449 2034795 2039736 1919457 1888319 2017906 1965387 2090610 1969811 1873171 1516064 1589836
14987 1589836 1627654 1750850 1686546 1662967 1910513 1812892 1728838 1592836 1605589 1896537
14977 1896537 1898368 2215006 1840950 1707703 1864324 1737409 1792842 1754806 1645515 1740023
14967 1740023 1550452 1746325 1994856 2016304 1977464 1883434 1604436 1726488 1786155 1684835
14957 1684835 1721464 1600752 1418169 1681908 1860018 1710338 1887914 1752744 1809431 1945689
14947 1945689 1927592 1609903 1722998 1610690 1640729 1681845 1634920 1792028 1779765 1809258
14937 1809258 1909660 1833538 1853077 1969511 1836861 1682067 1784023 1984452 1961451 1861450
14927 1861450 1754017 1570488 1909892 1965886 1845707 1837209 1907872 1825717 1669018 1606343
14917 1606343 1727276 1846340 1825100 1916870 1734024 1787289 1874478 2053179 2014554 2058378
14907 2058378 2149963 2050777 1796120 1956240 2000061 1828060 1880583 1897028 1933170 1827279
14897 1827279 1825736 1925297 1936264 1726827 1667048 1896222 1797593 1652794 2028652 2068278 1796090
14886 1796090 1862034 1911858 1735222 1920107 2011136 2055425 1987486 1853631 1928494 1921789 1841527
14875 1841527 1818763 1570869 1832640 1989733 1928093 1861430 1899483 1852802 1909720 2009987
14865 2009987 1979362 2055616 2059386 1954897 2016432 2121956 1748578 1797925 1966563 1646498
14855 1646498 1732962 1755201 1954548 1895003 1831292 1732718 1804127 2078066 1841286 2046708
14845 2046708 1951711 1646463 1488947 1756555 1716787 1602326 1779103 1700241 1890553 1747339
14835 1747339 2055033 1866624 1781209 1817600 2013579 2123922 1658371 1631032 1946969 1780880
14825 1780880 1505167 1621680 1754360 1795367 1684279 1805362 1770958 1428882 1579767 1724304
14815 1724304 1622748 1715603 1712274 1707743 1953107 1737026 1755164 1711848 1599064 1749130 1703180
14804 1703180 1847985 1670757 2029705 1996746 2160988 2077767 1956753 1931700 1917852 1971823
14794 1971823 2145221 1977146 1957509 2043450 2005143 1860460 1603457 1616255 1838885 1697062
14784 1697062 1470787 1307393 1670256 1599700 1749161 1936216 1883133 1679831 1687060 1910133
14774 1910133 1845273 1849199 1811892 1866977 1858178 2068668 2060858 1895369 1693275 1874181 1722008
14763 1722008 1747219 1782473 1498787 1730286 1758301 1777180 1907939 1674569 1615077 1864479
14753 1864479 1970831 1844459 1962657 1919317 1796739 1602693 1746382 1847179 1933567 1748211
14743 1748211 1753189 1832022 1658326 1842393 1828146 1911797 2012584 2018181 1892218 1828165 1840907
14732 1840907 1792166 1900166 1872108 1863053 1859854 2093681 2043705 1920952 2051613 1674121 1739441
14721 1739441 2025962 1946464 2029164 1978482 2164087 2182634 2048705 2210526 2214866 1925191
14711 1925191 1787115 1977621 2001980 1946023 1992925 1898514 2009458 1994081 1971054 1993014 1990353
14700 1990353 2089425 2054817 2036884 2181881 2175401 2109563 2009965 1867306 2143824 1971032 1716255
14689 1716255 1844130 1876301 1809296 2079360 2040870 1886433 1852402 1905293 1892081 1673375
14679 1673375 1676184 1708785 1676315 1619755 1668081 1578558 1719634 2055158 1820875 2006051 2107565
14668 2107565 2088124 1836997 1674815 1730167 1871255 2054605 2043501 2228647 2141079 2050107
14658 2050107 2015331 1955398 1856862 1718978 1753268 1837958 2045955 1886281 1670888 1929086
14648 1929086 1772357 1547433 1786394 1730190 1811016 1843111 2013976 2283205 2023821 1883071
14638 1883071 1856769 1836225 1550231 1840161 2080044 2025180 2042890 2235298 2075638 1884057
14628 1884057 1578893 1599830 1710306 1682064 1548736 1557629 1722020 1759931 1872780 1967861
14618 1967861 2016852 2172920 2213138 2014265 1991917 1893047 1878105 1927679 1738925 1861125
14608 1861125 1779957 1994546 2080310 1868891 1855493 1999242 2070135 2250834 1877744 1698085
14598 1698085 2029962 2037367 1879471 1728291 1850943 1762459 2077946 2111988 2138017 1971249
14588 1971249 1701313 1956657 1967321 1541379 1683062 1818826 1598435 1671369 1788338 1888361
14578 1888361 1997445 1926014 2058260 1962970 1891465 1752144 1804744 2031419 2041892 1860495
14568 1860495 2194784 2171456 1916366 2005329 2387961 2162861 2009004 2101895 2118557 1701956
14558 1701956 1565506 1789696 1852353 1805260 1831216 2053047 2054627 2032317 2147145 2065817 1781252
14547 1781252 2023089 1745714 1959336 1720715 1826543 1880657 1977190 2104126 2157488 2192423
14537 2192423 2081080 2027188 2020962 1994068 2014270 1947903 2055519 2334970 2072133 2059806 1954401
14526 1954401 1878594 2002164 2106693 2077301 2094805 2007054 1992407 2039824 1906581 1777432
14516 1777432 1615665 1604297 1912092 2135669 2012280 1935394 2071969 1741723 1610507 1716356
14506 1716356 1971292 1857419 1870501 2004671 1961601 2111643 1982537 2080311 2069338 1938347
14496 1938347 1971008 2048397 2121046 1869088 1669820 1746955 1959564 1870706 1657084 1772718
14486 1772718 1697219 1733977 2128422 2074521 2043587 2037915 2104174 2012718 2196030 2081035 1909087
14475 1909087 2130111 1980886 2061126 1716714 1640477 1584304 1605806 1851036 1818331 1606385
14465 1606385 1566433 1947452 1858860 1881521 2079220 1880399 1919765 2000406 1864681 1860545 2032632
14454 2032632 2022568 2106046 2249560 1924594 1986923 2113812 1942659 1925600 2020573 1775395
14444 1775395 1796689 1557995 1780556 1966925 1906646 1926493 2195296 2178957 2057526 2297108
14434 2297108 2126331 2154119 2060387 1843599 1790723 1921456 1880203 2205565 2096624 2190330
14424 2190330 2018827 2082967 2125770 1984356 1954513 2040283 1844358 1730328 1933357 2115072
14414 2115072 2157698 1972580 2098266 2046041 1943851 1922076 2078097 2011760 1997319 2059180
14404 2059180 2289347 2358967 2046725 1977257 1781939 1720476 1947586 1894745 1799227 1852632
14394 1852632 2015334 2143143 2154509 2069861 2088755 2286066 2020134 1989628 2064330 1808905
14384 1808905 1936392 1880440 1908495 2130350 1802808 2087808 2024754 1968629 1971274 2041689 2083555
14373 2083555 2000418 1982790 2080386 2076196 2187883 1989531 1782112 1976974 1870408 1857974
14363 1857974 2058380 2444614 2231462 2307836 2265938 2188651 1995891 2095088 2106807 1864726
14353 1864726 2002071 2143508 2139750 2176312 2190849 2029954 2041556 2102163 1962027 1969380 2040813
14342 2040813 1996526 2069952 2013154 2019564 2168288 1918456 1991403 2198879 2253743 2293235 2270560
14331 2270560 2154082 2015402 1912696 1731551 1718055 1411508 1891886 2018943 2045120 2104546
14321 2104546 2056108 2225895 2033040 2270786 2224006 2064994 2059277 2118481 2068779 1920376
14311 1920376 1849641 1918475 1978945 1735076 2035023 2047161 1969888 2107062 1862707 2004600
14301 2004600 1958500 1573624 1949143 2116997 1983835 2345188 2199054 2110915 2025163 2105618
14291 2105618 1796120 1699399 1725900 1907994 1881306 2133098 2132228 2055333 1915289 1942175 1909750
14280 1909750 2017083 2219891 2006024 2103116 2098953 1864892 1901548 2042779 2032716 1763251
14270 1763251 1934687 2025350 1992487 1990184 2100129 2116377 1948256 2008671 1968587 2108210 1969028
14259 1969028 1893581 2057980 2112182 2121196 2293240 2179329 2041899 2077753 1836403 1700262
14249 1700262 1967283 1805733 1715435 2002381 2039253 2041378 2208024 1828128 1890080 1783175
14239 1783175 1647984 2035451 1950072 1890096 2017700 1963511 2074557 2235110 2099758 2093184
14229 2093184 2151381 1927304 1919346 1925361 2243417 2045262 1911961 1973105 2083167 1959599
14219 1959599 2047565 1980195 1985663 1718782 1799427 2117367 1814564 1847857 2073488 1999879 2152615
14208 2152615 2181546 2060138 2215499 2234389 2222451 2134492 2004670 2039575 2275656 2395475
14198 2395475 2382240 2163264 2010119 1880346 1912643 1998477 1925600 2187965 2058240 2035820
14188 2035820 2106956 1960884 2021204 1925133 1770581 1824236 2044519 2061791 1921143 1919098 1949486
14177 1949486 1912286 2021282 1856276 2134721 2198449 2262943 2105661 2181398 2472376 2334082
14167 2334082 2218418 2148093 2185614 2096533 2138663 2397862 2232063 1872422 1979940 2207202
14157 2207202 2245024 2203764 2463028 2291633 2445048 2484902 2311358 2020123 1934324 1905397
14147 1905397 1914205 1801110 2025662 2061569 1998474 2315510 2395631 2174489 2249902 2649310
14137 2649310 2180762 2294594 2317564 2039536 1958710 2196378 1943802 2115308 2104882 2029752
14127 2029752 2034429 1798299 1871066 1993926 1989533 2053309 2014555 2101560 1852452 1927489 2015396
14116 2015396 1790263 1953719 2051115 1867005 1897684 1967390 2225813 2277594 2181622 2203325
14106 2203325 2292537 2026069 1844964 1775614 1609444 1846140 2046643 1925166 1765739 2014623
14096 2014623 1983501 2063647 2230172 2160842 2121038 2214692 2125292 2002282 2141944 2024547
14086 2024547 1980575 1795774 1772672 2054577 1849299 1952839 2003555 2259309 2326455 2260785
14076 2260785 2010948 2109907 2083217 2012098 2033981 2027566 1918800 2064931 2206247 2157032 2310307
14065 2310307 2106187 2098542 2057511 2162746 1970379 1917727 2105781 2045276 2091795 1946768
14055 1946768 1965984 2035741 1906423 2013052 1998615 1902294 2016408 2014766 1985492 1886400 1902937
14044 1902937 2039519 2077043 2115902 2074676 2099343 2202654 2093655 1826642 1754110 1974952
14034 1974952 1876066 1822367 2081165 1941138 2006130 2054207 1940253 2225562 2048699 1967584
14024 1967584 2105426 2258855 2338717 2170013 2199026 2173917 1985792 2031424 2234871 2145151
14014 2145151 2262021 2182614 1985438 1996144 1976011 1898916 1915691 1907512 1701832 1824683 1956237
14003 1956237 1957386 1933668 1914241 1776198 1941923 2144651 1962763 2078995 2010769 1684447
13993 1684447 1990992 2063977 2204827 2353455 2394614 2495271 2380433 2292617 2113314 1906483
13983 1906483 2021971 2175408 2050789 1962109 1854440 1985637 2261469 2467437 2329083 2249811
13973 2249811 1975141 2184417 2168521 2311676 2470915 2030315 2236668 2109097 2047690 2239518
13963 2239518 1978759 1836985 1901299 1938165 2033861 1996832 1991766 2208441 2155758 2125529 2007635
13952 2007635 1949748 1973187 2130291 2018074 2160417 2339285 2281995 2204935 2170421 1896391
13942 1896391 2132304 2182242 1935300 1958931 2058047 2185398 1837059 2143198 1969481 1888219
13932 1888219 2060588 2084581 2064203 2401935 2475227 2198755 2004937 2256871 2234182 2254401
13922 2254401 2121044 2279960 2024931 2024008 2055301 1940915 1824342 1900116 2331313 2070647
13912 2070647 2020132 2131123 2132036 2096181 2203306 2236351 2245009 2387360 2254065 2080373 2085859
13901 2085859 2253294 2215562 2150448 2178440 2049737 1924967 2073382 2113739 2059260 2332767
13891 2332767 2170029 2094648 1884682 1976212 1673781 1852994 1978862 1963343 2049390 2114525
13881 2114525 2215930 2131857 2115941 2138133 2217116 2208398 2022772 1986920 2176376 2030464 2198824
13870 2198824 2198629 2019879 2034804 1944136 2043687 2107734 2063745 1810472 2072789 2264873 2325429
13859 2325429 2242359 2180671 2150258 2228398 2460172 2428969 2260822 2151086 2208109 1997815
13849 1997815 2173542 2213994 2277151 2119466 2082369 2076749 2175756 2117444 2013681 2095963 1958154
13838 1958154 2363647 2194491 2295440 2429556 2324432 2238894 2267256 2080531 2260945 2131388
13828 2131388 1931853 2322409 2220070 2181110 2387522 2326958 2219269 2186619 2289097 2119668
$$ [...]
##END NTUPLES=NMR SPECTRUM
##END=
