##TITLE=1H_CG-1148-C
 CDCl3, 8 sc, 
 9.06.2021
##JCAMPDX= 6.0         $$ Bruker NMR JCAMP-DX V2.0
##DATA TYPE= NMR SPECTRUM
##DATA CLASS= NTUPLES
##ORIGIN= UXNMR, Bruker Analytische Messtechnik GmbH
##OWNER= root
$$ XWIN-NMR		Version 3.5
$$ Wed Jun  9 10:58:40 2021 Russian Standard Time (UT+4h)  she@DPX200
##.OBSERVE FREQUENCY= 200.131506
##.OBSERVE NUCLEUS= ^1H
##.ACQUISITION MODE= SIMULTANEOUS
##.ACQUISITION SCHEME= undefined
##.AVERAGES= 8
##.DIGITISER RES= 18
##SPECTROMETER/DATA SYSTEM= spect
##.PULSE SEQUENCE= zg30
##.SOLVENT NAME= CDCl3
##.SHIFT REFERENCE= (INTERNAL, CDCl3, 0, 17.5105)
##AUDIT TRAIL= $$ (NUMBER, WHEN, WHO, WHERE, WHAT)
$$ ##TITLE= Audit trail, XWIN-NMR		Version 3.5
$$ ##JCAMPDX= 5.01
$$ ##ORIGIN= Bruker BioSpin GmbH
$$ ##OWNER= she
$$ F:/spectra/data/she/nmr/H-F/1/pdata/1/auditp.txt
$$ ##AUDIT TRAIL=  $$ (NUMBER, WHEN, WHO, WHERE, WHAT)
(   1,<2021-06-09 10:56:47.65 +0400>,<she>,<DPX200>,
      <created by zg, POWCHK disabled, PULCHK disabled
       configuration hash MD5:
       00 E9 B6 7A A2 85 ED C7 34 08 36 98 17 FE 4E 26
       data hash MD5: 16K
       D6 AA AB CB 60 BB 08 C2 B1 95 53 A4 CE 51 6D B3>)
(   2,<2021-06-09 10:56:49.85 +0400>,<she>,<DPX200>,
      <Start of raw data processing
       efp BC_mod = 2 LB = 0.24 FT_mod = 6 PKNL = 1 PHC0 = -11481.76 PHC1 = 9.201011 SI = 16K 
       data hash MD5: 16K
       FB C4 04 E4 F5 B0 A5 D4 05 64 CD 62 A5 C9 DF 2C>)
(   3,<2021-06-09 10:57:13.37 +0400>,<she>,<DPX200>,
      <pk PHC0 = -3.688138 PHC1 = 3.2 
       data hash MD5: 16K
       A6 EC F3 51 D5 49 50 C5 CF AD 23 0B AE C7 82 2A>)
(   4,<2021-06-09 10:57:16.85 +0400>,<she>,<DPX200>,
      <abs ABSG = 5 
       data hash MD5: 16K
       AA 11 07 B0 28 C8 F8 7D 2D 8D E8 F5 78 EC 02 0A>)
(   5,<2021-06-09 10:57:36.09 +0400>,<she>,<DPX200>,
      <pk PHC0 = -1.29871 PHC1 = 2 
       data hash MD5: 16K
       6F F6 A6 C2 C7 2C F2 A4 DC F2 7D 8B 6F 00 44 04>)
(   6,<2021-06-09 10:57:39.87 +0400>,<she>,<DPX200>,
      <abs ABSG = 5 
       data hash MD5: 16K
       FE 89 98 EA C5 25 E6 D7 C8 3B 2B 72 36 B9 7E C5>)
$$ ##END=
$$ 
$$ hash MD5
$$ 5A 17 04 B4 51 59 78 38 30 0E 08 2E ED B5 CC BD
##$RELAX= 
##$RELAX= 
##$RELAX= 
##$RELAX= 
##$RELAX= 
##$RELAX= 
$$ Bruker specific parameters
$$ --------------------------
##$DU= <F:/spectra>
##$EXPNO= 1
##$NAME= <H-F>
##$PROCNO= 1
##$TYPE= <nmr>
##$USER= <she>
##$AMP= (0..31)
100 100 100 100 100 100 100 100 100 100 100 100 100 100 100 100 100 100 
100 100 100 100 100 100 100 100 100 100 100 100 100 100 
##$AQSEQ= 0
##$AQ_mod= 1
##$AUNM= <au_zg>
##$AUTOPOS= <>
##$BF1= 200.13
##$BF2= 200.13
##$BF3= 200.13
##$BF4= 200.13
##$BF5= 200.13
##$BF6= 200.13
##$BF7= 200.13
##$BF8= 200.13
##$BYTORDA= 1
##$CFDGTYP= 0
##$CFRGTYP= 5
##$CHEMSTR= <none>
##$CNST= (0..31)
1 1 145 1 1 1 1 1 1 1 1 1 1 1 1 1 1 1 1 1 1 1 1 1 1 1 1 1 1 1 1 1 
##$CPDPRG= <>
##$CPDPRG1= <>
##$CPDPRG2= <>
##$CPDPRG3= <>
##$CPDPRG4= <mlev>
##$CPDPRG5= <mlev>
##$CPDPRG6= <mlev>
##$CPDPRG7= <mlev>
##$CPDPRG8= <mlev>
$$ [...]
##$SUBNAM3= <"">
##$SUBNAM4= <"">
##$SUBNAM5= <"">
##$SUBNAM6= <"">
##$SUBNAM7= <"">
##$SUBNAM8= <"">
##$SUBNAM9= <"">
##$SW= 20.0188882624521
##$SWIBOX= (0..15)
0 0 2 0 0 0 0 0 0 0 0 0 0 0 0 0 
##$SW_h= 4006.41025641026
##$TD= 16384
##$TD0= 1
##$TE= 0
##$TE2= 300
##$TE3= 300
##$TEG= 300
##$TL= (0..7)
0 120 120 120 120 120 120 120 
##$TP= (0..7)
150 150 150 150 150 150 150 150 
##$TP07= 0
##$TPNAME0= <>
##$TPNAME1= <>
##$TPNAME2= <>
##$TPNAME3= <>
##$TPNAME4= <>
##$TPNAME5= <>
##$TPNAME6= <>
##$TPNAME7= <>
##$TPOAL= (0..7)
0.5 0.5 0.5 0.5 0.5 0.5 0.5 0.5 
##$TPOFFS= (0..7)
0 0 0 0 0 0 0 0 
##$TUNHIN= 0
##$TUNHOUT= 0
##$TUNXOUT= 0
##$USERA1= <user>
##$USERA2= <user>
##$USERA3= <user>
##$USERA4= <user>
##$USERA5= <user>
##$V9= 5
##$VALIST= <valist>
##$VCLIST= <CCCCCCCCCCCCCCC>
##$VD= 0
##$VDLIST= <DDDDDDDDDDDDDDD>
##$VPLIST= <PPPPPPPPPPPPPPP>
##$VTLIST= <TTTTTTTTTTTTTTT>
##$WBST= 1024
##$WBSW= 4
##$XGAIN= (0..3)
0 0 0 0 
##$XL= 0
##$YL= 0
##$YMAX_a= 798423
##$YMIN_a= -644960
##$ZGOPTNS= <>
##$ZL1= 120
##$ZL2= 120
##$ZL3= 120
##$ZL4= 120
##$ABSF1= 17.52155
##$ABSF2= -2.49749
##$ABSG= 5
##$ABSL= 3
##$ALPHA= 0
##$AQORDER= 0
##$ASSFAC= 0
##$ASSFACI= 0
##$ASSFACX= 0
##$ASSWID= 0
##$AUNMP= <proc_1d>
##$AZFE= 0.1
##$AZFW= 0.1
##$BCFW= 0
##$BC_mod= 2
##$BYTORDP= 0
##$COROFFS= 0
##$CY= -3
##$DATMOD= 1
##$DC= 0
##$DFILT= <>
##$DTYPP= 0
##$F1P= 0
##$F2P= 0
##$FCOR= 1
##$FTSIZE= 16384
##$FT_mod= 6
##$GAMMA= 0
##$GB= 0
##$INTBC= 1
##$INTSCL= 1.334414e-10
##$ISEN= 128
##$LB= 0.24
##$LEV0= 0
##$LPBIN= 0
##$MAXI= 10000
##$MC2= 0
##$MEAN= 0
##$ME_mod= 0
##$MI= 1.114404
##$NCOEF= 0
##$NC_proc= -6
##$NLEV= 6
##$NOISF1= 3.799351
##$NOISF2= 2.8
##$NSP= 0
##$NTH_PI= 0
##$NZP= 0
##$OFFSET= 17.51055
##$PC= 1
##$PHC0= -11486.75
##$PHC1= 14.40101
##$PH_mod= 1
##$PKNL= yes
##$PPARMOD= 0
##$PSCAL= 0
##$PSIGN= 0
##$REVERSE= no
##$SF= 200.130004818459
##$SI= 16384
##$SIGF1= 3
##$SIGF2= 2
##$SINO= 5.538805
##$SIOLD= 16384
##$SREGLST= <1H.CDCl3>
##$SSB= 0
##$STSI= 16384
##$STSR= 0
##$SW_p= 4006.41025641026
##$SYMM= 0
##$S_DEV= 0
##$TDeff= 16384
##$TDoff= 0
##$TI= <>
##$TILT= no
##$TM1= 0
##$TM2= 0
##$TOPLEV= 0
##$USERP1= <user>
##$USERP2= <user>
##$USERP3= <user>
##$USERP4= <user>
##$USERP5= <user>
##$WDW= 1
##$XDIM= 16384
##$YMAX_p= 292379049
##$YMIN_p= -770122
$$ End of Bruker specific parameters
$$ ---------------------------------
##NTUPLES= NMR SPECTRUM
##VAR_NAME=  FREQUENCY,     SPECTRUM/REAL,   SPECTRUM/IMAG
##SYMBOL=    X,             R,               I
##VAR_TYPE=  INDEPENDENT,   DEPENDENT,       DEPENDENT
##VAR_FORM=  AFFN,          ASDF,            ASDF
##VAR_DIM=   16384,         16384,           16384
##UNITS=     HZ,            ARBITRARY UNITS, ARBITRARY UNITS
##FACTOR=    0.24454680195387, 1,            1
##FIRST=     3504.38636487237, 0,            0
##LAST=      -502.02389153789, 0,            0
##MIN=       -502.02389153789, -770122,      0
##MAX=       3504.38636487237, 292379049,    0
$$ Real data points
##PAGE= N=1
##DATA TABLE= (X++(R..R)), XYDATA
$$ [...]
5419A3870879J06876O5227J52760R2712J00188L19467j68453J62823M6988j46865
5409A4602602M6890K47449R7514q5047j06527j4768Q5542N32873L6189K28055
5399A5670772J56549L79533O2874M13383K93700J99592R50110M91022N79260N60022
5389A9756817N73394K05780J216098P07611L87628O09369L19610K80288P855k11366
5379B3853084n73676k49780k52596k06787m20730J54295n73216j00125J64882
5370B1795351J62531J05467L20390M88681M45257J202822K63948J132202J287267
5361B7203916P96105J070681Q32608J032193P02094R36407O09156J08367K6887
5352C3318414o73821o35759j163224p19632j003721r96199o45914j062030j125139
$$ plain form
5419 13870879 13977755 14042982 14195742 14288454 14388642 14708109 14539656 14702479 14749467 14602602
5409 14602602 14649492 14896941 14994455 14909408 14802881 14788113 14873655 15406528 15442717 15670772
5399 15670772 15827321 16206854 16269728 16683111 16976811 17176403 18126513 18617535 19196795 19756817
5389 19756817 20330211 20535991 21752089 22459700 22847328 23456697 23776307 24056595 24064450 23853084
5379 23853084 23279408 23029628 22777032 22570245 22149515 22303810 21730594 21630469 21795351
5370 21795351 21957882 22063349 22383739 22872420 23317677 24520499 24784447 25916649 27203916
5361 27203916 28000021 29070702 29903310 30935503 31637597 32574004 33183160 33291527 33318414
5352 33318414 32644593 32008834 30845610 30125978 29122257 28126058 27480144 26418114 25292975
5343B5292975m61755l66350l70666m84772k23427K38518p806J17808N59310k39381
5333B4054454L47071N36823J13131M33845P98727K49741J22253K48368k10018
5324B6694395K3579o50612j35448j302146n96920j256173j005027o99831r94062
5315B0077755m05360r27558k56911m68088k81393n66846J30201j48970m03140
5306A6749690r8392m89781K81345j06137j26414o4345J49604Q5867L37835j72066
5296A6547206o47423m83021o70264k61939k40271k25283m41720m02594k12791
5287A2961900m65699K76310j61068l53769q0286k56566O082m06447L31782J25438
5277A1977677j39222n8006n4814o1530k33863k8159l49445k6082l8857k93015
$$ plain form
5343 25292975 24831220 24464870 24094204 23609432 23386005 23624523 23616717 23734525 24293835 24054454
5333 24054454 24401525 24938348 25051479 25485324 26284051 26533792 26656045 26904413 26694395
5324 26694395 26717974 26067362 25931914 24629768 24032848 22776675 21771648 21071817 20077755
5315 20077755 19672395 18744837 18487926 18019838 17738445 17171599 17301800 17152830 16749690
5306 16749690 16651298 16161517 16442862 16336725 16210311 16145966 16295570 16381437 16719272 16547206
5296 16547206 15899783 15416762 14746498 14484559 14244288 14019005 13577285 13174691 12961900
5287 12961900 12496201 12772511 12611443 12257674 12177388 11920822 11926904 11520457 11852239 11977677
5277 11977677 11838455 11780449 11725635 11664105 11430242 11402083 11052638 11026556 10987699 10694684
5267A0694684M7475K55099k51636j72537M40245r1040j71431q4752l82056J43631
5257A0427682p4702M1589k57493K09243j68341k39596J39379l98264L96322J5451
5247A0091270J8044j11153k1959N5661J58489j76708O177J6229N6378k19890j51342
5236I721196p9954l9695k5344j13844K35420p970J9933K63611j80220k55478k78068
5225I259587k7675L54051j6119L07627k47649j40290Q3445o6096L59902m4648
5215I822135K3549J91795J0515M28268m37711l64090L08597K4735N36392m80483
5205A0063702K30124m64968J44989K28502K95100M5676O4788J98941l80662L77870
5195A0804062k64214p408J86727n34978Q2436K0585k05435J36851j75910K28386
$$ plain form
5267 10694684 10742159 10997258 10745622 10573085 11013330 10922290 10750859 10666107 10284051 10427682
5257 10427682 10352980 10394569 10137076 10346319 10177978 9938382 10077761 9679497 10075819 10091270
5247 10091270 10109314 9998161 9976202 10031863 10190352 10013644 10019821 10036050 10092428 9872538 9721196
5236 9721196 9641242 9601547 9576203 9462359 9697779 9689809 9709742 9973353 9793133 9537655 9259587
5225 9259587 9231912 9585963 9569844 9877471 9629822 9489532 9572977 9506881 9866783 9822135
5215 9822135 9845684 10037479 10047994 10476262 10038551 9674461 9983058 10007793 10544185 10063702
5205 10063702 10293826 9828858 9973847 10202349 10497449 10543125 10607913 10806854 10426192 10804062
5195 10804062 10539848 10532440 10719167 10184189 10266625 10287210 10081775 10218626 10042716 10271102
5185A0271102k45981J35109N0924K88913j10897R661K027K6763L82953N977P4284
5174A0890835K1039j98349N5646Q9917J88025O3616N9838K10566J45533K71303
5164A1797969M7811k93827q9790N9819K92991N598J10281r1659l46651M7102O033
5153A1545677P4776K55012K2878l4105J18336J34704J58095k85344k27400Q0298
5143A1842927J774K65164J79176l3236k49337j43262M09947l454J96601J55101
5133A2621401j87927L63693j41285L007l0719J66688J51973k55470P0156j6182
5123A2745335K0426K32382J29611K87092K33951L41730o4994K83747r781J06800
5113A4306299P06824r7216J13009k59508l70085o2839J62546K03107k24673J3242
$$ plain form
5185 10271102 10025121 10160230 10211154 10500067 10389170 10398831 10400858 10427621 10810574 10816551 10890835
5174 10890835 10911874 10713525 10769171 10859088 11047113 11110729 11170567 11381133 11526666 11797969
5164 11797969 11845780 11551953 11462163 11521982 11814973 11820571 11930852 11839193 11492542 11539644 11545677
5153 11545677 11620453 11875465 11898343 11864238 11982574 12117278 12275373 11990029 11762629 11842927
5143 11842927 11844701 12109865 12289041 12255805 12006468 11863206 12273153 12269699 12466300 12621401
5133 12621401 12433474 12797167 12655882 12658889 12628170 12794858 12946831 12691361 12761517 12745335
5123 12745335 12765761 12998143 13127754 13414846 13648797 13990527 13925533 14209280 14199499 14306299
5113 14306299 15013123 14915907 15028916 14769408 14399323 14336484 14499030 14702137 14477464 14490706
5103A4490706L91872K11058L0835J133j56244j14354M39560J42973N23458M4914
5093A6005911k54147M05239L24669M71249k22055j53037k73320k29766J13241
5084A6187984j09040O4616l01281n21J75421J30012l7752P1535L2633O1123L93365
5073A6668095M56785O95355L35339K37760M90757J30934K68015K71752k62397
5064A9292395j18243k48322k76141J3217k07619l587K46099M62702K10816n2661
5054A9318656J24523j04803J84316M64329O0370M56758L30832j2716P55626L68362
5044B1946253N54220O43968M95583P73968Q77716Q59886L69081J083254O9805
5035B7673734l5014J27582k60583J16828Q3336M30549L60712P23416O01778Q50836
$$ plain form
5103 14490706 14882578 15093636 15124471 15125604 14969360 14855006 15294566 15437539 15960997 16005911
5093 16005911 15751764 16157003 16481672 16952921 16730866 16577829 16304509 16074743 16187984
5084 16187984 16078944 16143560 15842279 15841758 16017179 16147191 16109439 16180974 16213607 16274730 16668095
5073 16668095 17124880 17820235 18155574 18393334 18884091 19015025 19283040 19554792 19292395
5064 19292395 19174152 18925830 18649689 18662906 18455287 18451700 18697799 19160501 19371317 19318656
5054 19318656 19443179 19338376 19522692 19987021 20047391 20504149 20834981 20822265 21577891 21946253
5044 21946253 22500473 23144441 23640024 24413992 25291708 26151594 26520675 27603929 27673734
5035 27673734 27638720 27766302 27505719 27622547 27705883 28136432 28497144 29220560 29822338 30673174
5025C0673174P35461Q35281J340433J176775J783757J710655J862291J905682
5017D2023509K201759K130888K618630K943063L030091L439695L383894L556733
5009F5328262L834072L654537K904922K537213K394144K412094K195299K130138
5001H7390681K037562J793075J279202O59364N82776M40201J22885j10514J42790
4992I4338022n140O28453J0268m13454k82829j533947j138765k068532k443695
4983H7090381k942844k906934k533636k335663k204981k720592k100496j612713
4975F7732522j857284p66021q10232l20439k18414k52221o76026j149486q72973
4966F0809426j186106p19364m63818l54353L84648N57785P63649M09987N12915
$$ plain form
5025 30673174 31408635 32243916 33584349 34761124 36544881 38255536 40117827 42023509
5017 42023509 44225268 46356156 48974786 51917849 54947940 58387635 61771529 65328262
5009 65328262 69162334 72816871 75721793 78259006 80653150 83065244 85260543 87390681
5001 87390681 89428243 91221318 92500520 93159884 93742660 94182861 94305746 94195232 94338022
4992 94338022 94332882 94961335 94971603 94558149 94275320 92741373 91602608 89534076 87090381
4983 87090381 84147537 81240603 78706967 76371304 74166323 71445731 69345235 67732522
4975 67732522 65875238 65109217 64298985 63978546 63760132 63507911 62831885 61682399 60809426
4966 60809426 59623320 58903956 58440138 58085785 58470433 59028218 59791867 60201854 60714769
4957F0714769N85628N23688R65763P13554J345242J602620J730268J887448J493687
4948G1562667J322336J067508L71491r39763k360918l023883l274248k765737
4940F1959453k165209j451659j781793j006498j453216j047232o50659q19851
4932E1583336n68791m70734q27050m75494j85303M59131L31730m456q9279P3731
4922D9826821m15453r48181j410798k328085k157835k755137k069005k045720
4914C5696607j972593j283255j875899j317692j225231j658656o19296j015964
4906B4728021j366950o65849q35663n55331k16395p18960m10976j25852n78625
4897A9253420o11260k24443l70526l56686m15587J2989m58170j88869l83637n22236
$$ plain form
4957 60714769 61300397 61824085 62789848 63503402 64848644 66451264 68181532 70068980 71562667
4948 71562667 72885003 73952511 74324002 73384239 71023321 67999438 64725190 61959453
4940 61959453 59794244 58342585 56560792 55554294 54101078 53053846 52403187 51583336
4932 51583336 51014545 50543811 49716761 49241267 49055964 49515095 49846825 49842369 49753090 49826821
4922 49826821 49411368 48463187 47052389 44724304 42566469 39811332 37742327 35696607
4914 35696607 33724014 32440759 30564860 29247168 28021937 26363281 25743985 24728021
4906 24728021 23361071 22695222 21859559 21304228 21087833 20368873 19957897 19832045 19253420
4897 19253420 18642160 18417717 18047191 17690505 17274918 17287907 16829737 16640868 16257231 15734995
4887A5734995J75896k76832q1600k89875k20893M9319k79968r9176l54705j70647
4877A4186514K32677j44312l48509Q760m59832J02736m9585K4062k3318k96462
4867A3232731k67318j35186j5024p2096l70462k41033J15843o07784K08835P1053
4857A1919559J50015k18183j70002r4194K4467K83391k2473K39480j04656n3451
4847A1953953k07145q6076J38620o65558K48292j48809m25281M33587l8882J32615
4837A1335316L0698j38767K56153K16747R8823q427j765n032J95526m2515K08725
4826A2145482J59093j86004L46026j622N37896O7803N07188O14581L34818O41722
4816A5166983P85099P99948J059638J452107J682825K211910K774153L177898
$$ plain form
4887 15734995 15910891 15634059 15552459 15262584 15041691 15091010 14811042 14711866 14357161 14186514
4877 14186514 14419191 14274879 13926370 13935130 13475298 13578034 13528449 13552511 13529193 13232731
4867 13232731 12965413 12830227 12815203 12743107 12372645 12131612 12247455 11639671 11848506 11919559
4857 11919559 12069574 11851391 11681389 11587195 11611662 11895053 11872580 12112060 12007404 11953953
4847 11953953 11746808 11660732 11799352 11133794 11382086 11233277 10807996 11241583 11202701 11335316
4837 11335316 11366014 11227247 11483400 11700147 11798970 11790543 11788778 11783746 11979272 11936757 12145482
4826 12145482 12304575 12118571 12464597 12462975 13000871 13068674 13575862 14190443 14525261 15166983
4816 15166983 15952082 16752030 17811668 19263775 20946600 23158510 25932663 29110561
4808B9110561K557284J098466K011838K741260j599064m330463l775138l757608
4800B4057136l044180k422098j733962j099117r09389q38637n56966m33903m19593
4791A2599291l81998o40800k39786o0920k87565N357p9080j63978l43393l11229
4781A0095899k72670Q0077K01877j38576J4257j25644n9844K12887M4341K18260
4771A0270864J50399l05499j93105l4608L68783J01060K02242J59833L5886M5191
4761A0801046m17886k41073j76442l75871k18899j10162J02923m31802M351k40709
4751H695476k57583p7163p0951J39306K36501m29385l90051j95874J30947o5632
4741G715591K58001M0508k05213L61955j40201K49626P767q1156Q0840Q8413L9173
$$ plain form
4808 29110561 31667845 32766311 34778149 37519409 35920345 31589882 27814744 24057136
4800 24057136 21012956 18590858 16856896 15757779 14848390 14009753 13452787 13018884 12599291
4791 12599291 12217293 11576493 11336707 11275787 10988222 10993579 10914499 10750521 10407128 10095899
4781 10095899 9823229 9903306 10105183 9966607 9980864 9855220 9795376 10008263 10052604 10270864
4771 10270864 10421263 10115764 9922659 9888051 10256834 10357894 10560136 10719969 10755855 10801046
4761 10801046 10383160 10142087 9965645 9589774 9370875 9260713 9363636 8931834 8936185 8695476
4751 8695476 8437893 8360730 8289779 8429085 8665586 8236201 7846150 7650276 7781223 7715591
4741 7715591 7973592 8014100 7808887 8170842 8030641 8280267 8288034 8206878 8287718 8376131 8415304
4730H415304l79814M85349r782k0450L64099m8400L1242J55832L53730L03326
4720I650436N44454Q2295k35508j05441m54132o11764k56771j96667k79021N7427
4710H195308N2628j33455L0483l77855l00593J73836n59734k05804j94319r1601
4700F588894R0636k53377J16248l54374q96K54676K74059R0067k95439q4206j50099
4689F276189R51M4670K46057q2549j05129j21311l45773N46203k65013K06680
4679F400975n6021J90922j34092m5317L13462l08863n0392k6151j71530k7644
4669F085349L52390k83506j41850K44378p0571J81144J03631j97483l20758J2262
4659E964986K51542J8717L4679K56347l07862L60494n8927j02401K7129k9311
$$ plain form
4730 8415304 8035490 8520839 8511057 8490607 8854706 8806306 8837548 8993380 9347110 9650436
4720 9650436 10194890 10277185 10041677 9936236 9482104 8870340 8613569 8416902 8137881 8195308
4710 8195308 8247936 8114481 8144964 7767109 7466516 7640352 7080618 6874814 6680495 6588894
4700 6588894 6679530 6426153 6542401 6188027 6187131 6441807 6715866 6805933 6510494 6426288 6276189
4689 6276189 6277140 6321810 6567867 6485318 6380189 6258878 5913105 6459308 6194295 6400975
4679 6400975 6344954 6535876 6401784 6356467 6669929 6361066 6310674 6284523 6112993 6085349
4669 6085349 6437739 6154233 6012383 6256761 6186190 6367334 6470965 6273482 5952724 5964986
4659 5964986 6216528 6235245 6269924 6526271 6218409 6578903 6519976 6417575 6444704 6415393
4649F415393J976j80028j15353K27383L33128L1643n31841n4745J82127j0549
4639F299134k3272j79938J53889m670R9848k67953j07479K1443j2540J5755L21754
4628F315971l17756m977K1634J042m5648K05190k62025J79284L50831n15603l8112
4617E889831J76131m7610N79422j04014l7057j58950j1007j90338J98389M6228
4607F341025k2981l6573m34076K23040j07247J58612j35713K33546j49727M439
4597F074345J53138J33209l8063j42580n1599o1828L90621K39201j67940j38095
4587F390409k6530k12966L81473J37659k68115K50637k35529L7277J73189M7698
4577F675202J31729j52075k20768K94022n9492n6179J39464O7901l1644J04511
$$ plain form
4649 6415393 6417369 6237341 6121988 6349371 6682499 6714142 6182301 6127556 6309683 6299134
4639 6299134 6275862 6095924 6249813 6245143 6344991 6077038 5969559 5991002 5978462 5994217 6315971
4628 6315971 5998215 5993238 6014872 6015914 5970266 6175456 5913431 6092715 6443546 5927943 5889831
4617 5889831 6065962 6018352 6597774 6493760 6456703 6297753 6286746 6096408 6294797 6341025
4607 6341025 6318044 6281471 5847395 6070435 5963188 6121800 5986087 6219633 6069906 6074345
4597 6074345 6227483 6360692 6322629 6180049 6128450 6066622 6457243 6696444 6528504 6390409
4587 6390409 6363879 6150913 6532386 6670045 6401930 6652567 6417038 6454315 6627504 6675202
4577 6675202 6806931 6654856 6434088 6728110 6668618 6612439 6751903 6819804 6788160 6892671
4567F892671J06946k26098j22907j94445L49340p8883K7074P1279k06944J94449
4557F812482j38963j76070L351k109J46102j95283J37251N31389m3483J90724
4547G265391j54589j08905J59659L12549k44126J23269K84149m09410R8518K58892
4537G585397J10481k57114M18402j95482Q6286M01147k40849J95384N1366K79387
4527H434405Q1478j56921p8870O8254N1447L03402L3066K29780K44888K00039
4517I410968K6795k87844m6772J31327l0273K5373J70497M8583N05928l9346j64382
4506I750854K87472l34632K12731M83788q4998L30229P254o4162K08424L30801
4496A1127761J96580M88408l6635K27074l3344L21039M05383R2930J71691K52207
$$ plain form
4567 6892671 6999617 6773519 6650612 6456167 6805507 6726624 6753698 6824977 6618033 6812482
4557 6812482 6673519 6497449 6500800 6498691 6644793 6449510 6586761 7118150 7074667 7265391
4547 7265391 7110802 7001897 7161556 7474105 7229979 7353248 7637397 7227987 7326505 7585397
4537 7585397 7695878 7438764 7857166 7661684 7747970 8149117 7908268 8103652 8155018 8434405
4527 8434405 8515883 8358962 8280092 8348346 8399793 8703195 8736261 8966041 9210929 9410968
4517 9410968 9437763 9149919 9103147 9234474 9204201 9229574 9400071 9448654 9954582 9915236 9750854
4506 9750854 10038326 9703694 9916425 10400213 10315215 10645444 10652698 10588536 10796960 11127761
4496 11127761 11324341 11812749 11776114 12003188 11969844 12290883 12696266 12789196 12960887 13213094
4486A3213094N11002K19634O40171L0151L63191N83431K34248O82491M13678M30263
4476A7321354K0828N31764L55595L49959N81562O44447O00943P0229N19654J80609
4466B1176944K08521K06639o1646j2396L95017P1852q0986q8426o4091L32008
4456B2083436L37427M58773K95418L71881N19605O22587O92387R80761O31651
4447B6993926Q09775N80682N65975J033045O16318Q24230O01991J54155L80998
4438C2561095k80581L39011L05270N18343L59579J10490O04312N04340O72583
4429C5694442M11947R02789P13653O18907O65969L26780K45411P25019J45795
4420D0450712Q43020L68376N47118N70167R75724J175877Q22122J300178Q22440
$$ plain form
4486 13213094 13724096 13943730 14583901 14614052 14977243 15560674 15794922 16477413 16891091 17321354
4476 17321354 17342182 17873946 18229541 18579500 19161062 19805509 20406452 20476681 20996335 21176944
4466 21176944 21385465 21592104 21530458 21518062 21913079 21984931 21903945 21815519 21751428 22083436
4456 22083436 22420863 22879636 23175054 23546935 24066540 24689127 25381514 26362275 26993926
4447 26993926 27803701 28384383 28950358 29983403 30599721 31423951 32025942 32180097 32561095
4438 32561095 32280514 32619525 32924795 33443138 33802717 33913207 34517519 35021859 35694442
4429 35694442 36106389 37009178 37722831 38341738 39007707 39334487 39579898 40304917 40450712
4420 40450712 41293732 41662108 42209226 42779393 43755117 44930994 45753116 47053294 47875734
4411D7875734J011499J481479J006051J483428J669047J865354K239859K161648
4403F0794099K341240K050721K123189K129949K310851K275212K285647K291217
4395G8602125J988946K125048K010464K513946K747291K726510L796255L801874
4387A00312459L744134M570572M606068M529183M826207M589934M880190M661969
4379A36720716M566392L796872K722844K681508J209140M80486j00496j297535
4371A50779927k202446l351625m449591n471331n594469o227526o435175o161036
4363A10886728n281024m902064m386993l538524l931994l123336k863078k803919
4355H0055796l094881k799660k763313k754911k587922k288060k180640j633784
$$ plain form
4411 47875734 48887233 50368712 51374763 52858191 54527238 56392592 58632451 60794099
4403 60794099 63135339 65186060 67309249 69439198 71750049 74025261 76310908 78602125
4395 78602125 80591071 82716119 84726583 87240529 89987820 92714330 96510585 100312459
4387 100312459 104056593 108627165 113233233 117762416 122588623 127178557 132058747 136720716
4379 136720716 141287108 145083980 147806824 150488332 151697472 152177958 152077462 150779927
4371 150779927 148577481 145225856 140776265 135304934 129710465 123482939 117047764 110886728
4363 110886728 105605704 100703640 96316647 92778123 88846129 85722793 82859715 80055796
4355 80055796 76960915 74161255 71397942 68643031 66055109 63767049 61586409 59952625
4347E9952625j458307j519770j308465j545181j281482j223360j494979j024281
4339D9096800r89004j067248j161130j212155r48666j032653o75963j203825q99803
4330C9906353j250399j244559j089728p89798l54833r99625p65113q29199m70666
4321C2112433n43225k87628k76765p09583m81653m91033o7392j52964J54411J9621
4311B9276222L7463j145L79108J73421N86127K40764M81523L1033j45955m22173
4301C0636388q71875p35646j164095r47270q88250r59812r14664p71229r89146
4292B2394401o92572n56112m59776o15797l41087k10552l16177k72631j65483
4283A8764214m3281k40870O8544j52595J87704j53435m1337k19492m0082j67424
$$ plain form
4347 59952625 58494318 56974548 55666083 54120902 52839420 51616060 50121081 49096800
4339 49096800 48107796 47040548 45879418 44667263 43718597 42685944 42009981 40806156 39906353
4330 39906353 38655954 37411395 36321667 35531869 35177036 34177411 33412298 32583099 32112433
4321 32112433 31569208 31281580 31004815 30295232 29813579 29322546 29255154 29102190 29256601 29276222
4311 29276222 29313685 29312540 29691648 29865069 30451196 30691960 31173483 31204516 31058561 30636388
4301 30636388 29764513 29028867 27864772 26917502 26029252 25069440 24154776 23383547 22394401
4292 22394401 21701829 21145717 20685941 20070144 19729057 19518505 19202328 18929697 18764214
4283 18764214 18720933 18480063 18548607 18396012 18583716 18430281 18388944 18169452 18129370 17961946
4273A7961946L12302j21441m70701M21512j97389P3722J79639k89828K11175L32873
4263A8413810j68692J81855j58262m00239J97371m362N2256L13305K34946L30427
4253A8992415M754O8294K49627J84503K89448N91385J65395L23944p2241R4283
4243B0891807J6659j16233j37638k68259L12543K20820J84472j00441l74048L4621
4233B0664303J7907l1644Q0123o409M7284J16333J91612L0089J12546N44529L69713
4222B2136386O00295R1184J63955L52066O66029O37964O17719K64230P48821O33986
4212B6912635N18387P31776P18340N77890Q82179P70346O86926M59131P30984
4203C2988594M73297L21993J45273j53924O7630l08247J25457j73379N0667K28933
$$ plain form
4273 17961946 18274248 18152807 17682106 18103618 17906229 17979951 18159590 17869762 18080937 18413810
4263 18413810 18245118 18426973 18268711 17868472 18065843 18061481 18113737 18427042 18661988 18992415
4253 18992415 18997169 19065463 19315090 19499593 19789041 20380426 20545821 20869765 20797524 20891807
4243 20891807 20908466 20792233 20654595 20386336 20698879 20919699 21104171 21003730 20629682 20664303
4233 20664303 20682210 20650566 20730689 20724280 20771564 20887897 21079509 21109598 21222144 21766673 22136386
4222 22136386 22736681 22827865 22991820 23343886 24009915 24647879 25265598 25529828 26278649 26912635
4212 26912635 27431022 28162798 28881138 29459028 30341207 31111553 31798479 32257610 32988594
4203 32988594 33461891 33783884 33929157 33775233 33842863 33534616 33660073 33486694 33537361 33766294
4193C3766294K75032K23707O14681N67232L86119R95563M14384O68371J119976
4184C9031359M61933P70226J143562J061355Q92479P31503J023742R06993J113311
4175D7136463Q68732P02386P31113j50259k68644p44332m37544q10887p69158
4166D6257870m45573l77192r3785J4788R33228K86171Q05079O52166M59474J330497
4156D9822723Q89508J109485O20784J152106J504544J873175J753067J967699
4148F0693091J841126K524978L123251K824560K843473L273804L038373L714915
4140H3877571L987855M061191M782226N992844O524140Q289513R683047J0534947
4132A37733334J2381302J3096899J2935798J1697736R806524O215520K292534
$$ plain form
4193 33766294 34041326 34265033 34879714 35446946 35833065 36828628 37243012 37911383 39031359
4184 39031359 39493292 40263518 41407080 42468435 43360914 44092417 45116159 46023152 47136463
4175 47136463 48005195 48707581 49438694 49288435 49019791 48275459 47837915 47027028 46257870
4166 46257870 45812297 45435105 45341320 45356108 46289336 46575507 47380586 48032752 48492226 49822723
4156 49822723 50712231 51821716 52442500 53594606 55099150 56972325 58725392 60693091
4148 60693091 62534217 65059195 68182446 71007006 73850479 77124283 80162656 83877571
4140 83877571 87865426 91926617 96708843 102701687 109225827 117515340 127198387 137733334
4132 137733334 150114636 163211535 176147333 187845069 197651593 203867113 206159647
4125B06159647r73706m477133o741582q693158j1337523j2650486j3335184j2435658
4117A35515217j0435714r143103p350634n706027n294299m076794l403024l445168
4109H6660454k764232l080423l810255l128492l088475k623519k620122j319958
4101F4224978j963189j302465j017091j262360n93309j024396o50718l66908o8169
4092E5976373j76488l79981k58764l29508n31121l46354l26207j97095m01151
4083E3029704k3488l0099m68047K22242m3610j26456L17622K17508k00691J53581
4073E3048266l99514k44583R7592Q9134J32730j7578O25916K73469P51379O41604
4063E4998415N65307O00124r005M60989N73824P93785Q38537J95939J70276j62874
$$ plain form
4125 206159647 205185941 200708808 193967226 185274068 173936545 161286059 147950875 135515217
4117 135515217 125079503 115936400 108585766 102879739 97585440 93508646 90105622 86660454
4109 86660454 83896222 80815799 77005544 73877052 70788577 68165058 65544936 64224978
4101 64224978 62261789 60959324 59942233 58679873 58086564 57062168 56411450 56044542 55976373
4092 55976373 55799885 55419904 55161140 54831632 54300511 53954157 53627950 53430855 53029704
4083 53029704 53006216 52976117 52508070 52730312 52686702 52560246 52877868 53095376 52894685 53048266
4073 53048266 52648752 52404169 52501761 52590895 52723625 52706047 53331963 53605432 54356811 54998415
4063 54998415 55563722 56163846 56154841 56615830 57189654 57983439 58821976 59017915 59188191 59025317
4053E9025317R3671n53202l27540k316m15606P8293k73270m50137p27565o31148
4043E5816497j052157j168558o37206o51269l65451m72403O8356L21405N78110
4034E2437324P94969N02820J159068J000555Q82519K25888m1461q07903j566561
4025E4587218j174456j962436j478966j360917j284839j094284n87050j360502
4017D4283768j124619r65897o43372j012674q59939p36672o98985l05108l64049
4008C7572453j247J01356L18057L94004M95102J94549m8486n12536l9712k47734
3998C8225806p61298l26690o00805n31040m49575l98835J80713M14763M50573
3989C6203612L3206p2469k87685l51710p8492N16064N24562M5637J223244R83885
$$ plain form
4053 59025317 59118988 58565786 58238246 58235930 57820324 57898617 57625347 57175210 56447645 55816497
4043 55816497 54764340 53595782 52958576 52307307 51941856 51469453 51537809 51859214 52437324
4034 52437324 53232293 53735113 54894181 55894736 56777255 57003143 56961682 56153779 54587218
4025 54587218 53412762 51450326 49971360 48610443 47325604 46231320 45644270 44283768
4017 44283768 43159149 42193252 41549880 40537206 39677267 38940595 38241610 37936502 37572453
4008 37572453 37571206 37672562 37990619 38384623 38879725 39074274 39025788 38513252 38473540 38225806
3998 38225806 37464508 37137818 36537013 36005973 35556398 35157563 35338276 35753039 36203612
3989 36203612 36236818 36164349 35876664 35524954 35446462 35962526 36487088 36532725 37755969 38739854
3979C8739854R44321J254729J393852K216324K422700K218496K457421K042600
3971E3690297J347634J061615J285737J770161J765155J967970K391825L266666
3963F8547060L521365M110324M832599O109226O485626O690497O587976M751490
3955A11636163K132019j287473n023395p091992p809533p627994o005828m475024
3947G4446943l574592k477395k193505j877439j720765j773806j407242p57836
3939E8664363j037637q79029j58802n74282p88796o09850r13378r43204p77260
3930E1982125r26579j190537r94479q94449j127938q67532o16904j090773n45005
3921D3727929n71669n88852l38692k68569J37110O898k5797k5013r8486L76929
$$ plain form
3979 38739854 39684175 40938904 42332756 44549080 46971780 49190276 51647697 53690297
3971 53690297 55037931 56099546 57385283 59155444 60920599 62888569 65280394 68547060
3963 68547060 72068425 76178749 81011348 87120574 93606200 100296697 106884673 111636163
3955 111636163 113768182 112480709 107457314 100365322 92555789 84927795 78921967 74446943
3947 74446943 70872351 68394956 66201451 64324012 62603247 60829441 59422199 58664363
3939 58664363 57626726 56747697 56588895 56014613 55225817 54615967 53702589 52759385 51982125
3930 51982125 51055546 49865009 48870530 47976081 46848143 45980611 45363707 44272934 43727929
3921 43727929 43156260 42567408 42228716 41960147 42097257 42104155 42078358 42053345 41954859 42331788
3911D2331788N8289Q92447M24180R87925J199081J196684J388899J034729Q34675
3902E0348697J015603R22485O85996J108826J519856K101920K068707K144655
3894F1916745J563562N38414m46304j144676k087384k075664k084333j591415
3886E4588945j157049o32900n99520q31174j58263j88425J06402L98917N65372
3877E2092305M77263R42599J314110J111342J132798J496866J654089J352763
3869F1574135J276982J848273J914438K510357K408731K203714K409961K548530
3861G8695121L537464L331112M360153L797234L190666J740382l70648k695694
3853I5585790m769476n092200m400566l025671j808518j062256q25531j34800
$$ plain form
3911 42331788 42390077 43282524 43706704 44694629 45893710 47090394 48479293 49514022 50348697
3902 50348697 51364300 52286785 52972781 54081607 55601463 57703383 59772090 61916745
3894 61916745 63480307 64018721 63572417 62427741 60340357 58264693 56180360 54588945
3886 54588945 53431896 52798996 52199476 51368302 51210039 51021614 51128016 51526933 52092305
3877 52092305 52569568 53512167 54826277 55937619 57070417 58567283 60221372 61574135
3869 61574135 62851117 64699390 66613828 69124185 71532916 73736630 76146591 78695121
3861 78695121 82232585 85563697 89923850 93721084 96911750 98652132 98281484 95585790
3853 95585790 90816314 85724114 81323548 78297877 76489359 75427103 74601572 74466772
3845G4466772K96223J67004P95501n8925q86585k125634l346928l437865l537634
3836F2331929l308867k259011j780412j120774k02232n5436m16546q1239r82267
3827E2125145r30185j217333j225316j357505r56868n96929l20365J4989p5812
3818D5459821L99542K68492M11581J69822n46027o12790j347729p10464q69507
3809D2622741p69601n89716n35516n1477k21356M8243m73960J61719J8041K24252
3799D0433370K08594J25217L17843J99636K86150J02302K15541K9802r0684L52069
3789D2179840o8217k9093K44208L185j94776J42063J99859k77460J92580o532
3779D2385657k41410N01971k51483J65621L71097J5741K12919P364L11507L11894
$$ plain form
3845 74466772 74762995 74929999 75725500 75666575 74779990 72654356 69307428 65869563 62331929
3836 62331929 59023062 56764051 54983639 53862865 53660633 53605197 53188651 53107412 52125145
3827 52125145 51194960 49977627 48752311 47394806 46437938 45841009 45520644 45535633 45459821
3818 45459821 45859363 46127855 46539436 46709258 46163231 45550441 44202712 43492248 42622741
3809 42622741 41853140 41263424 40727908 40676431 40455075 40503318 40029358 40191077 40209118 40433370
3799 40433370 40641964 40767181 41085024 41284660 41570810 41673112 41888653 41918455 41827771 42179840
3789 42179840 42111623 42082530 42326738 42329923 42135147 42277210 42477069 42199609 42392189 42385657
3779 42385657 42144247 42646218 42394735 42560356 42931453 42947194 43160113 43167477 43478984 43790878
3769D3790878L39192n2342M05237k59283p47788n14319j067138o50038p74156
3760D0470243j346614n18198p78255n51018J40407p93553Q2149r29900k08029
3751C5567232k52698j07039k58929J07045n28247j12943R3987j81363M08072J46894
3741C4882011J79839j44339j20626k93076k83179m64702j023550p22746o32943
3732C1376689n52956o7246J25397J66554J9484k61897l23660m07236m13624o16869
3722B9044636m45694r63883n36790m08622j38324j03203j63987l96210o12582
3713B5275341m34377o40315m02609o04889n52804q16374l02041m96222n47653
3704B0478057n28511k89590k89677k35695m4571l43351l32162N813m55029m84166
$$ plain form
3769 43790878 44130070 44077728 44482965 44223682 43475894 42961575 41894437 41244399 40470243
3760 40470243 39123629 38605431 37827176 37276158 37416565 36623012 36705161 35775261 35567232
3751 35567232 35314534 35207495 34948566 35055611 34527364 34414421 34508408 34327045 34735117 34882011
3741 34882011 35061850 34917511 34796885 34503809 34220630 33755928 32732378 32009632 31376689
3732 31376689 30823733 30756487 30881884 31048438 31067922 30806025 30482365 30075129 29661505 29044636
3722 29044636 28598942 27635059 27098269 26689647 26551323 26448120 26284133 25887923 25275341
3713 25275341 24840964 24200649 23798040 23193151 22640347 21823973 21521932 21025710 20478057
3704 20478057 19949546 19659956 19370279 19134584 19090013 18746662 18414500 18420313 17965284 17481118
3694A7481118l78848l03958j13311o0971k41468k97356j19439m03699j8087M39386
3684A5983367J60953K5634o17426j51116o1038k23149j01483l22093Q5911J16572
3674A4896132l91081J37293J12117o5741M19340J29588k42082k9112J40488j77219
3664A4929723J69872o6199R9727J7805r1252J96582r3314R2166K94257N99920
3654A6149287k66140J58639j70610k5923L76071P3868R2473J50347K70995J45272
3644A6954279J65594P31005k6020K33849O36708j31058Q84465K55310L30047N75275
3634B0609454j10840K76527N0353O5715N02016j1383l7280L61312J58557k09781
3624B1654650K9772j59727k91635Q56828L83284J88059L16756N14211N30753N21513
$$ plain form
3694 17481118 17102270 16798312 16685001 16624030 16382562 16085206 15965767 15562068 15543981 15983367
3684 15983367 16144320 16169954 15552528 15401412 15340374 15117225 15015742 14693649 14779560 14896132
3674 14896132 14505051 14642344 14754461 14688720 15108060 15237648 14995566 14966454 15106942 14929723
3664 14929723 15099595 15033396 15133123 15150928 15059676 15256258 15162944 15255110 15549367 16149287
3654 16149287 15883147 16041786 15871176 15845253 16221324 16295192 16387665 16538012 16809007 16954279
3644 16954279 17119873 17850878 17824858 18058707 18695415 18564357 19448822 19704132 20034179 20609454
3634 20609454 20498614 20775141 20825494 20891209 21393225 21381842 21344562 21705874 21864431 21654650
3624 21654650 21684422 21524695 21233060 22089888 22473172 22661231 22977987 23492198 24022951 24544464
3614B4544464N65530L22116K47825P41566L75384N45057O92023K22290J12254
3605B8368509M85092j14610P31M53694N0766L73761O1650k46652K98561p8848
3595B9652654o9457J15177J6315J57098o4368J65513L6380o0942N52679J47321
3585C0648370P16284P06137L11414M22455Q49983O25595M84666M49033j81628
3576C5032309N4982L40147L7088n19039l11439k95582l9967r4005n5700k15601
3566C3933193m1125k45897l61129k24199K04927m55042q3890r1705j94377k19112
3556C2221644k21469p2017p7108R50Q5151Q925K51951j56736K2051J8908j26775
3545C1955475j10524k75029l81072k43755o05738m79725j99249j25346k11141
$$ plain form
3614 24544464 25109994 25432110 25679935 26421501 26796885 27341942 28033965 28256255 28368509
3605 28368509 28853601 28738991 28739722 29193416 29244182 29617943 29679593 29432941 29731502 29652654
3595 29652654 29583197 29698374 29714689 29871787 29807419 29972932 30009312 29948370 30501049 30648370
3585 30648370 31364654 32070791 32382205 32804660 33654643 34280238 34764904 35213937 35032309
3576 35032309 35087291 35427438 35464526 34945487 34634048 34338466 34298499 34204494 34148794 33933193
3566 33933193 33892068 33646171 33285042 33060843 33265770 32810728 32726838 32635133 32440756 32221644
3556 32221644 32000175 31928158 31851050 31852000 31937151 31946076 32198027 32041291 32063342 32082250 31955475
3545 31955475 31844951 31569922 31188850 30945095 30339357 29859632 29660383 29535037 29323896
3536B9323896l01557l76511k24334k43044r4896k34593l85036o13569q02743l0099
3526B6017514m51241o3666j07322p29778k11570q39935l07946k23355l11545r0644
3516B2680512m06962j27467k76225k36529J2628m27678m32721j4931N1584l58844
3506B0463367j69121l67613K2707K30282l53052j80974l18633l92405j66805l88614
3496A8379139j01651k79425l64848r1957n8478M0943K03690j01121k3019k92035
3486A7311238l27166L17460r7006J19838L0177j11514J58673P4074M55918Q0230
3476A8011922p9796J15097m82708P0202K70229J03305k01885k40051n4823L483
3466A7514975r2129L01894l93125Q394J7019k64599j492J01917k86256j15247
$$ plain form
3536 29323896 29022339 28645828 28421494 28178450 28083554 27848961 27463925 26850356 26047613 26017514
3526 26017514 25566273 25502607 25395285 24665507 24453937 23614002 23306056 23082701 22771156 22680512
3516 22680512 22273550 22146083 21869858 21633329 21645957 21218279 20785558 20770627 20822211 20463367
3506 20463367 20294246 19926633 19949340 20179622 19826570 19645596 19326963 18934558 18767753 18379139
3496 18379139 18277488 17998063 17633215 17541258 17482780 17523723 17727413 17626292 17603273 17311238
3486 17311238 16984072 17301532 17204526 17324364 17354541 17243027 17401700 17475774 17931692 18011922
3476 18011922 17932126 18047223 17564515 17634717 17904946 18008251 17806366 17566315 17511492 17514975
3466 17514975 17422846 17724740 17331615 17340009 17357028 17092429 17090937 17192854 16906598 16791351
3456A6791351P1522r1965O9427L23034l59468j12195j08097p9727J78547M96480
3446A7178909K80226k19241K30519l47251k67396M82907k44636n4063N4871J63967
3436A7258812l38173K40244m20749n0476M26642l76995L82631j54716K17105N70683
3426A7755008K07104M11862J52334L48807P4526M14731Q341J27495K66691n5651
3416A9711248L73482k66342J08250L23363L14058J73834K48990O5689R2420N38489
3406B1683481M14955K19123M03313M4007O47745M93587M99322N42939M24016P00931
3396B6073419L44310N76617M35192R46862J088384Q22168O37484O75766J017964
3387C2618166J186954R95299J161831J230918J449767J688158J689778J784804
$$ plain form
3456 16791351 16862873 16770908 16840335 17163369 16803901 16691706 16583609 16503882 16682429 17178909
3446 17178909 17459135 17239894 17470413 17123162 16855766 17338673 17094037 17039974 17094845 17258812
3436 17258812 16920639 17160883 16740134 16689658 17116300 16739305 17121936 16967220 17184325 17755008
3426 17755008 17962112 18373974 18526308 18875115 18949641 19364372 19372713 19500208 19766899 19711248
3416 19711248 20084730 19818388 19926638 20250001 20564059 20737893 20986883 21052572 21144992 21683481
3406 21683481 22098436 22317559 22720872 22764879 23412624 23906211 24405533 24948472 25372488 26073419
3396 26073419 26417729 26994346 27429538 28376400 29464784 30286952 30924436 31600202 32618166
3387 32618166 33805120 34800419 35962250 37193168 38642935 40331093 42020871 43805675
3379D3805675J517071J896712J632852J980053J935973J753658J977553K275096
3371E8774643K396695K584211L400073L003578K818383L155599J875211K141516
3363H0149909J664741J331370J300689J265550J713579J508614J656478J100149
3355I1691079k9345J73434m13541K46480L44982Q51212J163350J546991K327642
3346I7902284J790168J836496R34509o3216j526184l068193m772597m665664m403805
3337H3963798m303446k628516k682798j554742j825541j408018j498770j596867
3329F6465100j632258j930807j734408k000781j051339j161191o82290m98732
3321E5773294m10840l90895p78553j337453j481508j714131j811644j794134j693819
$$ plain form
3379 43805675 45322746 47219458 48852310 50832363 52768336 54521994 56499547 58774643
3371 58774643 61171338 63755549 67155622 70159200 72977583 76133182 78008393 80149909
3363 80149909 81814650 83146020 84446709 85712259 87425838 88934452 90590930 91691079
3355 91691079 91661734 91835168 91421627 91668107 92013089 92864301 94027651 95574642 97902284
3346 97902284 99692452 101528948 102463457 102400241 100874057 97805864 93033267 88367603 83963798
3337 83963798 79660352 77031836 74349038 72794296 70968755 69560737 68061967 66465100
3329 66465100 64832842 62902035 61167627 59166846 58115507 56954316 56272026 55773294
3321 55773294 55362454 54971559 54193006 52855553 51374045 49659914 47848270 46054136 44360317
3312D4360317j067695q92307j051368o31153r70193p20010j20409o0573j85704
3303C8660905n9212j16451L01782j10018J03322r5838j71652N86204k45615q2575
3293C8770852L95243m45739j7519n2323k79076O960l7029K3415m5558k7432m5340
3282C8246454J17907L96195K06116M13807j26011J70359l4700Q8388L01884j94756
3272C9585643N12898J4810K12103P12478N30733P20661Q25676M06613L32739N41980
3262D4396334p6400l5280J51659k37861K49043K50571k02081Q2333L3787R0570
3252D4702675M45435m956L24612o7998R3875K619j29887j10528N45957j40575
3242D5661229J47009K82006k10020Q70511L61947K91793P78730R29057R56037
$$ plain form
3312 44360317 43292622 42400315 41348947 40717794 39747601 39027591 38907182 38846609 38660905
3303 38660905 38601693 38485242 38787024 38677006 38780328 38684490 38512838 39099042 38853427 38770852
3293 38770852 39166095 38720356 38702837 38650514 38371438 38378398 38341369 38364784 38319226 38291794 38246454
3282 38246454 38364361 38760556 38966672 39380479 39254468 39424827 39390127 39478515 39780399 39585643
3272 39585643 40098541 40113351 40325454 41037932 41568665 42289326 43115002 43521615 43854354 44396334
3262 44396334 44319934 44284654 44436313 44198452 44447495 44698066 44495985 44578318 44612105 44702675
3252 44702675 45148110 45143154 45467766 45399768 45493643 45496262 45366375 45255847 45801804 45661229
3242 45661229 45808238 46090244 45880224 46750735 47112682 47404475 48183205 49112262 50068299
3233E0068299J295632J353323J571027J457375J834752J703238K038312J831509
3225F3153467J537516J701576J640511J843172J370542J659380J594073J504635
3217G6004872K236212K307319K580351K978192K626255K853946K917311L012514
3209I7516972K967031K872405K324924J541781J904760R73942N85780K62703o22518
3200A10327780o6711l05735O7314Q75308J045741J993955J863442J769258J830011
3191A19400363J347787Q75378q99669j891104l145784m287104m613606n844548
3183A00941713n783320n804946n088490m594130m241541l513079l006393k639061
3175F6270753k719843j668092j511030j536887o69476j307654r20728o10771j065759
$$ plain form
3233 50068299 51363931 52717254 54288281 55745656 57580408 59283646 61321958 63153467
3225 63153467 64690983 66392559 68033070 69876242 71246784 72906164 74500237 76004872
3217 76004872 78241084 80548403 83128754 86106946 88733201 91587147 94504458 97516972
3209 97516972 100484003 103356408 105681332 107223113 109127873 110101815 110687595 110950298 110327780
3200 110327780 110261069 109955334 110022648 110897956 111943697 113937652 115801094 117570352 119400363
3191 119400363 120748150 121623528 120723859 118832755 115686971 111399867 106786261 100941713
3183 100941713 95158393 89353447 84264957 79670827 75429286 71916207 68909814 66270753
3175 66270753 63550910 61882818 60371788 58834901 58165425 56857771 55937043 55326272 54260513
3166E4260513k23908k76657j41797l60656J5023o2273J07076K70559l77926L61893
3156E3571847L64150M42745M08124Q36711O66210O22823O81330Q71713J221974
3147E9687627R04543J366014N44605J140987R89034R36269J188611O36353Q08077
3138F8202120P51041R35558N79860P51238Q80503J067390Q72605J206211J250065
3129G6496591J371806J306309J401000J595257J529781K281949J854567J976896
3121H9814156K156660K158715K439598K920968L058337K614484L149079K790726
3113A11102723L044579K996697K818882L062916K683567L267330L332843L727920
3105A36037457M007706M069304M238580M606386M504037M537984N154857M802494
$$ plain form
3166 54260513 54036605 53759948 53618151 53257495 53272518 53210245 53317321 53587880 53209954 53571847
3156 53571847 53935997 54378742 54786866 55623577 56289787 56912610 57593940 58465653 59687627
3147 59687627 60592170 61958184 62502789 63643776 64632810 65569079 66757690 67394043 68202120
3138 68202120 68953161 69888719 70468579 71219817 72100320 73167710 74040315 75246526 76496591
3129 76496591 77868397 79174706 80575706 82170963 83700744 85982693 87837260 89814156
3121 89814156 91970816 94129531 96569129 99490097 102548434 105162918 108311997 111102723
3113 111102723 114147302 117143999 119962881 123025797 125709364 128976694 132309537 136037457
3105 136037457 140045163 144114467 148353047 152959433 157463470 162001454 167156311 171958805
3097A71958805M954209M703155M580369M552962M564492M006771L608145L521275
3089B06450183L222420L390338K867168K526057K397995J584431J768920J648292
3081B25855804M99185L17019r86745j430457k141279k762658l058367l046374
3073B13246128l592377l885228l550811m215308l880279m466349m416035m111767
3065A81127974m125987l840183l423133l540959k640565k285446k333338j541581
3057A57396782k093727j317157k001169j323711k126143j630680k059095k276732
3049A42568368k187349k677756k741802l558488k773464k758536k249508k184556
3041A21436909j842069j917685j388787j185227j860422j628969j944827k017773
$$ plain form
3097 171958805 176913014 181616169 186196538 190749500 195313992 199320763 202928908 206450183
3089 206450183 209672603 213062941 215930109 218456166 220854161 222438592 224207512 225855804
3081 225855804 226354989 226672008 225685263 224254806 222113527 219350869 216292502 213246128
3073 213246128 209653751 205768523 202217712 198002404 194122125 189655776 185239741 181127974
3065 181127974 177001987 173161804 169738671 166197712 163557147 161271701 158938363 157396782
3057 157396782 155303055 153985898 151984729 150661018 148534875 146904195 144845100 142568368
3049 142568368 140381019 137703263 134961461 131402973 128629509 125870973 123621465 121436909
3041 121436909 119594840 117677155 116288368 115103141 113242719 111613750 109668923 107651150
3033A07651150j768353k067970j948460j759211k003157j645837j428519r30984
3025I4098659k91670m12225M43079K76092O1160M44864K3567j626162j839580
3016I1177784k096607j403028j758606j220544j314132j398812n06181j527436
3008G9952438j303085j611015j347186j310907j581083n45833j318991j004476
3000F9929862r43977j087847l65987r78290k16265o44441j22629P6380r49623
2991F4697183r3935o37451j499774j234367j526652j029674p63216l31090l91805
2982E7189219m85261l97191k35809L61848J6464L24313K4366K11798R03777L97312
2972E8310836K89648N60622O91204O35869O26186P29439M20887N74712N66200
$$ plain form
3033 107651150 105882797 103814827 101866367 100107156 98103999 96458162 95029643 94098659
3025 94098659 93806989 93394764 93837843 94113935 94175095 94619959 94643526 93017364 91177784
3016 91177784 89081177 87678149 85919543 84698999 83384867 81986055 81479874 79952438
3008 79952438 78649353 77038338 75691152 74380245 72799162 72253329 70934338 69929862
3000 69929862 68985885 67898038 67532051 66553761 66337496 65693055 65570426 65646806 64697183
2991 64697183 64603248 63965797 62466023 61231656 59705004 58675330 57912114 57581024 57189219
2982 57189219 56703958 56306767 56070958 56432806 56449270 56773583 56797949 57009747 57913524 58310836
2972 58310836 58600484 59161106 59852310 60488179 61114365 61843804 62264691 62839403 63405603
2963F3405603P72498Q14083N76839R13771O47202Q57957Q26031R42502J394615
2954G1151101J380824J754338J285631J541913J449224K026657J875446K276869
2946H4742003J895987J786537J763159R83885J172914J209291J269203J070767
2938I5893746R94304M37603R00173J104828N48900N91279J69543k61881m91817
2929I9886678m40498o37623j071559q99255j573730j764477k293923k467987k945538
2920H5792088l030874l066734m083183l514617l492638l622895l211718l615464
2912E8153965k973878k530167k155635k127763j895578k139180j591581j915987
2904D0824196j940416q06729j317855j057121j128428j301340p32933p19989q11889
$$ plain form
2963 63405603 64178101 64992184 65569023 66482794 67129996 67987953 68813984 69756486 71151101
2954 71151101 72531925 74286263 75571894 77113807 78563031 80589688 82465134 84742003
2946 84742003 86637990 88424527 90187686 91171571 92344485 93553776 94822979 95893746
2938 95893746 96888050 97325653 98225826 99330654 99879554 100470833 100640376 100378495 99886678
2929 99886678 99446180 98808557 97736998 96837743 95264013 93499536 91205613 88737626 85792088
2920 85792088 82761214 79694480 75611297 72096680 68604042 64981147 61769429 58153965
2912 58153965 55180087 52649920 50494285 48366522 46470944 44331764 42740183 40824196
2904 40824196 38883780 38077051 36759196 35702075 34573647 33272307 32539374 31819385 31007496
2895C1007496q03475l89617o96073r02130n71049n14918m16101j71427k62046
2886B6280660j62544k77435k99696k55531k37934l93070k52172k64182m35890
2877B3702206n09394j93964o8316l88889K15146l32442K0495l57891l73496l24274
2867B1389181l41986q7339l08806l90249p48947J11556n33946n0429k23072l51748
2857A8464215m2024m47533l1994l30864n3965R381q9906l58546P573j72532j68258
2846A6785547j02870L7297J54955q7292K13016J76734k27300m1930K27514r7901
2836A7037770J56733P9580m20464j4791k2059N9223N7801K47439j8979j71200
2826A6991053K26732N3292P9608J65069N16346j76715L58438n777P4324K25124
$$ plain form
2895 31007496 30204021 29814404 29118331 28216201 27645152 27130234 26714133 26542706 26280660
2886 26280660 26118116 25840681 25540985 25285454 25047520 24654450 24402278 24138096 23702206
2877 23702206 23192812 22998848 22930532 22541643 22756789 22424347 22444842 22086951 21713455 21389181
2867 21389181 21047195 20959856 20651050 20260801 19511854 19623410 19089464 19039035 18815963 18464215
2857 18464215 18422191 17974658 17942664 17611800 17557835 17567216 17477310 17118764 17126337 16953805 16785547
2846 16785547 16682677 16719974 16874929 16787637 17000653 17177387 16950087 16908157 17135671 17037770
2836 17037770 17194503 17274083 16853619 16838828 16816769 16875992 16933793 17181232 17162253 16991053
2826 16991053 17217785 17271077 17350685 17515754 18032100 17855385 18213823 18208046 18282370 18507494
2816A8507494P9341N28879Q2266K84998N02560J44488R12774N600J65260J81150
2806B1394810J74056P77830K32066L02007M19237J96013O64632N85041N57626
2797B5303318N30123N01867P00806M49609J121230L88214J003334O21971P08794
2788C1329266N02644Q12682J93806P20413M16140P31872J053484Q16270R33212
2779C7509789R62041J164047O05496R14659O42318J143484J419138J576562J531516
2770D7469050J420024J404040J492572J671730J494588J491510J430789J619977
2762E9494280K019846J753901K216407J983987J929462K613300K783740L192817
2754G7987740L703362L995511M049244M342171M316470N458338N270252N070363
$$ plain form
2816 18507494 18586835 19115714 19197980 19482978 19985538 20130026 21042800 21048400 21213660 21394810
2806 21394810 21568866 22346696 22578762 22880769 23300006 23496019 24160651 24745692 25303318
2797 25303318 25833441 26335308 27036114 27485723 28606953 28995167 29998501 30620472 31329266
2788 31329266 31831910 32644592 32838398 33558811 33974951 34706823 35760307 36576577 37509789
2779 37509789 38471830 39635877 40241373 41156032 41798350 42941834 44360972 45937534 47469050
2770 47469050 48889074 50293114 51785686 53457416 54952004 56443514 57874303 59494280
2762 59494280 61514126 63268027 65484434 67468421 69397883 72011183 74794923 77987740
2754 77987740 81691102 85686613 89735857 94078028 98394498 103852836 109123088 114193451
2746A14193451N632801N832885P241560P162356Q067291Q719375R633605J0761317
2738A77244641J1434039J3248517J3680250J4136808J3826113J2221568R669088
2731B65461024P348183N052697K752613J761172Q04111J308457K806609L090516
2723B90385382J993667j085948n513671r936967j2467116j2874409j2538136j1390455
2715B26572347r763805q699301o291007m840038k839323j38386J645280L811254
2707A99457021M935963O220185N940448M341428K747294R11078P18316K064773
2699B27336506K722104L641856Q88225l340574r723454j5194425j8163643j7797891
2691A70368704j5678457j3200560j0779163r205331p323415o668819n646885n210134
$$ plain form
2746 114193451 119826252 125659137 132900697 140063053 148130344 156849719 166483324 177244641
2738 177244641 188678680 201927197 215607447 229744255 243570368 255791936 265461024
2731 265461024 272809207 277861904 280614517 282375689 283179800 284488257 287294866 290385382
2723 290385382 292379049 291293101 285779430 275842463 263375347 250500938 237962802 226572347
2715 226572347 216808542 208109241 201818234 196978196 194138873 194000487 195645767 199457021
2707 199457021 204392984 210613169 216553617 220895045 223642339 224553417 225271733 227336506
2699 227336506 230058610 233700466 234588691 231248117 221524663 206330238 188166595 170368704
2691 170368704 154690247 141489687 130710524 121505193 114181778 107512959 101866074 96655940
2683I6655940m563797l530763l139667l005545l359981l432017l171583l037592
2675F9414995l170362k476599k648064k110904j967236k014217k054175k232730
2667E0740708j717551j690655j318318j425152j503425j208021j139792j058520
2659C9679274j292784j291448j075039j044396l10204j026693q59757q67244o20943
2650C1290766n79407n68685p37958q85695r81506j346404o71924k32333n60777
2641B4726077l86492q28496r37569m44194k98397n48112r32509l94984p55216
2632A9200108m74657l86907n80867l06772n63411j85680o44922k72303o18420
2623A5166169m21804k65846k97669j35699m19411o04499m93616O6882k86922k21089
$$ plain form
2683 96655940 92092143 88561380 85421713 82416168 79056187 75624170 72452587 69414995
2675 69414995 66244633 63768034 61119970 59009066 57041830 55027613 52973438 50740708
2667 50740708 49023157 47332502 46014184 44589032 43085607 41877586 40737794 39679274
2659 39679274 38386490 37095042 36020003 34975607 34665403 33638710 32778953 31911709 31290766
2650 31290766 30711359 30142674 29404716 28519021 27537515 26191111 25519187 25286854 24726077
2641 24726077 24339585 23511089 22573520 22129326 21830929 21282817 20350308 19955324 19200108
2632 19200108 18725451 18338544 17757677 17450905 16887494 16701814 16056892 15784589 15166169
2623 15166169 14744365 14478519 14180850 14045151 13625740 13021241 12527625 12594507 12307585 12086496
2613A2086496l7124k46498o09765k6383k09497k09091k50754O1300j67750l47752
2603A0043182J38502m68704M6935K01875k52587l19131l30728l03174m908J01483
2593H852745j61294k23682k51804k87401l2709j52514k63813m77161k63489j53
2583F738725K30670j1642j31111k90016k15197J344k73084N4757p4247j70311
2573E859888J87907k56315l64304q9879p3717J88805j32108k11031j39752J7307
2563D986801k48157L12483N9181l5233j10105m80134K54586r3363k72962K70762
2553D643859l24503Q6409k46471m45610N40245k12348k4451K81990j63195O464
2543D142389l19562l81802K18325p7152R8181J54339m15037O6345n8274m0347
$$ plain form
2613 12086496 12049372 11802874 11193109 11166726 10957229 10748138 10497384 10558684 10390934 10043182
2603 10043182 10181684 9712980 9759915 9961790 9709203 9390072 9059344 8756170 8751262 8852745
2593 8852745 8691451 8467769 8215965 7928564 7895855 7743341 7479528 7002367 6738878 6738725
2583 6738725 6969395 6957753 6826642 6536626 6321429 6322773 6049689 6104446 6030199 5859888
2573 5859888 6047795 5791480 5427176 5337297 5263580 5452385 5320277 5109246 4969494 4986801
2563 4986801 4738644 5051127 5110308 5075075 4964970 4484836 4739422 4646059 4373097 4643859
2553 4643859 4319356 4405765 4159294 3713684 4253929 4041581 4017130 4299120 4135925 4142389
2543 4142389 3822827 3441025 3659350 3582198 3680379 3834718 3419681 3486026 3427752 3387405
2533C387405K19130j26920k13727j91094M02858k06317n2002J23385n24565N7240
2523B875393K91183p5687k68819j7497J7604K24717K12957j92243k85083J25789
2513B908314K33047l41633J54143j49721o6204R3596M16428M56o11830O1470j75687
2502B522379m7927J50497n8554j11183K16061l4972j32148M81801j80377m69428
2492B336149K57865J63229k14759K52439L56701o0549j94385k4748j3694n2598
2482B805650N92093k61220P6090l3696j54943L0889L13915j91318o1441l2639
2472C083380j56169J87690k25804N88181k30840j61322k9268j05522j43629J46075
2462B952772j2967k68733J90450m69923r5229J25901r5239r1837j72031J72406
$$ plain form
2533 3387405 3606535 3479615 3265888 3074794 3477652 3271335 3219333 3342718 2818153 2875393
2523 2875393 3166576 3090889 2822070 2804573 2822177 3046894 3259851 3067608 2782525 2908314
2513 2908314 3141361 2799728 2953871 2804150 2737946 2831542 3247970 3248426 2636596 2698066 2522379
2502 2522379 2474452 2624949 2566395 2455212 2671273 2636301 2504153 2985954 2805577 2336149
2492 2336149 2594014 2757243 2542484 2794923 3151624 3091075 2896690 2871942 2858248 2805650
2482 2805650 3397743 3136523 3212613 3178917 3023974 3054863 3368778 3177460 3116019 3083380
2472 3083380 2927211 3114901 2889097 3477278 3246438 3085116 3055848 2950326 2806697 2952772
2462 2952772 2939805 2671072 2861522 2391599 2296370 2422271 2327032 2235195 2063164 2235570
2452B235570m24761O70876L27141n48355M08587j62064K46870l44005l00587P7396
2442B186668M4359J53846l74847J9331J00295l2802n1970k59782k77697k74699
2432A232702M0575M6324K70198q7329R7522p1195R4511J58347j18081l38280j16920
2421A208374Q7594j45486O2875j75270k0590K28496l28685J49205L67957l52316
2411A082154l830o2119L5391L0656j12375M72758j35183p5957k68158l60315K70388
2400H73410K7938j00627P8380K95871k75923L2685j95392R3023k16678k6890M0573
2389F26370m9408K15546J55833p8187J44051m93369P2268R9317k26076L41034
2379H07379p7272j21361K25798m14042J40484p0247N2657r010M6042J089m98357
$$ plain form
2452 2235570 1810809 2481685 2808826 2260471 2669058 2506994 2753864 2409859 2109272 2186668
2442 2186668 2231027 2384873 2010026 2029357 2129652 2096850 2044880 1785098 1507401 1232702
2432 1232702 1273277 1319601 1589799 1502470 1599992 1528797 1623308 1781655 1663574 1325294 1208374
2421 1208374 1295968 1150482 1213357 1038087 1017497 1245993 917308 1066513 1434470 1082154
2411 1082154 1078324 1016205 1051596 1082252 969877 1442635 1307452 1231495 963337 603022 873410
2400 873410 901348 800721 879101 1174972 899049 931734 736342 829365 612687 585797 626370
2389 626370 576962 792508 948341 870154 1014205 520836 593104 692421 466345 807379
2379 807379 730107 608746 834544 420502 560986 490739 543396 534386 580428 581517 83160
2368H3160K97341j5833J65578J31125J63668l68329j86060M0542J81272J56593
2358F49057k15863j58697J78632l248j51311J22201j90686K70118k23289P8819
2348C55733J41607K00821k42603k10994K52945m7565j8768m0668q4051J87381
2338D93838O7710k16726l3999l11251J02296m9225J00553J27126J25096n5934
2328C49484k5358j34515J77819N0398j89023j07706K25986r4608l0443N9754j45652
2317A36136K18599j22482M6577r5438j50785K20328J5953J63493k59763J94270
2307C66888J69027J60729R9665m63125N2112r7444q6301L40880r8741j19521L5015
2296C59184J5309j61209M62501j77849l08775J99943L708K20812j16237j35801
$$ plain form
2368 83160 380501 364668 530246 661371 825039 456710 270650 311192 492464 649057
2358 649057 433194 274497 453129 449881 298570 420771 230085 500203 276914 355733
2348 355733 497340 698161 455558 244564 497509 449944 431176 390508 306457 493838
2338 493838 561548 344822 310823 -428 101868 52643 153196 280322 405418 349484
2328 349484 324126 189611 367430 417828 228805 121099 347085 252477 222034 281788 136136
2317 136136 354735 232253 278830 183392 32607 252935 268888 432381 172618 366888
2307 366888 535915 696644 796309 333184 385296 287852 201551 542431 443690 324169 359184
2296 359184 374493 213284 675785 497936 189161 389104 392812 613624 497387 361586
2286C61586j4332j15175R6130l05004J02604K54968r9124M0626k31700Q1134j0652
2275A61061P939P8348j25485j86662R6969P0704p6745K05351k9541k9580M2495
2264B14854M2700K9429N359o6533q5760j01883r4094J92153L4921q0708J68171
2253B58609l68748J93165J29088r246j20586j30770J64637p6908K64017k59418
2243D3840J67196l48458J84064j41730o5012M43611j34904J6373N0565r0108J09648
2232B35085j57899j71529J83671J67159J35118n45927L75979l8280j88222J20096
2222A15251n1449P1092m5746K65362N9672J85197m8402k21346l09143J53086n8866
2211A14708j19190K96342k89282M85713J32476k40696J879m80375K14196K42766
$$ plain form
2286 361586 347254 232079 328209 23205 125809 380777 281653 322279 90579 171713 161061
2275 161061 169000 247348 121863 -64799 32170 102874 26129 231480 201939 172359 214854
2264 214854 257554 286983 292342 225809 140049 38166 -55928 136225 171146 90438 258609
2253 258609 -110139 83026 212114 202868 82282 -48488 116149 39241 303258 43840
2243 43840 211036 -137422 46642 -95088 -160100 283511 148607 164980 215545 125437 235085
2232 235085 77186 -94343 89328 256487 391605 -154322 221657 183377 -4845 115251
2222 115251 63802 134894 89148 354510 414182 599379 550977 329631 20488 173574 114708
2211 114708 -4482 291860 2578 488291 620767 380071 381950 -98425 115771 358537
2201C58537l7074J5375Q6824q8811l1898O0996j39259j22914K5563L8736j18753
2190D7322j2645k986L56305l9924Q6022j4475J6950J48010P3075j20563l38567
2179A98524L23466m25017J97829O8306l59788J64332J69696K03670J06904l5644
2169F12278j93290j12604K54670j10797J40688k32378j25318j03662n3555L09172
2159C85204j97062J17944J08479n189P2016l6832J6542J21104M32675j25567K46928
2148A136242o35889m2316j55931J73985L86445j57752M24758p37119N8014J14273
2138E64710j2483K88404k9071k61992j15839p9514k24859L71360J91957J20147
2128H12820j28773k27443l9572L61762k82737K64737k58375K94733o1432j03028
$$ plain form
2201 358537 321463 336838 423662 334851 302953 363949 224690 101776 127339 166075 47322
2190 47322 34677 31691 387996 348072 434094 419619 436569 584579 657654 537091 198524
2179 198524 521990 96973 294802 363108 3320 167652 337348 541018 647922 612278
2169 612278 418988 306384 561054 450257 590945 358567 233249 129587 76032 385204
2159 385204 188142 306086 414565 409376 481392 444560 461102 582206 1014881 889314 1136242
2148 1136242 500353 458037 302106 476091 862536 704784 1129542 392423 450437 564710
2138 564710 552227 840631 811560 549568 433729 354215 129356 500716 692673 812820
2128 812820 684047 456604 417032 778794 496057 760794 502419 797152 735720 632692
2118F32692O4916k15336M88246j50910J34794k86095L10343l5494R578k16782
2108G35952J21844j42163m4537R5893K76820j31441N0778K87501R4199J51276
2098A496122l07007k44679L58819J38878J87478k35040J59975j39812O2360p5599
2088A401495L59481K30241Q3997K06407K1398l21934K20843n8519q3534K87600
2078B347475J99847j90456L11574k6611L31596N46072K37480M42484L83050M75496
2068E058007M20103R01662P21821P60449O20493N59013J372095J179948J494001
2059A3087592J811259K453199K951961M401630M638329L626282J483474k859099
2051C1594627n324290n960369m876933k764441j894978j254098q14396j471553
$$ plain form
2118 632692 697608 482272 970518 819608 954402 668307 978650 943156 952734 735952
2108 735952 857796 715633 671096 766989 1043809 912368 963146 1250647 1344846 1496122
2098 1496122 1189115 944436 1303255 1442133 1629611 1394571 1554546 1414734 1477094 1401495
2088 1401495 1760976 1991217 2075214 2281621 2303019 1981085 2201928 2143409 2059875 2347475
2078 2347475 2547322 2356866 2668440 2641829 2973425 3519497 3756977 4199461 4582511 5058007
2068 5058007 5478110 6379772 7101593 7862042 8482535 9041548 10413643 11593591 13087592
2059 13087592 14898851 17352050 20304011 24705641 29343970 32970252 34453726 31594627
2051 31594627 26270337 20309968 15433035 12668594 10773616 9519518 8705122 7233569
2043G233569l38582q31830m60908l04791l39091n25038k98693k88079j00721n12743
2033C233093j29345j76770M2120m4405N3304l02574j91114q2298k58038k21086
2023A922887J13436k74082J10331l68916K21111L7841j94257J30973q2975j87418
2013A428931j75738l37756n1506L65840l27523M57863j87308l40484k763k2344
2003H07212j13371J44287l13711j51169L37795P4199j41933J02916M0333l19844
1993D66714L99318j11936q2403M4092j68745K03189J43391l34988P8769P49k08102
1982D30048O7936j33826m29255K29179R273O4411O1711J45565m51490K88779K35272
1971E17603j80761K07800l17521p6751k69077j8330Q064L58474l96395J66414
$$ plain form
2043 7233569 6894987 6063157 5602249 5297458 4958367 4433329 4134636 3846557 3745836 3233093
2033 3233093 3103748 2926978 2969098 2924693 2977997 2675423 2484309 2402011 2143973 1922887
2023 1922887 2036323 1762241 1872572 1503656 1724767 1762608 1568351 1699324 1616349 1428931
2013 1428931 1253193 915437 863931 1229771 902248 1360111 1172803 832319 829556 807212
2003 807212 693841 838128 524417 373248 711043 785242 643309 746225 786558 466714
1993 466714 866032 754096 671693 715785 547040 750229 893620 558632 637401 638150 430048
1982 430048 497984 364158 -65097 164082 173355 237766 299477 445042 -6448 282331 517603
1971 517603 336842 544642 227121 150370 -118707 -137037 -128973 229501 -166894 -480
1961d80p2961L02148n3284j03141l3511l8811J1000J70909M20428m45824l791
1950A52682K18180j93385K02774l29392p8772J9656k48736M14136q3280J39609
1940B13472L3553j38537J13654j54897J96937J03821J63484p0005k60939j07205
1930I3338J76375j91046l1517j65666j04742m2974o4769K30855k10882J65684
1920a45344K84001k11169m1364r4171p1445J44488J78655j50474k68816K12706
1910a62933r2963j1384l764K27911m6222L55333M5761l21811j51174K8182K98142
1899A65078m9374j48851j04866M5158Q8613J87829k35014r4081J59679j61473
1889a47302O3828K00831j58949K09476q1935j42746j6050J39476k71820j57642
$$ plain form
1961 -480 -73441 228707 175423 72282 38771 -40 10960 181869 602297 156473 152682
1950 152682 370862 177477 380251 50859 -27913 -8257 -256993 157143 73863 213472
1940 213472 247025 108488 222142 67245 264182 368003 531487 461482 200543 93338
1930 93338 269713 78667 47150 -118516 -223258 -266232 -331001 -100146 -311028 -145344
1920 -145344 138657 -72512 -113876 -208047 -279492 -135004 43651 -106823 -375639 -162933
1910 -162933 -255896 -267280 -271044 -43133 -89355 265978 311739 -10072 -161246 -133064 165078
1899 165078 115704 -33147 -138013 -92855 -4242 183587 -51427 -145508 14171 -147302
1889 -147302 -83474 117357 -41592 167884 85949 -56797 -72847 66629 -205191 -362833
1879c62833l6509m3095K73467l7633N5196N2636n46749K70128k42480M33936J41902
1868d2034k09499K55231l94373J89590p1645J69766J22602k96651K55017j87998
1858b09994J49393J47408k15672j32164j31474M77674k18072J96655l31045K09377
1848e7914J52227j19068J65306m56427J16016K4681Q535K54953J32445l71401
1838a50647n4087j9209r8339J20968J58135j47812J63920J18200j71164J24707
1828D4672k3840O2595j19853R7687k96062J76450p4981Q3142p3790J6452j71960
1817b79488L62324L8037N8471R3803O0311m7737k02331P9810k67740R7558P2774
1806F5792j54814K06235j68042j55783j23698L21858J61048j9726k30973k27507
$$ plain form
1879 -362833 -399342 -442437 -168970 -206603 -151407 -98771 -645520 -375392 -617872 -183936 -42034
1868 -42034 -251533 3698 -390675 -201085 -272730 -102964 19638 -277013 -21996 -209994
1858 -209994 -60601 86807 -128865 -261029 -392503 85171 -132901 63754 -267291 -57914
1848 -57914 94313 -24755 140551 -315876 -199860 -175179 -166644 88309 220754 -150647
1838 -150647 -204734 -223943 -322282 -201314 -43179 -190991 -27071 91129 -80035 44672
1828 44672 20832 83427 -36426 61261 -234801 -58351 -133332 -50190 -123980 -107528 -279488
1817 -279488 82836 120873 179344 273147 333458 285721 83390 163200 -104540 -6982 65792
1806 65792 -89022 117213 -50829 -206612 -330310 -8452 152596 132870 -98103 -325610
1796c25610L86491j97433J61459J12273k84479j31796M30890k00424Q6827k7758
1786A0440k32717J61651q9751J11782j91211J50752M69574m45768L61480k45669
1776F0563j55133K9728K25437q3087P574K65322l88820l6263p6999l94258L57536
1765a88400k61394K61502Q4135l9728P304k67157M40183K23719j00980k88157
1755a28973n7909k80122L47061K19800N4560j34270p7967N7231j02195J22268
1745A9484l6811O4329l8289j41061m1353J14123J60987M7052Q103o03228K94139
1734a52525k17423J13466K49300k78715K99150m82707K18493K51294p2045J03613
1724C1901j03271j01074m5958K12030j81915K02421l5012q5862O7977P6919j99555
$$ plain form
1796 -325610 60881 -136552 24907 137180 -147299 -279095 151795 -48629 38198 10440
1786 10440 -222277 -60626 -150377 -38595 -229806 -79054 390520 -55248 306232 60563
1776 60563 -94570 -64842 160595 77508 85082 350404 -38416 -74679 -151678 -545936 -188400
1765 -188400 -449794 -188292 -104157 -143885 -136581 -403738 36445 260164 159184 -128973
1755 -128973 -186882 -467004 -119943 99857 154417 20147 -57820 -589 -102784 19484
1745 19484 -17327 47002 8713 -132348 -173701 -59578 101409 148461 156564 -446664 -152525
1734 -152525 -369948 -256482 -7182 -285897 13253 -469454 -250961 333 -71712 31901
1724 31901 -71370 -172444 -218402 -6372 -188287 14134 -20878 -106740 -38763 38156 -161399
1713a61399Q4184K09037J67686K6072k30685j28868j30405o0517k07147K85521
1703a46521Q2067j85335K49141k47279K72535k01831L3993j80034Q5644o1043
1693b98663M52490j40341l5001J2333o0441m1777m0406j34146j69466K06097p8090
1682c27411m2436K44789K2794j11837L17464l33154J06178P0526J91481l12625
1672a74231J36257l69029q5827j7201Q8525M88167O2981l00899k37Q881l1201
1661a93814q2851k4373J1665K74487j40110m58680J11932j48694J62373L85698
1651a02367q1297J57009j92890J01623k7856K42434j64455j61458J58143K48386
1641A77272l59460K88835p2415J64611j51294p3390l15865J03021J47904j04745
$$ plain form
1713 -161399 -77215 131822 299508 325580 94895 -33973 -164378 -224895 -432042 -146521
1703 -146521 -64454 -249789 -648 -247927 24608 -177223 -143230 -323264 -237620 -298663
1693 -298663 153827 13486 -21515 -9182 -69623 -111400 -151806 -285952 -455418 -249321 -327411
1682 -327411 -369847 -125058 -102264 -214101 103363 -229791 -123613 -53087 138394 -174231
1672 -174231 -37974 -407003 -492830 -510031 -421506 66661 129642 -171257 -171494 -162613 -193814
1661 -193814 -276665 -301038 -289373 -14886 -154996 -613676 -501744 -650438 -488065 -102367
1651 -102367 -183664 -26655 -219545 -117922 -145778 96656 -67799 -229257 -71114 177272
1641 177272 -182188 106647 34232 198843 47549 -25841 -341706 -238685 -90781 -195526
1631a95526Q9844j60104J66371J89036K01101j67681l05205K0790n5832J92390
1621b4816k38537j58840J18997m277K84005J38150k68324q3769k08817Q224L03095
1610a34909k95712K21753M455P0258K1164j07448j00638j80013J98106R8877K32729
1599B8622j98719j83464L76651j35107K51608k37598K68104l09584r5070j08370
1589c42927j74956J17109M0528m2736R6382P0116k16515J91599K49271r4135K05667
1578I9403N3927O7600j23070j18722m59942J12769K0160J7922J3536J24600j12523
1567c04340J83611K73170k99777n086n000j55368K52343J00057J48336j3383n19
1556A74044k21239q1564K72744J07311r6861J4162j24243R1707l4730m19481N4016
$$ plain form
1631 -195526 -105682 -265786 -99415 89621 290722 123041 -182164 -161374 -217206 -24816
1621 -24816 -263353 -422193 -303196 -307473 -23468 114682 -153642 -237411 -446228 -438004 -134909
1610 -134909 -430621 -208868 -204413 -134155 -112991 -220439 -321077 -501090 -302984 -204107 28622
1599 28622 -170097 -353561 23090 -112017 139591 -98007 170097 -139487 -234557 -342927
1589 -342927 -517883 -400774 -360246 -402982 -306600 -236484 -452999 -261400 -12129 -106264 99403
1578 99403 153330 220930 97860 -20862 -480804 -368035 -347875 -329953 -316417 -191817 -304340
1567 -304340 -120729 152441 -147336 -152422 -157422 -312790 -60447 39610 187946 174563 174044
1556 174044 -47195 -128759 143985 251296 154435 168597 44354 136061 101331 -318150 -264134
1545b64134q4979k21099L21650j94538J03157P7812q9944M15717j43039L1948
1535d7449K67112l8595R785k95167k01673O3057K9494k8787L39830j12328l2372
1524d7093l05196j24494N37368m5056j79650j31723k36826M39729R9528r5038
1514h8451K20489l85562J78083P1642j3198k11015m4132K40479j01337k6679J49310
1503a0371M9393k36950J39793J98090j99163K95008j68671k17730p4902J94976
1493c0527J39126k0176J62686l60523k86833L72992L2496J50741m46267K53242
1483c3043j682M93234o5432k74471j93873r6570k31545J57039K52131R3021L28650
1472D27459l80263k66823L01364K517r6046l044k37240q6690k47802L13570J33798
$$ plain form
1545 -264134 -349113 -570212 -248562 -443100 -339943 -262131 -352075 63642 -79397 -47449
1535 -47449 219663 181068 190853 -104314 -305987 -242930 -213436 -242223 97607 -14721 -47093
1524 -47093 -352289 -476783 60585 15529 -164121 -295844 -532670 -92941 6587 -88451
1514 -88451 132038 -253524 -75441 -3799 -16997 -228012 -272144 -31665 -133002 -159681 -10371
1503 -10371 39022 -197928 -58135 139955 -59208 235800 67129 -150601 -225503 -30527
1493 -30527 108599 88423 251109 -109414 -396247 -23255 9241 159982 -286285 -33043
1483 -33043 -34725 458509 393077 118606 -75267 -171837 -403382 -246343 5788 98809 427459
1472 427459 47196 -219627 81737 84254 -11792 -14836 -252076 -338766 -586568 -272998 -139200
1461a39200L35103k3825n10421K25234J2981J97832p6971M32613j51921j78208
1451A23217J8181k01275R9680j4541J183K1059j62069K5320j30809J64955o8657
1440a23756j44454p690k8976J57633P857j81588K12084J3468J59032L06349k64919
1429A05040K31414o19834J22329M3814J08563K947m09550R3715J58368M94669
1419C31475j9585n5204l14364L305Q1083J17101K70084m64076j39766j43913J06817
1408b27043K43540m60096Q0607N6135L15536K43733j81498J68907l88359k0403
1398a68941R8330m8245l4539p7358j72026N38601o5394L3077j97571R9324J25340
1387A30598L4215P8948j43198o7408j24177Q5792J66606k08072K09320k77739
$$ plain form
1461 -139200 195903 172078 -338343 -113109 -100128 97704 20733 453346 301425 123217
1451 123217 141398 -59877 39803 25262 26445 47504 -114565 -89245 -220054 -55099 -123756
1440 -123756 -268210 -275900 -304876 -147243 -139386 -320974 -108890 -95422 63610 369959 105040
1429 105040 336454 -283380 -161051 -117237 -8674 -5727 -415277 -321562 -163194 331475
1419 331475 311890 256686 -57678 -54373 26710 143811 413895 -50181 -189947 -333860 -227043
1408 -227043 16497 -443599 -362992 -306857 8679 252412 70914 239821 -148538 -168941
1398 -168941 -70611 -118856 -153395 -230753 -402779 135822 70428 103505 -94066 5258 130598
1387 130598 164813 243761 100563 33155 -91022 -5230 161376 -46696 162624 -115115
1377a15115j6206j23832K4823p8077p7911P1014K27000Q1832q6793k73086O3629
1366c02722K44882j51567n2089J59536k56513k577J09319k47498K14132R3060
1356a92037J2032j23748M68580n38316L54498k20284j14983J83585J18068K56619
1346B04014k92381K44766k87543l55259K9038j4833L57186J4257j38390j99286
1336d38431L48880P743j97140L41031k59416j52260R8325j46654k97427N0831
1326f44518P6495K99402O3523p2275l89363L12836K31419m5219j81684J28796
1316b20588j29034P9632P7096j75802K00652j34611M04108j90970O1422j1301
1306c9396j56035J43942n2457K75225k51461K1668l51627M91846R0852k62898
$$ plain form
1377 -115115 -131321 -255153 -230330 -308407 -386318 -315304 -88304 -6472 -93265 -366351 -302722
1366 -302722 -57840 -209407 -261496 -101960 -358473 -361050 -251731 -499229 -285097 -192037
1356 -192037 -180005 -303753 164827 -373489 -18991 -239275 -354258 -170673 -52605 204014
1346 204014 -88367 156399 -131144 -486403 -457365 -472198 -115012 -100755 -239145 -438431
1336 -438431 -89551 -81808 -278948 62083 -197333 -349593 -251268 -397922 -695349 -644518
1326 -644518 -568023 -268621 -205098 -277373 -666736 -353900 -122481 -167700 -349384 -220588
1316 -220588 -349622 -269990 -192894 -368696 -168044 -302655 101453 -89517 -28095 -39396
1306 -39396 -195431 -51489 -103946 171279 -80182 -58514 -410141 81705 172557 -90341
1296i0341J85373K10389J989j18191l63309k767K43170l4482o2949k0048J34166
1285H3000j30990K15343j60185K67059j44319j48105P5496p8838L15342m34077
1275a40274J7465L64253m81619O1171M1404J8511J24943L15544k03277R9004n8343
1264A58782j93888k6031L20849l21109L0591J94485l10635O2102o5984M6378K73077
1253A68617k55627L50295j47271J89588k40087L6489p1673k47420N3004L8629
1243a25456j18314L66869J51366n83922j33478J78656J5323M19027o7134l66604
1233b63667J35923l26652K05761M9945N2971j57900K12951k99987K43467K32456
1223H5268j86024n2014J40762p9636k07519M94709l05894K12342J5010l83320
$$ plain form
1296 -90341 95032 305421 307410 189219 -174090 -176857 66313 31831 -31118 -51166 83000
1285 83000 -47990 167353 7168 274227 129908 -18197 57299 -21539 293803 -140274
1275 -140274 -122809 241444 -240175 -179004 -137600 -119089 5854 321398 118121 217125 158782
1264 158782 -35106 -61137 259712 -61397 -30806 163679 -146956 -84854 -150838 -104460 168617
1253 168617 -87010 263285 116014 305602 65515 102004 30331 -217089 -164085 -125456
1243 -125456 -243770 123099 274465 -309457 -442935 -264279 -248956 170071 102937 -263667
1233 -263667 -127744 -454396 -248635 -198690 -145719 -303619 -90668 -390655 -147188 85268
1223 85268 -100756 -152770 -12008 -91644 -299163 195546 -110348 101994 117004 -266316
1213b66316L609J42410l8486j22924K32598j16935N3476J8275k444k11258K58252
1202d9743o0459j8254j87206l3984L79931j99759r811O2921o6538O9540J76974
1191F3612n4978J79503j65249k5547j34720R7823J33622k19199L65229m76130
1181b36034K17669K7633n1693L63631l79385J53975M4237k8019k6266j59934N2294
1170b1892k75670L94684k022j67359k8411P867k98833M93111n6201j07894J99755
1159A37135k57782J33088j2610J42747l26099P5964K31152k83102k1655L355L29994
1148A52187j40394j02253k12533L3288K80044p1301l9573M7362J40397m33982
1138c46758K60031K15283n59335L13508N9736P2463o5351j563J17759j83302o7495
$$ plain form
1213 -266316 -262707 -120297 -158783 -281707 -49109 -166044 -112568 -94293 -96737 -307995 -49743
1202 -49743 -110202 -128456 -315662 -349646 30285 -169474 -179285 -116364 -182902 -113362 63612
1191 63612 8634 188137 22888 -2659 -137379 -39556 94066 -125133 240096 -236034
1181 -236034 -18365 9268 -42425 321206 -58179 95796 140033 112014 85748 -74186 -21892
1170 -21892 -297562 97122 95100 -72259 -100670 -92803 -391636 101475 45274 -62620 137135
1159 137135 -120647 12441 -169 142578 -183521 -107557 123595 -159507 -181162 -177807 152187
1148 152187 11793 -90460 -302993 -269705 10339 -60962 -100535 -53173 87224 -346758
1138 -346758 -86727 128556 -430779 -117271 -57535 14928 -50423 -51986 65773 -117529 -185024
1127a85024l90578K72001L66920k49372R1051J94221m95421K24844p2736j51058
1117c95152J57619l08256K41392J14689O3856k32158K74932q5153J07811J06786
1107D6366k30985N1000M5027n6909K22155j57143k19181J43981R1486J54424m70550
1096c80329L99155j97447L29654J9686p6070M8266q1814N7804o5701K9947j17176
1085c4025j09080j2912j56716Q3187L4346J31615p2028p275J7824P9921l7012
1074h2155J43451j7997k54190p382N7174L9893M717L2351q1081k9610J16241p7248
1062a55836j50211m86j76077J98441K80082k23048L79630k81178J1907q1352k84628
1051d82756J74769L76500L5427k27451J85992l312J28865n2510j49297j7967j32031
$$ plain form
1127 -185024 -575602 -303601 63319 -186053 -95002 99219 -396202 -171358 -244094 -395152
1117 -395152 -237533 -545789 -304397 -189708 -125852 -358010 -83078 -168231 -60420 46366
1107 46366 -184619 -133619 -88592 -145501 76654 -80489 -299670 -155689 -64203 90221 -380329
1096 -380329 18826 -178621 151033 170719 94649 142915 61101 118905 53204 83151 -34025
1085 -34025 -143105 -156017 -312733 -229546 -195200 -63585 -135613 -142888 -125064 -45143 -82155
1074 -82155 61296 43299 -210891 -218273 -161099 -121206 -116489 -84138 -165219 -194829 -78588 -155836
1062 -155836 -306047 -306533 -482610 -284169 -4087 -227135 152495 -128683 -116776 -198128 -482756
1051 -482756 -307987 68513 103940 -123511 62481 59169 188034 135524 -13773 -31740 -163771
1040a63771n7166j45249K08693k06236r0754N0300J32738L70395n49205K22776
1030b27479l00960L74627K60093L35465l24608j73007q6001o6942K14575J3473
1020A9236M562J74376j28826j15890J7798k93905J46637P4763l1113J03449j80242
1009b09155Q7859J48567k1466N817j05660N2851N9412J19357k9747j87916k66038
998c46119J18806q618K24250K9474j1070L1848j57066L37866k34073L93151j69610
987B08839p4037j67620j42513K4807J72008J67168n18864L95877m59219K51302
977a42252n450J20039J53899k18157k1990j7330k4995M9248j79540J00590J67604
966a8334J58507k00104J3732j61105j83453K48564p097r6622j96883j59731J67688
$$ plain form
1040 -163771 -220937 -366186 -157493 -363729 -454483 -404183 -271445 98950 -450255 -227479
1030 -227479 -528439 -153812 106281 441746 117138 -55869 -141870 -208812 5763 19236
1020 19236 23798 198174 69348 -46542 -28744 -322649 -176012 -101249 -132362 -28913 -209155
1009 -209155 -121296 27271 5805 11622 -94038 -41187 18225 137582 107835 -80081 -346119
998 -346119 -227313 -235931 -11681 17793 6723 38571 -118495 219371 -14702 378449 208839
987 208839 134802 -32818 -175331 -150524 21484 188652 -330212 65665 -393554 -142252
977 -142252 -147702 -27663 126236 -91921 -113911 -131241 -156236 -106988 -286528 -185938 -18334
966 -18334 140173 -59931 -46199 -207304 -390757 -142193 -149290 -245912 -442795 -602526 -434838
955d34838L56960N09848j80902j45561N9620q8616o2057k0059J06599l33630L72551
944A39915k12293L7490L83373j65626L4191j51680k16937J52601L8694K14365
934B54093j40826j46977K04282j10659N5679k09841O8960Q4693P9504n4488O7826
923A52246k43273o1530J44720Q5178J12529O2277j37828j40033L798j60036J36907
912d5045J31806j53962J7091J4179p7649N22181l39181R2844q9617j95335M6611
901g6077Q7411j72926N9373k236r6995N54905k44358j92283K99120p9366K05581
890C42149l35185j07553J09041J43108j921j78553j34167l3738j4906M05667k84815
879i0873L01011J5851j43585J77758k36109J03721k02618Q1488j37459k46422
$$ plain form
955 -434838 -77878 431970 251068 105507 165127 76511 14454 -5605 100994 -232636 139915
944 139915 -72378 -34888 348485 182859 217050 65370 -151567 1034 39728 254093
934 254093 113267 -33710 170572 59913 115592 -94249 -25289 59404 138908 84420 152246
923 152246 -91027 -152557 -7837 77341 189870 252147 114319 -25714 -21916 -181952 -45045
912 -45045 86761 -67201 -50110 -35931 -113580 408601 69420 162264 72647 -122688 -76077
901 -76077 11334 -161592 -102219 -104455 -201450 353455 109097 -83186 215934 136568 342149
890 342149 6964 -100589 8452 151560 149639 -28914 -163081 -196819 -211725 193942 -90873
879 -90873 210138 225989 82404 260162 24053 127774 -74844 6644 -130815 -377237
869c77237R4896J34823j7781K25757q6514K4849L17858j77921Q6938m6723j51724
858B7221k6841j60318J01030K77945l29191N0059q534n5070M95536n95730J48078
847g5815l2574j22398L81033K5144L4443k73491k82092J08333R3496L15152j61482
836I749J50605k45899K10245n7431q036J99159l6087k36396Q458k6648k44818
825b77099L45005q3218J77989k49343J0007j27337M30100m23852K68504O2518
815A33274k55408N2027l58668L70470j86015L78374N6858j51346k28822k49711
805d38967o5534J45438q8466O9488J11485K44691j62061n9270q9516N3419L12767
794C3474K18247r7550j88624Q9588j84832J8102K27310l00374l0545L66658Q5365
$$ plain form
869 -377237 -282341 -147518 -165299 60458 -26056 -1207 316651 138730 225668 178945 27221
858 27221 380 -159938 -58908 219037 -110154 -60095 -68629 -123699 371837 -223893 -75815
847 -75815 -108389 -230787 150246 175390 209833 -63658 -345750 -237417 -143921 171231 9749
836 9749 160354 -85545 124700 67269 59233 258392 222305 -14091 -5633 -32281 -277099
825 -277099 67906 -15312 162677 -86666 -76659 -203996 226104 -197748 70756 133274
815 133274 -122134 -70107 -428775 -58305 -244320 134054 190912 39566 -189256 -438967
805 -438967 -504501 -359063 -447529 -378041 -266556 -21865 -183926 -243196 -332712 -279293 33474
794 33474 251721 154171 -34453 55135 -129697 -111595 115715 -184659 -215204 151454 236819
783B36819j65805K0842k27391q8404k19635J31687K52679K8986J96917l54577
773a87882J38415K93568l83998n4703J08531q7028q365O8780j75713J47553J25012
762a5830K1770K52285l07720R8850m03189P5749L62986j05783K28497j70856J20475
751A57234j34240k69018K7423k50418J73518K68027n1508j54580j05044r5404
741d34010L25088L14967k92513j78890L88090j21667L91077j81494m27527K00129
731a6750j8995L2736Q8924k4035M8225j43643L7752P9829m2658N4371n7414p0877
719c2535J46134J12346r2209J66728K7056o0688j27572j86189j09047k5406K77773
708I6391R8504K8872m2950n430m4538j54543o4889k47734M85852M6515p4890m7399
$$ plain form
783 236819 71014 91856 -135535 -223939 -443574 -311887 -59208 -30222 166695 -187882
773 -187882 -49467 244101 -139897 -194600 -86069 -173097 -181462 -112682 -288395 -140842 -15830
762 -15830 5940 258225 -49495 49355 -353834 -278085 84901 -20882 207615 36759 157234
751 157234 22994 -246024 -218601 -469019 -295501 -27474 -78982 -233562 -338606 -434010
741 -434010 -108922 206045 -86468 -265358 122732 1065 392142 210648 -216879 -16750
731 -16750 -35745 -3009 85915 61880 110105 -33538 4214 84043 41385 95756 38342 -32535
719 -32535 113599 225945 133736 300464 327520 266832 139260 -46929 -155976 -181382 96391
708 96391 194895 223767 180817 175387 130849 -23694 -88583 -336317 149535 196050 121160 73761
696G3761j08248j5329Q4069p9432l6151J56837K7701j66353O0915K6827l55856
685c31259K58072K04319K95223j83449J13915m09527P1593O4228j4210N3497p0031
674E2371n3367j35653L71792l69567r6655O2768N79952j75966L01589r6945k13263
663B27056L82948n00848L54450m69191k13448J12336K25637J66508j36477j2197
653A36774l01363K73174J05577k39819N9700M2849j02498J73724L18321k61411
643B05028J50668l16815M6481K12471k28141K58873Q5228n7625o1684j41915j7792
632A34777k16572L45415k67487k409L7649k52418J24125L38677k72038L8202K08100
621B16021l26964l9552L48814J4747K639O6462k32215N2153n5103L62409p0384
$$ plain form
696 73761 -34487 -49816 34253 -45179 -81330 75507 103208 -63145 -2230 24597 -331259
685 -331259 -73187 131132 426355 242906 356821 -52706 18887 83115 68905 122402 52371
674 52371 -996 -136649 235143 -134424 -231079 -168311 411641 235675 537264 440319 227056
663 227056 610004 109156 463606 -5585 -219033 -106697 118940 285448 148971 136774
653 136774 -164589 108585 214162 -25657 34043 76892 -25606 148118 466439 205028
643 205028 355696 38881 85362 297833 69692 328565 413793 356168 294484 152569 134777
632 134777 -81795 263620 -3867 -6276 31373 -221045 -96920 241757 -30281 7921 216021
621 216021 -110943 -150495 198319 213066 215705 282167 49952 102105 47002 409411 339027
610C39027k143m01060L22958k97290N62338k05088K800O7386L2352k35384j48538
599C7358L64424l68236M45122J3446l39895j64277J49052J9383P6494J18532k61974
588H9429K91147j03341p3038j59238J49470j45065j55014K2150j7397K18766j11155
577F714K36722k89981K49062m80992O1106L09387k98607L34307j53796J47477
567A21399j1543o8836J74502Q1943l60127m0797J68143m9080N2821l0015j68146
556a29736J42473Q6497J43288J7826k57519K77600J72588r6897j92497q9254K2734
545I7103J71741l5289o6144K14661M9448L2681k40258j80165K11234l01421m1925
534h8334M52033k34093K43017q6027j49047j31901m30862M12853M2392O7492p4865
$$ plain form
610 339027 336884 -64176 258782 -38508 523830 318742 321542 388928 421280 185896 37358
599 37358 401782 33546 478668 492114 152219 -12058 136994 156377 232871 351403 89429
588 89429 380576 277235 204197 44959 194429 49364 -105650 -83500 -100897 117869 6714
577 6714 243436 -46545 202517 -278475 -217369 92018 -206589 127718 -26078 121399
567 121399 109856 41020 215522 297465 -62662 -103459 64684 15604 68425 38410 -129736
556 -129736 12737 99234 242522 260348 2829 280429 453017 356120 163623 74369 97103
545 97103 268844 233555 167411 382072 431520 464201 223943 43778 255012 -46409 -88334
534 -88334 363699 129606 372623 286596 137549 5648 -425214 -12361 30031 97523 22658
523B2658j43966J42583J16859j21535M36152q8596k99284J2007j28577q1132K91503
512A58672L4987j24134L50384k61532q7971M92355k60004L6958k06480l9477L4222
501A27980M21151j2465k37372p4198q0813K52715o3165O1783k42876r5411j85332
490a28003K82221J67750K03708l4386k46346k52696j09969J22427m5698K30378
480A89386r9121k63798R0293j09864K8164J61173p9447K54971j22127K13993k66618
469b995J70468K5856j17488J87486j69997K87579j40538J45217k7321k17472J34749
458B75544J78920j89826m3956J4436Q3743o9624J18811j01739j9330L4826J94310
447D76115k22995j41558K24330m51398M17122j10904J36508k73208J94616r015
$$ plain form
523 22658 -121308 21275 138134 16599 452751 364155 64871 76878 -51699 -132831 158672
512 158672 193659 69525 419909 158377 70406 562761 302757 339715 133235 93758 127980
501 127980 549131 536666 299294 225096 144283 396998 333833 395616 152740 57329 -128003
490 -128003 154218 321968 525676 491290 244944 -7752 -117721 4706 -40992 189386
480 189386 90265 -173533 -83240 -193104 -164940 -3767 -83214 171757 49630 263623 -2995
469 -2995 167473 193329 75841 263327 93330 380909 240371 385588 358267 140795 275544
458 275544 454464 264638 220682 235118 318861 249237 368048 266309 246979 281805 476115
447 476115 253120 111562 335892 -115506 301616 190712 327220 54012 248628 239613
437B39613M6301K33733j73843j49243m24748K15166K53253j02308Q2261j41769
427G8416J29260P8822P3373j98110Q1525Q0808k21115J51377J25874k40814J40901
416B80317j31244k44186K41995j42479K09883J11819j4793j82204K07052O1832
406C97992k6659p2075J83809j61292O7414j11712j34905l5277j07638K29683l26264
395i6924L07729N4192M176J91915l89287J85797K22677j54404l59721J73486j34052
384E584K39321j00467J87557j8094o664k81946R5170K59997l3695K91234j79721
373D58276k00823L74609n04077L26908L2478K17689l41914k62560K50251l57657
363f820K00792q0104R1997n05689P54891M2494q8663K47005l22536L64312J54072
$$ plain form
437 239613 285914 519647 345804 196561 -228187 -13021 240232 137924 220185 78416
427 78416 207676 286498 359871 161761 243286 324094 102979 254356 380230 139416 280317
416 280317 149073 -95113 146882 4403 214286 326105 311312 129108 336160 397992
406 397992 371333 299258 483067 321775 389189 277477 142572 107295 -343 229340 -96924
395 -96924 210805 264997 269173 461088 71801 257598 480275 325871 -33850 139636 5584
384 5584 244905 144438 331995 313901 307237 25291 120461 380458 346763 637997 458276
373 458276 257453 632062 127985 454893 487371 705060 363146 100586 350837 -6820
363 -6820 193972 113868 205865 -299824 455067 497561 408898 655903 333367 697679 851751
352H51751N3341l84276q7343J57729l76627J60298k76101j63042L0667o0447L70088
341B76038K58433R7195J83544m19287K54333J01022o09914K47498l64005r9889
331g5032J97308j28424R2734L61341J48259q2172q9556k50052M1881O3241j73185
320A06343L55790l34255K4356M64270k17703K30708j26625j78737j23791J6772
310B17128k45428k6448L06623j13112p617j10324k06983L61926L5528M66149k91776
299C85666m88301L07635M1900j6509M09954m78039R8358J26952k7888R5433l13399
288A41762L1359m9612J31129M4022j24645K29900J61768l61532o0295M96704j62220
277D78340L69671k47939J0922j98147j60473J62532K72825J15698k51161k60698
$$ plain form
352 851751 905092 520816 433473 591202 214575 374873 98772 -64270 -33603 -94050 276038
341 276038 534471 631666 815210 395923 650256 751278 141364 388862 24857 -75032
331 -75032 122276 -6148 86586 447927 596186 514014 424458 174406 216287 279528 106343
320 106343 462133 127878 152234 616504 398801 629509 502884 324147 200356 217128
310 217128 -28300 -54748 251875 138763 131146 20822 -186161 175765 211293 677442 385666
299 385666 -102635 205000 246900 230391 640345 162306 260664 387616 359728 455161 141762
288 141762 173121 123509 254638 298660 174015 403915 565683 204151 143856 640560 478340
277 478340 848011 600072 610994 412847 252374 414906 687731 803429 552268 291570
267B91570l34288M0442J08192M85590j20531j36060k52497K70127K65940k38201
257C80284L3856r5447L8507O6088J46267o0089n01n02044K77224J08641j8945
246C73841J97271m00824M45282m13737J8686K90009K39689j25046k21215l08889
236I5067K28858L5072k87613M67898O1180m25089K94742m6825k87680J1103L1851
225A78564J42241K28118n1396l75507K21929N47980m66956N41851l18122k1367
215F27335j09607j95712K03902j49296K36840r2755j59107j79118j14217L05828
205C74093M07799n3041l9889k11087O6995k38729R5311K72405j29863M9203l02670
194B90527n242N6487M0262J94518M3998j27889R1253m9767j32726K6963o0456
$$ plain form
267 291570 -42718 -2276 105916 591506 470975 334915 82418 352545 618485 380284
257 380284 414140 318693 357200 423288 569555 509466 508965 6921 284145 392786 373841
246 373841 571112 170288 615570 201833 220519 510528 750217 625171 403956 95067
236 95067 323925 358997 71384 539282 600462 175373 470115 423290 135610 146713 178564
225 178564 320805 548923 497527 122020 343949 891929 424973 966824 648702 627335
215 627335 517728 322016 525918 376622 613462 520707 361600 182482 68265 374093
205 374093 781892 728851 688962 477875 544870 306141 401452 673857 543994 593197 290527
194 290527 285285 341772 382034 576552 620550 492661 583914 534147 401421 428384 367928
183C67928J37183j57772O5622j67132J88509J57460k99724m1798K52219j76909
173C25586Q0798j97900J15176j06909L4390R8002k9283j12423L1207J50962q111
162C81495R6130j02425M5687j29865k25677r849K03290M9270J94047J66073k04674
151D63502J1080r9586L3691M9452K45161k98902o7102p0202p0166J41794Q1401
140D20123j3973J5049J66465k60528L5207Q4501J79856k88029L6286k5059p350
129C42548K21616K8256N4495P1236l67915O0942j1923K180K61693k18579j90772
118B53777K65153m64412M93839L095j15094n3666m3194K9813J21774l2208J06638
107E65515J49760m9159j7376j14278O156j5039J73964j01927N2875l99227J32923
$$ plain form
183 367928 505111 347339 412961 245829 434338 591798 292074 250276 502495 325586
173 325586 406384 208484 323660 216751 251141 349143 319860 207437 238644 389606 381495
162 381495 477625 375200 420887 291022 65345 55496 258786 308056 502103 668176 463502
151 463502 474582 374996 408687 458139 703300 404398 337296 267094 196928 338722 420123
140 420123 406150 421199 587664 327136 362343 446844 626700 338671 374957 349898 342548
129 342548 564164 592420 646915 718151 350236 411178 399255 401435 663128 444549 253777
118 253777 518930 54518 548357 551452 436358 382692 339498 369311 491085 458877 565515
107 565515 715275 666116 648740 534462 540618 525579 699543 597616 650491 251264 384187
96C84187R7688K2890J14607k14743q0410J05917p7094J54051m3986k43331k1048
85A98728L08177J08404J70844q379J39121l9393k99541m8288j57293p0790J51214
74D52804n0406k9917n3645K93000j2197J80079j47200j19768R7275K58496k08459
63F60062P4297M1417j93280l1474o2474O362O7808p5208M8556j8339K19j8145
51D99801j33353K5165J59733j02918j62982O9478n5862J49541r9537L69058j96272
40E21852K5437k34508P4605p4031r4024O9907M6953J63243j8691K12931k91938
29D01736J89758j55015n0202L43142k01116n8876k34811K44950j26349K68116
19F21333K77989l60225J039j13390j1758j8796k959K89264Q6960M9971j00256
$$ plain form
96 384187 481875 504765 619372 404629 324219 430136 353042 507093 463107 219776 198728
85 198728 506905 615309 786153 777774 916895 877502 577961 529673 372380 301590 452804
74 452804 402398 372481 318836 611836 599639 779718 632518 512750 610025 868521 660062
63 660062 734359 775776 582496 551022 488548 494910 562718 487510 536066 517727 517946 499801
51 499801 366448 391613 551346 448428 285446 354924 299062 448603 349066 718124 521852
40 521852 547289 312781 387386 313355 219331 289238 336191 499434 480743 693674 401736
29 401736 591494 436479 386277 729419 528303 469427 234616 479566 353217 621333
19 621333 899322 539097 540136 426746 414988 396192 393233 682497 769457 819428 719172
8G19172j68521P9794P3243j57867p4974n6320R6321J38035
0F48883
$$ plain form
8 719172 550651 630445 703688 545821 470847 414527 510848 648883
0 648883
$$ Imaginary data points
##PAGE= N=2
##DATA TABLE= (X++(I..I)), XYDATA
16383d108102o4661R6065O4689J07600J04318J82782J41080k39173J99626K8161
16373c487615k70180L99609n7052J64222j66607j61054K95724O9554n5705J04673
16363c164431L6382L20143k1348j75469R2559R8832K25417N9229j4575j80291
16353b723552N4523K6226J41234M7282N3416l43K6966R3807n6094M18517j98769
16342b116787M9105K47894j94230P8240J0451n0070K14665o4470P9808N0298K31872
16331a463224J88142k30254M3150K12310k35620K18118Q4229J4994Q6461j24427
16321a206121K4035N1451K75891o2737J94293J9384r8961j11899J0963J87479
16311g16222n8942K40397O1280j3040j02746k49224M67227M1997J17528K7466
$$ plain form
16383 -4108102 -4172763 -4076698 -4012009 -3904409 -3800091 -3617309 -3476229 -3715402 -3515776 -3487615
16373 -3487615 -3757795 -3358186 -3415238 -3251016 -3417623 -3578677 -3282953 -3213399 -3269104 -3164431
16363 -3164431 -3128049 -2807906 -2829254 -3004723 -2912164 -2813332 -2587915 -2528686 -2543261 -2723552
16353 -2723552 -2669029 -2642803 -2501569 -2454287 -2400871 -2401214 -2374248 -2280441 -2336535 -1918018 -2116787
16342 -2116787 -2067682 -1819788 -2014018 -1935778 -1925327 -1975397 -1760732 -1825202 -1745394 -1695096 -1463224
16331 -1463224 -1275082 -1505336 -1462186 -1249876 -1485496 -1267378 -1183149 -1168155 -1081694 -1206121
16321 -1206121 -1182086 -1130635 -854744 -917481 -723188 -703804 -802765 -914664 -903701 -716222
16311 -716222 -775164 -534767 -473487 -486527 -589273 -838497 -371270 -329273 -211745 -184279
16301a84279j36028J67092j5378J43649O4157Q7227K4646J33727P3784n8086R0101
16290C90612p9745K59511J21160q9646k83294J97027j39436J42338J61602j69112
16280E11017J24109J54393r2748l1004Q2781J10738L0946j5723K91597m02830
16270G63276L4639L53652k28829N06499j2379k21379j3968m2432p5724M3963K65194
16259A372512M1369n2414M0416k3750k65118L25574L3960P1579J42160l2419L8274
16248A692143K60325m4893M8174K1553J00129J3345m85997L27392J65981j15883
16238A982269J80586k0928L9710Q3989K34876l02022K70071k45314q694J45349
16228B359892J91420N0701j17688r5355q6598k5672j05904K45591k29866J31612
$$ plain form
16301 -184279 -320307 -153215 -168593 -24944 39213 126440 151086 284813 358597 300511 390612
16290 390612 310867 570378 691538 601892 318598 515625 376189 518527 680129 511017
16280 511017 635126 789519 696771 665767 748548 859286 890232 874509 1166106 763276
16270 763276 797915 1151567 922738 1429237 1416858 1195479 1181511 1139079 1063355 1107318 1372512
16259 1372512 1413881 1361467 1401883 1378133 1113015 1438589 1472549 1544128 1686288 1653869 1692143
16248 1692143 1952468 1907575 1955749 1977302 2077431 2090776 1604779 1932171 2098152 1982269
16238 1982269 2162855 2141927 2181637 2265626 2500502 2198480 2468551 2223237 2214543 2359892
16228 2359892 2551312 2602013 2484325 2388970 2302372 2276700 2170796 2416387 2186521 2318133
16218B318133P7313l5293J46806P1312J06252k29897k1886J78959k44283N74601
16208B942017o2306O5859O4879l27477J34352R2967l11103o5943Q4003K01687
16198B818935L21970j63617J84667j73464k32721O7602J67024o1870j63443J34815
16188B899898j943k45498L01985m1568j08747M93369l07473K30973j37905j23897
16178B959194L9142J9272K47861j63690O8014l9536J62535j30090k94620j06736
16168B761346J73493J70913J67988j87294p3284J70833L4392J13005J4464K25602
16158C571458j96311K58561q6871k73671L78078k58350J9245K72974P4840j66570
16148C593383N3870j44911l27779L53587M2372K03471q525j64405l22502n7064
$$ plain form
16218 2318133 2395446 2360153 2506959 2578271 2684523 2454626 2432740 2611699 2367416 2942017
16208 2942017 2879711 2945570 3010449 2682972 2817324 2910291 2599188 2533245 2617248 2818935
16198 2818935 3140905 2977288 3161955 2988491 2755770 2823372 2990396 2928526 2765083 2899898
16188 2899898 2897955 2652457 2954442 2912874 2804127 3297496 2990023 3220996 3083091 2959194
16178 2959194 2998336 3017608 3265469 3101779 3169793 3130257 3292792 3162702 2868082 2761346
16168 2761346 2934839 3105752 3273740 3086446 3013162 3183995 3218387 3331392 3345856 3571458
16158 3571458 3375147 3633708 3546837 3273166 3651244 3392894 3412139 3685113 3759953 3593383
16148 3593383 3647253 3502342 3174563 3528150 3570522 3773993 3765468 3601063 3278561 3221497
16138C221497J65095j06520K85743r1623J02894j14873O122J42604r2923M9190
16128C567206j74249M8236j68254O073M2813j34266K00142j32202j6419J41864
16118C380944n5734P6445K4531M7812J07665L6888J67495l4976l7422l22924l69699
$$ plain form
16138 3221497 3386592 3280072 3565815 3474192 3577086 3462213 3468335 3610939 3518016 3567206
16128 3567206 3392957 3441193 3272939 3279012 3321825 3187559 3387701 3255499 3239080 3380944
16118 3380944 3325210 3401655 3426186 3473998 3581663 3618551 3786046 3751070 3713648 3390724 3021025
$$ [...]
##END NTUPLES=NMR SPECTRUM
##END=
