##TITLE=1H_CG-1148-B2
 CDCl3, 8 sc, 
 7.06.2021
##JCAMPDX= 6.0         $$ Bruker NMR JCAMP-DX V2.0
##DATA TYPE= NMR SPECTRUM
##DATA CLASS= NTUPLES
##ORIGIN= UXNMR, Bruker Analytische Messtechnik GmbH
##OWNER= root
$$ XWIN-NMR		Version 3.5
$$ Mon Jun  7 11:27:10 2021 Russian Standard Time (UT+4h)  she@DPX200
##.OBSERVE FREQUENCY= 200.131506
##.OBSERVE NUCLEUS= ^1H
##.ACQUISITION MODE= SIMULTANEOUS
##.ACQUISITION SCHEME= undefined
##.AVERAGES= 8
##.DIGITISER RES= 18
##SPECTROMETER/DATA SYSTEM= spect
##.PULSE SEQUENCE= zg30
##.SOLVENT NAME= DMSO
##.SHIFT REFERENCE= (INTERNAL, DMSO, 0, 17.5313)
##AUDIT TRAIL= $$ (NUMBER, WHEN, WHO, WHERE, WHAT)
$$ ##TITLE= Audit trail, XWIN-NMR		Version 3.5
$$ ##JCAMPDX= 5.01
$$ ##ORIGIN= Bruker BioSpin GmbH
$$ ##OWNER= she
$$ F:/spectra/data/she/nmr/H-F/1/pdata/1/auditp.txt
$$ ##AUDIT TRAIL=  $$ (NUMBER, WHEN, WHO, WHERE, WHAT)
(   1,<2021-06-07 11:25:33.53 +0400>,<she>,<DPX200>,
      <created by zg, POWCHK disabled, PULCHK disabled
       configuration hash MD5:
       00 E9 B6 7A A2 85 ED C7 34 08 36 98 17 FE 4E 26
       data hash MD5: 16K
       6A 1F 73 F3 4A FF 0F 63 D6 F7 56 1E 68 17 AB 00>)
(   2,<2021-06-07 11:25:36.12 +0400>,<she>,<DPX200>,
      <Start of raw data processing
       efp BC_mod = 2 LB = 0.24 FT_mod = 6 PKNL = 1 PHC0 = -11487.1 PHC1 = 17.40101 SI = 16K 
       data hash MD5: 16K
       57 A7 24 9E E6 4C E6 32 C8 F4 4F D3 A2 28 99 68>)
(   3,<2021-06-07 11:26:02.89 +0400>,<she>,<DPX200>,
      <pk PHC0 = 5.405845 PHC1 = -7.799999 
       data hash MD5: 16K
       B7 9F CE BE EF DA B2 35 AC E5 71 85 83 44 12 A5>)
(   4,<2021-06-07 11:26:06.87 +0400>,<she>,<DPX200>,
      <abs ABSG = 5 
       data hash MD5: 16K
       09 2F 58 28 D8 4E 29 38 F2 B3 CA 27 7B D3 13 BC>)
$$ ##END=
$$ 
$$ hash MD5
$$ 04 68 2F 09 C9 14 DE BD 33 89 B0 E9 B4 5F F6 85
##$RELAX= 
##$RELAX= 
##$RELAX= 
##$RELAX= 
##$RELAX= 
##$RELAX= 
$$ Bruker specific parameters
$$ --------------------------
##$DU= <F:/spectra>
##$EXPNO= 1
##$NAME= <H-F>
##$PROCNO= 1
##$TYPE= <nmr>
##$USER= <she>
##$AMP= (0..31)
100 100 100 100 100 100 100 100 100 100 100 100 100 100 100 100 100 100 
100 100 100 100 100 100 100 100 100 100 100 100 100 100 
##$AQSEQ= 0
##$AQ_mod= 1
##$AUNM= <au_zg>
##$AUTOPOS= <>
##$BF1= 200.13
##$BF2= 200.13
##$BF3= 200.13
##$BF4= 200.13
##$BF5= 200.13
##$BF6= 200.13
##$BF7= 200.13
##$BF8= 200.13
##$BYTORDA= 1
##$CFDGTYP= 0
##$CFRGTYP= 5
##$CHEMSTR= <none>
##$CNST= (0..31)
1 1 145 1 1 1 1 1 1 1 1 1 1 1 1 1 1 1 1 1 1 1 1 1 1 1 1 1 1 1 1 1 
##$CPDPRG= <>
##$CPDPRG1= <>
##$CPDPRG2= <>
##$CPDPRG3= <>
##$CPDPRG4= <mlev>
##$CPDPRG5= <mlev>
##$CPDPRG6= <mlev>
##$CPDPRG7= <mlev>
##$CPDPRG8= <mlev>
##$CPDPRGB= <>
##$CPDPRGT= <>
##$D= (0..31)
0 1.2 0 0 0 0 0 0 0 0.06 0 0.03 0 0 0 0 0.0002 0 0 0 0 0 0 0 0 0 0 0 0 
0 0 0 
##$DATE= 1623050733
##$DBL= (0..7)
120 120 120 120 120 120 120 120 
##$DBP= (0..7)
150 150 150 150 150 150 150 150 
##$DBP07= 0
##$DBPNAM0= <>
##$DBPNAM1= <>
##$DBPNAM2= <>
##$DBPNAM3= <>
##$DBPNAM4= <>
$$ [...]
##$SUBNAM3= <"">
##$SUBNAM4= <"">
##$SUBNAM5= <"">
##$SUBNAM6= <"">
##$SUBNAM7= <"">
##$SUBNAM8= <"">
##$SUBNAM9= <"">
##$SW= 20.0188882624521
##$SWIBOX= (0..15)
0 0 2 0 0 0 0 0 0 0 0 0 0 0 0 0 
##$SW_h= 4006.41025641026
##$TD= 16384
##$TD0= 1
##$TE= 0
##$TE2= 300
##$TE3= 300
##$TEG= 300
##$TL= (0..7)
0 120 120 120 120 120 120 120 
##$TP= (0..7)
150 150 150 150 150 150 150 150 
##$TP07= 0
##$TPNAME0= <>
##$TPNAME1= <>
##$TPNAME2= <>
##$TPNAME3= <>
##$TPNAME4= <>
##$TPNAME5= <>
##$TPNAME6= <>
##$TPNAME7= <>
##$TPOAL= (0..7)
0.5 0.5 0.5 0.5 0.5 0.5 0.5 0.5 
##$TPOFFS= (0..7)
0 0 0 0 0 0 0 0 
##$TUNHIN= 0
##$TUNHOUT= 0
##$TUNXOUT= 0
##$USERA1= <user>
##$USERA2= <user>
##$USERA3= <user>
##$USERA4= <user>
##$USERA5= <user>
##$V9= 5
##$VALIST= <valist>
##$VCLIST= <CCCCCCCCCCCCCCC>
##$VD= 0
##$VDLIST= <DDDDDDDDDDDDDDD>
##$VPLIST= <PPPPPPPPPPPPPPP>
##$VTLIST= <TTTTTTTTTTTTTTT>
##$WBST= 1024
##$WBSW= 4
##$XGAIN= (0..3)
0 0 0 0 
##$XL= 0
##$YL= 0
##$YMAX_a= 765559
##$YMIN_a= -646221
##$ZGOPTNS= <>
##$ZL1= 120
##$ZL2= 120
##$ZL3= 120
##$ZL4= 120
##$ABSF1= 17.49955
##$ABSF2= -2.519489
##$ABSG= 5
##$ABSL= 3
##$ALPHA= 0
##$AQORDER= 0
##$ASSFAC= 0
##$ASSFACI= 0
##$ASSFACX= 0
##$ASSWID= 0
##$AUNMP= <proc_1d>
##$AZFE= 0.1
##$AZFW= 0.1
##$BCFW= 0
##$BC_mod= 2
##$BYTORDP= 0
##$COROFFS= 0
##$CY= -3
##$DATMOD= 1
##$DC= 0
##$DFILT= <>
##$DTYPP= 0
##$F1P= 0
##$F2P= 0
##$FCOR= 1
##$FTSIZE= 16384
##$FT_mod= 6
##$GAMMA= 0
##$GB= 0
##$INTBC= 1
##$INTSCL= 1.334414e-10
##$ISEN= 128
##$LB= 0.24
##$LEV0= 0
##$LPBIN= 0
##$MAXI= 10000
##$MC2= 0
##$MEAN= 0
##$ME_mod= 0
##$MI= 1.114404
##$NCOEF= 0
##$NC_proc= -6
##$NLEV= 6
##$NOISF1= 3.799351
##$NOISF2= 2.8
##$NSP= 0
##$NTH_PI= 0
##$NZP= 0
##$OFFSET= 17.53132
##$PC= 1
##$PHC0= -11481.69
##$PHC1= 9.601011
##$PH_mod= 1
##$PKNL= yes
##$PPARMOD= 0
##$PSCAL= 0
##$PSIGN= 0
##$REVERSE= no
##$SF= 200.130000662074
##$SI= 16384
##$SIGF1= 3
##$SIGF2= 2
##$SINO= 5.538805
##$SIOLD= 16384
##$SREGLST= <1H.CDCl3>
##$SSB= 0
##$STSI= 16384
##$STSR= 0
##$SW_p= 4006.41025641026
##$SYMM= 0
##$S_DEV= 0
##$TDeff= 16384
##$TDoff= 0
##$TI= <>
##$TILT= no
##$TM1= 0
##$TM2= 0
##$TOPLEV= 0
##$USERP1= <user>
##$USERP2= <user>
##$USERP3= <user>
##$USERP4= <user>
##$USERP5= <user>
##$WDW= 1
##$XDIM= 16384
##$YMAX_p= 492776220
##$YMIN_p= -337080
$$ End of Bruker specific parameters
$$ ---------------------------------
##NTUPLES= NMR SPECTRUM
##VAR_NAME=  FREQUENCY,     SPECTRUM/REAL,   SPECTRUM/IMAG
##SYMBOL=    X,             R,               I
##VAR_TYPE=  INDEPENDENT,   DEPENDENT,       DEPENDENT
##VAR_FORM=  AFFN,          ASDF,            ASDF
##VAR_DIM=   16384,         16384,           16384
##UNITS=     HZ,            ARBITRARY UNITS, ARBITRARY UNITS
##FACTOR=    0.24454680195387, 1,            1
##FIRST=     3508.54319766126, 0,            0
##LAST=      -497.867058748999, 0,           0
##MIN=       -497.867058748999, -337080,     0
##MAX=       3508.54319766126, 492776220,    0
$$ Real data points
##PAGE= N=1
##DATA TABLE= (X++(R..R)), XYDATA
$$ [...]
7569 4501578 4166787 3950127 3782520 3587003 3462480 3368178 3195284 2977897 2926892 2828689
7559 2828689 2773250 2613371 2459163 2494890 2484650 2302568 2205247 2184902 2309485 2272315 2274980
7548 2274980 2219661 2069827 2167703 2170190 2084675 2181869 2160136 1993378 1937519 1947969 2008603
7537 2008603 1945616 1897883 1884465 1784154 1720266 1874307 1846184 1686640 1606343 1434963 1476892
7526 1476892 1486219 1393375 1480608 1444616 1304445 1176752 1153484 1066148 991526 1023851 1070966
7515 1070966 1066163 1037254 964831 1052811 992723 990664 1004407 923846 847565 802877 878585 868647
7503 868647 922540 786035 802894 899728 788133 770615 856922 809718 746151 603784 640207
7492 640207 671756 689748 630739 668522 675925 672516 692316 660167 693915 630033 625936 519754
7480 519754 724469 650547 650834 673041 584740 461186 551850 532830 605488 618224 593328 672215
7468 672215 630019 583365 638981 661974 629269 578524 474436 617102 513982 413556 497527
7457 497527 536898 533049 561047 589190 531078 509791 520311 479789 565952 535602 536357 478279
7445 478279 481358 441527 333393 339921 264614 304552 400730 428368 469576 416619 402565 384237
7433 384237 336207 328837 438490 420568 427549 500048 412236 319354 285402 456692 465376 452192
7421 452192 525415 516408 363544 289948 258580 341426 415582 339047 353082 424786 398938 366038
7409 366038 398815 355601 339792 378175 427142 378600 370446 384611 352016 294975 266012 303725
7397 303725 313115 262282 302556 210080 250579 271029 220009 248666 227179 114403 261713
7386 261713 283415 326428 306590 350317 248306 166725 259987 321200 400552 335248 252526
7375 252526 285870 196457 216715 317786 263029 192914 175791 131271 169402 328129 341281
7364 341281 389641 374815 292197 234239 258150 210678 216991 266705 216962 175304 267035 218146
7352 218146 294596 293489 310401 321296 242149 112805 200359 326596 315717 291389 253553
7341 253553 183055 159025 177454 194303 238883 240211 199785 242769 212184 57341 76374 148635
7329 148635 243696 330966 253649 318586 335522 287624 277736 256958 266900 246179 196993 158992
7317 158992 215407 273994 344363 288736 261002 182947 171211 227042 206161 167296 96284 113065
7305 113065 113695 183798 159528 112839 74416 -43230 21592 52309 207887 174995 81425 128108
7293 128108 124824 109429 188104 146002 161025 162851 121620 230322 349887 298447 177214
7282 177214 304703 272219 277484 122884 50827 94994 161486 163973 -13121 -39150 -64260
7271 -64260 -41391 -6644 79611 66413 24325 30776 98394 108277 38788 88128 27372 -13958
7259 -13958 -44543 -49742 -15888 -128977 -61888 25351 -23760 137457 173746 34862 -79842
7248 -79842 -6200 103175 86498 -71956 -54509 -7995 70190 -24891 -85143 -76836 75677
7237 75677 51304 54643 36541 -91103 -40161 -2676 56893 -66197 -30671 28084 -38034 774
7225 774 12323 -46605 62343 23756 10137 -7163 -52138 -73552 -66976 -82777 -120502 -30076
7213 -30076 -12083 48886 68641 -47724 28307 -50374 29808 33593 -33701 -94915 -113665 -75818
7201 -75818 -19526 725 -95614 1499 13062 14976 -91789 -36612 -30742 3885 126016 80289
7189 80289 108764 29479 19571 61682 40853 -57658 -86625 -140410 -53255 17249 -15494 44186
7177 44186 30301 4774 -69655 -88320 -128993 -174102 -20761 30633 -11600 14195 -5470 -37921
7165 -37921 -46140 -122696 -128754 -127745 -77261 36947 -18522 -190472 -192713 -119939 -180531 -129155
7153 -129155 -77441 -90209 -97495 -115959 -143099 -142361 -195715 -116435 -75795 -112593 -116906 -193772
7141 -193772 -275470 -143723 -23636 -64798 -116808 -141789 -14235 -1517 -23441 84167 -4827
7130 -4827 -65236 -120479 -224672 -140848 -112212 14929 58559 38203 -44676 -59211 -26453 -68974
7118 -68974 12458 -33923 -25998 -48689 -101559 -137586 -143543 -105494 -210096 -224208 -235914 -116770
7106 -116770 -110653 -136728 -71150 -110593 -139526 -103569 -181887 -72567 12542 -123539 -92265
7095 -92265 -36070 -54956 -67856 -39781 -134904 -222626 -187810 -166893 -118759 -79368 -40927 10811
7083 10811 -64581 -167408 -168692 -154294 -74996 -11634 -27138 -107830 -45422 -53438 -6812 -147340
7071 -147340 -188006 -113896 -143671 -171406 -154350 -54962 -22704 -53509 -54667 -34430 -5581 -49466
7059 -49466 -73009 -1654 -28463 -64460 -51440 -1381 -87045 -91422 -46055 63898 -23009 -153917
7047 -153917 -123124 -63241 -143774 -36971 -63938 -22990 -4894 -21624 -113748 8585 40876
7036 40876 -69815 -78575 -34145 -134032 -112913 15818 -11545 -30833 -25963 -50812 -183858 -141867
7024 -141867 -62721 -90067 -190835 -133119 -132483 -45197 25197 -60652 -1148 25047 37023 -66040
7012 -66040 -33507 3938 27498 64426 112596 -84085 -139025 -3398 43844 67996 12194
7001 12194 106160 227303 159349 76061 105842 -23679 -102383 -5119 -20581 -73060 -1184
6990 -1184 -47520 7847 99955 7633 23800 70257 14929 5245 14009 44067 21095 78773
6978 78773 -12634 -23552 -45281 -12193 93875 135077 120137 73123 57718 -14992 8190 9266
6966 9266 -12209 128452 237675 183749 151204 185529 219978 158444 104740 175752 273211 337000
6954 337000 276312 201339 251061 233998 269720 392363 411183 355411 348089 428407 397925 297588
6942 297588 433923 561411 443709 491729 421966 419942 417340 326445 360148 348670 237975
6931 237975 338410 415338 262164 320548 452030 386511 452819 446834 402562 368609 395890
6920 395890 442437 444876 366325 237837 183006 263554 357468 295915 294896 347523 249161 190365
6908 190365 246692 241027 157102 315087 233118 193479 274445 250704 158339 240283 271222 261877
6896 261877 267743 192754 200387 241630 319849 323601 432025 375974 130838 221538 308224 363597
6884 363597 393911 367503 373225 420030 331870 310702 280370 178122 248347 348949 428440
6873 428440 308551 219979 210881 356593 306861 104071 295586 289333 224905 329138 289668
6862 289668 404116 397963 373006 219764 247251 337666 332057 195889 199579 246018 425759
6851 425759 327715 334060 440162 410005 342438 390734 259698 162056 228338 310120 394209
6840 394209 300319 252942 282867 283953 302707 189327 130424 268281 287528 241636 188764
6829 188764 131890 151720 203885 305552 264866 311532 321184 280666 287692 286521 142147 269266
6817 269266 298132 349200 332053 261298 240509 273010 215605 199613 307839 344352 285914
6806 285914 150541 313731 307270 229345 254955 246792 251347 143866 203864 129103 108059 149555
6794 149555 62943 110697 129151 244090 166454 211384 183559 134760 122987 121440 30498 145124
6782 145124 183466 41482 75772 213290 253364 194875 82678 108068 107595 137584 151473
6771 151473 221934 137299 175701 167752 190570 105714 222455 199088 114518 141399 159730 251047
6759 251047 250471 143573 67254 103340 111693 57794 76960 118642 108931 191956 114595 168641
6747 168641 87910 44531 160696 108114 97715 145675 129934 154980 188745 153350 188615
6736 188615 227013 281233 117978 158939 142257 52741 83670 85452 160472 115193 50533 143430
6724 143430 125699 75772 116208 171599 153281 177174 139412 41394 66335 150201 196291 132676
6712 132676 197479 260771 178515 159151 114350 85540 128398 116509 102780 123083 118702 113123
6700 113123 63756 122988 184319 116253 144674 125210 201180 178693 88633 118787 135511 51072
6688 51072 67736 16153 137609 207055 229987 136121 178931 207623 217160 88446 90997 156067
6676 156067 264976 208129 189762 135212 150795 295082 379048 287348 199994 276522 381075
6665 381075 388898 281936 539593 480330 425688 439106 444601 404860 288032 380740 430971
6654 430971 376918 343281 329597 390286 400244 335271 317599 321720 315206 311171 358161 344211
6642 344211 398334 373015 440302 437222 328269 330307 260822 336070 360629 350497 305245 360438
6630 360438 326299 332298 353536 340962 380212 357652 448023 356090 244889 299965 230361 303341
6618 303341 338544 376278 390551 408811 390067 369844 462380 525339 482007 510444 489654 387630
6606 387630 304406 276753 379579 386186 333357 425408 446572 377790 339526 287808 387993
6595 387993 483668 313257 374047 482996 428255 433301 317065 353435 329323 382178 410888
6584 410888 400169 485256 457526 453410 408888 351698 263117 202070 404935 308809 338356 366679
6572 366679 403422 379160 292656 323269 417855 359399 224867 236404 256092 329444 349009
6561 349009 434481 390550 334490 336752 375112 293226 229252 164974 239398 282776 236116 233093
6549 233093 273506 380474 404167 452938 402511 344709 269266 139212 299803 257451 225418
6538 225418 378551 325261 316223 375982 386554 353879 371108 362509 373181 349449 308751 422961
6526 422961 476212 386034 426775 514137 488312 441807 415599 453742 493652 444457 345374 427995
6514 427995 476943 436865 490242 425434 448317 487272 473053 519587 520892 500540 454219 482569
6502 482569 561173 514985 517441 419921 336191 296619 352962 377641 333349 372368 346121 265401
6490 265401 251773 247615 311147 449522 320794 347663 396446 349086 252097 226538 343120
6479 343120 384780 302705 366222 404092 347064 280561 288328 173691 307705 279998 363952
6468 363952 359695 329780 329663 234323 247480 275256 307740 295431 381515 291889 269899 333798
6456 333798 224817 348546 283514 158961 170022 141283 264044 236471 336068 418308 397899
6445 397899 415886 344727 310216 355504 382045 355715 241974 234679 339533 338893 349619 332052
6433 332052 293373 254619 237807 303613 269116 403623 461013 499858 387956 472364 363707
6422 363707 302077 322862 390885 258526 284186 304756 397385 366962 329163 347215 339204 326359
6410 326359 289554 316475 307060 300137 171313 157023 290605 247839 294125 398964 301899
6399 301899 442844 429613 356884 453477 430793 317170 318239 285971 537578 611578 596303
6388 596303 531357 509002 554275 530205 535093 481957 444249 613716 588605 482195 528346
6377 528346 433675 518996 397656 352742 444207 378727 483989 444396 383326 386006 380075 331433
6365 331433 353051 414509 450458 420438 456714 445064 351878 450988 352077 403591 330340 374973
6353 374973 481501 591197 575770 483899 461777 472398 506588 417774 311502 317394 508808
6342 508808 427189 402306 425758 340594 373205 446326 463374 418640 439806 428851 310098
6331 310098 394986 378916 353857 360682 390359 405745 396736 526520 500920 411055 479147 422039
6319 422039 360382 338280 463050 320848 262018 233774 230020 238890 300409 419013 399472
6308 399472 455604 445749 411751 443140 389101 432169 448826 415281 331585 425767 435929 361717
6296 361717 415456 477633 508735 559573 579667 478414 458294 451095 455272 380536 469630 561762
6284 561762 610219 640308 697044 556431 505649 514875 419360 473791 426289 479711 463448 567739
6272 567739 507204 501007 531031 518239 488621 429358 624570 643959 515183 555959 539436
6261 539436 550927 613239 654413 664551 602772 537858 577429 741719 782811 681213 641303
6250 641303 737638 640206 585845 548892 698073 666301 567480 619874 643427 593482 515977
6239 515977 516053 558718 600665 632731 618670 631896 681211 746352 656123 672842 677895 532852
6227 532852 418775 537175 629078 618046 598242 651931 646143 785763 816084 828682 698183
6216 698183 622340 717372 741511 746478 765572 748097 719673 858392 828704 681525 744429
6205 744429 679678 707417 693088 698350 777004 762631 766942 759501 797890 835456 868752 906813
6193 906813 858680 924701 774667 699436 647507 793643 990698 873812 946851 832405 922881
6182 922881 872002 849743 937444 963997 911721 883907 906409 1050836 957393 998739 1051370
6171 1051370 946696 1018291 1256504 1208370 1084062 1152319 1094017 1059093 1019541 1035442 1022328
6160 1022328 990028 1007065 1093771 1061700 1019077 1078392 1115080 1165677 1006275 1010856 1022974
6149 1022974 995974 961434 1074681 1108211 1021270 1043177 1044789 997440 1031140 1069500 1012883
6138 1012883 1109987 1121897 1025270 1027759 1019108 1028256 1106029 1203686 1274121 1127325 1225046 1251566
6126 1251566 1039666 1092065 1183293 1232125 1191457 1262236 1241840 1193437 1154163 1021292 1173308
6115 1173308 1230029 1067178 1117180 1091994 1148255 1275871 1314403 1316337 1355640 1239942 1318281
6104 1318281 1322198 1181590 1227092 1252351 1277824 1299866 1250757 1238573 1173883 1188860 1351251
6093 1351251 1437706 1385854 1341029 1350494 1357922 1353670 1340912 1367896 1306620 1310407 1361767 1434492
6081 1434492 1444005 1460354 1410404 1420709 1490217 1551947 1473842 1527502 1571684 1548064 1656740
6070 1656740 1663782 1616433 1698128 1691690 1610147 1760617 1920336 1946740 2009208 1982243 1946185
6059 1946185 1911366 2063673 2121566 2058888 2210972 2206978 2055540 2212606 2242165 2316708 2390961
6048 2390961 2383864 2337670 2328206 2393810 2411529 2405948 2395970 2441721 2463924 2550208 2693979 2625930
6036 2625930 2597975 2768040 2748647 2794083 2797791 2788033 2859261 2949732 3063680 3092070 3091257 3025951
6024 3025951 3019911 2947736 3027006 3029038 2969209 2936909 2954726 2825085 2631616 2636292 2622800 2648231
6012 2648231 2529365 2460195 2517873 2448294 2484969 2497773 2482265 2404040 2306597 2422982 2528203
6001 2528203 2627454 2536418 2606544 2634937 2500017 2538437 2544783 2619491 2677016 2644180 2769622
5990 2769622 2713849 2866010 2874906 2801312 2977918 2939590 2986194 3139796 3109806 3132165 3299562
5979 3299562 3372361 3352483 3342257 3408075 3391665 3420952 3432470 3393315 3391126 3359036 3427319 3533795
5967 3533795 3516086 3507270 3565455 3542881 3428588 3360642 3314959 3302641 3324340 3422879 3404900
5956 3404900 3399584 3406633 3377838 3477930 3578589 3534037 3400159 3527177 3596824 3555881 3550862
5945 3550862 3494675 3434316 3594965 3630247 3660446 3713334 3761402 3728630 3828500 3963885 3932365
5934 3932365 3843930 3865982 3966652 3963971 4105105 4067405 4098758 4089820 4140651 4343059 4393584
5923 4393584 4394160 4480076 4498063 4412720 4412796 4495802 4486449 4478596 4632419 4736366 4776842 4713080
5911 4713080 4800625 4757807 4913107 5013062 5020340 5003538 5032731 5215476 5182280 5200701 5242035
5900 5242035 5184350 5272692 5387872 5348310 5433950 5469434 5508165 5519965 5478412 5680610 5753402
5889 5753402 5756898 5884812 5900478 5985077 6076551 6073841 6117186 6136802 6298598 6404023 6394776
5878 6394776 6409910 6484135 6584106 6701621 6874173 6865883 6936840 7006916 6998540 7032831 7199210
5867 7199210 7257720 7277081 7413768 7428323 7507047 7528886 7684151 7839206 7879929 7912582 7966620
5856 7966620 7969826 7942590 8080213 8214840 8413125 8494169 8615330 8701775 8800203 8848754 8850285
5845 8850285 8963590 9163219 9205792 9263711 9489051 9605228 9644324 9750312 9886056 9999337
5835 9999337 10110439 10207478 10351080 10435426 10584738 10739009 10813286 10934228 11139314 11375295
5825 11375295 11405499 11551784 11722888 11937063 12049881 12208716 12352421 12526749 12675951 12845897
5815 12845897 13044077 13205085 13388184 13493757 13628851 13829325 14045375 14247315 14403703
5806 14403703 14556491 14745032 14874987 15110652 15309013 15428512 15665643 15823115 16035812
5797 16035812 16259824 16588442 16716572 16834556 17173859 17373474 17559393 17788117 18028364
5788 18028364 18202233 18417224 18567311 18810680 19228181 19483382 19711750 20137366 20369433
5779 20369433 20535003 20888877 21148140 21364840 21706404 22098280 22341872 22727112 23008674
5770 23008674 23288741 23568852 23944303 24254471 24411776 24808939 25069065 25470499 25879913
5761 25879913 26211234 26521693 26802094 27128146 27553610 27827241 28175992 28473306 28728720
5752 28728720 29129435 29524586 29895856 30152019 30489378 30992755 31451140 31838751 32208887
5743 32208887 32613844 32929473 33282602 33698112 34122247 34423712 34870734 35118490 35593503
5734 35593503 36027585 36369952 36602791 36984214 37408760 37688587 38001457 38358073 38645138
5725 38645138 38902424 39220618 39504457 39827049 40171860 40525453 40648785 40845813 41092866
5716 41092866 41445465 41641466 41816561 42037953 42162016 42176973 42394043 42577072 42744367 42885027
5706 42885027 42997635 43150517 43139132 43142779 43171490 43104821 43219620 43230461 43116459 43230945
5696 43230945 43085321 42924938 42779221 42587154 42405330 42281115 42050873 41936764 41789324
5687 41789324 41394632 41287286 41125266 40871858 40632966 40254562 39949984 39752554 39463796
5678 39463796 39114070 38753672 38433077 38127376 37706819 37426982 37125081 36671522 36387021
5669 36387021 36089568 35682981 35284121 34916758 34571280 34204367 33783833 33378598 32959703
5660 32959703 32562984 32177070 31844402 31491957 31195942 30819299 30401840 30060139 29671319
5651 29671319 29344512 28967774 28648219 28216670 27901530 27602826 27291402 26981577 26608360
5642 26608360 26227766 25899801 25618359 25297072 24973734 24604697 24346208 23969974 23623564
5633 23623564 23356355 23155262 22904987 22722117 22340005 22098737 21860623 21537852 21232898
5624 21232898 20927557 20599064 20330383 20055115 19976546 19730027 19341122 19243780 19053932 18834006
5614 18834006 18703815 18483809 18337497 18138484 17909618 17677044 17463034 17293162 17168007
5605 17168007 17040994 16781150 16473608 16275078 16049110 15871628 15761352 15656812 15356146
5596 15356146 15150360 14995860 14791189 14703805 14526530 14416122 14165634 14110624 13862972 13755795
5586 13755795 13718418 13511535 13478963 13307377 13194881 13181896 13055530 12882944 12707127 12548022
5576 12548022 12373093 12390691 12240777 12033096 11802565 11640172 11569135 11538503 11521366 11336583
5566 11336583 11218316 11084591 10951543 10977189 10882676 10769144 10735886 10786016 10658880 10589201
5556 10589201 10534996 10429397 10491527 10396089 10300989 10250376 10151630 10158201 10088833 9905412 9897728
5545 9897728 9754912 9635510 9609076 9401051 9290959 9225927 9176276 9027699 9010058 8978818
5535 8978818 8923499 8882799 8902265 8789933 8717963 8763857 8815239 8849288 8788778 8874366 8846177
5524 8846177 8844257 8918036 8970314 8993432 8907246 8931245 8945820 8862772 8774536 8752155 8778806 8780836
5512 8780836 8784107 8728867 8962141 8966298 8878278 8962565 9074077 9121673 9137296 9265211 9348637
5501 9348637 9313916 9383436 9431449 9337995 9426298 9503206 9376137 9282870 9264569 9203926 9187252
5490 9187252 9125402 8997030 8930844 8905679 8715154 8804941 8855540 8814409 9015587 8932518 8893157
5479 8893157 8946189 9062055 9220894 9319135 9401478 9447890 9449066 9539318 9493089 9491308 9490198 9374278
5467 9374278 9269223 9161694 9263023 9250383 9127813 9087442 8952927 8795677 8708585 8628829
5457 8628829 8465676 8382701 8290918 8169515 8122898 8144591 8143952 8148923 8157124 8076614 8102554 8040163
5445 8040163 8149275 8222322 8230089 8151776 8052771 8117807 8235018 8218947 8114747 8135254 8026192
5434 8026192 8006977 7967819 7862152 7691382 7639496 7666267 7592155 7536583 7427390 7415628 7525225
5423 7525225 7609752 7528698 7578106 7580689 7513820 7635191 7713812 7583422 7646375 7861989 7877761
5412 7877761 7925384 7972626 8151885 8374127 8444574 8484081 8517929 8519768 8602805 8715767 8654795
5401 8654795 8899335 9014391 9166074 9223072 9342487 9517389 9569153 9751506 9962088 10269838
5391 10269838 10490800 10705518 11005991 11273717 11525970 11799629 12113252 12536676 12927228
5382 12927228 13363674 13813945 14133303 14572891 15068928 15621147 16268169 16724535 17510812
5373 17510812 18347451 19142537 20141167 21189097 22371378 23723606 25131933 26692097 28280149
5364 28280149 30056498 31634712 33245991 34839452 36174971 37119904 37707698 37694980 37294858
5355 37294858 36486164 35579290 34573588 33744591 33185588 32656824 32279386 32077007 32283429
5346 32283429 32827856 33482599 34317472 35469445 36827401 38452089 40138099 42049305 44297640
5337 44297640 46791974 49311792 51898370 54361038 56669587 58630556 60133117 61036715
5329 61036715 61123354 60257602 58739313 56575667 53857684 50850099 47906793 45062716 42225896
5320 42225896 39750772 37669585 35919169 34475272 33231078 32426602 31895098 31527702 31446549
5311 31446549 31490937 31694383 32074947 32643239 33276586 33941346 34854227 35691812 36372893 36807109
5301 36807109 36930338 36746816 35927475 34601053 32883550 30883890 28690712 26539019 24659611
5292 24659611 22911399 21343015 19767485 18525549 17366665 16270720 15450001 14661591
5284 14661591 13951657 13299504 12767443 12212979 11772140 11292480 10879140 10537969 10146040
5275 10146040 9811145 9457155 9162496 8962685 8715630 8376431 8148259 8018886 7943253 7763253
5265 7763253 7507756 7355109 7338261 7216145 6960386 6811400 6663520 6723972 6754308 6699850
5255 6699850 6556101 6451277 6189179 6094025 6098999 5987337 5877659 5899577 5815005 5664716
5245 5664716 5589151 5538460 5566695 5442439 5380617 5186025 5173454 5036045 4906005 4909960 4934195
5234 4934195 4784023 4838316 4816895 4724344 4641733 4720189 4695328 4702442 4725128 4666460 4635363
5223 4635363 4586184 4552775 4605585 4766467 4670885 4643606 4497292 4575648 4728336 4609924 4585379
5212 4585379 4507660 4438979 4364766 4470324 4384978 4292436 4407827 4542993 4534484 4428896 4330160
5201 4330160 4391707 4383420 4373425 4413708 4383087 4467224 4428438 4390406 4417251 4337173 4276974 4240428
5189 4240428 4177489 4099483 4129097 4172595 4135707 4245925 4154388 4088744 4019777 4082067 4097598
5178 4097598 4104038 4029456 4047945 3940115 3836539 3945619 3877403 3948300 4034939 4012463 3997302
5167 3997302 3879877 3882558 3867735 3888346 3958012 3893663 3775059 3847348 3870015 3946669 3842960
5156 3842960 3791789 3742257 3801927 3858408 3881059 3815707 3863422 3912865 3942595 3980567 3973836 3926871
5144 3926871 4026669 4079082 4100233 4091007 4187087 4353075 4367437 4242747 4194213 4398610 4370657
5133 4370657 4365423 4531841 4577530 4617567 4625742 4699610 4693352 4730333 4660108 4614137 4699900 4640494
5121 4640494 4622395 4594025 4718493 4769491 4722764 4841895 4874488 4945404 4949472 4866318 4943862
5110 4943862 4989091 5093272 5158765 5236195 5314406 5391034 5547193 5682910 5808537 5876074 5910815
5099 5910815 6165828 6304962 6611181 6777166 7045337 7471909 7943274 8226076 8538940 8740748
5089 8740748 9007561 9280769 9513246 9744227 9922815 9931486 9694011 9441811 9344650 9423834
5079 9423834 9463263 9567827 9735691 9891530 10160072 10511067 10789709 11096623 11652682 12154121
5069 12154121 12585079 12945739 13324612 13611711 13945206 14474540 14831757 14748142 14663402 14435840
5059 14435840 14047035 13680324 13389001 13156194 13003823 12880655 12930446 13025079 13245603 13592011
5049 13592011 13832521 14014566 14130946 14212930 14333422 14435520 14546576 14774577 15123620 15452284
5039 15452284 15680513 15846659 15899336 15892520 15887654 15915085 16065710 16348370 16685772 17251937
5029 17251937 17979213 18646651 19161567 19718944 20032530 20520710 21208237 21996125 22808150
5020 22808150 22880210 22471243 22073810 21710014 21431602 21205756 21179809 21363494 21587561 21937968
5010 21937968 22397981 22908037 23439928 24224736 25104475 26017742 27130040 28211821 29363241
5001 29363241 30825053 32539367 34256296 35968942 37516216 39271267 41340601 43744799
4993 43744799 46375029 49220988 51486457 53699617 56269995 58994056 62090747 66011263
4985 66011263 70479387 75416168 80816460 86499088 92509689 98705774 104843995 110794433
4977 110794433 115927250 120201651 123365632 125078323 125350536 123922501 120967528 116576702
4969 116576702 111414430 105880250 100351779 95069081 90144437 85811384 81953937 78417227
4961 78417227 75435957 73049447 71083041 69477231 68506750 67859497 67638250 67665600 67351437
4952 67351437 66655228 65596718 64591093 63797257 63206444 63053438 63347293 63826395 64423271
4943 64423271 65081128 65954963 67075498 68324155 69869351 71477412 73172866 74875662
4935 74875662 76023022 76773188 77741179 78887318 80284114 81016627 80249389 78066270 74581110
4926 74581110 70376134 66251105 62882628 60128219 57825024 55922611 54282705 52654510
4918 52654510 51161318 49844344 48585649 47557424 46697929 45790653 44964533 43946462 42914612
4909 42914612 41924962 41230644 40556375 39503213 37987040 35836638 33310131 30733390 28346891
4900 28346891 26287060 24554467 23120881 21942787 20958741 19981705 19194479 18561722 17734521
4891 17734521 16941268 16332602 15684742 15121906 14769011 14110016 13636388 13224952 12816676
4882 12816676 12512038 12214659 11863814 11630487 11407336 11167936 11057817 10773988 10500318
4873 10500318 10282577 10144433 10148060 9963936 9799781 9540821 9354470 9167037 9026985 8976682
4863 8976682 8861351 8780962 8678090 8494857 8390693 8266259 8207687 8218647 8114094 8052795
4853 8052795 7904166 7769326 7658110 7586075 7417186 7251883 7272594 7230172 6991475 6793673
4843 6793673 6692103 6537256 6547845 6538005 6554837 6531100 6446042 6539689 6495456 6460667 6481578
4832 6481578 6503992 6428135 6328749 6429779 6380441 6456011 6442534 6389296 6539541 6543559 6517119
4821 6517119 6606733 6682945 6535089 6541719 6626208 6732230 6807603 6819898 6905449 6978010 7032131
4810 7032131 7073415 7364903 7616727 7737322 7959892 8073908 8266663 8580922 8801298 9203301
4800 9203301 9635773 10058981 10540338 11302585 12190581 13367446 14776567 16233626 17111318
4791 17111318 17396808 17774265 18341669 19435907 20926150 22232141 21502054 19159516 17119739
4782 17119739 14976005 12857772 11177593 9871647 8972403 8341761 7712239 7243852 6926869
4773 6926869 6540118 6235098 6085404 5838475 5633374 5610179 5547764 5369336 5279059 5094682
4763 5094682 5187677 5283058 5200857 5128422 5017323 4942863 4817957 4889409 4874777 4774988 4589164
4752 4589164 4575736 4612252 4596129 4439760 4335860 4161498 3974422 3945675 3898552 3825882 3754529
4741 3754529 3768741 3773240 3719574 3722210 3655925 3581599 3556953 3534176 3457085 3566554 3532045 3690914
4729 3690914 3811098 3774639 3748627 3815161 3864802 3844449 3906104 3897465 3970007 4023124 4089611
4718 4089611 4107304 4171391 4167831 3961398 3996911 3960341 3884645 3718567 3716707 3578170 3459402
4707 3459402 3556776 3603546 3697580 3724664 3634104 3674156 3723836 3719991 3619362 3493092 3539689
4696 3539689 3594054 3666901 3594943 3461874 3427483 3445492 3593255 3539644 3433913 3422358 3343939
4685 3343939 3187542 3231714 3271381 3299860 3308668 3188694 3277977 3336943 3216574 3108736 3173100
4674 3173100 3170284 3172890 3196800 3117797 3305475 3355536 3266605 3284379 3310901 3378276 3414648 3461450
4662 3461450 3387097 3454026 3438517 3500860 3468553 3415015 3248398 3281910 3178097 3118695 3062720
4651 3062720 3188652 3244040 3156503 3138167 3211974 3312664 3287850 3274253 3488737 3503765 3415996
4640 3415996 3399329 3416150 3531258 3473604 3410253 3248005 3297654 3454737 3527000 3556966 3568613
4629 3568613 3588311 3596593 3627902 3579389 3424420 3419372 3509339 3369476 3309823 3410238 3422900
4618 3422900 3406295 3432839 3443614 3438018 3389876 3440789 3454812 3436518 3395457 3457159 3450245 3402471
4606 3402471 3306082 3289066 3318609 3396319 3357886 3304691 3292711 3275608 3362390 3404945 3424239
4595 3424239 3426536 3516827 3432434 3328751 3249551 3312517 3357385 3336555 3361058 3439512 3465875
4584 3465875 3427095 3441752 3403923 3550178 3550682 3535005 3635339 3721794 3798202 3788278 3751882 3651306
4572 3651306 3793904 3964013 4022888 4015351 4066955 3925591 3982598 4011120 3978381 3932494 3982378
4561 3982378 4043328 4052363 4034268 4099033 4283969 4198299 4222526 4347840 4325261 4333620 4507362
4550 4507362 4603836 4575475 4627535 4717321 4724347 4989812 4979046 4914174 4912483 4889436 4972375 5118550
4538 5118550 5110656 5177170 5216022 5130199 5163177 5291895 5351055 5448089 5484711 5417202 5643551
4527 5643551 5541594 5561539 5601963 5621788 5699023 5950402 5987788 6055082 6257401 6367232 6427613
4516 6427613 6533438 6656256 6766756 6872069 7046954 7126299 7333700 7547741 7776123 7916456
4506 7916456 7916237 8141902 8395642 8631989 8891598 9107350 9372522 9506654 9644817 10038175
4496 10038175 10459845 10753788 10987113 11220957 11354368 11513486 11652801 11886424 11982154 12084399
4486 12084399 12291902 12414365 12609430 12713576 12985718 13369416 13623943 13974256 14363480
4477 14363480 14672133 14962046 15267756 15664754 15939327 16368918 16800472 17209716 17695587
4468 17695587 18199573 18654331 19220641 19872878 20528313 21252038 21847927 22734334 23548921
4459 23548921 24414443 25528389 26798435 28269540 29746121 31420916 33534213 35877576
4451 35877576 38582250 41762478 45261709 49398403 54251380 59963775 66935799 75678004
4443 75678004 85752143 95518449 103525050 110560773 117526468 126183126 132904387 132411111
4435 132411111 123690866 107263381 89529800 74702140 63938203 56618688 51575467
4428 51575467 47843432 44756556 42178278 40128422 38496685 37293020 36462092 35718968
4420 35718968 35162660 34671870 34203976 34011898 33795686 33714852 33579568 33592846 33761838 33934848
4410 33934848 34138173 34516886 34866136 35349741 36011054 36756541 37487538 38227325 39136661
4401 39136661 40193180 41334915 42517658 43945958 45427837 47249151 49328440 51525409
4393 51525409 54205183 57155887 60523687 64373903 68887948 74050660 80174463 87567981
4385 87567981 96859674 107112721 116314218 125120707 134705675 143954910 152602576 156441494
4377 156441494 154590397 148975781 137170790 122778804 110529281 102171982 97337296 94886925
4369 94886925 93920500 94137940 95154934 96907916 99393943 102421150 105815749 109639156
4361 109639156 113822692 118140105 122712375 127734464 132722799 137910450 143408410 149141559
4353 149141559 154873897 160374098 165413138 169716534 172815636 174814419 175211534 173810177
4345 173810177 170688155 166024086 160121620 153307157 146120741 138967478 131978160 125348359
4337 125348359 119291242 113403017 107650948 101912645 96034887 90157411 84560604 79317112
4329 79317112 74476260 70215039 66689182 63651251 61010618 58749744 56674235 54832067
4321 54832067 53090662 51588620 50403423 49326864 48170436 47018322 46049310 45063600
4313 45063600 44000289 42971476 42006258 41221074 40357049 39439079 38671505 37943464 37172342
4304 37172342 36542702 35810901 35215181 34560713 33904714 33218705 32611287 32058619 31507917
4295 31507917 31080423 30557616 30280834 29933306 29630614 29471528 29327120 29118875 28851144
4286 28851144 28778646 28492887 28051308 27702984 27281409 26850992 26475245 26043827 25632374 25237500
4276 25237500 24916807 24649047 24259164 24212354 23892698 23720693 23741525 23641277 23674149 23635158
4266 23635158 23612947 23569660 23544799 23635400 23675043 23741611 23792227 23862152 23916911 24041995 24200372
4255 24200372 24349074 24430758 24668736 24826701 24978810 25438265 25811069 26286104 26943927 27669411
4245 27669411 28347052 29198281 30168133 31315033 32600255 33887853 35193454 36745768 38274534
4236 38274534 39704519 41009678 42064632 42925144 43405497 43467876 43163077 42489550 41654898
4227 41654898 40786159 40080350 39538697 38991807 38814410 38740775 38902286 39406282 40004469 40959237
4217 40959237 42041993 43361125 44826509 46667610 48547699 50610076 52961012 55379238
4209 55379238 57861828 60367654 62904179 65247298 66959781 68082951 68532057 67975489
4201 67975489 66591161 64414544 61751987 58889424 56021692 53162282 50734218 48595073
4193 48595073 46823231 45265067 44135967 43163449 42517511 42057542 41654633 41540641 41871064
4184 41871064 42227978 42681530 43484942 44278666 45150226 46199871 47237075 48342764 49104534
4175 49104534 49491916 49474956 49082269 48247051 46878014 45030153 43284819 41414134 39507659
4166 39507659 37960030 36625714 35561706 34652752 33888216 33428120 32941868 32493936 32317776
4157 32317776 32196206 32076562 31480521 30627708 29716902 28990934 28605524 28322820 28021017
4148 28021017 27845664 27740607 27759245 27983811 28149856 28344423 28632223 28880832 29243605 29779299
4138 29779299 30429628 31064812 31838798 32735887 33701688 34626491 35665614 36970783 38415792
4129 38415792 39928461 41597610 43319034 45260134 47300755 49760845 52486657 55487358
4121 55487358 58939205 62820348 67240725 72071907 77484343 83634335 90408249 97929459
4113 97929459 106494864 116236210 127095305 139188687 152496698 166270154 179454684
4106 179454684 191070423 200973889 208844140 213318973 211673960 201840414 185415957 166564188
4098 166564188 148547152 132922589 119958478 109218438 100269480 92351270 85466051
4091 85466051 79364645 74012892 69277812 65260871 61633052 58633917 55859440 53324355
4083 53324355 51189063 49282398 47401492 45713118 43989862 42458323 40913856 39388068
4075 39388068 38157393 36845082 35724891 34646428 33719774 32663837 31578753 30704611
4067 30704611 29791207 28982598 28168271 27267545 26445876 25714698 25125841 24451537 23920685
4058 23920685 23437585 23012940 22538494 22133480 21735863 21383734 20857746 20491249 20415461 20045859
4048 20045859 19746561 19511638 19277889 19052011 18832717 18599246 18409253 18190840 17931623
4039 17931623 17598215 17251053 16952379 16598942 16348707 16153372 15820781 15454353 15167348
4030 15167348 14804253 14525092 14282656 14115216 13804491 13566377 13497721 13357290 13158060 12975732
4020 12975732 12836955 12880424 12777786 12743369 12684845 12629095 12451190 12302959 12059876 11857643
4010 11857643 11647560 11308717 11062243 10960688 10899001 10725404 10644997 10539287 10472016 10565814
4000 10565814 10641078 10770296 10744941 10740863 10756393 10863691 11016209 10985901 11130527 11374702
3990 11374702 11547778 11730543 11979071 12170949 12372468 12679303 13024503 13444488 13914344
3981 13914344 14244285 14621364 14916826 15229050 15665588 16199076 16817553 17315003 17337986 17541722
3971 17541722 17969253 18319544 18719722 19383538 20268240 21436916 22730174 24285963 26031516
3962 26031516 27944508 29858049 31687650 33251132 34438168 35018480 34681340 33254459
3954 33254459 31052457 28509378 25934222 23968891 22362071 21305773 20426488 19817034
3946 19817034 19418735 19163043 19048699 18995390 18863999 18816786 18558143 18288494 17987708 17624847
3936 17624847 17238719 16662037 16206292 15656142 15179163 14735317 14232573 13817498 13397487
3927 13397487 12921437 12540057 12226595 11887742 11551022 11297006 11031269 10892469 10826849 10640456
3917 10640456 10417362 10280842 10140629 10123649 10075848 9994834 9872572 9843962 9881551 10018976
3907 10018976 10074573 10037090 9982315 9935378 10065929 10035618 10061973 10066194 10189881 10398750 10525243
3896 10525243 10671098 10715073 10741575 10940863 11014666 11110886 11135743 11187884 11240015 11258548 11104846
3885 11104846 11196840 11191599 11233877 11234707 11276648 11446633 11604481 11759615 11851277 12151828 12166651
3874 12166651 12276444 12387604 12551668 12550562 12609488 12564167 12714459 12789632 12867861 13048679
3864 13048679 13169444 13275481 13499588 13659213 13993208 14235197 14519919 15105491 15511600
3855 15511600 15819172 16359346 16992924 17768518 18508810 19175148 19906145 20694520 21524146
3846 21524146 22144686 22483371 22808826 23058723 23313132 23600930 23991294 24692911 25627793
3837 25627793 26660644 27921682 29215261 30256432 31158942 31894721 31980683 31059677 29284694
3828 29284694 27340447 25649814 24138964 23211842 22330361 21734965 21352123 21080996 20899800
3819 20899800 20651008 20555556 20507802 20575071 20720907 20857094 20996775 21078846 21433133 21713053
3809 21713053 22015799 22347403 22639160 23046916 23403923 23778099 24175380 24583645 25092643
3800 25092643 25459697 25867944 26391383 27069560 27731102 28396200 29291127 30279995 31022663
3791 31022663 32071693 33119716 33981661 34965812 35941408 37007959 38104337 39302162 40409787
3782 40409787 41577015 42800874 44105440 45412798 46716249 47950458 49179428 50277181
3774 50277181 51256489 52182732 52817057 53562365 54354001 54966627 55635248 56313890 56974018
3765 56974018 57431060 57789051 57969476 57841703 57552695 57123293 56607043 55941980 55302577
3756 55302577 54635535 54076653 53405958 52688986 51897832 50973951 50151168 48993200 47745312
3747 47745312 46417896 45050906 43694881 42366932 41222762 40082982 38969493 37738986
3739 37738986 36597803 35676457 34786387 33899581 33037596 32228227 31433413 30710665 30204255
3730 30204255 29752129 29304457 28842246 28455356 28248227 28054352 27858883 27638946 27533822
3721 27533822 27636487 27486781 27377578 27237822 27161539 26981426 26830428 26657189 26472178 26390496
3711 26390496 26162191 26114567 26163454 26346124 26569309 26982746 27277922 27671960 28253010 28919094
3701 28919094 29701847 30568256 31387166 32361013 33404329 34523939 35660224 36707163 37847079
3692 37847079 38762813 39579651 40182987 40628855 40857896 40831225 40600567 40040777 39443461 38718864
3682 38718864 37931035 37426269 36870026 36355276 36004576 35929763 35942331 36106010 36416363 36835241
3672 36835241 37508541 38268956 39127931 40043508 41083085 42178265 43210309 44257694 45356586
3663 45356586 46205221 46980387 47499333 47668060 47508520 47063801 46228033 44957675 43713390
3654 43713390 42327086 40808656 39345152 37886689 36651177 35502666 34533970 33638286
3646 33638286 32955105 32267169 31920789 31739309 31579421 31584795 31647100 31975322 32195429 32228144
3636 32228144 32603833 32952547 33241976 33340104 33278190 33217943 32757301 32274131 31466504 30615481
3626 30615481 29490369 28213724 27054228 25828336 24565871 23303595 22319104 21421693
3618 21421693 20629354 19885207 19181666 18476244 17948277 17601006 17312479 17005228 16675056
3609 16675056 16494515 16354224 16230114 16029361 15895681 15803409 15516401 15305955 15046828 14731295
3599 14731295 14334429 14037087 13669602 13178837 12674819 12166003 11755977 11428350 11018301
3590 11018301 10702044 10497036 10105654 9949850 9748048 9524988 9421111 9255217 9162821 8909505
3580 8909505 8724077 8562227 8386753 8246631 8266262 8177534 7956631 7954204 7916404 7863612 7661855
3569 7661855 7468900 7380747 7351860 7295325 7194714 7145141 7298788 7310310 7320449 7256084 7274174
3558 7274174 7099448 7038669 7125211 7224451 7135623 7129453 7001663 6941546 6954785 6832165 6826381
3547 6826381 6880589 7012131 6896861 6752443 6834259 6785371 6815423 6818111 6816742 6949151 6877861
3536 6877861 6928994 6813282 6811172 6971433 6900222 6802240 6793727 6845913 6831613 6872394 6921818
3525 6921818 6913344 6881236 6943207 6900414 6847711 6999830 6892837 6814565 6869613 6781449 6849422
3514 6849422 6831269 6836153 6845434 6768499 6846693 6808275 6765915 6784099 6971462 6842618 6798752
3503 6798752 6801299 6877218 6840148 6778062 6810752 6825112 6896895 6859388 6797128 6906413 6929305
3492 6929305 6829485 6860866 6890682 7020834 6904426 6783996 6926714 7155525 7183238 7133663
3482 7133663 7213166 7177459 7298164 7420328 7338505 7324118 7527555 7595440 7666041 7840384 7944156
3471 7944156 8031489 8093240 8220684 8332365 8509378 8548151 8598941 8737343 8800961 8793752 8877498
3460 8877498 9013857 9160934 9134791 9106490 9272867 9372830 9429766 9628049 9841780 9915352
3450 9915352 10133068 10347744 10392219 10587219 10844520 10920961 11033956 11122668 11204681 11180830
3440 11180830 11095917 11030034 10967490 10988223 10934895 11054820 11200148 11248723 11278388 11515875 11686316
3429 11686316 11813173 12152932 12237210 12502446 12737768 13035374 13165252 13287283 13437516 13651025
3419 13651025 13687196 13639696 13510721 13460089 13453620 13284955 13253395 13318093 13386532 13455329 13656111
3408 13656111 13718205 13998867 14149064 14364678 14880630 15224957 15463958 15705647 15972370 16324869
3398 16324869 16609355 16857225 16990065 17217953 17400981 17425259 17457015 17565030 17785608 17822711
3388 17822711 18134617 18443271 18668732 18942638 19288349 19515418 19758403 20211812 20389470
3379 20389470 20764098 21247817 21754851 22244064 22746920 23187181 23764366 24252300 24689077
3370 24689077 25311673 25850998 26280288 26818223 27385052 27903823 28349351 29033175 29685905
3361 29685905 30468590 31257479 32147475 33164341 34225609 35435460 36682593 38107250 39704881
3352 39704881 41549536 43419001 45569883 47916893 50157447 52229685 54382936 56606694
3344 56606694 58750179 60982610 62788715 63868423 64657443 65153480 65787383 66591059 67623393
3335 67623393 69109481 70882746 72839730 74766254 76609474 78203570 79793240 81326644
3327 81326644 83074409 85313523 87608639 89913661 91877611 93839664 96030941 98510838
3319 98510838 100958780 102208054 101595732 99631085 97021545 94786422 93337841 92961989
3311 92961989 93330231 94196837 95540895 97133690 98890948 100722659 102487380 103952344
3303 103952344 105267253 106331022 107218584 108005161 108772874 109324698 110195008 111303658 112351492
3294 112351492 113120916 113527292 113633977 113706516 114122710 114878637 115685499 116508557 117573484
3285 117573484 118564631 119224906 119707320 119858987 119626510 119013778 117986637 116609411 115051633
3276 115051633 113377269 111474176 109755273 108111541 106499671 104935165 103394248 101645143
3268 101645143 99626191 97240176 94374256 90928488 87232708 83344704 79292518 75169799
3260 75169799 71048247 67125280 63473552 60247191 57299503 54713951 52465536 50380969
3252 50380969 48488653 46840042 45288930 43955151 42739846 41661268 40648478 39603736
3244 39603736 38711443 37851197 37061572 36453326 35746092 35210474 34778580 34377157 33937479
3235 33937479 33498436 33239036 32913716 32639913 32391841 32044684 31781564 31616568 31394659
3226 31394659 31147617 30987154 30820293 30631892 30454897 30351994 30248532 30195839 30214110 30178305
3216 30178305 30095327 30048210 30076218 30144617 30264135 30311636 30483698 30662694 30839609 31149776
3206 31149776 31460489 31752611 32264538 32745331 33060801 33386994 34025038 34622556 35302104
3197 35302104 35990529 36678797 37400937 38031750 38765525 39618186 40476816 41352685 42317849
3188 42317849 43391884 44548527 45730204 47006519 48315192 49680565 51017779 52443661
3180 52443661 53660405 54842071 55800458 56728214 57482073 58086598 58524901 58965829 59453722
3171 59453722 59864688 60403860 60957025 61646849 62460813 63277308 64089184 64969711 65828579
3162 65828579 66856381 67711128 68511867 69290135 69972091 70500925 70930946 71384956 71803731
3153 71803731 72265404 72952385 73714035 74725674 75907926 77229049 78934429 81052109 83325893
3144 83325893 85863539 88627594 91770767 95361807 99234376 103362877 107755818 112420811
3136 112420811 117267154 122268687 127244717 132286338 137026565 141652842 146024738 150254563
3128 150254563 154066902 157699934 161360672 165264958 169397527 173693960 178398192 183650306
3120 183650306 189415054 195850021 202718259 209926367 217477935 224826406 231965752 238733328
3112 238733328 244796328 249858455 254205046 257594113 260019210 261592763 262750020 263146664
3104 263146664 263322525 263575159 264015904 264683734 265623500 267110981 268916488 271105511 273772956
3095 273772956 276725590 279755513 283277971 287064079 290844150 294456315 297996692 301227509
3087 301227509 304045733 306264045 307823912 308601244 308854565 308742225 308281270 307583173 306852786
3078 306852786 306004212 304940673 303564709 301523425 298563073 294447256 289288058 282844326
3070 282844326 275556054 267490282 258663014 249467321 240090446 230664789 221230877 211739784
3062 211739784 202305180 192964942 183636361 174403501 165370628 156835526 148738415 141416080
3054 141416080 134622645 128286762 122672296 117436013 112513786 108022315 103877311 100115696
3046 100115696 96476967 92914881 89682085 86616746 83755869 81144096 78846858 76589857
3038 76589857 74713205 73082259 71422920 69646058 68054392 66914525 66076228 65013670
3030 65013670 63071899 60973433 58859911 56892706 55295925 54085885 53069573 52167901
3022 52167901 51412069 50610546 50012002 49446454 48880977 48525148 48114260 47763972 47685714 47684611
3012 47684611 47808199 48233199 48892815 49746568 50359180 50482499 50378605 50828793 51721717
3003 51721717 52763805 52717249 51072915 49147067 47160375 45517127 44532487 43963580 43457575
2994 43457575 43083798 42855983 42801115 42670443 42647484 42718440 42580885 42594887 42768547 42800768
2984 42800768 42843028 43049985 43477723 44048936 44808877 45257204 45545806 46024367 46611714 47482720
2974 47482720 48416781 48753540 48396971 47988990 47813740 47858393 48275331 48916274 49796835 50754284
2964 50754284 51819352 53057033 54184356 55485679 56697937 57904857 59103961 60447626
2956 60447626 61929447 63372537 65057792 66984077 69052370 71303724 74024857 76952894
2948 76952894 80082142 83500203 87265948 91332772 95685369 100174673 104707308 109254333
2940 109254333 113627118 117714041 121582043 124800188 127510894 129738417 131173575 132192716
2932 132192716 132439513 132082866 131337566 130081874 128337688 126287582 123876308 121276018
2924 121276018 118531169 115506008 112198308 108809184 105155832 101188111 97104607 92716864
2916 92716864 88184098 83524480 78725424 74160805 69736836 65509497 61472915 57901324
2908 57901324 54611132 51583832 48949321 46660719 44634013 42790810 41237443 39633429
2900 39633429 38234634 37002737 35696490 34370769 33182335 32028795 30933951 29955422
2892 29955422 29021614 28215384 27420732 26727059 26145388 25698434 25307502 24872070 24475720
2883 24475720 24118876 23771772 23547688 23069409 22736156 22447670 22081015 21795555 21416721
2874 21416721 21101135 20678438 20313304 20092865 19705346 19348144 19153375 18907881 18624504
2865 18624504 18411468 18164514 17903244 17687483 17218920 16973782 16674722 16433442 16218494
2856 16218494 15953207 15860653 15567360 15159942 15024798 14880808 14740261 14640665 14432483 14339006
2846 14339006 14300420 14067358 14031239 13939189 13859585 13769009 13655442 13570140 13565386 13574174 13451550
2835 13451550 13319878 13330437 13406080 13319478 13367808 13367314 13478802 13654808 13603045 13757610 13869844
2824 13869844 13986321 14202875 14370603 14461147 14713370 14909876 14969548 15206074 15403544 15663151
2814 15663151 15857915 16069213 16304073 16632175 16786605 17016156 17237833 17472059 17641988
2805 17641988 17792160 18018759 18321009 18540143 18740627 18892169 19080255 19224080 19494312
2796 19494312 19787371 20131147 20653150 20988536 21348986 21827822 22324857 22721266 23144252
2787 23144252 23595186 24200979 24711430 25214284 25724903 26358214 27108080 27862365 28546847
2778 28546847 29259637 30094504 30931363 31826513 32678719 33607901 34573029 35612478 36593264
2769 36593264 37437172 38264828 39317670 40228627 41354896 42525642 43626710 44875542 46139165
2760 46139165 47402299 48778689 50252683 51862876 53682566 55508394 57483109 59559609
2752 59559609 61872193 64444191 67050362 69747842 72569815 75369258 78162538 81147769
2744 81147769 84117896 86787919 89394424 91823970 94275555 96994441 100128630 103635103
2736 103635103 107517436 111984886 116896749 122471649 128607214 135344779 142594935 150146193
2728 150146193 158196402 166763008 175615363 184763274 194182991 203607387 213636184 224885006
2720 224885006 237968979 252803778 269646806 288889109 310777151 335032038 361599717
2713 361599717 389978092 418393926 444621051 467155107 484284424 492776220 488412881
2706 488412881 470255353 443618846 416044510 392792713 376231077 365621853 358755768
2699 358755768 353400125 349025730 345357019 340864152 331908556 315073593 290936998 263082476
2691 263082476 235942124 212159726 192173226 175616972 161975216 150227564 140063725
2684 140063725 131235098 123535957 116619028 110371987 104652637 99278566 94213501 89576997
2676 89576997 85201351 81236015 77663098 74300817 71107272 67969830 65018236 62360844
2668 62360844 60003063 57690392 55420621 53319586 51497077 49857869 48286426 46797388
2660 46797388 45267600 43810144 42546903 41240254 39981774 38793605 37812959 36759371
2652 36759371 35765771 34902134 34055481 33264623 32451397 31670457 30798093 29914585 28966703
2643 28966703 28067930 27299003 26606676 25922673 25173017 24569740 23977775 23442909 22911958
2634 22911958 22390321 21755462 21097665 20407010 19594119 18950893 18305960 17708073 17115232
2625 17115232 16519093 16110926 15644906 15029895 14627079 14223131 13723847 13262336 12851896
2616 12851896 12355187 12045357 11763141 11545343 11260986 10986229 10727180 10636951 10485518 10323496
2606 10323496 10069617 9796895 9524530 9334891 9220765 9142758 8916776 8736762 8698042 8550816
2596 8550816 8301100 8117094 8172155 8007115 7826439 7793004 7757966 7638669 7513011 7369961
2586 7369961 7293010 7114241 6916235 6839420 6816289 6670975 6627456 6546886 6371567 6405508 6377157
2575 6377157 6286946 6009550 5868327 5761953 5705364 5701334 5612578 5404444 5406584 5366025 5329545
2564 5329545 5231694 5177639 5138837 4959983 5022755 4910507 4697602 4572489 4479962 4472625 4376586
2553 4376586 4316771 4190877 4002410 3937922 3814178 3729965 3718566 3635633 3519074 3348501
2543 3348501 3171168 3212347 3162187 3146287 3077099 3016159 2867093 2915432 2749552 2630132 2523010
2532 2523010 2440110 2348694 2284845 2232970 2254403 2170006 2241869 2186380 2211549 2121538 1964867
2521 1964867 1930824 1779369 1778328 1768115 1680257 1721149 1728909 1585748 1608050 1495367 1439063
2510 1439063 1422670 1411654 1411115 1312855 1250357 1279943 1298060 1264414 1213772 1234315 1180571 1125592
2498 1125592 1239717 1278284 1236190 1024270 1036639 1074383 1119897 1117436 1197843 1243060 1243147 1253602
2486 1253602 1141143 1315340 1387098 1416936 1358149 1441352 1330767 1329919 1354100 1427552 1427038 1482728
2474 1482728 1484694 1602919 1602636 1531814 1634421 1702242 1740878 1883699 1946903 1901209 2098185
2463 2098185 2148557 2234044 2337826 2340393 2333806 2468342 2693160 2928783 2929157 2966345 3010280
2452 3010280 3051357 3018694 2954597 2868781 2678138 2558256 2474036 2337341 2397897 2384746 2268396
2441 2268396 2199648 2233542 2277004 2168619 2149033 1933645 1735225 1654829 1571953 1563940 1473544
2430 1473544 1353536 1321451 1279891 1225992 1123996 1125271 984370 992451 906837 878300 1012030
2419 1012030 907144 886934 840697 778632 814089 754605 801584 834977 779688 719294 727998
2408 727998 629600 467145 547703 635407 705426 674321 594716 630383 702560 731167 631428
2397 631428 514390 470633 513524 502203 627399 587872 544565 560715 517234 542876 527294
2386 527294 381434 403300 371699 277157 297408 350916 361008 358617 343000 365404 359737 277486
2374 277486 358163 331295 281156 297632 325729 285695 229697 319554 258557 301236 247615 210982
2362 210982 240026 131480 146915 188833 187480 100846 111407 231622 262962 163654 118195
2351 118195 83278 96184 125113 29312 34556 182589 114518 20459 -68759 8195 82712 148011
2339 148011 34323 -82652 -41182 4321 15975 33246 73892 117738 76160 99117 107796
2328 107796 60278 53263 76047 25159 117252 40256 84874 30400 39926 53367 97661 24933
2316 24933 -29852 101332 81126 151717 90632 78285 165546 151504 65414 10346 32509 87690
2304 87690 189941 143566 85585 57116 146588 167155 127883 77752 157234 255497 201880 79422
2292 79422 130046 168627 -79268 -21184 66405 37022 99075 77088 127194 192978 136002 174072
2280 174072 119567 264127 190645 193448 264107 333958 280252 267483 241044 114338 103677
2269 103677 80962 115451 132951 52757 131406 68394 30451 15435 -41698 -39045 6865 15898
2257 15898 5074 81125 72866 51621 15574 78883 -24135 -15344 2608 5422 1039 51608
2245 51608 128790 -24890 63124 23125 -5886 35453 -18034 -38240 36563 5327 7561 75335
2233 75335 27883 65111 -156198 -147763 -77347 -80212 -59267 59864 -26992 25887 94194 43183
2221 43183 97832 7755 41486 32892 628 -8810 3383 -6168 13977 11686 65037 43735 -8067
2208 -8067 -64381 131 5515 44127 -80119 -82372 -88923 539 35472 121737 65036 -97646
2196 -97646 -122449 -106344 -57287 -94566 -71872 3577 14847 85007 24494 -26533 -65282 -38002
2184 -38002 -41124 -30720 34497 -77991 55275 -2365 -96683 -139013 -46135 -44057 35381 -50927
2172 -50927 -41016 1805 106691 25738 -15788 -12169 -39626 129467 47376 8664 -60807 -40831
2160 -40831 33094 -56768 -90002 -60572 -43460 -4822 -116183 -27854 -49019 -139543 -128414 -41193
2148 -41193 39906 -25861 50957 29638 49517 -29317 85999 195321 66418 55903 141932
2137 141932 176778 103367 144768 222419 106542 145441 145524 127182 101670 96172 200079 159205
2125 159205 152505 118181 110804 87985 168909 182073 188377 28282 113839 178778 119901 77826
2113 77826 124082 183476 124838 199953 243368 209687 93005 189855 257928 295325 309174 401606
2101 401606 391054 458541 432989 475474 588490 611162 655181 686075 718126 748280 711494
2090 711494 649341 660381 822226 815760 687262 681736 763653 853163 892069 784127 746953
2079 746953 890373 901333 953251 922567 958773 1035286 1171180 1187064 1197086 1224644 1256693
2068 1256693 1432132 1526973 1659807 1787437 1709188 1820879 1956477 2002558 2232951 2343061
2058 2343061 2522990 2728865 2976299 3133737 3523278 3832079 4209986 4675519 5080196 5559597
2048 5559597 6115910 6874721 7610376 8172140 9000966 10120990 11527204 13180143 15347923
2039 15347923 18059374 21617182 24091467 25135093 27224932 30376416 30212396 24673064
2031 24673064 18702447 14165632 11327884 9556871 8345110 7361901 6599315 5888663 5266464
2022 5266464 5037448 4656265 4501384 4259684 3743255 3409633 3148828 2967974 2839059 2638626
2012 2638626 2456977 2368064 2183133 2089025 1947945 1860820 1701610 1663067 1784548 1618321
2002 1618321 1476622 1483373 1423203 1344117 1186472 1120194 985649 1002506 954191 898266 913575
1991 913575 837453 774915 642521 666685 735272 613514 686820 585352 489252 410857 382452
1980 382452 409846 436686 439840 472857 486094 425797 387843 292204 418471 551215 505023
1969 505023 369775 367062 262364 308059 316880 227317 198925 96834 168348 243455 158854
1958 158854 210996 207792 277989 263017 176517 102889 104399 106916 126205 158864 98273 117210
1946 117210 71907 -55106 31398 98085 -32308 -91367 -86075 16712 32313 -106678 -82149
1935 -82149 -53441 -40469 -12854 74898 41286 -76836 -44781 -52558 -52755 -68626 12359 13429
1923 13429 -4547 18532 -49044 -30871 -115686 44217 20125 -106107 -126189 -29183 -33165 24179
1911 24179 80256 12180 -3554 -47140 75725 -57954 -140692 -70664 -157169 -82531 -158161
1900 -158161 -260803 -192243 -177337 -113636 -192931 -197476 -149735 -113282 -102775 -55155 -35749 -69388
1888 -69388 -36444 -114622 -70636 -159409 -147945 -88374 -84843 -211051 -156954 -164251 -153927 -78653
1876 -78653 -158087 -171800 -152309 -61769 -108284 -183094 -80250 -148204 -125046 -103728 31224
1865 31224 37188 -71231 -138352 -107573 -70278 -142839 -142404 -122787 -131055 -176347 -181929 -126023 -126660
1852 -126660 -151304 -118599 -87767 -179839 -218917 -113483 -283995 -224189 -199012 -155027 -168046
1841 -168046 -159181 -270532 -153803 -211179 -179510 -155612 -242080 -246038 -188246 -103465 -68032 -243096
1829 -243096 -176916 -147392 -149621 -129639 -6859 -76726 -217982 -63940 86 2098 -53244
1818 -53244 -105763 -142104 -51083 -129867 -150588 -86676 -127411 -139851 -195172 -235461 -206091 -148439
1806 -148439 -199991 -186123 -239758 -160500 -113560 -166241 -134699 -17895 -35980 -163517 14324
1795 14324 -38892 -53068 -157301 -28437 -64049 -84498 -140404 -140481 -207441 -175943 -106969 -60729
1783 -60729 32748 -16606 -137191 -204756 -145729 -127012 -44678 -124076 -159453 -199739 -259624 -189755
1771 -189755 -268394 -271629 -307821 -198010 -170917 -140525 -145189 -221974 -151500 -104967 -104234 -137593
1759 -137593 -93186 -24438 59902 -107947 -169954 -59390 -10390 -45928 -123308 -164674 -187579
1748 -187579 -275370 -218198 -198146 -191128 -259901 -131218 -164197 -168529 -185060 -163571 -139858 -127154
1736 -127154 -115846 -108180 -94487 -52221 -37534 -62663 -192762 -177009 -73550 -106005 -84291
1725 -84291 -153007 -152157 -136046 -134746 -232408 -230196 -278534 -204982 -144637 -159099 -79953 -160374 -163226
1712 -163226 -96957 -154483 -223033 -219334 -138606 -171023 -134226 -115991 -50677 -71925 -271086 -297379
1700 -297379 -177232 -78394 -156869 -193690 -248052 -273210 -226802 -274070 -223213 -179468 -126564
1689 -126564 -72073 -184531 -104104 -146396 -246460 -139739 -164166 -194909 -80732 -32234 -130210
1678 -130210 -122602 -127065 -73377 -119379 -101218 -136383 -125709 -167646 -135423 -145845 -80459 -98358
1666 -98358 -155212 -161056 -208116 -146227 -166750 -240502 -220371 -176069 -98828 -158497 -237830 -301369
1654 -301369 -331783 -238876 -231228 -278587 -170471 -179288 -216069 -283985 -201951 -182798 -221164 -256569
1642 -256569 -204243 -131714 -229072 -143550 -142479 -78310 -113554 -64014 -46218 -139658 -108396 -144541
1630 -144541 -78557 -44518 -63159 37225 28938 -84652 -155770 -95058 -134746 -206813 -241991
1619 -241991 -161120 -182216 -122833 -66754 -120682 -196899 -173396 -236807 -137414 -71625 -28534 -24007
1607 -24007 -17969 59847 57171 -46198 -32407 -104431 -210939 -253829 -135352 -143035 -163506 -128081
1595 -128081 -58321 -86550 -127560 -118594 -104257 -67400 -222066 -183158 -188739 -225171 -207412 -221064
1583 -221064 -215015 -104222 -132334 -147216 -206658 -180743 -133577 -113362 -92060 -89860 -140420 -102011
1571 -102011 -124329 -153842 -187628 -108173 -122878 -97444 -89429 -214949 -148827 -142516 -208009 -184567
1559 -184567 -163485 -145943 -47414 -84863 -66466 -97340 -259373 -204324 -125871 -91308 -15059
1548 -15059 -109621 -125209 -205304 -219488 -187098 -176056 -189850 -161593 -120011 -143483 -145240 -142818
1536 -142818 -139951 -132309 -171529 -183839 -141335 -107017 -118477 -174712 -148207 -32719 -99406 -131285
1524 -131285 -71987 -162273 -221377 -161839 -72960 -154205 -176303 -229110 -243168 -69286 -60339 -240823
1512 -240823 -284774 -219103 -166926 -170119 -95624 -30608 -159047 -167808 -179763 -126976 -102911 -99359
1500 -99359 -40199 -58335 -18917 37572 -54678 -127582 -149891 -201781 -177753 -230324 -235737 -134641
1488 -134641 -154696 -184343 -120728 -140856 -118386 -141040 -157881 -98029 -94095 -40649 78453 16141
1476 16141 -112004 -5235 31328 14001 -70286 -52410 -54216 -98614 -160482 -128806 -56362 -124607
1464 -124607 -147020 -215532 -142168 -285464 -159946 -61856 -97346 -62597 -60544 -203039 -102884
1453 -102884 -82597 -156150 -229178 -215891 -57054 -110391 -66226 -60352 -120327 -226806 -214049
1442 -214049 -53762 -66918 -96011 -59227 47200 -14908 29820 -69915 -133751 -66907 -25375
1431 -25375 1591 -57121 -59198 -118315 -102819 -68729 -82436 -33622 -198392 -222911 -100454 -86856
1419 -86856 28975 -108465 -143450 -183540 -167838 -203868 -143107 -88174 -188777 -212853 -108729
1408 -108729 -66248 -80861 -79226 -18169 -117602 -74156 -69559 7936 -33063 4978 6318 -50391
1396 -50391 -30574 -72742 -64324 -11198 -50133 -156866 -58186 -26225 -154081 -162189 -103542 -93607
1384 -93607 -115430 -40567 -77651 -102591 -106877 -61743 -855 -25737 17512 54384 20443 -75955
1372 -75955 -69924 -111202 -108176 -96336 -139333 -168030 -78917 -176458 -149832 -237156 -216757 -151942
1360 -151942 -140277 -78490 -51666 -118925 -30554 -3456 -74574 -228849 -152802 -56977 -9150
1349 -9150 -11112 -67995 -74249 68189 -26381 -133895 18502 28049 37605 -64748 -122165 -297240
1337 -297240 -211637 -221428 -229302 -137012 -143241 -143172 -160077 -218627 -91117 -261966 -244313 -149198
1325 -149198 -147068 -115582 -161250 -152922 -118348 -52559 -178107 -177465 -136888 -218533 -19043 -7162
1313 -7162 1646 38784 -22986 -96415 -93726 -73208 -119351 -50359 -152695 -90401 -126039 -65537
1301 -65537 -23676 -290 -106451 -201979 -112185 -96823 -76550 35715 19985 -53790 -28752
1290 -28752 -139173 -32388 31282 -75477 -72439 -138589 -218247 -106945 -40404 -128434 -77831
1279 -77831 -98996 -220475 -72625 -4176 -135100 -142716 -79392 -61338 -101681 -108996 -142788 -117815
1267 -117815 -10768 -55124 -87456 -3878 52863 100741 -47639 -132481 -72555 -137287 -106421
1256 -106421 -104354 -106414 -49062 -31118 -44416 60749 50422 17983 -78431 -30385 -128352 -48657
1244 -48657 79098 28409 -9505 -9655 -12016 -142668 -80157 -92621 16535 -50750 -161884 -114410
1232 -114410 -128853 -142135 -25818 -94309 -105253 -6770 3405 -4228 -59394 -103770 -42271 -39335
1220 -39335 -78118 -17578 -103099 -104238 -42735 -647 -41460 -82058 -89797 -209768 -127601 -59754
1208 -59754 -123628 -154885 -147276 -144564 16471 -110296 -170373 -157677 -183217 -186838 -140547 -81808
1196 -81808 -57098 -39280 -89551 15389 143092 66155 3979 -17502 -110889 -94542 -34158
1185 -34158 -64434 -36661 -13471 -12253 -129647 -222692 -60680 -45986 -99069 -92107 -21370 -49041
1173 -49041 -84490 -53695 25006 50100 -20212 -114953 -227852 -130391 -135050 -117722 -118053 -247173
1161 -247173 -185949 -51655 -119237 -170225 -85174 -198539 -81770 -70402 -175679 -118216 8368
1150 8368 92918 52097 22754 -64756 -34782 -125667 -36457 43638 -35922 49100 8413 -65470
1138 -65470 -211905 -139431 -76621 -6694 24251 -102092 -78566 28081 -25637 -78260 -111822
1127 -111822 -101491 -81477 -132591 -128360 -129906 -29238 -3907 -141542 -49789 30601 -44008 -69539
1115 -69539 -78989 -38165 -102398 -53368 -67941 -20853 -44285 -125028 -155455 -109545 -62779 -118845
1103 -118845 -76463 -105265 -68952 -48834 67278 -37651 -94637 -38226 28451 147177 93001
1092 93001 34174 36668 -53341 -53795 -49438 -108826 -120199 -521 -64534 -46833 -29654 13941
1080 13941 -78881 -116759 -170759 -139642 -2595 -56961 -101646 -49160 -52023 44743 -39752 -78992
1068 -78992 -76290 -71720 -95950 -163605 -61766 -144708 -76844 -48926 35587 -32173 57681 -30628
1056 -30628 2638 -20595 -31903 41413 -46427 -69431 -51800 3751 66303 11416 -82766 36375
1044 36375 -35943 -122446 -112130 -68740 -124060 -17398 -12264 4433 62578 6443 96132 449
1032 449 -22939 -10006 -56059 -54677 21912 41528 31652 32237 21388 -14938 -2552 -20338 9534
1019 9534 45945 83823 102416 -103 -148539 -42675 26666 -50366 -48413 20401 14539 68677
1007 68677 36016 -87937 -125084 -21767 61205 106388 14426 -32856 -114962 -131155 16809
996 16809 46199 7774 86159 18340 94992 77637 -23953 -26555 -28169 39226 63754 22792
984 22792 58483 752 -76604 -24433 -68798 -37233 33730 -31423 -79688 27865 5831 -23042
972 -23042 -44474 -149231 -95809 -19774 -83591 -87233 -62605 -75125 -84358 33862 47381 43348
960 43348 70093 -17500 28445 83819 -84649 31904 28124 -40294 -52507 6532 13252 85262
948 85262 142097 103552 81165 -44368 -125700 -73588 -105504 -62747 -7206 79027 103945 18231
936 18231 -42710 56621 139205 -2445 2109 14121 -34338 -46161 -16097 -52359 -31252 19760
924 19760 5062 -31898 -4104 -66889 -37150 -65368 10020 60019 -33358 34385 33672 31804 -144281
911 -144281 57903 178903 109905 103880 88279 159883 152530 -42795 -11142 -2229 -57062 94207
899 94207 53451 26029 182959 79221 -64807 90099 180207 77696 70952 27231 -46916
888 -46916 13189 -69285 -84478 7762 57601 53054 -54275 -90028 -63911 3608 -22181 46573
876 46573 112952 48892 43457 61046 -334 -10469 67504 49315 24945 23355 -13212 -29107
864 -29107 -23115 -88091 -86913 3308 -65624 -76138 -5203 85384 147281 52308 62097 39174 -9044
851 -9044 831 87484 21596 -112704 -123395 -112313 13133 18050 -104679 -10650 -6572 -76454
839 -76454 23943 -55681 -56659 119694 54128 77495 43649 -7211 10273 24645 52773 10192
827 10192 -58749 -57917 -77393 -4251 -96687 -124405 -68281 25639 -36259 -47412 -4475 6538
815 6538 -1682 -121947 -41670 -31138 -12538 18825 7728 147566 65921 -24746 -27281 36165
803 36165 5483 13494 -14044 67106 110273 13728 -31335 85828 34510 -76377 16736 24709
791 24709 91426 159874 53086 -7868 57555 -4355 -12074 -4523 64021 6336 -88880 -29512
779 -29512 36144 60886 101492 1126 83759 141103 4296 -58665 44765 126623 213547
768 213547 126001 -9812 17090 72267 125614 83757 -25331 -48283 -29007 15410 42215
757 42215 98823 52732 -11212 -20689 -80042 -18208 -43431 17292 4959 85271 120617 98544
745 98544 109257 -23460 -36210 -78811 -8834 51368 20612 -63903 88851 62019 62114 139057
733 139057 57001 -1534 -1343 -28138 -58206 63247 84446 99753 84591 -11976 75131 148477
721 148477 165778 64582 82284 123977 146433 65432 -48619 -72909 25493 39512 9822
710 9822 -5459 -42813 -8242 -11622 22825 109963 28192 -59338 -43642 -48186 77522 57030
698 57030 116340 29086 74037 150284 75636 91294 94090 -18367 113731 132719 134613 45772
686 45772 -119057 -111709 6378 41414 -21184 25887 -64907 -118006 41143 -36943 -62574 -10113
674 -10113 -26369 43006 27208 69832 203840 214736 48097 -61611 -40742 -7512 -68883
663 -68883 -87883 20336 68807 9181 -3682 991 10687 -70406 -117818 -132196 -77030 -72040
651 -72040 -8860 24426 118618 102190 41381 92321 40437 123515 156950 76380 133266 105957
639 105957 152636 68602 28252 55991 36740 -54862 -50771 35371 134708 142766 88859 124248
627 124248 170945 106313 79690 100325 180209 157517 156473 167288 218478 263990 177636 86793
615 86793 1648 50152 74883 30382 79428 82384 16871 -22956 85761 247394 115053 102452
603 102452 156765 75855 -8513 68166 69442 162763 -16286 -31058 10148 17507 69908 132996
591 132996 44728 141255 162556 140447 100898 21312 -19065 55827 89561 10262 -90483 -65982
579 -65982 -98119 -89303 12450 44586 31069 -62418 -44775 -76199 -52145 28819 60835 25316
567 25316 -65549 47658 104706 105175 226699 189082 90810 20714 -72167 -12304 95336 -2450
555 -2450 34131 84819 70135 -82866 44954 120877 127216 202828 170723 135258 159026 170278
543 170278 197019 122353 99590 103308 99201 67195 56208 109422 68114 169781 112615 29718
531 29718 115049 92166 -36168 -47282 -70525 -89981 28160 19419 86124 24427 65459 62671
519 62671 -13733 39537 87678 77082 99975 44415 98725 138334 155349 244052 120950 79180
507 79180 47620 25601 34718 76304 96361 135567 260097 245750 161900 55210 39612 45546
495 45546 -42685 25639 209509 140487 -18550 -70107 -31488 58948 110566 131833 112381 203925
483 203925 164991 174183 138764 102618 162238 132627 103820 126562 144302 148870 123134 24573
471 24573 -54 82854 158751 158340 124875 116057 51253 17988 46511 -8093 52176 70211 30486
458 30486 145614 204943 70892 125992 26835 -36380 128424 154234 71949 104006 213393
447 213393 123529 57136 57456 85323 158608 118775 115668 75089 -22862 -20613 131035 93864
435 93864 140101 96673 26683 118515 150816 208923 207228 127583 48849 98177 162847 107845
423 107845 47895 84108 55005 76162 22810 72114 58115 24167 41782 142297 211902 113882
411 113882 148160 208447 122898 54992 120869 97777 42769 98812 44119 138348 81327 39171
399 39171 102591 48562 -25000 45459 -1404 67879 78360 170954 174019 62295 67865 72947
387 72947 13796 21780 46581 86989 159872 173504 132402 96951 186123 151377 127214 161162
375 161162 172900 57352 215740 223183 203339 182943 169600 197782 114199 168035 122952 168964
363 168964 168774 104899 107962 129443 135665 171694 230555 233601 109029 96817 140431 108175 112155
350 112155 57508 168611 135066 149851 265575 164504 73026 106851 180693 47780 -5712
339 -5712 37836 -30272 31287 192081 240221 141214 54503 68573 60242 103043 106765 76835
327 76835 109489 104427 179628 191016 127678 96555 166037 204151 152719 135309 142074 146251 134554
314 134554 94999 107642 156125 168113 191186 210573 159508 165489 180514 175886 192428 267168
302 267168 163996 190902 128727 123037 106738 162207 94260 158333 11744 84897 148641 122357
290 122357 156130 143998 138283 203558 319380 156541 112766 148951 223771 173302 211709 302945
278 302945 216313 325345 239339 160777 173673 33637 159450 172562 143394 115536 42796
267 42796 99875 156331 48745 -13379 45712 172606 92080 143188 111458 106643 36424 12660
255 12660 49571 97487 116035 119673 102066 25695 121372 118355 10894 135299 193089 208376
243 208376 97953 216491 228849 64995 200035 282462 215784 212301 78378 115440 92094
232 92094 180059 193330 182482 89480 142511 191382 172469 114109 132414 176935 108102 158213
220 158213 69401 -48252 -52710 13651 -8423 104251 164374 72882 -15199 -6841 27594 88230
208 88230 124867 109420 90394 157093 294685 267000 192454 209819 104346 131009 197873 185140
196 185140 132073 114174 146032 167709 99010 100599 182350 67436 60527 76352 140708 189007
184 189007 100224 81901 -25907 86787 90125 33944 90386 27957 14175 96628 111453 149873
172 149873 114928 89186 36704 88318 -42047 -9547 15902 27137 73083 84055 -52152
161 -52152 -23521 12713 101727 26366 -24780 22425 63845 121765 72656 96060 117018 87387
149 87387 77953 19360 70300 29740 8785 -7165 -22000 -22457 20133 53678 -64637 66924
137 66924 133082 173672 22372 48899 129922 124217 74027 91268 91243 15056 -30776 -53064 -20855
124 -20855 22713 -88405 38893 30255 71033 67565 18153 53912 -42212 -46492 -29682 -34816
112 -34816 2086 -9649 -41710 26054 97127 81454 16394 -6218 -58416 9054 -13345 -87101
100 -87101 -12408 28101 12993 41713 40899 -30214 26724 18241 -37119 -57814 -13294 57189 80216
87 80216 54971 49186 9835 -90431 -151599 -168983 -98481 -25328 -74171 -124943 -195267 -154442
75 -154442 -77575 -72355 -27773 -94742 -104315 -25920 -77320 -79392 -129435 -44527 4739 -73112 -34646
62 -34646 -39427 -96603 -174608 -191267 -251659 -207338 -160349 -136334 -111287 -159343 -147190 -113055
50 -113055 -96598 -167414 -188067 -202145 -222117 -220427 -269476 -229141 -142919 -213465 -233403 -109305
38 -109305 -54794 -195117 -213241 -154160 -115966 -158140 -204538 -194133 -214948 -227609 -216713 -204291
26 -204291 -204664 -237603 -249823 -238569 -233204 -337080 -267578 -180442 -192362 -228185 -227058 -113556
14 -113556 -210262 -142983 -187937 -222558 -300494 -235529 -234490 -217186 -260547 -272268 -244788 -215562
2 -215562 -191741 -267085
0 -267085
$$ Imaginary data points
##PAGE= N=2
##DATA TABLE= (X++(I..I)), XYDATA
16383 -4151377 -4035491 -4015665 -3983045 -3900572 -3924812 -3844362 -3720782 -3700986 -3683569 -3569715 -3488260
16372 -3488260 -3513321 -3404110 -3408517 -3307061 -3266855 -3293481 -3222776 -3156179 -3071479 -2974513 -2961473
16361 -2961473 -2935025 -2887950 -2781819 -2804614 -2818651 -2726070 -2625707 -2555450 -2495981 -2434878 -2385626
16350 -2385626 -2298326 -2244431 -2221586 -2167757 -2153544 -2155940 -2143662 -1999381 -1985708 -2015637 -1891855
16339 -1891855 -1904053 -1880679 -1893235 -1782152 -1741085 -1665922 -1667651 -1559313 -1456066 -1476784 -1348899
16328 -1348899 -1233729 -1265021 -1170266 -1123129 -1095031 -1090662 -1022111 -1009878 -970722 -904293 -820711
16317 -820711 -698359 -767761 -739475 -706980 -746008 -633232 -575563 -576191 -495544 -413561 -407381 -441958
16305 -441958 -354167 -329999 -277465 -277731 -236743 -171845 -138410 -64147 -74444 -53245 108135 171942
16293 171942 193217 147066 215030 301834 312386 311309 392236 468690 450023 460155 489826 491078
16281 491078 634805 675179 655413 665341 767491 866570 874329 818916 880910 984089 1031427
16270 1031427 1039601 1097935 1160477 1151196 1240271 1260357 1282188 1301775 1233698 1261663 1317943 1367277
16258 1367277 1371136 1474948 1454099 1447780 1430390 1540961 1654801 1573849 1638389 1720608 1720978
16247 1720978 1732861 1793320 1722748 1849597 1829798 1886091 1910576 1894513 1974604 2059686 2021046
16236 2021046 2007463 1944524 2000036 1990644 2065676 2146094 2025324 2172099 2217632 2233801 2258100
16225 2258100 2314624 2391494 2482174 2488928 2428589 2463479 2475674 2423574 2482523 2489247 2478502 2591084
16213 2591084 2640096 2641685 2603161 2687195 2581482 2660581 2761240 2682180 2637855 2623604 2740324
16202 2740324 2775336 2709109 2765158 2890250 2829886 2833813 2833429 2863710 2979855 2833039 2884044
16191 2884044 2939901 2952229 2964649 3025284 3122939 2997782 2968409 3059255 3044194 3068794 3169485
16180 3169485 3138056 3115065 3077953 3097912 3063388 3044803 3069759 3070532 3172331 3270537 3259568
16169 3259568 3248980 3198308 3126331 3075077 3237646 3340928 3327400 3349656 3386743 3314106 3343590
16158 3343590 3286501 3287219 3245449 3361671 3364362 3365302 3430950 3474946 3451619 3393408 3542073 3530656
16146 3530656 3438118 3450426 3477327 3532905 3662467 3632541 3589365 3504301 3514630 3601567 3567862
16135 3567862 3609587 3600530 3618641 3622661 3584549 3698690 3728474 3803282 3626494 3651142 3728023
16124 3728023 3721470 3655023 3685717 3670820 3642485 3677455 3694250 3841303 3739157 3654982 3811694
16113 3811694 3792873 3778932 3784888 3813013 3838334 3868680 3842416 3787406 3822717 3807846 3720004
16102 3720004 3684273 3811091 3808748 3711677 3652265 3667275 3794151 3815556 3717163 3760977 3789632
16091 3789632 3791277 3766758 3803415 3801396 3761262 3859957 3823500 3791503 3816927 3810556 3900908 3895083
16079 3895083 3903001 3824766 3849484 3874007 3777690 3678091 3782462 3975602 3824485 3823479 3970471
16068 3970471 3980837 4021580 3935088 3840023 3879727 3847921 3830242 3800103 3836573 3818627 3865184
16057 3865184 3780896 3829194 3869978 3821304 3772393 3762727 3812945 3877518 3805382 3808358 3836554 3698762
16045 3698762 3667886 3794886 3852308 3873848 3938537 3776304 3836479 3909076 3864342 3877165 3881139
16034 3881139 3863434 3817290 3708700 3778321 3809670 3833440 3875370 3946668 3989272 3840787 3937589
16023 3937589 3911522 3914907 3973294 3943826 3856474 3837870 3836096 3692321 3772846 3808084 3936228
16012 3936228 3885049 3864112 3780005 3870112 3960519 3955949 4010097 3953868 3960235 3942697 3935792 4045301
16000 4045301 3997733 3929651 3924694 3879507 3937007 4074055 4010004 3949164 3911685 3951527 4020639
15989 4020639 3953148 3852167 3775768 3780768 3872610 3835645 3902088 3985497 3890246 3880585 3991603
15978 3991603 3968627 4010316 4022881 3970650 3918423 3893125 3895190 3836150 3611763 3735728 3844838
15967 3844838 3812781 3917762 3895772 3939490 3927480 4000640 3947299 4044400 4030390 3915587 4014894
15956 4014894 3904950 3932760 3920621 3877556 3951542 3934196 4012479 3914405 4052055 3887327 3901477
15945 3901477 3968577 4004839 4006743 3935703 3918737 3906945 3888470 3929458 3956713 4020256 3900730
15934 3900730 3861460 3957796 3997194 4014934 3992452 3968487 3976334 3838395 3714516 3824304 3912058
15923 3912058 3874391 3917629 3945400 3995800 4105349 4010205 3990724 3877247 3851182 3943454 4069466
15912 4069466 3999199 4045735 4016479 3997614 3935219 3876752 3912436 3896156 3993461 4075513 4184620
15901 4184620 4121070 4046420 3972769 3991338 4019808 3947451 3969923 4039539 4075574 3988966 3991925
15890 3991925 4012437 3939157 3961591 3957372 4037294 3998664 3978308 3907624 3990237 4069276 4027226
15879 4027226 4038236 4089732 3992691 4013368 4099730 4072168 4066087 3948848 3858368 4027754 3983064
15868 3983064 3901521 3955932 3970856 3950161 4009545 3972598 3944918 3949730 3872074 3882202 3848001
15857 3848001 3961008 3963007 4003881 3977749 3949559 3951821 4006210 3931203 3933067 3955392 4004186 4035833
15845 4035833 4098367 4060229 4027165 4066287 3999834 3898907 3915385 3976749 3900304 3845858 3907347
15834 3907347 4021323 4156400 4108490 4097214 3977926 3949244 3988593 4006989 4067204 4007712 4062750
15823 4062750 4020315 3977049 4164825 3940852 3910842 3995868 4017102 4002993 3944827 4083797 4032238
15812 4032238 3964785 3925145 4008946 4077251 4002180 4008474 3968412 4024739 3971021 3931652 3991959
15801 3991959 4002767 3879412 3808285 3871920 3957253 3967408 3941861 4001920 4017227 4002854 3925298
15790 3925298 3897933 3929019 4078544 4076112 4139563 4056127 4006601 4094661 4025490 3935133 3945647
15779 3945647 3951720 3937311 4010281 3920491 3911394 3975841 4014148 3923147 3967412 3992122 4068950 4011181
15767 4011181 3948360 4057646 3997228 3960587 3956474 3980681 3936687 3952060 4013467 3935220 3974101
15756 3974101 3957367 3917885 3976859 3984959 3982999 4020916 3976402 4077914 4110525 4032383 4028347 4037006
15744 4037006 3992131 3919787 4142499 4014860 3930074 4005265 4041451 4191448 4142902 3914258
15734 3914258 3916449 3934940 3972338 3999397 4120311 4127399 4032967 3989032 3902659 3858210 4020048
15723 4020048 4052179 4087062 3944415 4014284 4052071 4000066 3966416 3923030 3929087 3939277 3998413
15712 3998413 4123125 4101752 4136872 4015637 4012173 3934596 3979598 4019734 3893263 3932414 3976044
15701 3976044 4158094 4119650 4030001 3980406 4000322 4093724 4074288 4062581 4109262 4075975 4063458
15690 4063458 3958408 4043452 4052650 4019610 4046849 3954098 3995687 4065953 4000122 3977875 3991693
15679 3991693 4040699 4099507 4110552 4136753 4176077 4096400 4050284 4110593 3983479 3983341 4056373
15668 4056373 4071156 4132873 4162658 4087928 4141540 4088405 3979158 4060494 4121374 4029600 4026436
15657 4026436 4103191 3999994 3985706 4111439 4135933 3964017 3980185 4058427 4071140 4121814 4172034
15646 4172034 4143570 4147068 4119984 4162912 4056021 4027684 4091251 4203191 4049615 4024531 4079389
15635 4079389 4179586 4100004 4077768 4037938 4040625 4040541 4087051 4026457 4028724 4088366 4025115 4046908
15623 4046908 4164379 4094694 3930049 3928499 3969315 4039822 4047704 3935395 4024038 4114594 4032052
15612 4032052 3955655 4060124 4003935 4092560 4107318 3911414 3933817 3947069 4017856 3975701 4052574
15601 4052574 4012724 4110009 4031773 3975960 4066415 4116893 4159151 4071482 4055949 4107331 4161526
15590 4161526 4192595 4105204 4085234 4252508 4200114 4143899 4056179 4094004 4101729 4089908 4097821
15579 4097821 4087427 3962479 3889454 4069849 3962002 4086062 4074687 4077158 4221274 4148155
15569 4148155 4073821 4132815 4100754 4086802 4157077 4180426 4146083 4131831 4149064 4107130 4084557
15558 4084557 4004338 4025357 4058205 4028708 4022621 3944121 3983435 3990478 4062114 4014148 4124791
15547 4124791 4128108 4116280 4191979 4182150 4133158 4192571 4124695 3993439 4076827 4164106 4140116
15536 4140116 4088063 4111329 4168484 4183423 4121019 4103940 4113932 4140026 4206367 4281985 4237739
15525 4237739 4091955 4219820 4118597 4074296 4039245 4025823 4177860 4145109 3989597 4044108
15515 4044108 4137847 4099253 4039227 3988928 4010728 4061725 4001720 4106519 4196668 4063654 4114791
15504 4114791 4124848 4120838 4189598 4265704 4227803 4134558 4077012 4141719 4085350 4088485 4134843 4084124
15492 4084124 4111260 4222861 4173376 4230358 4235570 4165229 4067206 4136589 4185074 4045260 4034589
15481 4034589 4061448 4099783 4185285 4152820 4100790 4091094 4142386 4150707 4077139 4111096 4156340 4131339
15469 4131339 4014147 4036797 4181765 4156443 4062223 4090034 4105823 4192840 4194516 4123171 3984986
15458 3984986 4110852 4167215 4040981 4133169 4201709 4178359 4161823 4124458 4180759 4252202 4251129
15447 4251129 4155545 4134252 4077893 4100737 4201151 3997237 4092396 4159836 4122920 3985674 4092081
15436 4092081 4217615 4268346 4181419 4067351 4094445 4043651 3954695 4103941 4053106 4034991 4155262
15425 4155262 4264251 4172334 4073390 4114208 4133687 4157723 4191462 4208229 4227349 4151626 4049451
15414 4049451 4159503 4131177 4101348 4152722 4065807 4116620 4176945 4186999 4188920 4084524 4150269
15403 4150269 4110666 4121218 4041483 4185961 4181061 4143998 4201908 4168668 4120572 4178048 4191208
15392 4191208 4142094 4228590 4205661 4195200 4217353 4144379 4140219 4198731 4140780 4131354 4132931 4127420
15380 4127420 4173719 4105367 4135637 4164791 4140592 4124321 4111598 4203696 4209511 4150192 4147757 4151446
15368 4151446 4093319 4059756 4073922 4021388 4090621 4214583 4088875 4129508 4205751 4215518 4137461
15357 4137461 4147763 4302222 4238885 4218489 4270435 4204113 4104367 4112233 4127882 4165220 4298471
15346 4298471 4273742 4127655 4197560 4112454 4049958 4236148 4161491 4104809 4088689 4116871 4133568
15335 4133568 4164134 4125060 4144401 4247753 4247628 4204702 4288316 4241601 4194984 4102302 4205268
15324 4205268 4214446 4096808 4071581 4157721 4235706 4103743 4171573 4164346 4160497 4185240 4146427
15313 4146427 4154884 4228062 4208881 4338534 4288681 4225797 4241955 4275248 4226088 4306183 4264806
15302 4264806 4235930 4352817 4398894 4220761 4290773 4328879 4348288 4338566 4294939 4354557 4263214
15291 4263214 4127719 4039268 4145748 4206122 4254274 4128154 4081386 4132540 4135451 4173643 4220572
15280 4220572 4240119 4261872 4187982 4075418 4019767 4076905 4119613 4092515 4165591 4142125 4144926
15269 4144926 4199189 4236494 4190624 4190970 4259758 4225827 4197551 4354196 4399841 4283244 4306320
15258 4306320 4204181 4213459 4319260 4233211 4262896 4138635 4195485 4182045 4165887 4224982 4193810
15247 4193810 4167675 4179062 4261940 4243775 4332276 4262320 4217309 4212793 4253315 4175119 4071577
15236 4071577 4071609 4021185 4107104 4138229 4254580 4326381 4253936 4114444 4186225 4305760 4293024
15225 4293024 4216564 4150996 4157004 4199663 4285142 4217501 4250928 4196381 4240203 4260887 4283602
15214 4283602 4338542 4417495 4228552 4233044 4296311 4189610 4154418 4194847 4133567 4256642 4307301
15203 4307301 4263151 4254690 4333689 4384681 4286640 4187892 4228573 4215668 4152440 4143675 4161328 4188512
15191 4188512 4285832 4270290 4218873 4299267 4305050 4196201 4176949 4259900 4240508 4207339 4155219
15180 4155219 4232464 4202309 4248069 4361083 4374558 4310621 4168773 4091143 4093621 4127524 4138128
15169 4138128 4184714 4192986 4176340 4281931 4152121 4091485 4090953 4212340 4286756 4248459 4312154
15158 4312154 4212525 4253030 4263695 4135200 4143812 4032527 4089484 4178719 4149879 4131428 4124954
15147 4124954 4190532 4214060 4211758 4262858 4274489 4170881 4047442 4075576 4222728 4379880 4297075
15136 4297075 4244833 4319189 4218759 4185439 4315302 4313341 4317316 4320700 4226939 4328138 4197835
15125 4197835 4155525 4176976 4183689 4329304 4378038 4296396 4296626 4304393 4280813 4300866 4202250 4128084
15113 4128084 4150455 4234734 4295853 4229611 4313107 4299683 4187981 4137878 4170275 4382214 4288122
15102 4288122 4247247 4178074 4152394 4211115 4231152 4186328 4253766 4370259 4342376 4176936 4254667
15091 4254667 4292623 4234784 4234331 4274944 4309413 4301000 4273660 4299882 4314553 4261607 4379220 4370197
15079 4370197 4232127 4130936 4192269 4157247 4217587 4148453 4093160 4164074 4191107 4145392 4229195
15068 4229195 4276333 4222807 4337781 4303847 4260126 4213465 4249328 4260155 4283365 4234315 4202518
15057 4202518 4256197 4324929 4276721 4291775 4187463 4269538 4144763 4222639 4280880 4358110 4285246
15046 4285246 4225194 4317159 4260975 4195457 4195758 4152047 4252917 4285738 4249283 4352460 4280161
15035 4280161 4222430 4205916 4334349 4276616 4286886 4254374 4231371 4072518 4223252 4289860 4308378
15024 4308378 4259617 4305195 4391711 4256340 4358133 4460722 4313040 4304108 4375906 4494628
15014 4494628 4381121 4348323 4297995 4238255 4297784 4349881 4427794 4391095 4292117 4394611 4329551
15003 4329551 4287140 4318563 4325110 4407303 4438699 4195919 4149490 4185016 4318550 4281992 4261611
14992 4261611 4284565 4313986 4337934 4361244 4393806 4281203 4305219 4237442 4266874 4324447 4331646
14981 4331646 4346742 4302111 4326325 4341138 4244257 4319885 4303799 4425854 4441314 4336650 4382285
14970 4382285 4486955 4427758 4371764 4340599 4285891 4285090 4269158 4371309 4414848 4343745 4266677
14959 4266677 4332756 4287097 4323264 4334715 4364975 4344614 4253316 4299362 4389482 4377863 4377052 4393941
14947 4393941 4415349 4386177 4381671 4358937 4364369 4438527 4326504 4308891 4276057 4247655 4342097
14936 4342097 4401812 4365408 4367825 4219743 4331162 4319201 4392160 4280061 4241075 4355303 4423118
14925 4423118 4305744 4340046 4335102 4350247 4397439 4403648 4348859 4409286 4304183 4279296 4302759
14914 4302759 4312790 4315904 4300464 4353445 4337537 4373963 4341909 4355982 4403464 4443285 4427098
14903 4427098 4391526 4347492 4403554 4475447 4400470 4344817 4358722 4305945 4442292 4389812 4298190
14892 4298190 4318854 4337001 4232519 4359724 4330368 4398144 4366009 4360878 4385027 4381662 4391767
14881 4391767 4339756 4364720 4313245 4427845 4429789 4327008 4358980 4438943 4432844 4441221 4359649
14870 4359649 4328335 4478148 4353595 4268384 4235438 4318478 4452919 4431095 4325135 4248077
14860 4248077 4270766 4292583 4355190 4387972 4306148 4229065 4285338 4391713 4475509 4416359 4427430
14849 4427430 4425471 4447921 4364076 4373858 4381615 4416516 4410601 4416930 4468509 4347423 4267041 4387333
14837 4387333 4428049 4402844 4398796 4380292 4362748 4429062 4355514 4395108 4419016 4345682 4359730
14826 4359730 4301727 4316260 4392964 4540894 4446671 4382720 4421714 4453054 4377721 4355479 4391396
14815 4391396 4362595 4368967 4420202 4400328 4565923 4566052 4551963 4468329 4405298 4386758 4366495 4442022
14803 4442022 4395424 4355375 4427782 4332707 4367146 4422124 4431804 4412243 4449219 4518483 4479710
14792 4479710 4511696 4439122 4304904 4391793 4381993 4422350 4470117 4456302 4431610 4467621 4474984
14781 4474984 4419061 4401842 4329817 4340006 4329645 4407334 4415850 4389201 4426005 4454703 4387354
14770 4387354 4458228 4457173 4448010 4510829 4422313 4265479 4300593 4323844 4317817 4427016 4450164
14759 4450164 4466573 4464830 4392591 4358027 4369483 4490748 4463643 4438210 4348394 4344288 4457851
14748 4457851 4489015 4494951 4430442 4409532 4361656 4408755 4426350 4357768 4376976 4320896 4354812
14737 4354812 4410226 4328006 4340173 4372097 4472249 4418932 4436019 4441409 4414454 4548031 4468210
14726 4468210 4463533 4578746 4434474 4355265 4390838 4289494 4385175 4485978 4525514 4458464 4531957
14715 4531957 4420024 4397416 4493377 4439507 4306562 4353606 4404729 4444156 4416408 4406739 4364864
14704 4364864 4351397 4436104 4375453 4462219 4475700 4455463 4423640 4434458 4475254 4475595 4464880 4458993
14692 4458993 4428665 4478351 4542278 4439902 4476802 4400453 4364654 4418837 4309397 4328464 4402797
14681 4402797 4346212 4304470 4378392 4476571 4339847 4278004 4294989 4349581 4477853 4306358 4253035
14670 4253035 4358984 4421437 4367187 4320272 4299073 4398029 4415268 4434742 4467344 4444032 4376386
14659 4376386 4435796 4466489 4436704 4525164 4515301 4367266 4450070 4571758 4541813 4544184 4481416
14648 4481416 4509187 4517056 4410791 4403179 4382008 4400263 4337821 4400860 4348120 4313634 4468634
14637 4468634 4486211 4432220 4482355 4584543 4485278 4418046 4491851 4570038 4632901 4475977 4454569
14626 4454569 4506979 4528728 4460984 4309415 4451940 4541653 4456187 4466137 4468485 4472990 4483968
14615 4483968 4499256 4446605 4520697 4587028 4561328 4556562 4506426 4570165 4502552 4419997 4439552
14604 4439552 4411819 4480800 4472857 4364028 4342705 4302958 4375557 4402020 4447486 4448680 4546577
14593 4546577 4558672 4512134 4421910 4448201 4478638 4474937 4608418 4578273 4407948 4465235 4450536
14582 4450536 4373121 4405614 4493103 4559686 4502341 4450794 4432941 4547490 4566259 4475975 4465876
14571 4465876 4412185 4373051 4372198 4587319 4561964 4551810 4558476 4466866 4455995 4471619 4535242 4518160
14559 4518160 4451677 4422873 4489091 4499526 4428272 4480469 4483908 4450537 4547918 4532591 4493379
14548 4493379 4554500 4450685 4442019 4547042 4483329 4527678 4433179 4535023 4483444 4592878 4659491
14537 4659491 4656621 4655507 4548175 4459418 4496001 4448863 4521154 4556658 4532407 4526649 4558575 4442507
14525 4442507 4427077 4375754 4380244 4468621 4447543 4557913 4453034 4430931 4450571 4465309 4494225
14514 4494225 4462458 4444387 4397292 4414411 4481567 4406651 4422200 4445599 4518915 4520538 4570846
14503 4570846 4491068 4476238 4507490 4575451 4554063 4453262 4540056 4414953 4454072 4460380 4476464
14492 4476464 4588383 4478564 4465052 4401399 4431211 4474670 4484224 4504147 4568707 4566670 4506898
14481 4506898 4537733 4524185 4436867 4447189 4395977 4559166 4553856 4438602 4569391 4588455 4584145
14470 4584145 4599657 4492929 4520845 4449731 4409161 4469557 4470449 4502105 4491062 4449314 4622254
14459 4622254 4630059 4494218 4514997 4534425 4488247 4463702 4558481 4572621 4637199 4558912 4527097
14448 4527097 4600993 4575634 4565714 4559762 4553251 4680704 4695849 4563631 4542073 4497490 4582684
14437 4582684 4492073 4387111 4537676 4681126 4540563 4611905 4589465 4517384 4568438 4570174 4564939
14426 4564939 4499409 4574812 4585568 4679880 4661543 4551298 4480253 4496357 4454881 4480015 4441263
14415 4441263 4376740 4432341 4509063 4514650 4528764 4601793 4595703 4648001 4676143 4595203 4593225 4659874
14403 4659874 4643196 4578585 4576090 4463217 4563914 4575207 4586405 4566820 4620542 4659347 4619467
14392 4619467 4518479 4456826 4508500 4598601 4572124 4509401 4637912 4611771 4563630 4568451 4541659
14381 4541659 4562257 4506507 4502312 4548734 4625764 4678069 4592497 4505295 4462130 4477752 4542774
14370 4542774 4561233 4566680 4663983 4675968 4592546 4651120 4521633 4530437 4673941 4681943 4510096
14359 4510096 4414963 4454239 4539620 4596978 4624295 4649182 4559198 4523528 4559201 4630845 4663416
14348 4663416 4730608 4765398 4586712 4585100 4639977 4672345 4616588 4486949 4581305 4676832 4613247
14337 4613247 4635086 4674760 4597956 4594381 4644434 4636683 4505496 4492157 4601894 4649646 4651003
14326 4651003 4639510 4516999 4562174 4542893 4453813 4526580 4634507 4647065 4552280 4686000 4734379
14315 4734379 4635048 4762768 4690160 4600251 4520622 4560039 4565625 4566824 4593324 4551256 4583278
14304 4583278 4603219 4563628 4643491 4611874 4813916 4745855 4677447 4652062 4656965 4584544 4560336
14293 4560336 4680025 4787843 4661943 4580440 4681670 4636296 4551362 4596823 4650284 4544900
14283 4544900 4563302 4592585 4539521 4590729 4652801 4632274 4637995 4606672 4610904 4604563 4706087 4671300
14271 4671300 4740919 4687568 4590637 4570044 4484809 4659874 4577893 4508854 4531721 4474009 4604558
14260 4604558 4661570 4659265 4682190 4590174 4578559 4602645 4567318 4561571 4622572 4723337 4726870 4720435
14248 4720435 4663152 4638982 4712850 4737346 4748143 4731030 4706222 4750258 4540291 4511986 4817248
14237 4817248 4819696 4653337 4597847 4585291 4515081 4532049 4597691 4669432 4685983 4655724 4575916
14226 4575916 4588743 4732072 4583175 4619828 4549812 4638422 4682986 4656071 4614337 4616978 4613938
14215 4613938 4712656 4774773 4628210 4568768 4642392 4657504 4613092 4570285 4549675 4563075 4613327
14204 4613327 4733851 4707988 4678808 4594982 4543128 4544050 4675378 4687508 4610514 4642007 4716075
14193 4716075 4730822 4733237 4794367 4674267 4645693 4656949 4618960 4659413 4696871 4619726 4642091
14182 4642091 4654813 4641351 4648075 4617235 4579340 4644862 4570163 4560372 4542730 4578108 4554699 4696741
14170 4696741 4728615 4724383 4730630 4828943 4745003 4669074 4672203 4722267 4694001 4636276 4754623 4790498
14158 4790498 4785865 4767151 4813128 4723966 4724682 4697771 4741919 4740468 4744976 4715800 4728157 4730260
14146 4730260 4762734 4628305 4691063 4620212 4616856 4612161 4567870 4671620 4735863 4732758 4856463
14135 4856463 4684762 4600362 4691554 4685681 4600218 4712308 4718892 4709689 4745699 4613184 4637470
14124 4637470 4610125 4542150 4746911 4751948 4667284 4696145 4723050 4593923 4686446 4719696 4696080
14113 4696080 4756720 4706359 4852738 4767098 4699074 4727028 4694385 4709757 4755249 4635937 4641829
14102 4641829 4701018 4727619 4737019 4673458 4706639 4821715 4675365 4679686 4680155 4735742 4778199 4770377
14090 4770377 4690762 4690733 4805154 4768749 4657541 4624408 4689351 4634405 4697575 4885634 4781328
14079 4781328 4723272 4774077 4679604 4730737 4672729 4733149 4675215 4685592 4711181 4806381 4795617
14068 4795617 4684615 4653675 4670972 4637715 4767754 4822892 4707420 4714559 4681142 4731232 4639839
14057 4639839 4681624 4776965 4827274 4790320 4734687 4756794 4673084 4752823 4731315 4726052 4836943
14046 4836943 4865347 4758334 4812565 4766042 4746107 4873405 4815400 4796615 4661548 4745892 4652362
14035 4652362 4689668 4701884 4683480 4833636 4774669 4810600 4736619 4686226 4707991 4858212 4833121
14024 4833121 4687427 4703118 4730341 4676800 4548646 4552832 4625549 4804728 4805123 4761322 4693104
14013 4693104 4746279 4775717 4769814 4865486 4904725 4781292 4746835 4750896 4846655 4851404 4872079 4807376
14001 4807376 4848615 4834761 4807698 4690675 4797619 4829858 4750787 4811526 4780876 4721021 4701821
13990 4701821 4672485 4590504 4661395 4686645 4678622 4739030 4727952 4686686 4690389 4702593 4725091 4801976
13978 4801976 4835905 4814382 4786236 4845966 4817494 4818337 4820096 4909135 4909000 4844105 4690460 4644695
13966 4644695 4682577 4711781 4766789 4802820 4881265 4779568 4794667 4832411 4855481 4771451 4728023
13955 4728023 4634279 4760329 4848591 4902875 4895127 4874459 4849381 4784860 4747833 4777805 4779338
13944 4779338 4917859 4896369 4806208 4718635 4816482 4874281 4871116 4802310 4814191 4860329 4825170
13933 4825170 4697728 4753753 4789316 4827560 4758188 4780746 4763278 4716073 4846110 4839169 4782281
13922 4782281 4922970 4902653 4798486 4813138 4759503 4709523 4830398 4868228 4876777 4912103 4874209
13911 4874209 4858975 4805426 4779952 4766835 4775784 4890302 4903871 4766956 4712712 4732302 4852451
13900 4852451 4743220 4789408 4776677 4682564 4790866 4881471 4757695 4818962 4782855 4761086 4704828
13889 4704828 4856570 4920370 4827586 4811227 4864186 4918778 4890501 4867798 4830227 4829152 4791052
13878 4791052 4686494 4630369 4771249 4860377 4919602 4822651 4819554 4825405 4773487 4880094 4790632
13867 4790632 4793270 4937763 4905789 4804983 4853029 4788913 4797624 4788926 4754690 4796360 4848172
13856 4848172 4805173 4787137 4862527 4936313 4935150 4790533 4860815 4871417 4906404 4787061 4815462
13845 4815462 4748799 4697146 4800512 4881882 4940642 4833754 4845596 4694223 4737407 4790439 4836996
13834 4836996 4828390 4827289 4852589 4892064 4887695 4811652 4851137 4841874 4842177 4758631 4760087 4689908 4603284
13821 4603284 4643453 4915208 4970977 4885870 4806569 4897281 4967084 4930550 4860611 4738406 4798661
13810 4798661 4820386 4766067 4777820 4890680 4925769 4953895 4928301 4950592 4748601 4774718 4873856
13799 4873856 4869572 4975406 4957068 4866045 4915007 4909663 4914047 4864415 4924349 4912638 4906397 4869322
13787 4869322 4819335 4847656 4896665 4843589 4855419 4923532 4921477 4869416 4864129 4834982 4811190 4898781
13775 4898781 4858791 4757804 4851109 4916913 4937151 4954450 4947723 4991249 4880482 4914403 4886103
13764 4886103 4925872 4786250 4795099 4912198 4950146 4801198 4879330 4912784 4876969 4911806 4821203
13753 4821203 4726614 4791945 4855743 4819742 4827049 4960025 4887726 4835911 4923026 4909111 4835764
13742 4835764 4905121 4925753 4975565 4944709 4953700 5000653 4899321 4813586 4842837 4912323 4908703
13731 4908703 4900067 4838720 4959283 4972631 4863820 4910555 5031371 4892104 4891938 4939098 4872387
13720 4872387 4920456 4988475 4902014 4839775 4892477 4969226 4925037 4904607 5009625 5031054 4970056
13709 4970056 4989832 5042299 5078478 4980895 4914035 4950032 5026541 4988306 5043160 5024756 4899887
13698 4899887 4842910 4921186 4894814 4915777 4969287 4963892 4892548 4780399 4947943 4992908 4971691
13687 4971691 5042666 4974445 4954826 4972899 4944036 5012278 4919470 4907668 4940092 4870673 4914585
13676 4914585 4986285 4920427 4966634 4986208 4915743 4928842 4909200 4887574 4957290 5076821 5065929
13665 5065929 5034059 4978753 4887803 4962419 5021519 4906250 4880849 4902223 4797464 4856178 4963743
13654 4963743 4888438 4852810 4893568 4931131 5073987 5037009 4980031 4944614 4915927 4965465 4968624
$$ [...]
##END NTUPLES=NMR SPECTRUM
##END=
