##TITLE=1H_CG-1148-B1
 CDCl3, 8 sc, 
 4.06.2021
##JCAMPDX= 6.0         $$ Bruker NMR JCAMP-DX V2.0
##DATA TYPE= NMR SPECTRUM
##DATA CLASS= NTUPLES
##ORIGIN= UXNMR, Bruker Analytische Messtechnik GmbH
##OWNER= root
$$ XWIN-NMR		Version 3.5
$$ Fri Jun  4 13:05:05 2021 Russian Standard Time (UT+4h)  she@DPX200
##.OBSERVE FREQUENCY= 200.131506
##.OBSERVE NUCLEUS= ^1H
##.ACQUISITION MODE= SIMULTANEOUS
##.ACQUISITION SCHEME= undefined
##.AVERAGES= 8
##.DIGITISER RES= 18
##SPECTROMETER/DATA SYSTEM= spect
##.PULSE SEQUENCE= zg30
##.SOLVENT NAME= CD3CN
##.SHIFT REFERENCE= (INTERNAL, CD3CN, 0, 17.5167)
##AUDIT TRAIL= $$ (NUMBER, WHEN, WHO, WHERE, WHAT)
$$ ##TITLE= Audit trail, XWIN-NMR		Version 3.5
$$ ##JCAMPDX= 5.01
$$ ##ORIGIN= Bruker BioSpin GmbH
$$ ##OWNER= she
$$ F:/spectra/data/she/nmr/H-F/1/pdata/1/auditp.txt
$$ ##AUDIT TRAIL=  $$ (NUMBER, WHEN, WHO, WHERE, WHAT)
(   1,<2021-06-04 13:03:13.78 +0400>,<she>,<DPX200>,
      <created by zg, POWCHK disabled, PULCHK disabled
       configuration hash MD5:
       00 E9 B6 7A A2 85 ED C7 34 08 36 98 17 FE 4E 26
       data hash MD5: 16K
       55 4D 09 15 98 B0 B2 B6 1E 95 48 03 51 9A 66 C6>)
(   2,<2021-06-04 13:03:16.21 +0400>,<she>,<DPX200>,
      <Start of raw data processing
       efp BC_mod = 2 LB = 0.24 FT_mod = 6 PKNL = 1 PHC0 = -11128.66 PHC1 = 23.00101 SI = 16K 
       data hash MD5: 16K
       AB E5 5F DC 11 6C AF 2A 06 97 5B C4 02 1D 6D 4A>)
(   3,<2021-06-04 13:03:33.31 +0400>,<she>,<DPX200>,
      <pk PHC0 = 1.347976 PHC1 = -2.4 
       data hash MD5: 16K
       25 D0 3C CF B4 3E C5 7F F4 5D B4 67 9C 10 3A 71>)
(   4,<2021-06-04 13:03:36.81 +0400>,<she>,<DPX200>,
      <abs ABSG = 5 
       data hash MD5: 16K
       ED B0 89 3A CB 40 35 6B E7 0B C5 01 20 EC 27 61>)
(   5,<2021-06-04 13:04:06.81 +0400>,<she>,<DPX200>,
      <pk PHC0 = 8.338838 PHC1 = -11.2 
       data hash MD5: 16K
       B5 46 F6 C4 97 42 55 5E 5A 23 B4 6D 53 BB 72 91>)
(   6,<2021-06-04 13:04:09.57 +0400>,<she>,<DPX200>,
      <abs ABSG = 5 
       data hash MD5: 16K
       1F 4F 9B 2F 9F 39 58 48 80 03 6F 4A F1 67 BC 9E>)
$$ ##END=
$$ 
$$ hash MD5
$$ AE BC 62 E4 3A 18 83 E0 E7 D7 76 38 51 28 9A 6B
##$RELAX= 
##$RELAX= 
##$RELAX= 
##$RELAX= 
##$RELAX= 
##$RELAX= 
$$ Bruker specific parameters
$$ --------------------------
##$DU= <F:/spectra>
##$EXPNO= 1
##$NAME= <H-F>
##$PROCNO= 1
##$TYPE= <nmr>
##$USER= <she>
##$AMP= (0..31)
100 100 100 100 100 100 100 100 100 100 100 100 100 100 100 100 100 100 
100 100 100 100 100 100 100 100 100 100 100 100 100 100 
##$AQSEQ= 0
##$AQ_mod= 1
##$AUNM= <au_zg>
##$AUTOPOS= <>
##$BF1= 200.13
##$BF2= 200.13
##$BF3= 200.13
##$BF4= 200.13
##$BF5= 200.13
##$BF6= 200.13
##$BF7= 200.13
##$BF8= 200.13
##$BYTORDA= 1
##$CFDGTYP= 0
##$CFRGTYP= 5
##$CHEMSTR= <none>
##$CNST= (0..31)
1 1 145 1 1 1 1 1 1 1 1 1 1 1 1 1 1 1 1 1 1 1 1 1 1 1 1 1 1 1 1 1 
##$CPDPRG= <>
##$CPDPRG1= <>
##$CPDPRG2= <>
##$CPDPRG3= <>
##$CPDPRG4= <mlev>
##$CPDPRG5= <mlev>
##$CPDPRG6= <mlev>
##$CPDPRG7= <mlev>
##$CPDPRG8= <mlev>
$$ [...]
##$SUBNAM3= <"">
##$SUBNAM4= <"">
##$SUBNAM5= <"">
##$SUBNAM6= <"">
##$SUBNAM7= <"">
##$SUBNAM8= <"">
##$SUBNAM9= <"">
##$SW= 20.0188882624521
##$SWIBOX= (0..15)
0 0 2 0 0 0 0 0 0 0 0 0 0 0 0 0 
##$SW_h= 4006.41025641026
##$TD= 16384
##$TD0= 1
##$TE= 0
##$TE2= 300
##$TE3= 300
##$TEG= 300
##$TL= (0..7)
0 120 120 120 120 120 120 120 
##$TP= (0..7)
150 150 150 150 150 150 150 150 
##$TP07= 0
##$TPNAME0= <>
##$TPNAME1= <>
##$TPNAME2= <>
##$TPNAME3= <>
##$TPNAME4= <>
##$TPNAME5= <>
##$TPNAME6= <>
##$TPNAME7= <>
##$TPOAL= (0..7)
0.5 0.5 0.5 0.5 0.5 0.5 0.5 0.5 
##$TPOFFS= (0..7)
0 0 0 0 0 0 0 0 
##$TUNHIN= 0
##$TUNHOUT= 0
##$TUNXOUT= 0
##$USERA1= <user>
##$USERA2= <user>
##$USERA3= <user>
##$USERA4= <user>
##$USERA5= <user>
##$V9= 5
##$VALIST= <valist>
##$VCLIST= <CCCCCCCCCCCCCCC>
##$VD= 0
##$VDLIST= <DDDDDDDDDDDDDDD>
##$VPLIST= <PPPPPPPPPPPPPPP>
##$VTLIST= <TTTTTTTTTTTTTTT>
##$WBST= 1024
##$WBSW= 4
##$XGAIN= (0..3)
0 0 0 0 
##$XL= 0
##$YL= 0
##$YMAX_a= 863741
##$YMIN_a= -680700
##$ZGOPTNS= <>
##$ZL1= 120
##$ZL2= 120
##$ZL3= 120
##$ZL4= 120
##$ABSF1= 17.50933
##$ABSF2= -2.509708
##$ABSG= 5
##$ABSL= 3
##$ALPHA= 0
##$AQORDER= 0
##$ASSFAC= 0
##$ASSFACI= 0
##$ASSFACX= 0
##$ASSWID= 0
##$AUNMP= <proc_1d>
##$AZFE= 0.1
##$AZFW= 0.1
##$BCFW= 0
##$BC_mod= 2
##$BYTORDP= 0
##$COROFFS= 0
##$CY= -3
##$DATMOD= 1
##$DC= 0
##$DFILT= <>
##$DTYPP= 0
##$F1P= 0
##$F2P= 0
##$FCOR= 1
##$FTSIZE= 16384
##$FT_mod= 6
##$GAMMA= 0
##$GB= 0
##$INTBC= 1
##$INTSCL= 1.334414e-10
##$ISEN= 128
##$LB= 0.24
##$LEV0= 0
##$LPBIN= 0
##$MAXI= 10000
##$MC2= 0
##$MEAN= 0
##$ME_mod= 0
##$MI= 1.114404
##$NCOEF= 0
##$NC_proc= -5
##$NLEV= 6
##$NOISF1= 3.799351
##$NOISF2= 2.8
##$NSP= 0
##$NTH_PI= 0
##$NZP= 0
##$OFFSET= 17.51666
##$PC= 1
##$PHC0= -11118.97
##$PHC1= 9.40101
##$PH_mod= 1
##$PKNL= yes
##$PPARMOD= 0
##$PSCAL= 0
##$PSIGN= 0
##$REVERSE= no
##$SF= 200.130003596505
##$SI= 16384
##$SIGF1= 3
##$SIGF2= 2
##$SINO= 5.538805
##$SIOLD= 16384
##$SREGLST= <1H.CDCl3>
##$SSB= 0
##$STSI= 16384
##$STSR= 0
##$SW_p= 4006.41025641026
##$SYMM= 0
##$S_DEV= 0
##$TDeff= 16384
##$TDoff= 0
##$TI= <>
##$TILT= no
##$TM1= 0
##$TM2= 0
##$TOPLEV= 0
##$USERP1= <user>
##$USERP2= <user>
##$USERP3= <user>
##$USERP4= <user>
##$USERP5= <user>
##$WDW= 1
##$XDIM= 16384
##$YMAX_p= 309531061
##$YMIN_p= -293001
$$ End of Bruker specific parameters
$$ ---------------------------------
##NTUPLES= NMR SPECTRUM
##VAR_NAME=  FREQUENCY,     SPECTRUM/REAL,   SPECTRUM/IMAG
##SYMBOL=    X,             R,               I
##VAR_TYPE=  INDEPENDENT,   DEPENDENT,       DEPENDENT
##VAR_FORM=  AFFN,          ASDF,            ASDF
##VAR_DIM=   16384,         16384,           16384
##UNITS=     HZ,            ARBITRARY UNITS, ARBITRARY UNITS
##FACTOR=    0.24454680195387, 1,            1
##FIRST=     3505.60936695002, 0,            0
##LAST=      -500.800889460239, 0,           0
##MIN=       -500.800889460239, -293001,     0
##MAX=       3505.60936695002, 309531061,    0
$$ Real data points
##PAGE= N=1
##DATA TABLE= (X++(R..R)), XYDATA
$$ [...]
5512H641033l52874k92098k38638j55156j79733p7511j24294l8005n6335j28307
$$ 8641033 8288159 7996061 7757423 7602267 7422534 7345023 7220729 7182724 7126389 6998082
5502F998082j9500k5935m3215r0645j22540l6332j34787k36627j76994j42375
$$ 6998082 6978582 6952647 6909432 6818787 6696247 6659915 6525128 6288501 6111507 5969132
5492E969132j70851j18348j99392k13686j11559o6390j34618n4843k7472j9094
$$ 5969132 5798281 5679933 5480541 5266855 5155296 5088906 4954288 4899445 4871973 4852879
5482D852879o4549M7951m532m2193M8094R0009N2421Q2438N462m680J20784N6408
$$ 4852879 4788330 4836281 4831749 4789556 4837650 4927659 4980080 5062518 5067980 5063300 5184084 5240492
5470E240492r1501p9257p9480r4759j02320j55231j72324j92584p4369j38717
$$ 5240492 5148991 5069734 4990254 4895495 4793175 4637944 4465620 4273036 4198667 4059950
5460D059950o4031j12553q2733K7168j18256m3783l6012N2336J3072p8981L6396
$$ 4059950 3995919 3883366 3800633 3827801 3709545 3665762 3629750 3682086 3695158 3616177 3652573
5449C652573l9162L6469M656k202M0423J6934J1269n097l8242n0298j00446l4382
$$ 3652573 3613411 3649880 3654536 3652334 3692757 3709691 3720960 3715863 3677621 3627323 3526877 3492495
5437C492495r9807o7693l7302o9571q4922p4917q1817j9376j3570p0358o8276
$$ 3492495 3392688 3324995 3287693 3218122 3133200 3058283 2976466 2957090 2943520 2873162 2804886
5426B804886j6652J8105m2706p5512L4029j0611J3301K9271j771J3765l835j2582
$$ 2804886 2788234 2806339 2763633 2688121 2722150 2711539 2724840 2754111 2752340 2766105 2762270 2749688
5414B749688O645J9540K0967l295M0864j733k3262P802l6114N3794K2445N7739
$$ 2749688 2756333 2775873 2796840 2793545 2834409 2832676 2809414 2817216 2781102 2834896 2857341 2915080
5402B915080j6645k7413J6852N7643N0463M7994l9505O8309n610J6919J65585
$$ 2915080 2898435 2871022 2887874 2945517 2995980 3043974 3004469 3072778 3067168 3084087 3249672
5391C249672N2582J26088O8094R0992Q7914J15059J46346R2282R1891J08520J06782
$$ 3249672 3302254 3428342 3496436 3587428 3675342 3790401 3936747 4029029 4120920 4229440 4336222
5380D336222O4664l2058j1287n6690n1131p1349p7924J4385l3066J1449j2742
$$ 4336222 4400886 4368828 4357541 4300851 4249720 4178371 4100447 4114832 4081766 4093215 4080473
5369D080473q7980O3022L8156J04028R7821J28712R4840J71250K26077K29111
$$ 4080473 3992493 4055515 4093671 4197699 4295520 4424232 4519072 4690322 4916399 5145510
5359E145510K27433J69000K03425J88833K05553R6698O5095k6438n9776j17461
$$ 5145510 5372943 5541943 5745368 5934201 6139754 6236452 6301547 6275109 6215333 6097872
5349F097872j14397j67827k26296k66726j85350j89854j54842j17141j04685j5617
$$ 6097872 5983475 5815648 5589352 5322626 5137276 4947422 4792580 4675439 4570754 4555137
5339D555137n8979M464M3472L9367J7467P8291J03837J18507J78202N1008J22873
$$ 4555137 4496158 4500622 4544094 4583461 4600928 4679219 4783056 4901563 5079765 5130773 5253646
5328E253646Q8223R9294O7742J7827N4215j980q5910n3876o3511k20535j98171
$$ 5253646 5341869 5441163 5508905 5526732 5580947 5578967 5493057 5439181 5375670 5155135 4956964
5317D956964j82231k03221k24437k09435j42881o0763j32924l7571q1067o9730
$$ 4956964 4774733 4571512 4347075 4137640 3994759 3933996 3801072 3763501 3682434 3612704
5307C612704q316n9422l0590L227q7329n5154Q6677O0262J281O0116N8474m0018
$$ 3612704 3604388 3544966 3514376 3517603 3430274 3375120 3461797 3522059 3523340 3583456 3641930 3601912
5295C601912L6074M031j1554r8627m6666r4037j72413o8623o1727p3434j76145
$$ 3601912 3637986 3642017 3630463 3531836 3485170 3391133 3218720 3150097 3088370 3014936 2838791
5284B838791o2649j0630j24579l4129q1092J193k569o8840J3461k1406j5598p0699
$$ 2838791 2776142 2765512 2640933 2606804 2525712 2526905 2524336 2455496 2468957 2447551 2431953 2361254
5272B361254k390O2905m830J6934k9028K9639J0405J2154l3016J0753j8955L6537
$$ 2361254 2358864 2421769 2416939 2433873 2404845 2434484 2444889 2457043 2424027 2434780 2415825 2452362
5260B452362L9659l7777n4096k1436M4041j4103o7753l93m16J9133l1091j2468
$$ 2452362 2492021 2454244 2400148 2378712 2422753 2408650 2340897 2340504 2340088 2359221 2328130 2315662
5248B315662M0518r50l5465m6420o367k1944K1153n2283l1965o4168l8540M4815
$$ 2315662 2356180 2355230 2319765 2273345 2266978 2245034 2266187 2213904 2181939 2117771 2079231 2124046
5236B124046k3090m9257K3920o9186M1813n002o4967L414j819O828J3371m698
$$ 2124046 2100956 2051699 2075619 2006433 2048246 2043244 1978277 1981691 1979872 1986700 2000071 1995373
5224A995373j9404j7817p669m1479O2896J2405N21L3138l2441J5336m5340P533
$$ 1995373 1975969 1958152 1950483 1909004 1971900 1984305 1984826 2017964 1985523 2000859 1955519 1963052
5212A963052N6871Q804J1760K4186M670p7322r536p33R127j5250K6247j4888l1655
$$ 1963052 2019923 2028727 2040487 2064673 2069343 1992021 1982485 1981752 1990879 1975629 2001876 1986988 1955333
5199A955333K126J9336P523p493K2273q549m821J3203M2464M0959K467K7093J7321
$$ 1955333 1957459 1976795 1984318 1976825 1999098 1990549 1985728 1998931 2041395 2082354 2084821 2111914 2129235
5186B129235n5230R302O0936L6355K8537K5330p2437n182O7575N196l4659J16867
$$ 2129235 2074005 2083307 2144243 2180598 2209135 2234465 2162028 2156846 2224421 2229617 2194958 2311825
5174B311825M7644q2296L2084l2922j2381J0835n2972j725K9321R93N1551K3643
$$ 2311825 2359469 2277173 2309257 2276335 2263954 2274789 2221817 2220092 2249413 2250406 2301957 2325600
5162B325600O1596J1820L9475J6556o778O1042j2266N1801N8173R1571J4035L5981
$$ 2325600 2387196 2399016 2438491 2455047 2448269 2509311 2497045 2548846 2607019 2698590 2712625 2748606
5150B748606k6075Q4691P5951J1864N9760K0200J0204j5065k8350J5418M1123
$$ 2748606 2722531 2807222 2883173 2895037 2954797 2974997 2985201 2970136 2941786 2957204 2998327
5139B998327l5281j5178N3076j7492l4188K7042l9057k5824P035K3462N0126K6207
$$ 2998327 2963046 2947868 3000944 2983452 2949264 2976306 2937249 2911425 2918460 2941922 2992048 3018255
5127C018255l0800J2380J4620j4746L5903k775J4814J0798K5706j1574Q174N6115
$$ 3018255 2987455 2999835 3014455 2999709 3035612 3032837 3047651 3058449 3084155 3072581 3080755 3136870
5115C136870J2098M6369J8094o7397K1687M7949k4191L4293J0599K041M7776k4560
$$ 3136870 3148968 3195337 3213431 3146034 3167721 3215670 3191479 3225772 3236371 3238412 3286188 3261628
5103C261628O3981J5456L5884P4837Q25j3753M4642Q7922O1325K8108M1316L2456
$$ 3261628 3325609 3341065 3376949 3451786 3452611 3438858 3483500 3571422 3632747 3660855 3702171 3734627
5091C734627Q6202Q0491m9411O8149J1480M1914N8065N5937L7873J2194R1316
$$ 3734627 3820829 3901320 3851909 3920058 3931538 3973452 4031517 4087454 4125327 4137521 4228837
5080D228837L8343J9796k3965J8521K3744j1283K3844L7363R8942N2181M4014
$$ 4228837 4267180 4286976 4263011 4281532 4305276 4293993 4317837 4355200 4454142 4506323 4550337
5069D550337K4342M9881Q8183N0398J20755O9246J13787J12002J32775J17986
$$ 4550337 4574679 4624560 4712743 4763141 4883896 4953142 5066929 5178931 5311706 5429692
5059E429692J49611J52560M6485J11734J42020J76758J26625J56849N8867m8907
$$ 5429692 5579303 5731863 5778348 5890082 6032102 6208860 6335485 6492334 6551201 6502294
5049F502294o8481J39827l8825n741m801L1341J22533J16540J89121J35868J49666
$$ 6502294 6433813 6573640 6534815 6529074 6524273 6555614 6678147 6794687 6983808 7119676 7269342
5038G269342J91457J80521K82066L41712L02630M49448M70525N97503M32547L52412
$$ 7269342 7460799 7641320 7923386 8265098 8567728 9017176 9487701 10085204 10517751 10870163
5028A0870163K80968L64591L90197M68064N81308K79227p4113k43791r1682q1424
$$ 10870163 11151131 11515722 11905919 12373983 12955291 13234518 13160405 12916614 12824932 12743508
5018A2743508j56739j7904J35849J80964K97907K70560M05438M59352N90039O59344
$$ 12743508 12586769 12568865 12704714 12885678 13183585 13454145 13859583 14318935 14908974 15568318
5008A5568318P08404Q27316Q47181J083307J187997J256133J331282J313737J265484
$$ 15568318 16276722 17104038 17951219 19034526 20222523 21478656 22809938 24123675 25389159
4999B5389159J325284J465939J521441J641002J726455J406665J079196J000933
$$ 25389159 26714443 28180382 29701823 31342825 33069280 34475945 35555141 36556074
4991C6556074J247787J435740J456336J600333J908503K154193K264490K529376
$$ 36556074 37803861 39239601 40695937 42296270 44204773 46358966 48623456 51152832
4983E1152832K857484K913214K913256K675966K305490J849827J332401P61624
$$ 51152832 54010316 56923530 59836786 62512752 64818242 66668069 68000470 68762094
4975F8762094L5194r42825j935100k913478l550216l726821l771017l631470l529731
$$ 68762094 68797288 67854463 65919363 63005885 59455669 55728848 51957831 48326361 44796630
4966D4796630l445399l328659l203938k882015k547258k308756k089175j795490
$$ 44796630 41351231 38022572 34818634 31936619 29389361 27080605 24991430 23195940
4958B3195940j541205j338841j192238j042284q97991p88279p55756o70738n71044
$$ 23195940 21654735 20315894 19123656 18081372 17183381 16395102 15639346 14968608 14397564
4949A4397564n74268n00348n08089m78879l84278l52739l78540l64663m08510
$$ 14397564 13823296 13322948 12814859 12335980 11951702 11598963 11220423 10855760 10447250
4940A0447250k80912k75954k87752k10924j73814k31438j97526j86931j69985
$$ 10447250 10166338 9890384 9602632 9391708 9217894 8986456 8788930 8601999 8432014
4931H432014j06008j30222j36182n6119j24811n8001m8666j20906K7143k5185
$$ 8432014 8326006 8195784 8059602 8003483 7878672 7820671 7772005 7651099 7678242 7653057
4921G653057l8036m303L1953J22810Q0109J15736J16917J40637J96385J59624
$$ 7653057 7615021 7610718 7642671 7765481 7845590 7961326 8078243 8218880 8415265 8574889
4911H574889K25342K26083K17366J84214J55530P1884p9647j94424k59384k81744
$$ 8574889 8800231 9026314 9243680 9427894 9583424 9655308 9575661 9381237 9121853 8840109
4901H840109l25075m22089m33450m38411m18730l36366k20098k72194k30373r9714
$$ 8840109 8515034 8092945 7659495 7221084 6802354 6465988 6245890 5973696 5743323 5643609
4891E643609j67076j58274j50795m2960r7340j01282j27911q1007q3440j31382
$$ 5643609 5476533 5318259 5167464 5124504 5027164 4925882 4797971 4716964 4633524 4502142
4881D502142n2367q6056j7898k1816o6807j3845r317n8699k4888o746l9102p0517
$$ 4502142 4449775 4363719 4345821 4324005 4257198 4243353 4234036 4175337 4150449 4143703 4104601 4034084
4869D034084n3137j0685l0869l4667l0303n2532j2905j8705k3848k1759m8659
$$ 4034084 3980947 3970262 3939393 3904726 3874423 3821891 3808986 3790281 3766433 3744674 3696015
4858C696015k0057l0104p8028n4834L7201l6506M813l4008n0931j8841k9593l1887
$$ 3696015 3675958 3645854 3567826 3512992 3550193 3513687 3518500 3484492 3433561 3414720 3385127 3353240
4846C353240l6383k9041k5121J1351l68R14k5194k1109M495K5141N9702K5625
$$ 3353240 3316857 3287816 3262695 3274046 3273678 3274592 3249398 3228289 3232784 3257925 3317627 3343252
4834C343252J8416M3885K4026P0745k2946k0997M9978N2698p4257M8250Q3190
$$ 3343252 3361668 3405553 3429579 3500324 3477378 3456381 3506359 3559057 3484800 3533050 3616240
4823C616240J7593j5741N6873P2046M9954m6838M2200J34920J20345Q2398M3401
$$ 3616240 3633833 3618092 3674965 3747011 3796965 3750127 3792327 3927247 4047592 4129990 4173391
4812D173391R0664J07342O9308R1231J02329J73788K15450K39437L60157L23370
$$ 4173391 4264055 4371397 4440705 4531936 4634265 4808053 5023503 5262940 5623097 5946467
4802E946467M42295N83547P50423R36481Q99178O57740J72139M3198L36283O12372
$$ 5946467 6388762 6972309 7722732 8659213 9558391 10216131 10388270 10431468 10767751 11380123
4792A1380123Q22621Q27951K59116p58362j255719j022040p67374q67707j061734
$$ 11380123 12202744 13030695 13289811 12531449 11275730 10253690 9486316 8618609 7556875
4783G556875q22267o16148m03357l51804l39717j60398k13965j78152j21583j02177
$$ 7556875 6734608 6118460 5715103 5363299 5023582 4863184 4649219 4471067 4349484 4247307
4773D247307j19211r0250o5819o5598J7704l1206r2300Q9611o0767K3639P3770
$$ 4247307 4128096 4037846 3972027 3906429 3924133 3892927 3800627 3890238 3829471 3853110 3926880
4762C926880j2541n2227k1917m7663n3813j7677p673j1677J35362J0368m8266
$$ 3926880 3914339 3862112 3840195 3792532 3738719 3721042 3713369 3701692 3837054 3847422 3799156
4751C799156r2815j37866j40953m9446k6414q7645j02239j05490q8422n8434l0984
$$ 3799156 3706341 3568475 3427522 3378076 3351662 3264017 3161778 3056288 2967866 2909432 2878448
4740B878448o8220n5758l5515n4934p5816l8763j6812l0990N9465l7510m2591
$$ 2878448 2810228 2754470 2718955 2664021 2588205 2549442 2532630 2501640 2561105 2523595 2481004
4729B481004J6017J5207j4336J6806J7546k0034K8961o9779K9226O412O791L0308
$$ 2481004 2497021 2512228 2497892 2514698 2532244 2512210 2541171 2471392 2500618 2507030 2513821 2544129
4717B544129N6666k0907m6040K8438Q695K204M6672m0584L7685j0803R923N2211
$$ 2544129 2600795 2579888 2533848 2562286 2570981 2573185 2619857 2579273 2616958 2606155 2616078 2668289
4705B668289p821K1256N2294k546L5708R9399N9157n0577o415k4581p672l3119
$$ 2668289 2660468 2681724 2734018 2731472 2767180 2866579 2925736 2875159 2868744 2844163 2836491 2803372
4693B803372j00539j03802j02324l8882n7735n2456o4500J0755K654o1499j3833
$$ 2803372 2702833 2599031 2496707 2457825 2400090 2347634 2283134 2293889 2296543 2235044 2221211
4682B221211m0295L587k0075m5982n261q5265P813L1751k1342j0715l4794M0810
$$ 2221211 2180916 2184503 2164428 2118446 2113185 2027920 2035733 2067484 2046142 2035427 2000633 2041443
4670B041443k1740Q806n0616r74q17k1557L73j7010J1842m777O4299L7979J9178
$$ 2041443 2019703 2028509 1977893 1976919 1976102 1954545 1954918 1937908 1949750 1944973 2009272 2047251 2066429
4657B066429k3978k9835k5998M5889Q803J1847p820K0600L3460l3671L7678R005
$$ 2066429 2042451 2012616 1986618 2032507 2041310 2053157 2045337 2065937 2099397 2065726 2103404 2112409
4645B112409l0768j3868M5888n5138j2650L0837l6106L1826j108j1252o1934K0410
$$ 2112409 2081641 2067773 2113661 2058523 2045873 2076710 2040604 2072430 2071322 2060070 1998136 2018546
4633B018546J3899J3053J6391j1789j7223M7917M499L333m5646j2727M0242P931
$$ 2018546 2032445 2045498 2061889 2050100 2032877 2080794 2085293 2088626 2042980 2030253 2070495 2078426
4621B078426N9096J4923K7356L2639o5241k2716L5229j7616j2613m9340J7426
$$ 2078426 2137522 2152445 2179801 2212440 2147199 2124483 2159712 2142096 2129483 2080143 2097569
4610B097569P5216m1526k9419j6829J5186P233O345M0989k4003M5430L5070k7348
$$ 2097569 2172785 2131259 2101840 2085011 2100197 2107430 2113775 2154764 2130761 2176191 2211261 2183913
4598B183913j3083l5806n4268Q0836O349N518o3655n962J6286p189k5930J9849
$$ 2183913 2170830 2135024 2080756 2161592 2167941 2173459 2109804 2103842 2120128 2112939 2087009 2106858
4586B106858L2825k6604q657J8182M299L4045K5015m5138j9507J5479L2317k7304
$$ 2106858 2139683 2113079 2104422 2122604 2126903 2160948 2185963 2140825 2121318 2136797 2169114 2141810
4574B141810L661J7051J7585Q0761L1808j8914N746N6406p128k4549N8088J0180
$$ 2141810 2145471 2162522 2180107 2260868 2292676 2273762 2279508 2335914 2328786 2304237 2362325 2372505
4562B372505O0781n486J4186K9808Q995J6392p713Q68L209J7566N1773K391K8518
$$ 2372505 2433286 2427800 2441986 2471794 2480789 2497181 2489468 2490336 2493545 2511111 2562884 2565275 2593793
4549B593793M374N5967L3585L1208n3354M2218N3817K2520J2837j1204O7237P1784
$$ 2593793 2598167 2654134 2687719 2718927 2665573 2707791 2761608 2784128 2796965 2785761 2852998 2924782
4537B924782K555L463M2622j7528O4093O7167J5394j9105M1917L6810N393M0758
$$ 2924782 2927337 2930800 2973422 2955894 3019987 3087154 3102548 3083443 3125360 3162170 3167563 3208321
4525C208321Q049J1585k31M0597P3325L2639L0701P7576M5532L0443L3707M5062
$$ 3208321 3216370 3227955 3227724 3268321 3341646 3374285 3404986 3482562 3528094 3558537 3592244 3637306
4513C637306M2304m1828K0292R659L4982L0506L8930J14871R3160l8834O8011
$$ 3637306 3679610 3637782 3658074 3667733 3702715 3733221 3772151 3887022 3980182 3941348 4009359
4502D009359N8217Q2284L9313P2726N2652k3065P8704M0164O9213R7756O0627
$$ 4009359 4067576 4149860 4189173 4261899 4314551 4291486 4370190 4410354 4479567 4577323 4637950
4491D637950P1611R7597J20601J15127N3074J12917J40120P4116J61111J20735
$$ 4637950 4709561 4807158 4927759 5042886 5095960 5208877 5348997 5423113 5584224 5704959
4481E704959O0002J76093J56255J46047J53165K19620J71701K22899K05380K19211
$$ 5704959 5764961 5941054 6097309 6243356 6396521 6616141 6787842 7010741 7216121 7435332
4471G435332J88937K71804L58005K83002L03373K67445K91704K64746J99493J77893
$$ 7435332 7624269 7896073 8254078 8537080 8840453 9107898 9399602 9664348 9863841 10041734
4461A0041734J66802J08550m493m6549n6916m7501j09060r7292k3733j9263Q8028
$$ 10041734 10208536 10317086 10312593 10266044 10209128 10161627 10052567 9955275 9931542 9912279 10000307
4450A0000307J48421J20993J29288K01728L36510L18760L01877L01717K84851
$$ 10000307 10148728 10269721 10399009 10600737 10937247 11256007 11557884 11859601 12144452
4441A2144452M86785L73146M65165M94809M96062N28722N02960M66381M84740
$$ 12144452 12631237 13004383 13469548 13964357 14460419 14989141 15492101 15958482 16443222
4432A6443222N24477L49187K98034J73691J05316N5947J27677Q3729K20658K31806
$$ 16443222 16967699 17316886 17614920 17788611 17893927 17949874 18077551 18161280 18381938 18613744
4422A8613744K12421K86368K77163L61064L82636L86602L60364L45518L16093
$$ 18613744 18826165 19112533 19389696 19750760 20133396 20519998 20880362 21225880 21541973
4413B1541973M05145L49422L99546M53030N30024N96093N73126N80806O06674
$$ 21541973 21947118 22296540 22696086 23149116 23679140 24275233 24848359 25429165 26035839
4404B6035839P05060P47052P38601Q78743Q64150R11482R79770J072040J149885
$$ 26035839 26740899 27487951 28226552 29105295 29969445 30880927 31860697 32932737 34082622
4395C4082622J130891J129023J144991J190888J197460J201621J290266J327831
$$ 34082622 35213513 36342536 37487527 38678415 39875875 41077496 42367762 43695593
4387D3695593J584902J611020J546376J519381J589532J682118J680748J698525
$$ 43695593 45280495 46891515 48437891 49957272 51546804 53228922 54909670 56608195
4379E6608195J714139J714830J757869J871332J999235K154781K220308K354662
$$ 56608195 58322334 60037164 61795033 63666365 65665600 67820381 70040689 72395351
4371G2395351K209843K214823K189100J955986J742326J472431J132855P34338
$$ 72395351 74605194 76820017 79009117 80965103 82707429 84179860 85312715 86047053
4363H6047053M11512J94438k23798m34849o88748j157504j516807j918618k272021
$$ 86047053 86458565 86653003 86429205 85994356 85305608 84148104 82631297 80712679 78440658
4354G8440658k731607l108475l126382l118470k949635k566782k015661j661420
$$ 78440658 75709051 72600576 69474194 66355724 63406089 60839307 58823646 57162226
4346E7162226j284344j038231j031689q04038p76687j158462j605413k197296
$$ 57162226 55877882 54839651 53807962 53003924 52227237 51068775 49463362 47266066
4338D7266066k701955k908931k725113k487285k130185j779817j656898j286494
$$ 47266066 44564111 41655180 38930067 36442782 34312597 32532780 30875882 29589388
4330B9589388j105985j053390q73775p44972n73178n29555n18774n56000m57808
$$ 29589388 28483403 27430013 26556238 25811266 25238088 24708533 24189759 23633759 23175951
4321B3175951m75569n69417n91602o17652o85631o59368o66137o04599o15242
$$ 23175951 22700382 22130965 21539363 20921711 20236080 19576712 18910575 18305976 17690734
4312A7690734m75245m54799n09787l75719m03746m45762l71561l66146m21651
$$ 17690734 17215489 16760690 16250903 15875184 15471438 15025676 14654115 14287969 13866318
4303A3866318m29059m20457m41538m22975l28398k85161l52633l83106k43635
$$ 13866318 13437259 13016802 12575264 12152289 11823891 11538730 11186097 10802991 10559356
4294A0559356j92282j76015k12002k14556j47711j46971j54842j26166j16218
$$ 10559356 10367074 10191059 9979057 9764501 9616790 9469819 9314977 9188811 9072593
4285I072593o5689j80244j16217p8559r4958r0374l4558K1906q4272l4837R843
$$ 9072593 9006904 8826660 8710443 8631884 8536926 8446552 8411994 8433900 8349628 8314791 8324634
4274H324634l8773n3147o2672n9537m3472j31253q7676q1950p7363n5024j03351
$$ 8324634 8285861 8232714 8170042 8110505 8067033 7935780 7848104 7766154 7688791 7633767 7530416
4263G530416n0110q1273k5409j4402k8560l1606K59J9877L7056j7056M9214J0822
$$ 7530416 7480306 7399033 7373624 7359222 7330662 7299056 7299315 7319192 7356248 7339192 7388406 7399228
4251G399228L2224M665Q5754Q772N8827O8902N6443R0033K2585P9955P0435R932
$$ 7399228 7431452 7436117 7521871 7530643 7589470 7658372 7714815 7804848 7827433 7907388 7977823 7987755
4239G987755M7021n250l1049n5795m3007M3175l1988J5275Q0073M1699J11799
$$ 7987755 8034776 8029526 7998477 7942682 7899675 7942850 7910862 7926137 8006210 8047909 8159708
4228H159708M7862R9064J03107J36619R8335O4762J63413J83131J27215J28393
$$ 8159708 8207570 8306634 8409741 8546360 8644695 8709457 8872870 9056001 9183216 9311609
4218I311609P3365M5098N4308K0056J117N2478J40562J07827K04376J66477K07270
$$ 9311609 9384974 9430072 9484380 9504436 9505553 9558031 9698593 9806420 10010796 10177273 10384543
4207A0384543K12722J64458J76661J90775J41653J22336J76L131O4526j4057J7868
$$ 10384543 10597265 10761723 10938384 11129159 11270812 11393148 11393324 11396455 11460981 11446924 11464792
4196A1464792J9772N8050J29817J07243R0365J82275J74984J50165K20937K95530
$$ 11464792 11484564 11542614 11672431 11779674 11870039 12052314 12227298 12377463 12598400 12893930
4186A2893930K81043L24914L59341L73169M40757L12899L40230L71504L31269
$$ 12893930 13174973 13499887 13859228 14232397 14673154 14986053 15326283 15697787 16029056
4177A6029056L46120K32301J44825L0153l0538n2864j13681r9190j16098O2881
$$ 16029056 16375176 16607477 16752302 16782455 16751917 16699053 16585372 16486182 16370084 16432965
4167A6432965K9522P0973J09623J90585J71897K07707K24885K87515K71841L54821
$$ 16432965 16462487 16533460 16643083 16833668 17005565 17213272 17438157 17725672 17997513 18352334
4157A8352334M01595M53281N49789N83882N79862N96852O44380P16131P03136
$$ 18352334 18753929 19207210 19756999 20340881 20920743 21517595 22161975 22878106 23581242
4148B3581242P30709O67155P31540P19768Q44472Q42622R05706J120682J186087
$$ 23581242 24311951 24979106 25710646 26430414 27274886 28117508 29023214 30143896 31329983
4139C1329983J340441J511961J766596K025051K291558K588683K945475L325435
$$ 31329983 32670424 34182385 35948981 37974032 40265590 42854273 45799748 49125183
4131D9125183L800103M246820M659118N114898N607399N989286O175433O368463
$$ 49125183 52925286 57172106 61831224 66946122 72553521 78542807 84718240 91086703
4123I1086703O530278O862647P017143O458098N424800M576468M369480L606971
$$ 91086703 97616981 104479628 111496771 117954869 123379669 127956137 132325617 135932588
4115A35932588O50279m840762j0076572j2640899j2645100j1141586r332709p637438
$$ 135932588 136582867 131742105 121665533 109024634 96379534 85237948 75905239 68267801
4107F8267801o153886n036594m307836l669911l123539k726510k283767k038235
$$ 68267801 62113915 57077321 52769485 49099574 45976035 43249525 40965758 38927523
4099C8927523j715202j487137j326205j100843r11473p93876o04989n96843m69690
$$ 38927523 37212321 35725184 34398979 33298136 32386663 31592787 30987798 30390955 29921265
4090B9921265l23251k43242j90810j40871j5895r06k6736N7111J0393n314m3916
$$ 29921265 29598014 29354772 29163962 29023091 29007196 29006290 28979554 29036665 29047058 29041744 28997828
4079B8997828q3715j73963k21692k55080j63112n7016P5949J68704L33273L88308
$$ 28997828 28914113 28740150 28518458 28263378 28100266 28043250 28119199 28287903 28621176 29009484
4069B9009484N89216O14277O43924P46682P96020P80168Q87473Q26794P54382
$$ 29009484 29598700 30212977 30856901 31603583 32399603 33179771 34067244 34894038 35648420
4060C5648420R06036R62312J060846J097762J127072J074206Q97003P81084P36802
$$ 35648420 36554456 37516768 38577614 39675376 40802448 41876654 42773657 43554741 44291543
4051D4291543M94178J83197k61344n44771n98264o43014n36513m22289j72225
$$ 44291543 44785721 44968918 44707574 44162803 43564539 42921525 42385012 41962723 41790498
4042D1790498L876K02167L71851M60554N31649N82750O71319Q56561R19933R21539
$$ 41790498 41794374 41996541 42368392 42828946 43360595 43943345 44614664 45471225 46391158 47312697
4032D7312697J031039J129307J290768J390728J310993J155241J114457P76708
$$ 47312697 48343736 49473043 50763811 52154539 53465532 54620773 55735230 56511938
4024E6511938L38214n94640j673687k629112l042532k909525k493158k154443
$$ 56511938 56850152 56255512 54581825 51952713 48910181 46000656 43507498 41353055
4016D1353055j820220j446813j165491r97527q35173o61904m96628m74634l27235
$$ 41353055 39532835 38086022 36920531 35923004 35087831 34425927 33929299 33454665 33127430
4007C3127430k52922j01064k0602O0772N4775J70514J41896P5330P2087n602j65599
$$ 33127430 32874508 32773444 32752842 32813614 32868389 33038903 33180799 33256129 33328216 33322614 33157015
3996C3157015n69657q79756j232871j464904j452359j374026j186434r28880q12701
$$ 33157015 32587358 31707602 30474731 29009827 27557468 26183442 24997008 24068128 23255427
3987B3255427p05073n59879m53725l76943l43175l10489k87295l26876l41901
$$ 23255427 22550354 21990475 21536750 21159807 20816632 20506143 20218848 19891972 19550071
3978A9550071k36121q0090l2979J5129R2319K41713K33323M24213M39002M62379
$$ 19550071 19313950 19233860 19200881 19216010 19308329 19550042 19783365 20207578 20646580 21108959
3968B1108959O52526O78756P51805P74174P68234Q95623J096989J351771J687444
$$ 21108959 21761485 22440241 23192046 23966220 24734454 25630077 26727066 28078837 29766281
3959B9766281J999801K251487K642602K953789L329911L797256M193404M132647
$$ 29766281 31766082 34017569 36660171 39613960 42943871 46741127 50934531 55067178
3951E5067178L359264K524689K230180J795270k4512k862232n207735n822077
$$ 55067178 58426442 60951131 63181311 64976581 64952069 62089837 56882102 51060025
3943E1060025n233658m283514l293045k495500j923732j448391j011885p42251
$$ 51060025 45826367 41542853 38249808 35754308 33830576 32382185 31370300 30628049
3935C0628049n07638m31417k83981j00515j76780k36024k22578l05788m51117
$$ 30628049 30120411 29688994 29405013 29304498 29127718 28891694 28669116 28363328 27912211
3926B7912211o32225p81021p59238q83998q07731p76779p64532o58044n93196
$$ 27912211 27279986 26498965 25739727 24855729 24047998 23271219 22506687 21848643 21255447
3917B1255447n30287m17489m21473m10205k24018k12147j66612j11339o3890n0637
$$ 21255447 20725160 20307671 19886198 19475993 19251975 19039828 18873216 18761877 18697987 18647350
3907A8647350o3827O2792Q6108J09125K26328L53469M33332M97336M48285N30902
$$ 18647350 18583523 18646315 18732423 18841548 19067876 19421345 19854677 20352013 20800298 21331200
3897B1331200O41770N50823N09603M08631K47695J03433O7496K0445J24134J95989
$$ 21331200 21972970 22523793 23033396 23442027 23689722 23793155 23860651 23881096 24005230 24201219
3887B4201219K00315J25369m7467k95245n05245n71085n92459m27359j98024r6141
$$ 24201219 24401534 24526903 24479436 24184191 23678946 23107861 22515402 22088043 21890019 21793878
3877B1793878M3802J03580K00016K33790K25386L79409M46574M43678M84346M94345
$$ 21793878 21837680 21941260 22141276 22375066 22600452 22979861 23426435 23870113 24354459 24848804
3867B4848804M80822L97378L97168M42899N43641N76508O78682Q97261J158500
$$ 24848804 25329626 25727004 26124172 26567071 27110712 27687220 28365902 29263163 30421663
3858C0421663J465124J689864J937065K393764K614700K593973K067006J828926
$$ 30421663 31886787 33576651 35513716 37907480 40522180 43116153 45183159 47012085
3850D7012085K026154J660723l0359k320204l673530l714886l009239k183539
$$ 47012085 49038239 50698962 50668603 48348399 44674869 40959983 37950744 35767205
3842C5767205j590762j404947j145675j132180j435929j664291j707165j611585
$$ 35767205 34176443 32771496 31625821 30493641 29057712 27393421 25686256 24074671
3834B4074671j332163j233350r21166p45111n97845l58751k72815k18406j54149
$$ 24074671 22742508 21509158 20587992 19842881 19245036 18886285 18613470 18395064 18240915
3825A8240915q3331o8735l2661N7082Q8176l9547j43366k25499j88217j44680
$$ 18240915 18157584 18088849 18056188 18113270 18201446 18161899 18018533 17793034 17604817 17460137
3815A7460137k2044P9893J76740K21003J90357J30996J69119J6693k02344n28710
$$ 17460137 17438093 17517986 17694726 17915729 18106086 18237082 18406201 18422894 18220550 17691840
3805A7691840n81472n13179m49451l38818k40953j23155j62412p2497L2415L5253
$$ 17691840 17110368 16597189 16147738 15808920 15567967 15444812 15282400 15209903 15242318 15277571
3795A5277571M8329R9129L8715P9385M3165J20727J6145P7541Q1898M5576M2542
$$ 15277571 15325900 15425029 15463744 15543129 15586294 15707021 15723166 15800707 15882605 15928181 15970723
3784A5970723K5371K6879p968J12936O5078M3132N6366J00592M8384J53535J37515
$$ 15970723 15996094 16022973 16015005 16127941 16193019 16236151 16292517 16393109 16441493 16595028 16732543
3773A6732543J87484J84956K40379K67371K46685L41729K75221L03680K91508
$$ 16732543 16920027 17104983 17345362 17612733 17859418 18201147 18476368 18780048 19071556
3764A9071556M15656M42182M53431M73323L91532L78237K25021J51084J57925
$$ 19071556 19487212 19929394 20382825 20856148 21247680 21625917 21850938 22002022 22159947
3755B2159947n9067P581O3539J10420J18088J45513K19603K68740M07160M00111
$$ 22159947 22100880 22108461 22172000 22282420 22400508 22546021 22765624 23034364 23441524 23841635
3745B3841635M03739N26678M84460N17374M06023M33782L09964K78588J64354
$$ 23841635 24245374 24772052 25256512 25773886 26179909 26613691 26923655 27202243 27366597
3736B7366597P8771K4121N4932K52540K90641J80543K79975J56127Q6835N0438
$$ 27366597 27445368 27469489 27524421 27776961 28067602 28248145 28528120 28684247 28771082 28821520
3726B8821520j11690l33880n39046n73947o90812n25951n01390l87047k19062
$$ 28821520 28709830 28375950 27836904 27262957 26572145 26046194 25544804 25157757 24938695
3717B4938695k89761k98904l61234l87521n27556p59910p32865q81552q77803
$$ 24938695 24648934 24350030 23988796 23601275 23073719 22313809 21580944 20699392 19821589
3708A9821589q54636p58343o06388n28974n44549m67575m42998m92692n59302
$$ 19821589 18966953 18208610 17602222 17073248 16528699 16061124 15618126 15125434 14566132
3699A4566132m90266n44050n81673o04614n78814m88061m50643l81155l30957
$$ 14566132 14075866 13531816 12950143 12345529 11766715 11278654 10828011 10446856 10115899
3690A0115899l37222l06246k18168k68948k34930k39338k35812k24234j84712
$$ 10115899 9778677 9472431 9254263 8985315 8750385 8511047 8275235 8051001 7866289
3681G866289j53946j85806j29655j35208q6018j03558n7747q9015r8495j53769
$$ 7866289 7712343 7526537 7396882 7261674 7175656 7072098 7014351 6925336 6826841 6673072
3671F673072j06915o9150l4753m4894q0603l6716n3228m6497l3976m2909j9443
$$ 6673072 6566157 6497007 6462254 6417360 6336757 6300041 6246813 6200316 6166340 6123431 6103988
3660F103988k5345k1967k1355l9278o0415k0804l5717j8048l235N0158k570m3856
$$ 6103988 6078643 6056676 6035321 5996043 5935628 5914824 5879107 5861059 5857824 5907982 5905412 5861556
3648E861556k2268P841M3332N5402J3194q05N2012J0891M7569L7988N5407P0741
$$ 5861556 5839288 5847129 5890461 5945863 5959057 5958252 6010264 6021155 6068724 6106712 6162119 6232860
3636F232860j6814O6686J5864J11950J6856M8359J15077M0695J29970J02812K6653
$$ 6232860 6216046 6282732 6298596 6410546 6427402 6475761 6590838 6631533 6761503 6864315 6890968
3625F890968J33508Q1222N9789K4180N0826N3591L6688O2559K115N8330k5629
$$ 6890968 7024476 7105698 7165487 7189667 7240493 7294084 7330772 7393331 7395446 7453776 7428147
3614G428147M0160r415l102p3619L5897K6436p3688J5209N6807j8367M5263P4303
$$ 7428147 7468307 7458892 7455790 7382171 7418068 7444504 7370816 7386025 7442832 7424465 7469728 7544031
3602G544031K6793l2197O2450Q5009O4895J07560R5260O8580J58357P7286M4751
$$ 7544031 7570824 7538627 7601077 7686086 7750981 7858541 7953801 8022381 8180738 8258024 8302775
3591H302775J56905Q8599J4726O699m0310n6934m3253m9439q4511j21124j17450
$$ 8302775 8459680 8548279 8563005 8569704 8529394 8472460 8429207 8379768 8295257 8174133 8056683
3580H056683q6730j1521M9016p6245L7496o7477j903P3924L5568j1339N1629R4541
$$ 8056683 7969953 7958432 8007448 7931203 7968699 7901222 7899319 7973243 8008811 7997472 8049101 8143642
3568H143642R3786O9770N8987O8606N0828Q1939R3273N7930L4243L1838j4533
$$ 8143642 8237428 8307198 8366185 8434791 8485619 8567558 8660831 8718761 8753004 8784842 8770309
3557H770309j02823n3229j8631j03134j31488o8188m0125p4780o7175k3009J6380
$$ 8770309 8667486 8614257 8595626 8492492 8361004 8292816 8252691 8177911 8110736 8087727 8104107
3546H104107k484K3897O2157J5226O6863O3477K4992O4167J18287P1306o269N4276
$$ 8104107 8101623 8125520 8187677 8202903 8269766 8333243 8358235 8422402 8540689 8611995 8605726 8660002
3534H660002N3351M3776O970k7314J6832M8133M2460k6197k9209j3664l2773O387
$$ 8660002 8713353 8757129 8764099 8736785 8753617 8801750 8844210 8818013 8788804 8775140 8742367 8748754
3522H748754j33522r0530p7311p0198r5567M0001l340o7234m1816j0571K2646
$$ 8748754 8615232 8524702 8447391 8377193 8281626 8321627 8318287 8251053 8209237 8198666 8221312
3511H221312k4110j00377K98q913L8540o3295j0039n543l5948q11q9770r3745
$$ 8221312 8197202 8096825 8097123 8088210 8126750 8063455 8053416 8047873 8011925 8011114 7921344 7827599
3499G827599o6313o9963p0983j38122p2772o3664r0487m0429l6231n7121k7390
$$ 7827599 7761286 7691323 7620340 7482218 7409446 7345782 7255295 7214866 7178635 7121514 7094124
3488G094124n3796j1907k9470m997M3872k8623M8184o772N3839P6938L1510M6824
$$ 7094124 7040328 7028421 6998951 6993954 7037826 7009203 7057387 7050615 7104454 7181392 7212902 7259726
3476G259726M5830Q6998J04054R1935m9562N3226M8967J5516K5353j9985R4329
$$ 7259726 7305556 7392554 7496608 7588543 7538981 7592207 7641174 7656690 7682043 7662058 7756387
3465G756387N6923m663J6907o2314M9324Q0675K1065M2162n7846n505l388r651
$$ 7756387 7813310 7808647 7825554 7763240 7812564 7893239 7914304 7956466 7898620 7893115 7889727 7880076
3453G880076n4908J4258l2111m1797k2078j3924l757M2667j7915m5635k6115K0329
$$ 7880076 7825168 7839426 7807315 7765518 7743440 7729516 7725759 7768426 7750511 7704876 7678761 7699090
3441G699090N5080q829N2005M8081N1526N9427J7768M7940J0208L0814N1187J19520
$$ 7699090 7754170 7745341 7797346 7845427 7896953 7956380 7974148 8022088 8032296 8063110 8114297 8233817
3429H233817M8647l1420J6609J04420P8156J37722Q3466J09002P3537J51806J26718
$$ 8233817 8282464 8251044 8267653 8372073 8450229 8587951 8671417 8780419 8853956 9005762 9132480
3418I132480N7007J68753J26260J25727J24390J55239J18681J03993J09576J35711
$$ 9132480 9189487 9358240 9484500 9610227 9734617 9889856 10008537 10112530 10222106 10357817
3408A0357817J67102J87988J62236J29518J28905K79725J81004K08779K60092
$$ 10357817 10524919 10712907 10875143 11004661 11133566 11413291 11594295 11803074 12063166
3399A2063166K59884K72161K78651L41031L04507L70823L82156L83456M41041
$$ 12063166 12323050 12595211 12873862 13214893 13519400 13890223 14272379 14655835 15096876
3390A5096876M52958M69061N64828O17514O57392P67320P83354Q22884R56713
$$ 15096876 15549834 16018895 16583723 17201237 17858629 18625949 19409303 20232187 21188900
3381B1188900J063745J148428J267007J337958J481773J665585J874883J881355
$$ 21188900 22252645 23401073 24668080 26006038 27487811 29153396 31028279 32909634
3373C2909634K111920K292805K316734K512584K597019K627483K648769K757062
$$ 32909634 35021554 37314359 39631093 42143677 44740696 47368179 50016948 52774010
3365E2774010K651304K597658K457434K202368J791969J262759P47641K59319
$$ 52774010 55425314 58022972 60480406 62682774 64474743 65737502 66485143 66744462
3357F6744462j84068n31667p64151q14966q28532p70307p57820p94214q30443
$$ 66744462 66560394 66028727 65264576 64449610 63621078 62850771 62092951 61298737 60468294
3348F0468294j061961j493035j840584k234964k569745k761720k934226k933099
$$ 60468294 59406333 57913298 56072714 53837750 51268005 48506285 45572059 42638960
3340D2638960k747108k513699k378332k001312j739950j516713j302292j229706
$$ 42638960 39891852 37378153 34999821 32998509 31258559 29741846 28439554 27209848
3332B7209848j069181r05970q61092q22603o66138o44953n51537o08229m71146
$$ 27209848 26140667 25234697 24373605 23551002 22884864 22239911 21688374 21080145 20608999
3323B0608999m79907m85539l53312k90937k68953k92730k80525k07682j58216
$$ 20608999 20129092 19643553 19290241 18999304 18730351 18437621 18157096 17949414 17791198
3314A7791198j32486j20128j02607j04374j15314m358J2715N3150k7328k5489
$$ 17791198 17658712 17538584 17435977 17331603 17216289 17211931 17224646 17277796 17250468 17224979
3304A7224979j206M9842J10014P7868Q3820J29628l542J21180J44200R4096O5668
$$ 17224979 17223773 17273615 17383629 17461497 17545317 17674945 17671403 17792583 17936783 18030879 18096547
3293A8096547N6934N2786J08259L7512R8854j2000Q897O7285M1703J2644L3645
$$ 18096547 18153481 18206267 18314526 18352038 18450892 18438892 18447789 18515074 18556777 18569421 18603066
3282A8603066J7471n03o875k0893k1959o5991m0709l6036M9565O4337P8111L0900
$$ 18603066 18620537 18620034 18613159 18592266 18570307 18504316 18463607 18427571 18477136 18541473 18619584 18650484
3270A8650484J30117J57129J14804K23952K54021K87642K43079K80154K59624
$$ 18650484 18780601 18937730 19052534 19276486 19530507 19818149 20061228 20341382 20601006
3261B0601006K50349L00357K63121K39310J55866K88424K37290K19891K83921
$$ 20601006 20851355 21151712 21414833 21654143 21810009 22098433 22335723 22555614 22839535
3252B2839535K24778K51674L51474L49844L32720K92048K76562K41529K48805
$$ 22839535 23064313 23315987 23667461 24017305 24350025 24642073 24918635 25160164 25408969
3243B5408969J99543K31546K61261J98668L17795L51837M46305M68200M73687
$$ 25408969 25608512 25840058 26101319 26299987 26617782 26969619 27415924 27884124 28357811
3234B8357811N76626N87319O61689O69689P31319Q07494Q22452Q76140R84392
$$ 28357811 28934437 29521756 30183445 30853134 31584453 32391947 33214399 34090539 35074931
3225C5074931R95806J182673J274664J373559J606959J666752J817561K030951
$$ 35074931 36070737 37253410 38528074 39901633 41508592 43175344 44992905 47023856
3217D7023856K258483K501199K704818K950824L222715L646803M175131M767911
$$ 47023856 49282339 51783538 54488356 57439180 60661895 64308698 68483829 73251740
3209G3251740N500880O241209P002207P857034Q676786R327648R938514J0160279
$$ 73251740 78752620 84993829 91996036 99853070 108529856 117857504 127796018 137956297
3201A37956297J0019221R336311Q005793O144303L706051P80660k448320n562764
$$ 137956297 147975518 157311829 165317622 171461925 175167976 175948636 173500316 167937552
3193A67937552q222204j0323801j1452178j1795172j1471021j0719454r684668
$$ 167937552 159715348 149391547 137939369 126144197 114673176 103953722 94269054
3186I4269054q392895p348451o374738n466741m641327m024502l464933l005313
$$ 94269054 85876159 78527708 72152970 66686229 62044902 58020400 54555467 51550154
3178E1550154k639761k223862j992016j785075j575542j310281j174958j099202
$$ 51550154 48910393 46686531 44694515 42909440 41333898 40023617 38848659 37749457
3170C7749457r65168q45202p07725p02915n94577n49776l99187l06415k34021
$$ 37749457 36784289 35939087 35231362 34528447 33933870 33384094 32984907 32678492 32444471
3161C2444471j79378n8376J00519R8542K47244L07211L21123M72514M24923N30224
$$ 32444471 32265093 32206717 32307236 32405778 32653022 32960233 33281356 33753870 34178793 34709017
3151C4709017M79491N09572M30517L43877L79143K49386K27703J88524J81455
$$ 34709017 35188508 35698080 36128597 36472474 36851617 37101003 37328706 37517230 37698685
3142C7698685K53322L44263M05122L15324M52296M87925M88437N11296N45154
$$ 37698685 37952007 38296270 38701392 39016716 39469012 39956937 40445374 40956670 41501824
3133D1501824M24227N24285M86191M68281N49135N46131N74164N60739N97677
$$ 41501824 41926051 42450336 42936527 43404808 43953943 44500074 45074238 45634977 46232654
3124D6232654M97630N82830N67036M77954M16462M84359M67954N58569N93609
$$ 46232654 46730284 47313114 47880150 48358104 48774566 49258925 49726879 50285448 50879057
3115E0879057P06310P49452P96701P46306Q61566R12316R12394R60321J010959
$$ 50879057 51585367 52334819 53131520 53877826 54739392 55651708 56564102 57524423 58535382
3106E8535382J090741J117195J255189J470914J546599J842210K065268K207075
$$ 58535382 59626123 60743318 61998507 63469421 65016020 66858230 68923498 71130573
3098G1130573K470268K663670K809845L041571L196285L321890L473162L505603
$$ 71130573 73600841 76264511 79074356 82115927 85312212 88634102 92107264 95612867
3090I5612867L476792L480168L287136L090569K858241K589845K390243K225837
$$ 95612867 99089659 102569827 105856963 108947532 111805773 114395618 116785861 119011698
3082A19011698K140666K113336K062750K012868K027846J973323J853866J711452
$$ 119011698 121152364 123265700 125328450 127341318 129369164 131342487 133196353 134907805
3074A34907805J194552Q27242K79238l02490q48813j340139j706533k070862k322688
$$ 134907805 136102357 136929599 137208837 136906347 136057534 134717395 133010862 130940000 128617312
3065A28617312k453518k511754k698509k605071k581422k526509k507829k537133
$$ 128617312 126163794 123652040 120953531 118348460 115767038 113240529 110732700 108195567
3057A08195567k551338k644667k828959k920913l155017l432879l553371l540431
$$ 108195567 105644229 102999562 100170603 97249690 94094673 90661794 87108423 83567992
3049H3567992l516351l393057l089603k929104k654922k386228k394666k245819
$$ 83567992 80051641 76658584 73568981 70639877 67984955 65598727 63204061 60958242
3041F0958242j922331j585209j327862j505666j876743j906869j758982j596105
$$ 60958242 59035911 57450702 56122840 54617174 52740431 50833562 49074580 47478475
3033D7478475j404532j119563q27667o87543n55386m05262k35943j39799j0116
$$ 47478475 46073943 44954380 44126713 43439170 42883784 42478522 42242579 42102780 42092664
3024D2092664P2784J45904K70612K67461L93481M13735M78476N97339N32016J75320
$$ 42092664 42165448 42311352 42581964 42849425 43242906 43656641 44135117 44732456 45264472 45439792
3014D5439792k74389k42569K734K48750J76108p82220j634181j751205j704189
$$ 45439792 45165403 44922834 44925568 45174318 45350426 44568206 42934025 41182820 39478631
3005C9478631j709140j486786j250157j083200j044141q91512q97754p60170o99242
$$ 39478631 37769491 36282705 35032548 33949348 32905207 32013695 31115941 30355771 29656529
2996B9656529o23276m75750m56197l08922k24252r8214K906M5425J90210J54876
$$ 29656529 29033253 28557503 28101306 27792384 27568132 27469918 27472824 27518249 27708459 27863335
2986B7863335J48302M0969J23868L11685L62703K95136j61198n12379l90413m35261
$$ 27863335 28011637 28052606 28176474 28488159 28850862 29145998 28984800 28472421 28082008 27646747
2976B7646747l85866k55639r1882n7167M2052P5375J11091J53498J37262L05030
$$ 27646747 27260881 27005242 26913360 26856193 26898245 26973620 27084711 27238209 27375471 27680501
2966B7680501K79875L02229K82763K83018L10162L32092L97048L47941L57713
$$ 27680501 27960376 28262605 28545368 28828386 29138548 29470640 29867688 30215629 30573342
2957C0573342M55021M49272N28555N32909O10388O11099P52236P74372P66667
$$ 30573342 31028363 31477635 32006190 32539099 33149487 33760586 34512822 35287194 36053861
2948C6053861P85947Q38116Q60956J013968J195888J370676J542266J731556J973050
$$ 36053861 36839808 37677924 38538880 39552848 40748736 42119412 43661678 45393234 47366284
2939D7366284K273793K476692K754966K983802L230586L526951L890692L884842
$$ 47366284 49640077 52116769 54871735 57855537 61086123 64613074 68503766 72388608
2931G2388608L977781L790718L500557L108824K428101J713879P90063j77714
$$ 72388608 76366389 80157107 83657664 86766488 89194589 90908468 91698531 91520817
2923I1520817j166436k185216l117288l852193m446360m789697m933041m762979
$$ 91520817 90354381 88169165 85051877 81199684 76753324 71963627 67030586 62267607
2915F2267607m576863m234622l839030l381434k985795k526390k340241k145678
$$ 62267607 57690744 53456122 49617092 46235658 43249863 40723473 38383232 36237554
2907C6237554j812028j718373j625818j444902j358781j225844j221399j138884
$$ 36237554 34425526 32707153 31081335 29636433 28277652 27051808 25830409 24691525
2899B4691525j070400j047201r05899q65182q28610p77589p08463p37498n77629
$$ 24691525 23621125 22573924 21668025 20802843 19974233 19196644 18488181 17750683 17173054
2890A7173054n00479n30168n18310m98785m02082l34277l23358l16496l02223
$$ 17173054 16672575 16142407 15624097 15125312 14723230 14388953 14065595 13749099 13446876
2881A3446876k82636k32861l02106k62075j72549k27645k55030j67583j62991
$$ 13446876 13164240 12931379 12629273 12367198 12194649 11967004 11711974 11544391 11381400
2872A1381400k15016k51913k11509j67928j58289j60866k48739q0805r4383j59158
$$ 11381400 11166384 10914471 10702962 10535034 10376745 10215879 9967140 9886335 9791952 9632794
2862I632794j29700j62256j18737j06315j44259j16185j29111j17129r9329m6500
$$ 9632794 9503094 9340838 9222101 9115786 8971527 8855342 8726231 8609102 8509773 8463273
2852H463273j27371j50962r9035m5611o6725r2219j6541k0564m4474o1575p9437
$$ 8463273 8335902 8184940 8085905 8040294 7973569 7881350 7864809 7844245 7799771 7738196 7658759
2841G658759k1314M866n3259j4107J5010J5209K664m9733k43K0956j942P2807
$$ 7658759 7637445 7642311 7589052 7574945 7589955 7605164 7607828 7558095 7557852 7578808 7576866 7649673
2829G649673L2839J482N2413O9710J9367M015N5908M8337L1160Q2792Q5636Q1393
$$ 7649673 7682512 7683994 7736407 7806117 7825484 7829499 7885407 7933744 7964904 8047696 8133332 8214725
2817H214725N184Q1095Q5298Q3496J31101M9616J12703Q4430J05991O2475Q0933
$$ 8214725 8219909 8301004 8386302 8469798 8600899 8650515 8763218 8847648 8953639 9016114 9097047
2806I097047J45744Q6866J10424O6157J02556Q9259J01388J40389K50782J55493
$$ 9097047 9242791 9329657 9440081 9506238 9608794 9698053 9799441 9939830 10190612 10346105
2796A0346105J76114K20799K43746K70335K72575K60837K88229L06950L09416
$$ 10346105 10522219 10743018 10986764 11257099 11529674 11790511 12078740 12385690 12695106
2787A2695106L76790L78609L45834L34717L39242L40342L00608L78506K88071
$$ 12695106 13071896 13450505 13796339 14131056 14470298 14810640 15111248 15489754 15777825
2778A5777825K52950K50524L65398L66950K76911M45269M77968M85310O03973
$$ 15777825 16030775 16281299 16646697 17013647 17290558 17735827 18213795 18699105 19303078
2769A9303078N98755O12350O63724P91846P40569P59491P28607P70702Q20120
$$ 19303078 19901833 20514183 21177907 21969753 22710322 23469813 24198420 24969122 25789242
2760B5789242P84181Q44966Q96984Q99618Q67016R38878J029564J089873J191730
$$ 25789242 26573423 27418389 28315373 29214991 30082007 31020885 32050449 33140322 34332052
2751C4332052J327938J377594J520826J526914J569232J664040J664619J748041
$$ 34332052 35659990 37037584 38558410 40085324 41654556 43318596 44983215 46731256
2743D6731256J894530K006425K283909K417605K651942K993385L355987L620507
$$ 46731256 48625786 50632211 52916120 55333725 57985667 60979052 64335039 67955546
2735F7955546L950095M137592M194857M024147L778312L409751K891413K093776
$$ 67955546 71905641 76043233 80238090 84262237 88040549 91450300 94341713 96435489
2727I6435489J323051R40668J047472J303813J378720J182695J244353J479422
$$ 96435489 97758540 98699208 99746680 101050493 102429213 103611908 104856261 106335683
2719A06335683K001287K491911K926122L280938L053208K439013J959646J985042
$$ 106335683 108336970 110828881 113755003 117035941 120089149 122528162 124487808 126472850
2711A26472850K691319L658753M978033O484049P856588R424881J1071998J3148168
$$ 126472850 129164169 132822922 137800955 144285004 152141592 161566473 172638471 185786639
2703A85786639J5314456J7215671J8890407J9899573J9145454J5780943J0831842
$$ 185786639 201101095 218316766 237207173 257106746 276252200 292033143 302864985
2696C02864985O143655N22421q361715j9684644k8053846k9912784k6873685k2165996
$$ 302864985 309008640 309531061 301169346 281484702 253430856 223518072 196644387 174478391
2688A74478391j7752946j4342961j1661060r755984q481536p224868o128055n192832
$$ 174478391 156725445 142382484 130721424 120965440 112483904 105259036 99130981 93938149
2680I3938149m737917m548434m268059m153742m139787m164532m110565l838753
$$ 93938149 89200232 84651798 80383739 76229997 72090210 67925678 63815113 59976360
2672E9976360l499601l133729k806992k562357k344357k280706k106017j866890
$$ 59976360 56476759 53343030 50536038 47973681 45629324 43348618 41242601 39375711
2664C9375711j792427j620526j558936j435882j290801j178866j131412r74432
$$ 39375711 37583284 35962758 34403822 32967940 31677139 30498273 29366861 28392429
2656B8392429r47570r64973q68718r19414q03773p89836p70417p39084o44110
$$ 28392429 27444859 26479886 25611168 24691754 23887981 23098145 22327728 21588644 20944534
2647B0944534n94738n97780n13815m66115m88057m35358m49054m45340m40883
$$ 20944534 20349796 19752016 19238201 18772086 18284029 17848671 17399617 16954277 16513394
2638A6513394l98892l48899m26507m29252l31963l69858m08196l80157l73855
$$ 16513394 16114502 15765603 15339096 14909844 14577881 14208023 13799827 13419670 13045815
2629A3045815m19857m58398l46072l91205l68468l58321l15600l20288k86654
$$ 13045815 12625958 12167560 11821488 11430283 11061815 10703494 10387894 10067606 9780952
2620I780952j92933k50639k76826k73649j86382k18729j74472j24898j27225j73097
$$ 9780952 9588019 9337380 9060554 8786905 8600523 8381794 8207322 8082424 7955199 7782102
2610G782102j18248j49169j24421j65899j71917j85842k16922j49492k13651r4544
$$ 7782102 7663854 7514685 7390264 7224365 7052448 6866606 6649684 6500192 6286541 6191997
2600F191997r8622j83661j53356r0042q4350j78869j31913o4327j15862r2527
$$ 6191997 6093375 5909714 5756358 5666316 5581966 5403097 5271184 5206857 5090995 4998468
2590D998468j37535j24137r1796j39994r8857j45219j04909p7466r1745k00616
$$ 4998468 4860933 4736796 4645000 4505006 4406149 4260930 4156021 4078555 3986810 3786194
2580C786194r2362j00360n8125l2120r0513j9968p6071m1700m0525l5671p3906
$$ 3786194 3693832 3593472 3535347 3503227 3412714 3392746 3316675 3274975 3234450 3198779 3124873
2569C124873j00438l3883l0442o6915p1480l0358m9362j61186n7800l1936n965
$$ 3124873 3024435 2990552 2960110 2893195 2821715 2791357 2741995 2580809 2523009 2491073 2485108
2558B485108l1935o0149o7618q5870k5260j8196l0829l0425n0563l9181N7588
$$ 2485108 2453173 2393024 2325406 2239536 2214276 2196080 2165251 2134826 2084263 2045082 2102670
2547B102670J6332o7512k4514q0353k3271m7868k1822K6391n6424m2258o7621
$$ 2102670 2119002 2051490 2026976 1946623 1923352 1875484 1853662 1880053 1823629 1781371 1713750
2536A713750p403M4305l9014l5812N745o014n8749n4706L1K402J689p1768l9458
$$ 1713750 1706347 1750652 1711638 1675826 1681571 1675557 1616808 1562102 1562133 1564535 1566224 1494456 1454998
2523A454998R071j4643j5694l2208m4762m8888k9518m2143m6163L8033j5392L0722
$$ 1454998 1464069 1449426 1433732 1401524 1356762 1307874 1278356 1236213 1190050 1228083 1212691 1243413
2511A243413k4110j07327L4899j1640l5709k4389K0101l3581j3254K9590R331
$$ 1243413 1219303 1111976 1146875 1135235 1099526 1075137 1095238 1061657 1048403 1077993 1087324
2500A087324l6026J4607L5868J6703j6242k658j4156P658k3193n6652J0392Q223
$$ 1087324 1051298 1065905 1101773 1118476 1102234 1099576 1085420 1093078 1069885 1013233 1023625 1031848
2488A031848p085R935J4522N0791o395p9312J8742j9531J1212P4843j4999J1081
$$ 1031848 1024763 1034698 1049220 1100011 1093616 1014304 1033046 1013515 1024727 1099570 1084571 1095652
2476A095652L3900N3375k9375l6678m575J8103K7570M229n247k6894J0215m188
$$ 1095652 1129552 1182927 1153552 1116874 1112299 1130402 1157972 1162201 1156954 1130060 1140275 1136087
2464A136087Q128k1145M347n5540K9597K3007O758N943Q573O4981q591K4013K8113
$$ 1136087 1144215 1123070 1127417 1071877 1101474 1124481 1131239 1137182 1145755 1210736 1202145 1226158 1254271
2451A254271r05Q3851N7533N8630N0617O5371P3847J08594P6540O7774M5877K9983
$$ 1254271 1253366 1337217 1394750 1453380 1503997 1569368 1643215 1751809 1828349 1896123 1942000 1971983
2439A971983n832j01702j00134j32816j08121j54940j32222p1037k7149j21418
$$ 1971983 1966151 1864449 1764315 1631499 1523378 1368438 1236216 1165179 1138030 1016612
2429A016612l1455o3368n3500K1829q5517k4887M6639k7123K6803m3262m0815
$$ 1016612 985157 921789 868289 890118 804601 779714 826353 799230 826033 782771 741956
2418G41956j6531o5043l8075k5318J2210j7504O693m9176J8913l8637o778j7818
$$ 741956 725425 660382 622307 596989 609199 591695 598388 549212 568125 529488 522710 504892
2406E04892J2364P025n5191k9923q141J2631j690o3526M7963J5714L919k3269
$$ 504892 517256 524281 469090 439167 431026 443657 441967 378441 426404 442118 446037 422768
2394D22768m8482L7875p043M753L6930m7300p5785j01511M4749r466K799M6307
$$ 422768 374286 412161 405118 409871 446801 399501 323716 222205 266954 257488 260287 306594
2382C06594k8516n0885K4950M952l6321J5180q28K3699j5984j4352l4009N1692
$$ 306594 278078 227193 252143 257095 220774 235954 235126 258825 242841 228489 194480 246172
2370B46172l2280k3829k2112J4544l7402J6895j5754K0803n3749J3124Q751k4671
$$ 246172 213892 190063 167951 182495 145093 161988 146234 167037 113288 126412 135163 110492
2358A10492k2390j1765L9015M6111p980l3681k0142q4097O2482q20o79j5593M714
$$ 110492 88102 76337 115352 161463 153483 119802 99660 15563 78045 77225 76546 60953 65667
2345F5667P054m7487K944n024N761L6589M281R931p0255M7246n2385m2983K4518
$$ 65667 72721 25234 28178 23154 28915 65504 69785 79716 9461 56707 4322 -38661 -14143
2332a4143l388L5892p276P2389q295m2769k4429m396r287r446q556k6205K386
$$ -14143 -17531 18361 11085 83474 75179 32410 7981 3585 -5702 -15148 -23704 -49909 -47523
2319d7523L7610K6525K0287k8243M1824J2898k5599j2505k2343J9268k8922l7409
$$ -47523 -9913 16612 36899 8656 50480 63378 37779 25274 2931 22199 -6723 -44132
2307d4132q603L8042n2746N4224K1859m2076p98J616L5884j6465k1766M7104J0238
$$ -44132 -52735 -14693 -67439 -13215 8644 -33432 -34230 -32614 3270 -13195 -34961 12143 22381
2294B2381j8275N3311L8368Q265o3791K1448k7174r718j1376K5383N4063j9623
$$ 22381 4106 57417 95785 104050 40259 61707 34533 24815 13439 38822 92885 73262
2282G3262m6729j6832O899m0192N4250J1481J4075r303k9797j635l0697M0916
$$ 73262 26533 9701 16600 -23592 30658 42139 56214 46911 17114 15479 -15218 25698
2270B5698l8767m3396K0399J4651J1169l7066J3130q984n4705J9114j6177M9523
$$ 25698 -13069 -56465 -36066 -21415 -10246 -47312 -34182 -43166 -97871 -78757 -94934 -45411
2258d5411k6919l1109K1905j5584l547K064K0583k8239l5108K7452q080J6703
$$ -45411 -72330 -103439 -81534 -97118 -100665 -98601 -78018 -106257 -141365 -113913 -121993 -105290
2246a05290j49L6183N3268o0733L2380R125n6692P331N1576j1p0397O4811j6520
$$ -105290 -105439 -69256 -15988 -76721 -44341 -35216 -91908 -84577 -33001 -33012 -103409 -38598 -55118
2233e5118j6808l6703l2549L4727q6426J00243K6732m449J5276j4863J5357j7298
$$ -55118 -71926 -108629 -141178 -106451 -192877 -92634 -65902 -70351 -55075 -69938 -54581 -71879
2221g1879l221K3078k7594O255J9718J4965n0235N5139K031k7141J3779n1611
$$ -71879 -75100 -52022 -79616 -73361 -53643 -38678 -88913 -33774 -31743 -58884 -45105 -96716
2209i6716J8582J0975N2785K8051k5748J7228o6492n7027j9M8068L6773l4844
$$ -96716 -78134 -67159 -14374 13677 -12071 5157 -61335 -118362 -118381 -70313 -33540 -68384
2197f8384J382K0448p597O770P959M0636k1452J817K6103j8882K214j7949j2949
$$ -68384 -67002 -46554 -54151 -47381 -39422 1214 -20238 -18421 7682 -11200 -8986 -26935 -39884
2184c9884J3820N0705o6574m0729M7055L7391j7717J1723m0697R189L5278j6497
$$ -39884 -26064 24641 -41933 -82662 -35607 1784 -15933 -4210 -44907 -35718 -440 -16937
2172a6937k2088q61K0583M9309N7612J2372J9741p5098j0683l7121k7831M4033
$$ -16937 -39025 -39886 -19303 30006 87618 99990 119731 44633 33950 -3171 -31002 13031
2160A3031J9119j7010m9499L0729M7525P649P5546k8708p4414L3141Q225j372
$$ 13031 32150 15140 -34359 -3630 43895 51544 127090 98382 23968 57109 65334 63962
2148F3962K8505K7001o0260j3798q681J4672j4102L4238L1533K7664J8852m8292
$$ 63962 92467 119468 59208 45410 36729 51401 37299 71537 103070 130734 149586 101294
2136A01294k4138L6532R883k9588m4977m5852P31N0376R6280l900j5635k6527
$$ 101294 77156 113688 123571 93983 49006 3154 3885 54261 150541 146641 131006 104479
2124A04479L4330K6784M337K9383j0936L0177L4769k5524K0740k055k4272N2469
$$ 104479 138809 165593 169930 199313 188377 218554 253323 227799 248539 246484 222212 274681
2112B74681M3016j5564n5577J143M2517P605K1405L4392K9214O292P5406q885
$$ 274681 317697 302133 246556 247699 290216 297821 319226 353618 382832 389124 464530 455645
2100D55645J5430R143j5814M9768m2351Q977K7720J3648K7905J0979k1280N7666
$$ 455645 471075 480218 464404 514172 471821 480798 508518 522166 550071 561050 539770 597436
2088E97436O355P6284j9483O669K5312L8228N7826J7267L6101O2163R3416L0121
$$ 597436 603791 680075 660592 667261 692573 730801 788627 805894 841995 904158 997574 1027695
2076A027695P9487N359L2109J53259J28730M0355M1149J03995J51480J64777K04052
$$ 1027695 1107182 1112541 1144650 1297909 1426639 1466994 1508143 1612138 1763618 1928395 2132447
2065B132447K28353J56023K23393K77213L36787M37838L72293M15384N47615O55984
$$ 2132447 2360800 2516823 2740216 3017429 3354216 3792054 4164347 4579731 5127346 5783330
2055E783330Q74589J103952J443483J911614J997888J068449Q16882J761594J555483
$$ 5783330 6657919 7761871 9205354 11116968 13114856 14183305 15000187 16761781 18317264
2046A8317264j242287l834674l314333k098366j301615r41547p61399o00174m27927
$$ 18317264 17074977 13240303 9925970 7827604 6525989 5584442 4823043 4222869 3794942
2037C794942l48869k85532j91018j67750j49892k08408k49922k50375j64131q2814
$$ 3794942 3446073 3160541 2969523 2801773 2651881 2443473 2193551 1943176 1779045 1696231
2027A696231j32590r7845j14168j40123k1838m6377m9007j1650n2211j07458o3110
$$ 1696231 1563641 1465796 1351628 1211505 1189667 1143290 1094283 1082633 1030422 922964 859854
2016H59854n7784l9086K1736o5995o2601m2387K9549q0847k1686k5393k1284J3067
$$ 859854 802070 762984 784720 718725 656124 613737 643286 562439 540753 515360 494076 507143
2004E07143r8111L7392l6436j2895K4094k9641k3527j8150n8879n2364K2634j260
$$ 507143 409032 446424 409988 397093 421187 391546 368019 349869 290990 238626 261260 260000
1992B60000m4990J1391n2620M8994l4964L9916j1028k5165M9869j4458n3155n2628
$$ 260000 215010 226401 173781 222775 187811 227727 216699 191534 241403 226945 173790 121162
1980A21162o0226O5405M1587r2135M5334j0575o5239J7634M2656L11n9035l479
$$ 121162 60936 126341 167928 75793 121127 110552 45313 62947 105603 105914 46879 43400
1968D3400l663L1741j2695p6727O2488M6509m0825j0425K7707o673j2960j052
$$ 43400 39737 71478 58783 -17944 44544 91053 50228 39803 67510 60837 47877 46825
1956D6825j7516N053j9727K5279K0699l0608k9327J1171j1976l1618O6149n9081
$$ 46825 29309 34362 14635 39914 60613 30005 678 11849 -127 -31745 34404 -24677
1944b4677l4591k729J3933k6088O4354m3817o317n496j1211m4786L7895K421J5369
$$ -24677 -59268 -61997 -48064 -74152 -9798 -53615 -59932 -65428 -76639 -121425 -83530 -81109 -65740
1931f5740R5588r621q2236j9713l7563K2705M5079n5695l62m1929O5472J9820
$$ -65740 29848 20227 -62009 -81722 -119285 -96580 -51501 -107196 -107558 -149487 -84015 -64195
1919f4195m2017P0514J3538n0409K621J2649j5381k3981L4425l1073M9208k2492
$$ -64195 -106212 -35698 -22160 -72569 -69948 -57299 -72680 -96661 -62236 -93309 -44101 -66593
1907f6593m3815L5411K4254m1785k5023k728N1013R252j6856r4220L9917N2180
$$ -66593 -110408 -74997 -50743 -92528 -117551 -120279 -69266 -60014 -76870 -171090 -131173 -78993
1895g8993j1867K580k3221L1309m7944K7324Q6818j6325o5764P951J0398J103
$$ -78993 -90860 -88280 -111501 -80192 -128136 -100812 -13994 -30319 -96083 -88132 -77734 -76631
1883g6631J3961L7343l8389J6336K8628m6761o9687K2135J3748k2710j7897K3022
$$ -76631 -62670 -25327 -63716 -47380 -18752 -65513 -135200 -113065 -99317 -122027 -139924 -116902
1871a16902K3578o6806Q452J2107l0176J7054Q211k3071M3430K8360K7790K2263
$$ -116902 -93324 -160130 -151678 -139571 -169747 -152693 -144482 -167553 -124123 -95763 -67973 -45710
1859d5710j0125l0433J9031k8342K1715k2223J1282o849p03r135k7114k7705o831
$$ -45710 -55835 -86268 -67237 -95579 -73864 -96087 -84805 -91654 -92357 -101492 -128606 -156311 -163142
1846a63142N4365K0758k7698L6713n310J9778k0287p0315J8484K6309k6397j4615
$$ -163142 -108777 -88019 -115717 -79004 -84314 -64536 -84823 -155138 -136654 -110345 -136742 -151357
1834a51357O8504q135k9556l4654r974Q547k893K7254l2850K0468N9940j7255
$$ -151357 -82853 -90988 -120544 -155198 -165172 -156625 -159518 -132264 -165114 -144646 -84706 -101961
1822a01961n3153k0831O4003J8005K5055m9625K5876l3568M5791n4062P2120J6776
$$ -101961 -155114 -175945 -111942 -93937 -68882 -118507 -92631 -126199 -80408 -134470 -62350 -45574
1810d5574l7026J8415P37q056K9720q665k2642O4646l2253n4053n573N7088m3469
$$ -45574 -82600 -64185 -63448 -71504 -41784 -50449 -73091 -8445 -40698 -94751 -100324 -43236 -86705
1797h6705k8220J7479M2722m748m0157k8063j9924J8352J7177M5636m8989q4326
$$ -86705 -114925 -97446 -54724 -59472 -99629 -127692 -147616 -129264 -112087 -66451 -115440 -199766
1785a99766N7482L4361K2969j3513J7649L8880R840l3053n6402k219j6103L7895
$$ -199766 -142284 -107923 -84954 -98467 -80818 -41938 -32098 -65151 -121553 -123772 -139875 -101980
1773a01980Q214m3630O435o910N7345l0684m4360Q4897l5753l2016K9989J8441
$$ -101980 -93766 -137396 -130961 -137871 -80526 -111210 -155570 -70673 -106426 -138442 -108453 -90012
1761i0012k84p3990K2897J6683J813j4053K7797O5960l3028k1063K4168m9297
$$ -90012 -90296 -164286 -141389 -124706 -122893 -136946 -109149 -43189 -76217 -97280 -73112 -122409
1749a22409q000N0413m081j1039J1391j7068k8917K283j8734L271M1329P577j2330
$$ -122409 -130409 -79996 -84077 -95116 -83725 -100793 -129710 -127427 -146161 -142890 -101561 -93984 -106314
1736a06314Q481j1536P0442j3506J874n7913m6293L210l1424M5005m683n393j6023
$$ -106314 -97833 -109369 -38927 -52433 -50559 -108472 -154765 -151555 -182979 -137974 -142657 -148050 -164073
1723a64073R9442J1679O355n1456k0025M4016K1608k2851L1016L769M7859Q507
$$ -164073 -64631 -52952 -46597 -98053 -118078 -74062 -52454 -75305 -44289 -40520 7339 15846
1711A5846m5498q3483n3782P3837l6813N2882l7947k0695L1108K940k973K3441
$$ 15846 -29652 -113135 -166917 -93080 -129893 -77011 -114958 -135653 -104545 -101605 -104578 -81137
1699h1137L1669l8030k6853K6092n6142J1278l2526K4180N4082j8122J989q118
$$ -81137 -49468 -87498 -114351 -88259 -144401 -133123 -165649 -141469 -87387 -105509 -103520 -111638
1687a11638L3921k2153L865M4004J602m9558l9565J8628j9759N602N2238n2049
$$ -111638 -77717 -99870 -96005 -52001 -50399 -99957 -139522 -120894 -140653 -135051 -82813 -134862
1675a34862K4693j4961N8467K100N419P283m3276j4124K647K0881l3190M7246
$$ -134862 -110169 -125130 -66663 -64563 -59144 -51861 -95137 -109261 -106614 -85733 -118923 -71677
1663g1677Q845j1615L285j3266l6638Q28R843L617j7235N0159N411r236L4401
$$ -71677 -62832 -74447 -71162 -84428 -121066 -120238 -110395 -106778 -124013 -73854 -68443 -77679 -43278
1650d3278Q80k2129l774m3342r318K8740j1648K6848p042n5737j0133Q9619m52
$$ -43278 -42398 -64527 -68301 -111643 -120961 -92221 -103869 -77021 -84063 -139800 -149933 -60314 -60766
1637f0766J3082J678l9890L3665j2904k2715j5203L158L4072M546J6788J0464
$$ -60766 -47684 -46006 -85896 -52231 -65135 -87850 -103053 -99895 -65823 -61277 -44489 -34025
1625c4025m5488n387P766P57L0650l1975r723k1086l1887L8694q5075J0444K863
$$ -34025 -79513 -84900 -77134 -76377 -45727 -77702 -87425 -108511 -140398 -101704 -186779 -176335 -173472
1612a73472K4482J8878M6510l3822J2587P6587m6259k2201k0637l011J7255Q054
$$ -173472 -148990 -130112 -83602 -117424 -104837 -28250 -74509 -96710 -117347 -120358 -103103 -95049
1600i5049K3352M9145n7407k0641M8482j0738n8335J2525k0084N8778n484p3925
$$ -95049 -71697 -22552 -79959 -100600 -52118 -62856 -121191 -108666 -128750 -69972 -75456 -149381
1588a49381P3367j6421m2685K8843j3303R8626l5399l8128j9963K3331o976m5630
$$ -149381 -76014 -92435 -135120 -106277 -119580 -20954 -56353 -94481 -114444 -91113 -98089 -143719
1576a43719J0950n1355k4486L8893L5311N637j7594P8647P797n9924M336N2658
$$ -143719 -132769 -184124 -208610 -169717 -134406 -128769 -146363 -67716 -59919 -119843 -115507 -62849
1564f2849L5643q4567J8396j5387R2275L1024o6260m847l1606K0649l7594K963
$$ -62849 -27206 -111773 -93377 -108764 -16489 14535 -51725 -56572 -88178 -67529 -105123 -102160
1552a02160J9870j4083N5701N3005Q379k0096l5385J8780l0391l0589K032M8094
$$ -102160 -82290 -96373 -40672 12333 20712 616 -34769 -15989 -46380 -76969 -74937 -26843
1540b6843k586n7209M2630j673k9322j4619J4485m2383L2763J207L4259m2807
$$ -26843 -29429 -86638 -44008 -45681 -75003 -89622 -75137 -117520 -84757 -83550 -49291 -92098
1528i2098M0713M0188k9504m7533K2178K2078J188m6282p072L4203j8938J94l3109
$$ -92098 -51385 -11197 -40701 -88234 -66056 -43978 -42790 -89072 -96144 -61941 -80879 -80685 -113794
1515a13794O1936n0612k856K1325K3010Q496m0234J005K7370j3397l9598O2112
$$ -113794 -51858 -102470 -105326 -84001 -60991 -52495 -92729 -91724 -64354 -77751 -117349 -55237
1503e5237m002N233j2055q375L103k7998M4234M2923j2428k3985j5769l8197J9583
$$ -55237 -59239 -54006 -66061 -74436 -71333 -99331 -55097 -12174 -24602 -48587 -64356 -102553 -82970
1490h2970K7053l557m5518o086L4200P785K798N3379l7180N264K2104R477m2852
$$ -82970 -55917 -59474 -104992 -111078 -76878 -69093 -66295 -12916 -50096 -44832 -22728 -13251 -56103
1477e6103M157Q399l8464K5129K3026j5174O855l0197L5941j6954N1440k020m4563
$$ -56103 -51946 -43547 -82011 -56882 -33856 -49030 -42175 -72372 -36431 -53385 -1945 -3965 -48528
1464d8528l3448k0315K5793K166M7773l8447k3883K4982j6463j5955O0797j6559
$$ -48528 -81976 -102291 -76498 -74332 -26559 -65006 -88889 -63907 -80370 -96325 -35528 -52087
1452e2087j8105J8345j1356K6850O345O2L5285l091j8807k4779l6006j3472J748
$$ -52087 -70192 -51847 -63203 -36353 -30008 -29946 5339 2248 -16559 -41338 -77344 -90816 -89068
1439h9068j1485L54j0773J1186J05901l1028p3917O593M0162j7392l0010Q4868
$$ -89068 -100553 -100199 -110972 -99786 6115 -24913 -98830 -92237 -52075 -69467 -99477 -14609
1427a4609k5508o841J8852K9143K8288m7887m0398j4092k177J05083M559q9718
$$ -14609 -40117 -46958 -28106 1037 29325 -18562 -58960 -73052 -75229 29854 34413 -55305
1415e5305o84K2155j9194K466j1769J7821j0394J2671J2610m6761J5369M3899
$$ -55305 -55989 -33834 -53028 -50562 -62331 -44510 -54904 -42233 -29623 -76384 -61015 -17116
1403a7116o0482L8677R634K539n2419k5957M7236J9671k0933L9389k4012n4393
$$ -17116 -77598 -38921 -29287 -26748 -79167 -105124 -57888 -38217 -59150 -19761 -43773 -98166
1391i8166l1565O3379M9099j2207O4559p7879l5552j1067Q2187m7431k226N419
$$ -98166 -129731 -66352 -17253 -29460 35099 -42780 -78332 -89399 -7212 -54643 -56869 -51450
1379e1450o621K1956l1110j372m3891N3483J3154j2260O191m8584O6603n5718
$$ -51450 -58071 -36115 -67225 -68597 -112488 -59005 -45851 -58111 -51920 -100504 -33901 -89619
1367h9619M366K1666j5120M0472l28o8446m094j4375M8025j3873N2015k7148j8819
$$ -89619 -85253 -63587 -78707 -38235 -38563 -107009 -111103 -125478 -77453 -91326 -39311 -66459 -85278
1354h5278L0888J4073J6120o1113J6355k9376M7970j7493J5376m0163J2762n452
$$ -85278 -54390 -40317 -24197 -85310 -68955 -98331 -50361 -67854 -52478 -92641 -79879 -85331
1342h5331P0732J8436q710j4311N169q04L4952J0459n7236J2454J8453l0692l2852
$$ -85331 -14599 3837 -4873 -19184 -14015 -14819 20133 30592 -26644 -14190 4263 -26429 -59281
1329e9281M7819N817L2360q0843k2027R1157k5760j419M464M1079k7954m6362
$$ -59281 -11462 -5645 26715 -54128 -76155 15002 -10758 -12177 -7713 33366 5412 -40950
1317d0950k8911K8219M1433k3279m102l8593L4407J065j4506o0221l3462N4355
$$ -40950 -69861 -41642 -209 -23488 -27590 -66183 -31776 -30711 -45217 -105438 -138900 -84545
1305h4545L3796l474n2675k271J5384j569L7816J089K5814j2747J4209N441p3410
$$ -84545 -50749 -54223 -106898 -109169 -93785 -95354 -57538 -56449 -30635 -43382 -29173 -23732 -97142
1292i7142j094Q428L838Q901l0937O6144k5606k6315O7663m0261L3889M0621J549
$$ -97142 -98236 -89808 -85970 -77069 -108006 -41862 -67468 -93783 -26120 -66381 -32492 8129 9678
1279I678j0771m3353p975k6948N6156M5050j2075j8872l7710O334p256K335j9839
$$ 9678 -1093 -44446 -52421 -79369 -23213 21837 9762 -9110 -46820 -40486 -47742 -45407 -65246
1266f5246L2263N9245m059m26k9571J5906j808l1670J1596j9434n615P5650m4144
$$ -65246 -32983 26262 22203 21777 -7794 8112 6304 -25366 -13770 -33204 -38819 36831 -7313
1253g313q6985L5410N1407l4620J5330p468k1657j354N3570l903k5580J3929k8196
$$ -7313 -94298 -58888 -7481 -42101 -26771 -34239 -55896 -57250 -3680 -7583 -33163 -19234 -47430
1240d7430j1584L1277J5529l8105J9295L438k5292K6263K5389k4616j3250m8277
$$ -47430 -59014 -27737 -12208 -50313 -31018 -27580 -52872 -26609 -1220 -25836 -39086 -87363
1228h7363K9479L2366k5112j7366K8135N601K7188J6513k2707J5378j1408k0736
$$ -87363 -57884 -25518 -50630 -67996 -39861 -34260 -7072 9441 -13266 2112 -9296 -30032
1216c0032k1837k3198M672K1868L3334j754L73J7976p877J0381l3889J7454K3035
$$ -30032 -51869 -75067 -70395 -48527 -15193 -16947 -16574 1402 -6475 3906 -29983 -12529 10506
1203A0506j5708j2926q256M3827q532k7814J901j4009J1456l99j1530L5498M9135
$$ 10506 -5202 -18128 -26384 17443 8911 -18903 -17002 -31011 -19555 -19954 -31484 4014 53149
1190E3149K8499m7526m9239L5986K1747l3804k567J4163k4312p8616M6427M9529
$$ 53149 81648 34122 -15117 20869 42616 8812 6245 20408 -3904 -82520 -36093 13436
1178A3436J0501k8687K357J9068L55M5298K4702l5720o9857j5595k1765Q412k8705
$$ 13436 23937 -4750 -2393 16675 17030 62328 87030 51310 -18547 -34142 -55907 -47495 -76200
1165g6200K1555k3356l223N8976j5223J5024l6362l8652N2932L7249L382k8150
$$ -76200 -54645 -78001 -81224 -22248 -37471 -22447 -58809 -97461 -44529 -7280 -3898 -32048
1153c2048K3135J664N1041l886K2422J8136o4457J5142l1210k896R587N4506j9092
$$ -32048 -8913 -7249 43792 39906 62328 80464 16007 31149 -61 -2957 6630 61136 42044
1140D2044l3175j6935J0443j5989O3923q4564J6152M3540K529J6819m3599k2605
$$ 42044 8869 -8066 2377 -13612 50311 -34253 -18101 25439 27968 44787 1188 -21417
1128b1417m1776n136l0617N5190K6493l6359j2104J0649K9112J128J4235k021
$$ -21417 -63193 -68329 -98946 -43756 -17263 -53622 -65726 -55077 -25965 -24837 -10602 -12623
1116a2623k7667K3084j0954J6130N7467o6119M019L766j0135J690m5110L4054
$$ -12623 -40290 -17206 -28160 -12030 45437 -20682 -16663 -12897 -23032 -21342 -66452 -32398
1104c2398k2200j7945P4010M036m9891J3973L7703k6637J4286m5953L9080M3679
$$ -32398 -54598 -72543 1467 5503 -44388 -30415 7288 -19349 -5063 -51016 -11936 31743
1092C1743o6434R1936m3230K0704P87J6042n6735n8788L1232R129n638Q1376n8754
$$ 31743 -34691 57245 14015 34719 35506 51548 -5187 -63975 -32743 -23614 -29252 52124 -6630
1079f630l2621J6441k7376R918j1874K2201M2690K8123J0523l1305o0032M0813
$$ -6630 -39251 -22810 -50186 -40268 -52142 -29941 12749 40872 51395 20090 -39942 871
1067H71K0956q7068J7128J6255K0724j0134n873N7071k6997K6807k6149P85k6303
$$ 871 21827 -65241 -48113 -31858 -11134 -21268 -27141 29930 2933 29740 3591 4376 -21927
1054b1927j8929J9699J3062l0102P1964J2897K2662L2658q2779k0304k0571P9863
$$ -21927 -40856 -21157 -8095 -38197 33767 46664 69326 101984 19205 -1099 -21670 58193
1042E8193Q047n2119j1971o892J2791M815P6877k0441n9353k0769j6734J9087
$$ 58193 66240 14121 2150 -4742 8049 12864 89741 69300 9947 -10822 -27556 -8469
1030h469n191L4738k6035N5017J101l3674M3123m3291m0546N5083J3955l6360
$$ -8469 -13660 21078 -4957 50060 51161 17487 60610 17319 -23227 31856 45811 9451
1018I451o9630K9491O7563j4907j5860m1303Q034p475K062j5747L3311M5889L9395
$$ 9451 -60179 -30688 36875 21968 6108 -35195 -27161 -34636 -32574 -48321 -15010 30879 70274
1005G0274j8471j6748o6447m7362K7839M1150M4835k0741n4045m2642K2765P1028
$$ 70274 51803 35055 -31392 -78754 -50915 -9765 35070 14329 -39716 -82358 -59593 11435
993A1435N2497p9978J08421l7192O929k1759m6870L1014l9241q868K3510q404
$$ 11435 63932 -16046 92375 55183 62112 40353 -6517 24497 -14744 -23612 -102 -8506
981h506l5443O2546K314n7354L2695L3179m384J3076J333K2503m667k9887l0848
$$ -8506 -43949 18597 20911 -36443 -3748 29431 25047 38123 39456 61959 57292 27405 -3443
968c443M7173m3546k331l3970M9545l4431K4283K3982j6123j6119O3988o183j2861
$$ -3443 43730 184 -2147 -36117 13428 -21003 3280 27262 11139 -4980 59008 52825 39964
955C9964P780O852j7429m3253l5684N9239j1828o010j1587j4545l3370j5658K6168
$$ 39964 47744 54596 37167 -6086 -41770 17469 5641 -369 -11956 -26501 -59871 -75529 -49361
942d9361J4740J9431l0802K8681P7634N9807r6739j3733J7043K028k5653N5975
$$ -49361 -34621 -15190 -45992 -17311 60323 120130 23391 9658 26701 28729 3076 59051
930E9051J3772J3812n8307L6701p910n5108L3641r136j3728J6289L660m0931j807
$$ 59051 72823 86635 28328 65029 57119 2011 35652 26516 12788 29077 32737 -8194 -10001
917a0001j7564L6672j9119J673N4787P57l8071k3008M3322J6475j4987J7863k5922
$$ -10001 -27565 9107 -10012 -8339 46448 47205 9134 -13874 29448 45923 30936 48799 22877
904B2877m2005k3567j4616R4799j1644j9041m6545l233N5945p171J3795K8771
$$ 22877 -19128 -42695 -57311 37488 25844 6803 -39742 -42975 12970 5799 19594 48365
892D8365j8370K0824m5705j3290K2980K2463n3000K3891K5691L8258j376p3902
$$ 48365 29995 50819 5114 -8176 14804 37267 -15733 8158 33849 72107 70731 -3171
880c171K2990k3995M3368P457m1366k4474M1363J0132j1022J0281J3240L5854
$$ -3171 19819 -4176 39192 46649 5283 -19191 22172 32304 21282 31563 44803 80657
868H0657k9463J6059l2755J5234K4916n4163j618J0086K0763q521L8342k7558
$$ 80657 51194 67253 34498 49732 74648 20485 18867 28953 49716 41195 79537 51979
856E1979n7253o11N4118k911L4538l270n4950k2814J6586j2819J7055N6484k5436
$$ 51979 -5274 -5885 48233 45322 79860 76590 21640 -1174 15412 2593 19648 76132 50696
843E0696L4565j524k2044j5784o808Q933j0288j0961N9573l4658j3241L4885m3290
$$ 50696 85261 83737 61693 45909 39101 48034 37746 26785 86358 51700 38459 73344 30054
830C0054m477j1855K4832k4801L0003M5641J1605K507m5963l2491j0320R425J498
$$ 30054 25577 13722 38554 13753 43756 89397 101002 103509 57546 25055 14735 24160 25658
817B5658j9857J8836K513l759j0199p423J5461K896P526R617J6660j9896M5549
$$ 25658 5801 24637 27150 23391 13192 5769 21230 24126 31652 41269 57929 38033 83582
804H3582k1415o8712j6433J8870J5063J0501l9486L494M3853L8979k2822K8507
$$ 83582 62167 -6545 -22978 -4108 10955 21456 -18030 -14536 29317 68296 45474 73981
792G3981J5373o463o405k2782k4941K794K2534o819J9881j1573O8754n1331k1380
$$ 73981 89354 82891 76486 53704 28763 31557 54091 47272 67153 55580 124334 73003 51623
779E1623m6005k0501L3297J4727j2503L9074L6600l735k3797n9876m004M9882
$$ 51623 5618 -14883 18414 33141 20638 59712 96312 92577 68780 8904 4900 54782
767E4782o4203j0875M4839J1080Q893l1224K4045K0134l4871M40J4961l3874k2305
$$ 54782 -9421 -20296 24543 35623 44516 13292 37337 57471 22600 23040 38001 4127 -18178
754a8178J9964L0875o7286m126P2619j1434M4835N2332n9940j4251j3049m0900
$$ -18178 1786 32661 -34625 -38751 33868 22434 67269 119601 59661 45410 32361 -8539
742h539m4416L0811K5833l6363j2770N5882k39M733J7993K6704p7605o426O9207
$$ -8539 -52955 -22144 3689 -32674 -45444 10438 10199 14932 32925 59629 -17976 -24402 44805
729D4805j8085k0340O1567K0293l8525j5784L3122K0936k0360l6598j3777M8152
$$ 44805 26720 6380 67947 88240 49715 33931 67053 87989 67629 31031 17254 65406
717F5406j7875K1176n595j9241M5180k5862o1882n1219N7171N5320k6927P343
$$ 65406 47531 68707 63112 43871 89051 63189 1307 -49912 7259 62579 35652 42995
705D2995k2817R520p636L776K1122L0955K5608r2751k9789M1464m0310K5898J0809
$$ 42995 20178 29698 22062 25838 46960 77915 103523 10772 -19017 22447 -17863 8035 18844
692A8844K5176K4841K7233k855m4739p279K0876k53m4216o9267L8255K3729q375
$$ 18844 44020 68861 96094 93239 48500 41221 62097 61844 17628 -51639 -13384 10345 1970
679A970L4188J9375r440M1079m9287J9859K9767K0738j1794l0199o1733O0428
$$ 1970 36158 55533 46093 87172 37885 57744 87511 108249 96455 66256 4523 64951
667F4951M2677k8121k050j0552l697l9269r08k102J158J3109Q944J3619N894k3431
$$ 64951 107628 79507 77457 66905 63208 23939 23031 20929 22087 35196 44140 57759 63653 40222
653D0222l16J6169J7016k4003J2479j3537j2104k1771J0269L2612L0731m855k9416
$$ 40222 39906 56075 73091 49088 61567 48030 35926 14155 24424 57036 87767 82912 53496
640E3496n4478P6187K043k6173Q097k2289k3653J8256M7794J8917p7440L9753
$$ 53496 -982 75205 77248 51075 59172 36883 13230 31486 79280 98197 20757 60510
628F0510m796K1193j6478K8292L3741o6377J3127l8566J3615m3480k2076Q434
$$ 60510 55714 76907 60429 88721 122462 56085 69212 30646 44261 781 -21295 -12861
616a2861O7126J7987Q043M2273o3455J4992J7304l3119n2635n08M0296p858J1769
$$ -12861 54265 72252 80295 122568 59113 74105 91409 58290 5655 5147 45443 37585 49354
603D9354L4447m3450J5316k3680k8537J6834K5614n075P625l7189l880k1615M1056
$$ 49354 83801 40351 55667 31987 3450 20284 45898 40823 48448 11259 7379 -14236 26820
590B6820J0169k4779M3732L0315N873Q903L1079m2867o0791O286Q761k1838J6053
$$ 26820 36989 12210 55942 86257 92130 101033 132112 89245 28454 34740 43501 21663 37716
577C7716l4968p7472P9886R8407j1435j1276p6285l838M5682K7344Q193m0726
$$ 37716 2748 -74724 5162 103569 92134 80858 4573 735 46417 73761 81954 41228
565D1228j7918M42n277R5859m3777k1434J0920m0892k0128p557n020n24J6069
$$ 41228 23310 23752 18475 114334 70557 49123 60043 19151 -977 -8534 -13554 -14078 1991
552A991N9279o1873L2620L5096n1168K1505l4438L4884M751J989q793l737K6913
$$ 1991 61270 -603 32017 67113 15945 37450 3012 37896 42647 44636 35843 32106 59019
539E9019j7948L1610j0736P60p9462L0021M3956L3762p891m3001l2276R5163l988
$$ 59019 41071 72681 61945 62705 -16757 13264 57220 90982 83091 40090 7814 102977 98989
526I8989l7843k9458r896L6012j3635J4498m3168n0114J4161Q8853P746R114L1833
$$ 98989 61146 31688 21792 57804 44169 58667 15499 -34615 -20454 68399 76145 85259 117092
513A17092l9305l9763M081r76k2512L0498J6789j4830r461o4789J0336Q4674l2962
$$ 117092 77787 38024 42105 41129 18617 49115 65904 51074 41613 -23176 -12840 71834 38872
500C8872p885J7271n8423N5910J6227o255J5177j9893o654r140n553M371N5643
$$ 38872 30987 48258 -10165 45745 61972 55717 70894 51001 44347 35207 29654 34025 89668
487H9668l1783l7942M9911l7424j2552K57M9521j8547K9232L7030L942r3090l788
$$ 89668 57885 19943 69854 32430 19878 20135 69656 51109 80341 117371 121313 28223 24435
474B4435M8784M6175K387k8867j0603j419m7526j9824Q7018r240J2558l1794J8252
$$ 24435 73219 119394 121781 92914 82311 80892 33366 13542 100560 91320 103878 72084 90336
461I0336l4294j0299m705k9727K7254k9313K1825j5457k1646J131j3841M5149
$$ 90336 56042 45743 41038 11311 38565 9252 31077 15620 -6026 -4895 -18736 26413
449B6413K6923j2983R136K8948q937M712R044J5718k6759j2409O625k5966J0604
$$ 26413 53336 40353 49489 78437 69500 74212 83256 98974 72215 59806 66431 40465 51069
436E1069L5276J1118k2782p5503N4198K0141k3876K0346K1248N0080p0470l5511
$$ 51069 86345 97463 74681 -822 53376 73517 49641 69987 91235 141315 70845 35334
424C5334L3004Q423K6548J0026l3767K8883l2263j3477m4505K6769O3560k6569
$$ 35334 68338 76761 103309 113335 79568 108451 76188 62711 18206 44975 108535 81966
412H1966j6554K676o0015L2194L9602o6328K497m361p172L4377J1716j7856J460
$$ 81966 65412 68088 8073 40267 79869 13541 16038 11677 4505 38882 50598 32742 34202
399C4202J1420K3122k9128j457M2451k0105O824o7378N8686J6961m4669N0279
$$ 34202 45622 68744 39616 38159 80610 60505 67329 -49 58637 75598 30929 81208
387H1208j4944J4187r714n1466K0492K1094L3j316O7183l2552m7584n3365K2253
$$ 81208 66264 80451 70737 19271 39763 60857 60890 59574 126757 94205 46621 -6744 15509
374A5509K3153m5032Q4361Q429J0147l848q670n827n4720J3178K4177l7154l9332
$$ 15509 38662 -6370 77991 86420 96567 92719 84049 78222 23502 36680 60857 23703 -15629
361a5629l123N1436j3843M693L0680j7134J8997o5386J8158P5856r784q049l0589
$$ -15629 -18752 32684 18841 23534 54214 37080 56077 -9309 8849 84705 74921 66872 36283
348C6283j895n727P0802n3144K738N7649k7664k2635k7541j3432n738R139L5422
$$ 36283 34388 28661 99463 46319 49057 106706 79042 56407 28866 15434 9696 18835 54257
335E4257M208P0006j470o1736k9566k0875M1160l4354o126P3469O580K9116o798
$$ 54257 58465 128471 127001 65265 35699 14824 55984 21630 15504 88973 95553 124669 117871
322A17871j8573l3577K2010o277K1709o0322k8213j1863o305K1787p545K4143
$$ 117871 99298 65721 87731 81454 103163 42841 14628 2765 -3540 18247 10702 34845
310C4845P1700o0456L0356k0134m2409L0551k7725N7996j9076J3835j2948j4891
$$ 34845 106545 46089 76445 56311 13902 44453 16728 74724 55648 69483 56535 41644
298D1644j2559J7036J2132q2445O655M6331q78L1758J4339k0591N781P447l0053
$$ 41644 29085 46121 58253 -24192 -17537 28794 27916 59674 74013 53422 59203 66650 36597
285C6597M1541J028n0670L7755J4355m3547p4349j6268R2847J4699L5526k4139
$$ 36597 78138 79166 28496 66251 80606 37059 -37290 -53558 39289 53988 89514 65375
273F5375j4782k3431L1128m1464K773j0516L0900J4594L2602K4758l1191k2474
$$ 65375 50593 27162 58290 16826 19599 9083 39983 54577 87179 111937 80746 58272
261E8272K7935k1035j7094L684o5664j8259P1448p805l4849N2800K3013L884K3047
$$ 58272 86207 65172 48078 51762 -13902 -32161 39287 31482 -3367 49433 72446 76330 99377
248I9377k964n8075p70k4896L2380l3474K5662M2564M7105k3711j0862J5840n2796
$$ 99377 96413 38338 37568 12672 45052 11578 37240 79804 126909 103198 92336 108176 55380
235E5380K5469M385M82k6332j6925R890K1955J9412l1066l7047R374k6928M4501
$$ 55380 80849 85234 85716 59384 42459 52349 74304 93716 62650 25603 34977 8049 52550
222E2550J6895L0025j9421m7424J9391M1373j2754m0660J4309K7260l9413k2472
$$ 52550 69445 99470 80049 32625 52016 93389 80635 39975 54284 81544 42131 19659
210A9659K5353M611L8751j2313r738k3393J0729o657M1326Q27n4460n9781N7203
$$ 19659 45012 49623 88374 76061 66323 42930 53659 47002 88328 89155 34695 -25086 32117
197C2117K7771M8900p3209k3681O1165J069M6564p8100M617k6795l4298O9918
$$ 32117 59888 108788 35579 11898 73063 74132 120696 42596 47213 20418 -13880 56038
185E6038k4492j2033L4311K8752m4371K8842j6310O621J7226L5417J8778n7422
$$ 56038 31546 19513 53824 82576 38205 67047 50737 57358 74584 110001 128779 71357
173G1357k7994k4933M5785O658J689Q520M7551l0701m614j9869J0947N737j8645
$$ 71357 43363 18430 64215 70873 72562 81082 128633 97932 93318 73449 84396 90133 71488
160G1488P757l3355J4472K151k8769K3470p4037J2197L2436M1950K0350o1749
$$ 71488 79245 45890 60362 62513 33744 57214 -16823 -4626 27810 69760 90110 28361
148B8361O7022m5128J7229K1741j7498k829p770N285P29j767k2698J5350m4344
$$ 28361 95383 50255 67484 89225 71727 68898 61128 66413 67142 65375 42677 58027 13683
135A3683j786N0418K3927K1059J910l7347M751j6140J0268K1568j3806l1130J7605
$$ 13683 11897 62315 86242 107301 109211 71864 76615 60475 70743 92311 78505 47375 64980
122F4980L0237j6640k3912j2387K577P254n762J4501j9117j8537M5028L1802k1389
$$ 64980 95217 78577 54665 42278 44855 52109 46347 60848 41731 23194 68222 100024 78635
109G8635J6137K2049n7637q36J0913j5839l835J1373K6082n6164l0381M1782r316
$$ 78635 94772 116821 59184 58348 69261 53422 49587 60960 87042 30878 497 42279 32963
96C2963L2063M2788l9915p0645K1781M7227K548j9703J4621J1241j7629m619J4692
$$ 32963 65026 107814 67899 -2746 19035 66262 68810 49107 63728 74969 57340 52721 67413
83F7413Q87l624k2254j9566J6599m2462J0543M9504L151N6630l0972j8869R573
$$ 67413 68300 64676 42422 22856 39455 -3007 7536 57040 60191 116821 85849 66980 76553
70G6553M040j6588K3390p772k4228K1933l1595l0495J7751J3364J671L1556J413
$$ 76553 80593 64005 87395 79623 55395 77328 45733 15238 32989 46353 48024 79580 80993
57H0993p612p477L9502j1577o083K1401k6745m925l7666j7380Q279L7970O639
$$ 80993 73381 65904 105406 93829 87746 109147 82402 77477 39811 22431 30710 68680 75319
44G5319J371K2507k2865J6428k1436K1091J65o8369J7073N4424l6723j3287k498
$$ 75319 76690 99197 76332 92760 71324 92415 92580 24211 41284 95708 58985 45698 43200
31D3200L4721M6176m413l9289j3287o751l080J5456q095N991j7301J1376L3606
$$ 43200 77921 124097 119684 80395 67108 60357 57277 72733 64638 70629 53328 64704 98310
18I8310l8888K684J0177K0103K2612j9844K4229j0867n9819k1053K6951J3943
$$ 98310 59422 62106 72283 92386 114998 95154 119383 108516 48697 27644 54595 68538
6F8538q549O16P064k1525L051l9908
$$ 68538 59989 60605 67669 46144 49195 9287
0I287
$$ 9287
$$ Imaginary data points
##PAGE= N=2
##DATA TABLE= (X++(I..I)), XYDATA
16383b071733j6327J3556P503L3609L6683J2186K8523K0844L6643J7136K2605
$$ -2071733 -2088060 -2074504 -2067001 -2033392 -1996709 -1984523 -1956000 -1935156 -1898513 -1881377 -1858772
16372a858772O2025j2746J5955L9692J9816J1498L1624K5228L2193L7211J3753
$$ -1858772 -1796747 -1809493 -1793538 -1753846 -1734030 -1722532 -1690908 -1665680 -1633487 -1596276 -1582523
16361a582523P1518K3357j7354k5184K2514O1966k339J3958O5736L3275M7466
$$ -1582523 -1511005 -1487648 -1505002 -1530186 -1507672 -1445706 -1448045 -1434087 -1368351 -1335076 -1287610
16350a287610M6965J7097Q546J8607M7421m3360J5363J320O0126M3900M5896J8163
$$ -1287610 -1240645 -1223548 -1215002 -1196395 -1148974 -1192334 -1176971 -1175651 -1115525 -1071625 -1025729 -1007566
16338a007566l0185M9761N7826k252L7625j5103j6575N8718P9484K7267j5006
$$ -1007566 -1037751 -987990 -930164 -932416 -894791 -909894 -926469 -867751 -788267 -761000 -776006
16327g76006J3739P453J7459L1785K4726K5871K1572j0403J0522K4680M7378J764
$$ -776006 -762267 -754814 -737355 -705570 -680844 -654973 -633401 -643804 -633282 -608602 -561224 -559460
16315e59460O28R4054L1887k1798M0973L0764N7097k2013N9387J8374k9407K8897
$$ -559460 -558832 -464778 -432891 -454689 -413716 -382952 -325855 -347868 -288481 -270107 -299514 -270617
16303b70617Q71L3557M5528K7364J0919M4065o499l0720N0359M067J614N3287
$$ -270617 -269746 -236189 -190661 -163297 -152378 -108313 -114812 -145532 -95173 -91106 -89492 -36205
16291c6205L8877N3313L6258j1145j0111j2630J7016l096Q4948J5813L7519j8015
$$ -36205 2672 55985 92243 81098 70987 58357 75373 72277 157225 173038 210557 192542
16279A92542k2165P1204J3197O0465l7122l8072M7128R359O711K9214R2340J3133
$$ 192542 170377 241581 254778 315243 278121 240049 287177 296536 303247 332461 424801 437934
16267D37934j1649L4002k0723O5110L0030j1189j3512j0106L7717L329j0971K8799
$$ 437934 426285 460287 439564 504674 534704 523515 510003 499897 537614 540943 529972 558771
16255E58771J7610O9015K053M690l0378K7135K9255J4851J578l106j649J5692
$$ 558771 576381 645396 647449 652139 621761 648896 678151 693002 694580 691474 689825 705517
16243G05517K630M2145L1095j3712J627j385M3534L2630J0639K1257o430K4064
$$ 705517 708147 750292 781387 767675 769302 767917 811451 844081 854720 875977 869547 893611
16231H93611M4909K2406r533j4233L5683P624M1818k4546j5818N595K1998N6521
$$ 893611 938520 960926 951393 937160 972843 980467 1022285 997739 981921 987516 1009514 1066035
16219A066035K5827j8135k409P345K4864J2566L1272l0615k8481M5408O3291k6214
$$ 1066035 1091862 1073727 1071318 1078663 1103527 1116093 1147365 1116750 1088269 1133677 1196968 1170754
16207A170754l8188K2836K7627k1772J2788K2259n3983N7065K6383Q997M5205
$$ 1170754 1132566 1155402 1183029 1161257 1174045 1196304 1142321 1199386 1225769 1234766 1279971
16196A279971j7988J6760J8007O493Q654k3268J1991P6159j6132L1075n7505k0782
$$ 1279971 1261983 1278743 1296750 1303243 1311897 1288629 1300620 1376779 1360647 1391722 1334217 1313435
16184A313435j2217Q0660L8259J1535j3141m7284J6983R116L330j5019Q115L3080
$$ 1313435 1301218 1381878 1420137 1431672 1418531 1371247 1388230 1397346 1400676 1385657 1393772 1426852
16172A426852P2051k521k2006l9382O0699L3815p193q781j5071L3873n0654J3144
$$ 1426852 1498903 1496382 1474376 1434994 1495693 1529508 1522315 1513534 1498463 1532336 1481682 1494826
16160A494826P3864r7940J8331O2820l3818p647K5262j1415m0632N6678J6016
$$ 1494826 1568690 1470750 1489081 1551901 1518083 1510436 1535698 1524283 1483651 1540329 1556345
16149A556345K7372l2393j3440N4549j2586l2586N9663L1723k1985j3315k9432
$$ 1556345 1583717 1551324 1537884 1592433 1579847 1547261 1606924 1638647 1616662 1603347 1573915
16138A573915K9939l5517N2197n584m844P63J2763k9835L5979K9624J5498k1968
$$ 1573915 1603854 1568337 1620534 1614950 1610106 1610869 1623632 1593797 1629776 1659400 1674898 1652930
16126A652930M8399J2495N914o2784K2361M4725n005o3110J0058J5732J8203j9437
$$ 1652930 1701329 1713824 1719738 1656954 1679315 1724040 1719035 1655925 1665983 1681715 1699918 1680481
16114A680481J0711K2477n3271j2607j8749L2239J4726J6290P828k58o8995O3901
$$ 1680481 1691192 1713669 1660398 1647791 1629042 1661281 1676007 1692297 1700125 1699867 1630872 1694773
16102A694773K2895l4418N839O4647N61o1741j9738R9221l0731j0604k3183J4709
$$ 1694773 1717668 1683250 1689089 1753736 1754297 1692556 1672818 1772039 1741308 1730704 1707521 1722230
16090A722230P2781K2527k8282j1086K4255o1687J5283k1530n246q69N6077k8482
$$ 1722230 1795011 1817538 1789256 1778170 1802425 1740738 1756021 1734491 1729245 1728376 1784453 1755971
16078A755971l7814j4223n32P1640l2462l859J1345j6988j0168M2203K3494j9802
$$ 1755971 1718157 1703934 1703402 1775042 1742580 1738721 1750066 1733078 1722910 1765113 1788607 1768805
16066A768805l3443j5433j9679J2541O7059K233n0915k7090K6173j0953k4945
$$ 1768805 1735362 1719929 1700250 1712791 1779850 1782083 1731168 1704078 1730251 1719298 1694353
16055A694353M8997l1647L9692J8861m2212j2906J7435N5687l3340k4527J9196
$$ 1694353 1743350 1711703 1751395 1770256 1728044 1715138 1732573 1788260 1754920 1730393 1749589
16044A749589M4626K8939n6829J4985j288k3498n7407J4203N2730L4434L1354
$$ 1749589 1794215 1823154 1766325 1781310 1780022 1756524 1699117 1713320 1766050 1800484 1831838
16033A831838n114m4631L714j0691J7997K4084k3474J3747j6785N4643j0331p33
$$ 1831838 1826724 1782093 1785807 1775116 1793113 1817197 1793723 1807470 1790685 1845328 1834997 1834264
16021A834264j5838l0871M1936k6975l4494M4695j0182l7839M175l6856J3505
$$ 1834264 1818426 1787555 1829491 1802516 1768022 1812717 1802535 1764696 1768871 1732015 1745520
16010A745520M3604K6842j4032l6125o9678L2297L150K835N1901j2613Q650N961
$$ 1745520 1789124 1815966 1801934 1765809 1696131 1728428 1731578 1734413 1786314 1773701 1782351 1788312
15998A788312j100R160k758K2745l8355j8875J6956L3816j8245K7719j9592K4722
$$ 1788312 1787212 1796372 1793614 1816359 1778004 1759129 1776085 1809901 1791656 1819375 1799783 1824505
15986A824505j2725k510l349o898K2198O144k6688p731r32j8945M8876m1730l0684
$$ 1824505 1811780 1809270 1805921 1799023 1821221 1827365 1800677 1792946 1792014 1773069 1821945 1780215 1749531
15973A749531L0216m0348M1862L3799r216N2277l9341K0110m2720j3751p3837
$$ 1749531 1779747 1739399 1781261 1815060 1805844 1858121 1818780 1838890 1796170 1782419 1708582
15962A708582L0197M3634N1885j3852j3014l491r370k6808K2596j3920R323o4416
$$ 1708582 1738779 1782413 1834298 1820446 1807432 1803941 1794571 1767763 1790359 1776439 1785762 1721346
15950A721346r07k925J6580O4831N709l3179j9858L7212L2894N7875k8760l6244
$$ 1721346 1720439 1717514 1734094 1798925 1804634 1771455 1751597 1788809 1821703 1879578 1850818 1814574
15938A814574L235n6053n766j1249j9505K2625k685M9006l698P690l4903m2631
$$ 1814574 1817809 1761756 1755990 1744741 1725236 1747861 1745176 1794182 1790484 1798174 1763271 1720640
15926A720640Q1424m1419L0017P507J1200N2414q6330j5499M2528R794k9759M044
$$ 1720640 1802064 1760645 1790662 1798169 1809369 1861783 1775453 1759954 1802482 1812276 1782517 1786561
15914A786561q404N4408K5680l3935p222k5065k6979K1632j9404J6275j877M3043
$$ 1786561 1778157 1832565 1858245 1824310 1817088 1792023 1765044 1786676 1767272 1783547 1781670 1824713
15902A824713r611o7293M5557J4237k1897k0477L3630l3382M7726j6338l6595
$$ 1824713 1815102 1747809 1793366 1807603 1785706 1765229 1798859 1765477 1813203 1796865 1760270
15891A760270L4015j2483J4764k1041j2849K7806K6576n4227K4983l2041K3257
$$ 1760270 1794285 1781802 1796566 1775525 1762676 1790482 1817058 1762831 1787814 1755773 1779030
15880A779030K6776O868k3624N545K0520M1183j3087k3445L6952m0693K3465q8429
$$ 1779030 1805806 1812674 1789050 1794595 1815115 1856298 1843211 1819766 1856718 1816025 1839490 1751061
15868A751061j9508Q4703j7534N405j8556L57L1019m0248l336R650K1072j2087
$$ 1751061 1731553 1816256 1798722 1804127 1785571 1785928 1816947 1776699 1773363 1783013 1804085 1791998
15856A791998L1216j073J115M4365q2939N6742j7206n1523m746q937K8408M0598
$$ 1791998 1823214 1822141 1823256 1867621 1784682 1841424 1824218 1772695 1767949 1759012 1787420 1828018
15844A828018n750K1831Q3n9142j7625l8739J9581M7675L6284J426J2617n8546
$$ 1828018 1822268 1844099 1844182 1785040 1767415 1728676 1748257 1795932 1832216 1833642 1846259 1787713
15832A787713M5666l2730j7219P4170n1055j2905L2573K3596l1091j2342n3348
$$ 1787713 1833379 1800649 1783430 1857600 1806545 1793640 1826213 1849809 1818718 1806376 1753028
15821A753028Q3176m0733K3615k976K4234j2416p2348K9455j2431k3000k8068
$$ 1753028 1836204 1795471 1819086 1816110 1840344 1827928 1755580 1785035 1772604 1749604 1721536
15810A721536L7718K3915J2428k2634J6660N1995j5658j3150k5023k1019j5864
$$ 1721536 1759254 1783169 1795597 1772963 1789623 1841618 1825960 1812810 1787787 1766768 1750904
15799A750904k0291O9452j5634k4607Q1476n7244K8405J5530k8095L1059m0127
$$ 1750904 1730613 1800065 1784431 1759824 1841300 1784056 1812461 1827991 1799896 1830955 1790828
15788A790828L6525J870j6184l3346O5010R83o1112J4279k8311L0890M0616o757
$$ 1790828 1827353 1829223 1813039 1779693 1844703 1845686 1784574 1798853 1770542 1801432 1842048 1835291
15776A835291K4997m1851M1298k4017k7279K6366L990J8591q475n6044q071J3372
$$ 1835291 1860288 1818437 1859735 1835718 1808439 1834805 1838795 1857386 1848911 1792867 1784796 1798168
15764A798168o46j2542k8556J3337O332L3007j5769l1874O1824J7141J7916j4491
$$ 1798168 1797522 1784980 1756424 1769761 1776093 1809100 1793331 1761457 1823281 1840422 1858338 1843847
15752A843847J2596n0935J8372m082R325j6407j5485K3996M929N1048k4727J1668
$$ 1843847 1856443 1805508 1823880 1819798 1829123 1812716 1797231 1821227 1826156 1877204 1852477 1864145
15740A864145n4892q739K9490L009r0610K9510K4587j6468O578P0336o310r229
$$ 1864145 1809253 1800514 1830004 1833013 1742403 1771913 1796500 1780032 1786610 1856946 1850636 1841407
15728A841407O091p1124J4307N3196M8863k4215k958m0927J8909j1759r1235N0642
$$ 1841407 1847498 1776374 1790681 1843877 1892740 1868525 1865567 1824640 1843549 1831790 1740555 1791197
15716A791197K3137N906j9431j1478L7438j6245m516k2407M3553r072R822n864
$$ 1791197 1814334 1820240 1800809 1789331 1826769 1810524 1806008 1783601 1827154 1818082 1827904 1822040
15704A822040K6158j6733m7513l021m360J3133M7751L1682M1890m7209l0567K4287
$$ 1822040 1848198 1831465 1783952 1780931 1776571 1789704 1837455 1869137 1911027 1863818 1833251 1857538
$$ [...]
##END NTUPLES=NMR SPECTRUM
##END=
