##TITLE=1H_CG-1148-B
 CDCl3, 8 sc, 
 4.06.2021
##JCAMPDX= 6.0         $$ Bruker NMR JCAMP-DX V2.0
##DATA TYPE= NMR SPECTRUM
##DATA CLASS= NTUPLES
##ORIGIN= UXNMR, Bruker Analytische Messtechnik GmbH
##OWNER= root
$$ XWIN-NMR		Version 3.5
$$ Fri Jun  4 12:56:10 2021 Russian Standard Time (UT+4h)  she@DPX200
##.OBSERVE FREQUENCY= 200.131506
##.OBSERVE NUCLEUS= ^1H
##.ACQUISITION MODE= SIMULTANEOUS
##.ACQUISITION SCHEME= undefined
##.AVERAGES= 8
##.DIGITISER RES= 18
##SPECTROMETER/DATA SYSTEM= spect
##.PULSE SEQUENCE= zg30
##.SOLVENT NAME= CD3CN
##.SHIFT REFERENCE= (INTERNAL, CD3CN, 0, 17.5093)
##AUDIT TRAIL= $$ (NUMBER, WHEN, WHO, WHERE, WHAT)
$$ ##TITLE= Audit trail, XWIN-NMR		Version 3.5
$$ ##JCAMPDX= 5.01
$$ ##ORIGIN= Bruker BioSpin GmbH
$$ ##OWNER= she
$$ F:/spectra/data/she/nmr/H-F/1/pdata/1/auditp.txt
$$ ##AUDIT TRAIL=  $$ (NUMBER, WHEN, WHO, WHERE, WHAT)
(   1,<2021-06-04 12:54:54.50 +0400>,<she>,<DPX200>,
      <created by zg, POWCHK disabled, PULCHK disabled
       configuration hash MD5:
       00 E9 B6 7A A2 85 ED C7 34 08 36 98 17 FE 4E 26
       data hash MD5: 16K
       36 94 D7 DA 41 8D 1F 2F 68 5E 47 8E A7 17 72 C1>)
(   2,<2021-06-04 12:54:56.84 +0400>,<she>,<DPX200>,
      <Start of raw data processing
       efp BC_mod = 2 LB = 0.24 FT_mod = 6 PKNL = 1 PHC0 = -11120.87 PHC1 = 13.20101 SI = 16K 
       data hash MD5: 16K
       9D 72 70 0F 7A F4 46 02 AE 01 3F CB E3 DA 1F 0A>)
(   3,<2021-06-04 12:55:19.10 +0400>,<she>,<DPX200>,
      <pk PHC0 = -7.786949 PHC1 = 9.799998 
       data hash MD5: 16K
       E9 5D 81 79 58 6D 52 DB 15 04 DC A3 AC 6A 36 EE>)
(   4,<2021-06-04 12:55:22.42 +0400>,<she>,<DPX200>,
      <abs ABSG = 5 
       data hash MD5: 16K
       6B 9A E9 E3 80 97 C9 3E 13 CE 0B 78 39 DF 39 8B>)
(   5,<2021-06-04 12:55:43.65 +0400>,<she>,<DPX200>,
      <abs ABSG = 5 
       data hash MD5: 16K
       84 14 9A 77 E1 05 4D 20 3F 03 9B 46 9A 97 1C E2>)
$$ ##END=
$$ 
$$ hash MD5
$$ 5C 90 5B D9 73 4F 6D F5 11 10 43 1A E4 59 37 76
##$RELAX= 
##$RELAX= 
##$RELAX= 
##$RELAX= 
##$RELAX= 
##$RELAX= 
$$ Bruker specific parameters
$$ --------------------------
##$DU= <F:/spectra>
##$EXPNO= 1
##$NAME= <H-F>
##$PROCNO= 1
##$TYPE= <nmr>
##$USER= <she>
##$AMP= (0..31)
100 100 100 100 100 100 100 100 100 100 100 100 100 100 100 100 100 100 
100 100 100 100 100 100 100 100 100 100 100 100 100 100 
##$AQSEQ= 0
##$AQ_mod= 1
##$AUNM= <au_zg>
##$AUTOPOS= <>
##$BF1= 200.13
##$BF2= 200.13
##$BF3= 200.13
##$BF4= 200.13
##$BF5= 200.13
##$BF6= 200.13
##$BF7= 200.13
##$BF8= 200.13
##$BYTORDA= 1
##$CFDGTYP= 0
##$CFRGTYP= 5
##$CHEMSTR= <none>
##$CNST= (0..31)
1 1 145 1 1 1 1 1 1 1 1 1 1 1 1 1 1 1 1 1 1 1 1 1 1 1 1 1 1 1 1 1 
##$CPDPRG= <>
##$CPDPRG1= <>
##$CPDPRG2= <>
##$CPDPRG3= <>
##$CPDPRG4= <mlev>
##$CPDPRG5= <mlev>
##$CPDPRG6= <mlev>
##$CPDPRG7= <mlev>
##$CPDPRG8= <mlev>
##$CPDPRGB= <>
##$CPDPRGT= <>
##$D= (0..31)
0 1.2 0 0 0 0 0 0 0 0.06 0 0.03 0 0 0 0 0.0002 0 0 0 0 0 0 0 0 0 0 0 0 
0 0 0 
##$DATE= 1622796893
##$DBL= (0..7)
$$ [...]
##$SUBNAM3= <"">
##$SUBNAM4= <"">
##$SUBNAM5= <"">
##$SUBNAM6= <"">
##$SUBNAM7= <"">
##$SUBNAM8= <"">
##$SUBNAM9= <"">
##$SW= 20.0188882624521
##$SWIBOX= (0..15)
0 0 2 0 0 0 0 0 0 0 0 0 0 0 0 0 
##$SW_h= 4006.41025641026
##$TD= 16384
##$TD0= 1
##$TE= 0
##$TE2= 300
##$TE3= 300
##$TEG= 300
##$TL= (0..7)
0 120 120 120 120 120 120 120 
##$TP= (0..7)
150 150 150 150 150 150 150 150 
##$TP07= 0
##$TPNAME0= <>
##$TPNAME1= <>
##$TPNAME2= <>
##$TPNAME3= <>
##$TPNAME4= <>
##$TPNAME5= <>
##$TPNAME6= <>
##$TPNAME7= <>
##$TPOAL= (0..7)
0.5 0.5 0.5 0.5 0.5 0.5 0.5 0.5 
##$TPOFFS= (0..7)
0 0 0 0 0 0 0 0 
##$TUNHIN= 0
##$TUNHOUT= 0
##$TUNXOUT= 0
##$USERA1= <user>
##$USERA2= <user>
##$USERA3= <user>
##$USERA4= <user>
##$USERA5= <user>
##$V9= 5
##$VALIST= <valist>
##$VCLIST= <CCCCCCCCCCCCCCC>
##$VD= 0
##$VDLIST= <DDDDDDDDDDDDDDD>
##$VPLIST= <PPPPPPPPPPPPPPP>
##$VTLIST= <TTTTTTTTTTTTTTT>
##$WBST= 1024
##$WBSW= 4
##$XGAIN= (0..3)
0 0 0 0 
##$XL= 0
##$YL= 0
##$YMAX_a= 422001
##$YMIN_a= -337616
##$ZGOPTNS= <>
##$ZL1= 120
##$ZL2= 120
##$ZL3= 120
##$ZL4= 120
##$ABSF1= 17.50933
##$ABSF2= -2.509708
##$ABSG= 5
##$ABSL= 3
##$ALPHA= 0
##$AQORDER= 0
##$ASSFAC= 0
##$ASSFACI= 0
##$ASSFACX= 0
##$ASSWID= 0
##$AUNMP= <proc_1d>
##$AZFE= 0.1
##$AZFW= 0.1
##$BCFW= 0
##$BC_mod= 2
##$BYTORDP= 0
##$COROFFS= 0
##$CY= -3
##$DATMOD= 1
##$DC= 0
##$DFILT= <>
##$DTYPP= 0
##$F1P= 0
##$F2P= 0
##$FCOR= 1
##$FTSIZE= 16384
##$FT_mod= 6
##$GAMMA= 0
##$GB= 0
##$INTBC= 1
##$INTSCL= 1.334414e-10
##$ISEN= 128
##$LB= 0.24
##$LEV0= 0
##$LPBIN= 0
##$MAXI= 10000
##$MC2= 0
##$MEAN= 0
##$ME_mod= 0
##$MI= 1.114404
##$NCOEF= 0
##$NC_proc= -7
##$NLEV= 6
##$NOISF1= 3.799351
##$NOISF2= 2.8
##$NSP= 0
##$NTH_PI= 0
##$NZP= 0
##$OFFSET= 17.50933
##$PC= 1
##$PHC0= -11128.66
##$PHC1= 23.00101
##$PH_mod= 1
##$PKNL= yes
##$PPARMOD= 0
##$PSCAL= 0
##$PSIGN= 0
##$REVERSE= no
##$SF= 200.130005063028
##$SI= 16384
##$SIGF1= 3
##$SIGF2= 2
##$SINO= 5.538805
##$SIOLD= 16384
##$SREGLST= <1H.CDCl3>
##$SSB= 0
##$STSI= 16384
##$STSR= 0
##$SW_p= 4006.41025641026
##$SYMM= 0
##$S_DEV= 0
##$TDeff= 16384
##$TDoff= 0
##$TI= <>
##$TILT= no
##$TM1= 0
##$TM2= 0
##$TOPLEV= 0
##$USERP1= <user>
##$USERP2= <user>
##$USERP3= <user>
##$USERP4= <user>
##$USERP5= <user>
##$WDW= 1
##$XDIM= 16384
##$YMAX_p= 338331511
##$YMIN_p= -714091
$$ End of Bruker specific parameters
$$ ---------------------------------
##NTUPLES= NMR SPECTRUM
##VAR_NAME=  FREQUENCY,     SPECTRUM/REAL,   SPECTRUM/IMAG
##SYMBOL=    X,             R,               I
##VAR_TYPE=  INDEPENDENT,   DEPENDENT,       DEPENDENT
##VAR_FORM=  AFFN,          ASDF,            ASDF
##VAR_DIM=   16384,         16384,           16384
##UNITS=     HZ,            ARBITRARY UNITS, ARBITRARY UNITS
##FACTOR=    0.24454680195387, 1,            1
##FIRST=     3504.14245155001, 0,            0
##LAST=      -502.267804860248, 0,           0
##MIN=       -502.267804860248, -714091,     0
##MAX=       3504.14245155001, 338331511,    0
$$ Real data points
##PAGE= N=1
##DATA TABLE= (X++(R..R)), XYDATA
$$ [...]
5425A0469282k23497l59354j26531J41401N6848L04399J02180k2342j5884j39636
5415A0186866L00917K53507j68342J92078J70009m80940m36764J64744m36427
5406I745648k94032K11m55444L6266k50021n38431k77343j05536j98956J13831
5396G776193K33757n06321k54402J62742K07362j91871j31839J43050k96222n4695
5386G087754L1758l3838J71268n35580N6223J29778j13060J66848j99381k14949
5376F546821j22237j63035M9196J59749k46024p3530J34125L4729j95347p1497
5366F052950k93333L52644L96385J26085k8366p5374l315k78851R4298r5146K68933
5355F516910K49338j13965J17051l981M3480p827M7086k1675P295j42632m7992
$$ y = [10469282, 10245785, 9886431, 9759900, 9901301, 9958149, 10262548, 10364728, 10342386, 10326502, 10186866, 10487783, 10741290, 10572948, 10765026, 10935035, 10454095, 10017331, 10182075, 9745648, 9451616, 9451827, 8996383, 9032649, 8782628, 8244197, 7966854, 7861318, 7662362, 7776193, 8009950, 7503629, 7249227, 7411969, 7619331, 7427460, 7295621, 7438671, 7142449, 7087754, 7119512, 7085674, 7256942, 6721362, 6777585, 6907363, 6794303, 6961151, 6761770, 6546821, 6424584, 6261549, 6310745, 6470494, 6224470, 6150940, 6285065, 6319794, 6124447, 6052950, 5759617, 6112261, 6508646, 6634731, 6606365, 6530991, 6527676, 6248825, 6343123, 6247977, 6516910, 6766248, 6652283, 6769334, 6765353, 6808833, 6801006, 6848092, 6826417, 6833712, 6691080, 6643088]
5344F643088K13500l27883j60255P7676J8886k65634K13321J77609k01294J03325
5334F492339J58546n9222J26366j03249M2104R2571J02882R3332R6584j12170
5324F930083n2798O0476k5575K5740M1366k94795j4241j47462j42352J3511m2241
5313F351712j11620J96056L9742j09499N5514k63243J29872j768P976M4570j18934
5302F220378J20910M7711J47075p5467L9623M1774k36336P304J64451M910j61
5291F482172o4813r3289J28808L3369K71053P9075k51628k50770K48953L9880
5281F622810N5600j32205J10685J32153l90477K45311j10536p5842r2700m9416
5271F315383M25444p6467J68367q862R5628m8595k51619j9099p1110J43943l76823
$$ y = [6643088, 6856588, 6528705, 6368450, 6446126, 6465012, 6199378, 6412699, 6590308, 6389014, 6492339, 6650885, 6591663, 6718029, 6614780, 6656884, 6749455, 6852337, 6945669, 7042253, 6930083, 6877285, 6937761, 6912186, 6937926, 6979292, 6684497, 6670256, 6522794, 6380442, 6393953, 6351712, 6240092, 6436148, 6475890, 6366391, 6421905, 6158662, 6288534, 6286766, 6294742, 6339312, 6220378, 6341288, 6388999, 6536074, 6460607, 6500230, 6542004, 6305668, 6312972, 6477423, 6482333, 6482172, 6417359, 6324070, 6452878, 6486247, 6757300, 6836375, 6584747, 6333977, 6582930, 6622810, 6678410, 6546205, 6656890, 6789043, 6398566, 6643877, 6533341, 6457499, 6364799, 6315383, 6740827, 6664360, 6832727, 6823865, 6919493, 6870898, 6619279, 6600180, 6529070, 6673013, 6296190]
5260F296190O4703K00032l08568k03514j83780J70898l26512n2752j52115J80008
5250E684590J08560J2393K19851m49814k36354L50564k34692K16545R8010j71026
5240E598627L7510j2639L08524o4485K19018J15934k97246J65862M2974J07017
5230F221096j86541n6499J74139q5687j15770j7590p1991o7193L08748j64196
5220E938516o4149J24124l7546k02417J59693R1924j79911J71649K03986j88690
5210F017179R9595l53552K28338J58416K4079K0395J95926N987l63129R6661m2324
5199F087571K61973r3130J62276j13223k48528J54941J22207J75642o8786J357
5189F442300j24760k97471K95836J63899K9367q0434J54426R739q2192K95454
$$ y = [6296190, 6360893, 6560925, 6252357, 6048843, 5865063, 6035961, 5709449, 5656697, 5504582, 5684590, 5793150, 5805543, 6025394, 5575580, 5339226, 5689790, 5455098, 5671643, 5769653, 5598627, 5636137, 5623498, 5932022, 5867537, 6086555, 6202489, 5905243, 6071105, 6114079, 6221096, 6034555, 5978056, 6152195, 6066508, 5950738, 5933148, 5861157, 5793964, 6102712, 5938516, 5874367, 5998491, 5960945, 5758528, 5918221, 6010145, 5830234, 6001883, 6205869, 6017179, 6116774, 5763222, 5991560, 6149976, 6174055, 6194450, 6390376, 6396363, 6033234, 6129895, 6087571, 6349544, 6256414, 6418690, 6305467, 6056939, 6211880, 6334087, 6509729, 6440943, 6442300, 6317540, 6020069, 6315905, 6479804, 6509171, 6428737, 6583163, 6592902, 6510710, 6806164]
5179F806164j01984K45732k2640Q0584K72076l993l19439l1355K82803J93164
5169G401112K91769L2255N5560J04170K05962R5319J54888K72216k08j86402O5862
5158H492503J63932j01273Q5468R8799j61849n7470k51279J15918l1168k62149
5148H091432n164J07312J57570O7134L03333k3125J97503k33603m591J40041R1898
5137H889740J03945K11304J52730O3314L2848M7151J48497J55011M47138p694
5127A0243984K23525L22799J9630M16749O81687L14516J58241N09525P73172Q39806
5117A4503634P69369P11084N07650P38169J324813Q11210J056806J071570N18054
5108B2012359O2738Q5827m74117m83288l48326m90381k91290l92311k35396k40298
$$ y = [6806164, 6704180, 6949912, 6927272, 7007856, 7279932, 7275939, 6956500, 6925145, 7207948, 7401112, 7692881, 7725136, 7780696, 7884866, 8090828, 8186147, 8341035, 8613251, 8613043, 8426641, 8492503, 8656435, 8555162, 8640630, 8739429, 8577580, 8520110, 8268831, 8384749, 8353581, 8091432, 8086268, 8193580, 8351150, 8418284, 8721617, 8698492, 8895995, 8662392, 8657801, 8797842, 8889740, 8993685, 9204989, 9357719, 9421033, 9453881, 9501032, 9649529, 9804540, 10251678, 10243984, 10467509, 10790308, 10809938, 11226687, 11908374, 12222890, 12381131, 12890656, 13663828, 14503634, 15273003, 15984087, 16491737, 17229906, 18554719, 19365929, 20422735, 21494305, 22012359, 22075097, 22160924, 21686807, 21203519, 20855193, 20364812, 20073522, 19681211, 19445815, 19205517]
5098A9205517N0955J56869J15400M03308K40396M42163N06908P44540J028344
5089B2894400J289864J353879J599965J556459J688810J842058J304275J012540
5081C4542250J02458j089728j389326k141289j888393j382811j612091j368930
5073B3772140r75965n30996p14035m12667r6415k22458q3091N2403J2745J84467
5063B0986128K78195L52760N73723P68829O52425J154597O43045L90480O07175
5054B6407357O7681l76815o80673j255601j042783n77184q53857r30121j52482
5045B0605522m43827l12491j45319j55535l91842r8038l3882N4042K55849k23191
5035A9111288j09833P0512o1689j13408J53103Q9931P1328K17976J68336K92484
$$ y = [19205517, 19256472, 19413341, 19528741, 19932049, 20172445, 20614608, 21121516, 21866056, 22894400, 24184264, 25538143, 27138108, 28694567, 30383377, 32225435, 33529710, 34542250, 34644708, 33554980, 32165654, 30024365, 28135972, 26753161, 25141070, 23772140, 22796175, 22265179, 21551144, 21138477, 21042062, 20819604, 20736513, 20788916, 20801661, 20986128, 21264323, 21617083, 22190806, 22959635, 23612060, 24766657, 25409702, 25800182, 26407357, 26475038, 26098223, 25417550, 24161949, 23119166, 22541982, 21688125, 20758004, 20605522, 20161695, 19849204, 19703885, 19548350, 19156508, 19058470, 19024588, 19078630, 19334479, 19111288, 19001455, 19071967, 19010278, 18896870, 19049973, 19139904, 19211232, 19429208, 19597544, 19890028]
5025A9890028N4277M77133L37984K63578M73286M95935L61208O47383J411749
5016B4412561J203569Q89300J137768J320665J030437J607945J478648K101870
5008C5182763J995180J526236J980774K618111K602606K277407K357184K319022
5000E2859283J962560J565995J457750Q78590J88730o74040j138011j872603k778931
4991E2449323k920483k734818k615777k774837k593668k576075k360044k216572
4983C1657049k157018j313728j536699j484238p20035j081896r51314n26832n89775
4974B1295514p79643l15350m40272l06556n96603m73151m79401j61499m12262
4965A7330777l99636r827l50818k73453k97972n18980J83351K0609j53364l4260
$$ y = [19890028, 19944305, 20421438, 20759422, 21023000, 21496286, 21992221, 22353429, 23000812, 24412561, 25616130, 26505430, 27643198, 28963863, 29994300, 31602245, 33080893, 35182763, 37177943, 38704179, 40684953, 43303064, 45905670, 48183077, 50540261, 52859283, 54821843, 56387838, 57845588, 58724178, 58912908, 58238868, 57100857, 55228254, 52449323, 49528840, 46794022, 44178245, 41403408, 38809740, 36233665, 33873621, 31657049, 29500031, 28186303, 26649604, 25165366, 24445331, 23363435, 22412121, 21885289, 21295514, 20515871, 20200521, 19760249, 19453693, 18857090, 18383939, 17904538, 17743039, 17330777, 16931141, 16921314, 16570496, 16297043, 15999071, 15480091, 15663442, 15684051, 15530687, 15496427]
4955A5496427k82797m84025j3502n3646n83J18822r7431K63920K73074k6936J12293
4944A5305616L23469K0325K04837O85848K93987j72830O81315M06400M63291O05980
4934A8818238O25046P44219R38062J112366J175971Q73417Q74693R5997o62051
4925B4595958j029404j393935j489036j394020j185371j243060q96405j017545
4917A4947182o86076P0553k71251n98506l94819k47832m27843k28891j58578J06912
4907A2110851q9799j72660l63062l0232j73092r7432K39948K0862j87661l01976
4897A0955747j66321J30866j01899l87984M91923K50922j99490J60044L0243N4844
4887A1218895q2811k14448k234k657j12015j75840M6054j6912j45656l59684l70025
$$ y = [15496427, 15213630, 14729605, 14716103, 14662457, 14661874, 14780696, 14683265, 14947185, 15220259, 15193323, 15305616, 15629085, 15649410, 15854247, 16540095, 16834082, 16661252, 17342567, 17748967, 18212258, 18818238, 19443284, 20187503, 21125565, 22237931, 23413902, 24287319, 25162012, 25258009, 24595958, 23566554, 22172619, 20683583, 19289563, 18104192, 16861132, 15964727, 14947182, 14261106, 14331659, 14060408, 13461902, 13067083, 12819251, 12391408, 12162517, 12003939, 12110851, 12021052, 11848392, 11485330, 11455098, 11282006, 11184574, 11424522, 11445384, 11257723, 10955747, 10789426, 10920292, 10818393, 10430409, 10922332, 11173254, 10973764, 11133808, 11164051, 11218895, 11136084, 10921636, 10919402, 10916745, 10804730, 10628890, 10674944, 10658032, 10512376, 10152692, 9782667]
4876I782667m8118J16496J43914m44128J0610K87878k77273m06545j8446N2280
4866I199335l07993J47793J9946O3508j16451k68307K41299r6971K07749K31016
4856I320924k42641J3795n1308j87213K41558M22847j60258L4912L60288l33661
4846I419243J71067M05152j40099K10489K24178K71067l8757O4722J07163j1305
4836A0682920J4435n8171m0890k08551j83365P0324j75468L63477Q4024N9879
4826A0608614j83372J00176J55630j83884J98431p9628K35912j00674j45175k177
4816A0603853J98290Q1034k19239l1965j70899k92759Q3730k57635q8394j03843
4806I802173k73682K3842m0743O9198p087J26647p6190L17477N6716k36823K47456
$$ y = [9782667, 9734549, 9851045, 9994959, 9550831, 9561441, 9849319, 9572046, 9165501, 9147055, 9199335, 8891342, 9039135, 9059081, 9122589, 9006138, 8737831, 8979130, 8882159, 9089908, 9320924, 9078283, 9092078, 9040770, 8853557, 9095115, 9517962, 9357704, 9392616, 9752904, 9419243, 9590310, 9995462, 9855363, 10065852, 10290030, 10561097, 10522340, 10587062, 10694225, 10682920, 10697355, 10639184, 10598294, 10389743, 10206378, 10276702, 10101234, 10464711, 10548735, 10608614, 10425242, 10525418, 10681048, 10497164, 10695595, 10615967, 10851879, 10751205, 10606030, 10603853, 10802143, 10883177, 10663938, 10631973, 10461074, 10168315, 10252045, 9994410, 9906016, 9802173, 9528491, 9552333, 9511590, 9580788, 9573701, 9700348, 9624158, 9941635, 9998351, 9761528, 10008984]
4795A0008984K21893L45178L65410l1217R8866M33579o0419K32525N04393J28264
4785A2247456P1146M99586K16179K96971Q09912L79055M14819M60863N50432O72078
4775A6618497L91157J56035K10666O0864P8447K52542L78897N06445K99933j55835
4765A8797648m12543j20936m75036r02954p45701j160970r89727n76158o20182
4756A2793441p75257q0077o01690k34492N9554k07492l94723l5134R4383k15237
4746A0403276K4604j06139P4135R0527l07685q4253K60106K02978m2858j50545
4736A0364146L78356j36125J14945J91408L17050N3925M29902M54257N92941N8654
4726A2819459J71622O39230L52750M59647O18521N18282J021620R84718Q31227
$$ y = [10008984, 10230877, 10576055, 10941465, 10910248, 11009114, 11442693, 11382274, 11614799, 12119192, 12247456, 12318602, 12818188, 13034367, 13331338, 14141250, 14520305, 14935124, 15395987, 15946419, 16618497, 17009654, 17165689, 17376355, 17437219, 17515666, 17768208, 18147105, 18653550, 18953483, 18797648, 18385105, 18264169, 17789133, 16886179, 16140478, 14979508, 13989781, 13413623, 12793441, 12018184, 11938107, 11336417, 11101925, 11161479, 10953987, 10559264, 10524130, 10618513, 10403276, 10427880, 10321741, 10395876, 10486403, 10178718, 10094465, 10354571, 10557549, 10514691, 10364146, 10742502, 10606377, 10721322, 10912730, 11229780, 11283705, 11713607, 12167864, 12760805, 12819459, 12991081, 13630311, 13983061, 14442708, 15061229, 15579511, 16601131, 17585849, 18417076]
4717A8417076R63325M24912J62353N6071l67758m78066o14588j123931j257021
4708A6182373j034805j161712j083929m81382o74732p09875l00635m23411k50335
4699A0061557k85723m78539k45249j69526l03518K12918N3875n8849o4149l26472
4689H396325o5252M2279J99488j99409j00353O4799k11425j10187o2603k49306
4679G704356J71341l0712j6298j44420k4623O9262m7862P3087J07919k21482L6345
4668G676913L5557J66321P8395n7219k02090J99360R5432J44838k99919j9594
4658G817994J5389J04826K67672j18216L54818j69781j35856J22475j03887n0906
4648H104528J80748j8836k16980m440O1000J97353K59630j34081K47502j28916
$$ y = [18417076, 19380401, 19805313, 19967666, 20023737, 19655979, 19177913, 18563325, 17439394, 16182373, 15147568, 13985856, 12901927, 12420545, 11745813, 11035938, 10735303, 10311892, 10061557, 9775834, 9297295, 9052046, 8882520, 8579002, 8791920, 8845795, 8786946, 8722797, 8396325, 8331073, 8373352, 8572840, 8373431, 8273078, 8337877, 8126452, 8016265, 7953662, 7704356, 7875697, 7844985, 7828687, 7684267, 7659644, 7728906, 7681044, 7754131, 7862050, 7640568, 7676913, 7712470, 7878791, 7957186, 7899967, 7697877, 7897237, 7992669, 8137507, 7837588, 7817994, 7833383, 7938209, 8205881, 8087665, 8442483, 8272702, 8136846, 8259321, 8155434, 8104528, 8285276, 8266440, 8049460, 8045020, 8106020, 8303373, 8563003, 8428922, 8676424, 8547508]
4638H547508k04860M9045K91663L25969J79758m8027o6013j80680L8433J51537
4628I084333J53615J4967j15780j85447k21472J46430j51663J54203n941Q837
4618H882082m657k37230r2137j02143L49926J02620J07087p6753R5091L24059
4608I347945J4205n4906P6614J9149j98953k95706K38012j68330J46260O565j80458
4597H950397K00679J785Q2423j46288K34607J50583K30428j03301q1317j87801
4587I332195n8993M49485N1525n7430J06265j08355M4609J34913J73652J4829
4577A0082695J12935K55257n1558J43849J20420j16168L07813K26386J60868j1289
4567A1231208m7086l22338O9519J84372K35712M00624L0854J69838O3054J07857
$$ y = [8547508, 8342648, 8391693, 8683356, 9009325, 9189083, 9141056, 9075043, 8894363, 8932796, 9084333, 9237948, 9252915, 9137135, 8951688, 8730216, 8876646, 8724983, 8879186, 8873245, 8882082, 8877425, 8640195, 8548058, 8445915, 8795841, 8898461, 9005548, 8928795, 9023886, 9347945, 9362150, 9307244, 9383858, 9403007, 9204054, 8908348, 9146360, 8978030, 9124290, 9130855, 8950397, 9151076, 9152861, 9235284, 9088996, 9323603, 9474186, 9704614, 9601313, 9519996, 9332195, 9273202, 9722687, 9774212, 9716782, 9823047, 9714692, 9759301, 9894214, 10067866, 10082695, 10195630, 10450887, 10399329, 10543178, 10663598, 10547430, 10855243, 11081629, 11242497, 11231208, 11184122, 10861784, 10931303, 11115675, 11351387, 11752011, 11782865, 11952703, 12015757, 12123614]
4557A2123614J2196j36512M4855M73721k3365k64408L04422j1828k54730O6206
4547A2334171o8862j95049k02250j99842k0172P3966J31712M4508R5010J22130
4537A2115322q3568j19037L2566J18196L81640K94863j05849m3108k4424L34890
4527A2901491J95418N3595J43862O193J41055J38470J4559L81524J61418N40588
4517A4678173j50632K60157P4286M8932L24924L2500J76067L29797M23779L84794
4507A6582777K97410L68813L97228J26275J75359J37196N07301K38246N49874
4498A9380479L65177M84500N46937L47712O18898O92912O62082O62160Q18989
4489B4579846Q44821P57783J097365Q42334J272876J542958J543631K091461J997713
$$ y = [12123614, 12135810, 11999298, 12044153, 12517874, 12494509, 12230101, 12534523, 12522695, 12267965, 12334171, 12265309, 12070260, 11868010, 11668168, 11647996, 11721962, 11853674, 11898182, 11993192, 12115322, 12031754, 11912717, 11945283, 12063479, 12445119, 12739982, 12634133, 12591025, 12566601, 12901491, 13096909, 13150504, 13294366, 13300559, 13441614, 13580084, 13594643, 13976167, 14137585, 14678173, 14527541, 14787698, 14861984, 14910916, 15235840, 15268340, 15444407, 15774204, 16197983, 16582777, 16880187, 17249000, 17646228, 17772503, 17947862, 18085058, 18592359, 18830605, 19380479, 19745656, 20230156, 20777093, 21124805, 21743703, 22436615, 23098697, 23760857, 24579846, 25424667, 26182450, 27279815, 28122149, 29395025, 30937983, 32481614, 34573075, 36570788]
4480C6570788K127061J950803J488541O91455L91409L16452L74783J015862J809034
4471D6736188K327231L118535M215026M874294N135588M857310K884590o34362
4463G3514400l470354o970369o912290n652584m965357l483415k740010j992219
4455C7327802j419768j374541j336427q70643p35535p66708o38651l35886r9921
4446B9749722r2828J3683K17550J65882r895K29819N38347L85717N15492P36876
4436C2450365O4239O72714R79203P30068J185006J305824J139763J371995J581608
4427D1480785J026023Q30819K55966l58669m57170l46954k9818L00120O91824
4418D3392926R13803J245269J469809J726836K077745K180800K673560K916522
$$ y = [36570788, 38697849, 40648652, 42137193, 42828648, 43220057, 43536509, 43911292, 44927154, 46736188, 49063419, 52181954, 56396980, 61271274, 66406862, 71264172, 74148762, 73514400, 70044046, 63073677, 56161387, 50508803, 45543446, 42060031, 39320021, 37327802, 35908034, 34533493, 33197066, 32326423, 31590888, 30824180, 30185529, 29849643, 29749722, 29656894, 29670577, 29888127, 30054009, 30044114, 30273933, 30812280, 31197997, 31713489, 32450365, 32514604, 33187318, 34166521, 34896589, 36081595, 37387419, 38527182, 39899177, 41480785, 42506808, 43337627, 43593593, 43234924, 42777754, 42430800, 42400982, 42701102, 43392926, 44306729, 45551998, 47021807, 48748643, 50826388, 53007188, 55680748, 58597270]
4410E8597270L389107L713141M555903N135724N542775N805383O292883M669243
4402I7701429Q08389o05781k158143n307763n178268l849580l096239j794033
4394G6520011j367483p09512m0051J52299K80631K51897l4772N02654K7532K12228
4384G5795434L65698K38603K3505m41355q69172j048237j419956k374546k345045
4375F7924929k368862k373164k171883j960978j568508j238699j095549o90229
4367E4457057q12046m87634m94901r04946j756650j932642k463910k720490k486882
4358D0396956k007695j802305j301478j362505j286794r76983p14697q24239q13001
4349B9307259l64226m09970j58356l33397l35025l18544m33383n27588m49845
$$ y = [58597270, 61986377, 65699518, 70255421, 75391145, 80933920, 86739303, 93032186, 97701429, 98509818, 97904037, 95745894, 90438131, 85259863, 81410283, 78314044, 76520011, 75152528, 74443016, 74402965, 74555264, 74835895, 75087792, 75053020, 75555674, 75583206, 75795434, 76161132, 76399735, 76423240, 75981885, 75112713, 74064476, 72644520, 70269974, 67924929, 65556067, 63182903, 61011020, 59050042, 57481534, 56242835, 55147286, 54457057, 53645011, 53157377, 52662476, 51757530, 50000880, 48068238, 45604328, 42883838, 40396956, 38389261, 36586956, 35285478, 33922973, 32636179, 31659196, 30944499, 30120260, 29307259, 28943033, 28533063, 28374707, 28041310, 27706285, 27387741, 26954358, 26426770, 25976925]
4340B5976925r07410p76968n05870q13404p55191l51541l95194l08719j74738
4331B0987890j84819l65654m24893k50338k21958n770l32191n61588O7937j57557
4321A8551059k46411j76421l77539o02637k01960k47006j78549P1947j82787J5886
4311A6425582j52508l66879j41360L19053J3736K84970j13000j94535R5004J66787
4301A6336850J67272K21888P4036l2241J29336R9152k21826K25602J77222J03284
4291A7280575N04774J10273J42404J20319J84395J32879N27214J62995J44663
4282A9310491j19237O0609j23828k8266K1824l8423j60550n4130K31228J0621
4272A9110339k94677M0363Q1537j187L53533M5171M3227O52100M12302K12059
$$ y = [25976925, 25069515, 24292547, 23786677, 22973273, 22218082, 21866541, 21471347, 21162628, 20987890, 20803071, 20437417, 20012524, 19762186, 19540228, 19534458, 19202267, 18640679, 18708616, 18551059, 18304648, 18128227, 17750688, 17148051, 16946091, 16699085, 16520536, 16592483, 16409696, 16425582, 16273074, 15906195, 15764835, 16083888, 16097624, 16382594, 16269594, 16075059, 16170063, 16336850, 16504122, 16726010, 16800046, 16767805, 16897141, 16996293, 16774467, 17000069, 17177291, 17280575, 17785349, 17895622, 18038026, 18158345, 18342740, 18475619, 19002833, 19165828, 19310491, 19191254, 19251863, 19128035, 19099769, 19121593, 19083170, 18922620, 18868490, 19099718, 19110339, 18815662, 18856025, 18937562, 18936375, 19289908, 19335079, 19378306, 20030406, 20442708, 20654767]
4262B0654767K87846J08073L30045N63009L38787J08657J95591j86355j26877
4253B2273543J03727j53348J8493K31538K16487L02623M72733M71736O01759R20253
4243B5459544O75536J204377J217467J457597J811432J303896J466460J298313
4235C5894622J73244o15267j046515j117433j173347q71675j030221q66724o12292
4226B8734392n34283n81115n72676k54426j74958j75627o04J31954J05047L65567
4216B7043271J14585K13133K31492L69009N86866L70426Q60463L45386N72068
4207C0706699R26062N65511M42086O40030N48880j24505K34918j10242l72724
4198C3456715j00634k49508m63019k81245m86438m79052k41222k04117j47700
$$ y = [20654767, 20942613, 21050686, 21380731, 21943740, 22282527, 22391184, 22586775, 22400420, 22273543, 22377270, 22223922, 22242415, 22473953, 22690440, 22993063, 23465796, 23937532, 24539291, 25459544, 26135080, 27339457, 28556924, 30014521, 31825953, 33129849, 34596309, 35894622, 36067866, 35452599, 34406084, 33288651, 32115304, 31243629, 30213408, 29346684, 28734392, 28200109, 27618994, 27046318, 26791892, 26616934, 26441307, 26440703, 26572657, 26677704, 27043271, 27157856, 27370989, 27602481, 27971490, 28558356, 28928782, 29789245, 30134631, 30706699, 31632761, 32198272, 32640358, 33280388, 33829268, 33704763, 33939681, 33829439, 33456715, 33356081, 33106573, 32643554, 32362309, 31875871, 31396819, 31155597, 30951480, 30803780]
4189C0803780N987l28655j55555K68754J97736L61394M83668K55690l8591Q7639
4179C1941847J62646O72653O71253O60892M56113P37698M77248N89262P06130
4170C7075742L08062N24935K9108J21598J84434J03694L38823M49685K88318N48378
4160C9972777Q16160J197021J049529J459479J518209J500247J920324J752479
4152E1186225J965309K226344K633597K911222K766604L429089L600723M007590
4144G4726703L902603M170203M493444M096730M375234M868052N608458O523197
4136A12764624P421753O651036O007726L522455q97142n562080q161015r005286
4128A12742071r095207q784771p578933o888508n915327m659327m061627l516327
$$ y = [30803780, 30809767, 30481112, 30325557, 30594311, 30792047, 31153441, 31637109, 31892799, 31854208, 31941847, 32104493, 32777146, 33448399, 34109291, 34565404, 35303102, 35780350, 36369612, 37075742, 37383804, 37908739, 37937847, 38059445, 38243879, 38347573, 38686396, 39136081, 39424399, 39972777, 40788937, 41985958, 43035487, 44494966, 46013175, 47513422, 49433746, 51186225, 53151534, 55377878, 58011475, 60922697, 63689301, 67118390, 70719113, 74726703, 78629306, 82799509, 87292953, 91389683, 95764917, 100632969, 106241427, 112764624, 120186377, 126837413, 132845139, 136367594, 135470452, 129908372, 121747357, 112742071, 103646864, 94862093, 87283160, 80394652, 74479325, 69819998, 65758371, 62242044]
4120F2242044k991422k309510k141243j473113j177251j210041j138987p96120
4112D9004357j106673m73336o20910r29919p97099n07295o50723m61529o13321
4103D2843552n54781M7673k92617P334j1401K89848J0019K52311K58840n5441
4093D2795337M35666p7243j40474K79696j96625M6551K73655K65015L50599Q53837
4083D4886014O45210N89983J216613P20075J095591J370671J360301J140865M59159
4074E3484482j58288o97209l74021q11856k42383j40283k03404K60147L65182
4065E1482367M20858M33592L71178J21202O1902K61658J85420L45304P44026O35644
4055E5063151R47169J386844J696748J824967K096407J994431J771315J100001
$$ y = [62242044, 59250622, 56941112, 54799869, 53326756, 52149505, 50939464, 49800477, 49004357, 47897684, 47424348, 46803438, 45873519, 45076420, 44569125, 43918402, 43456873, 42843552, 42288771, 42336444, 42043827, 42051161, 42039760, 42329608, 42339627, 42591938, 42850778, 42795337, 43231003, 43153760, 43013286, 43292982, 43096357, 43142908, 43416563, 43681578, 44032177, 44886014, 45531224, 46121207, 47337820, 48057895, 49153486, 50524157, 51884458, 53025323, 53484482, 53326194, 52628985, 52254964, 51443108, 51200725, 51060442, 50857038, 51117185, 51482367, 51903225, 52336817, 52707995, 52829197, 52891099, 53152757, 53338177, 53683481, 54427507, 55063151, 56010320, 57397164, 59093912, 60918879, 63015286, 65009717, 66781032, 67881033]
4047F7881033k82496p08002j712552k048874j595963j560324j599908j643037
4039E6729877j669967j641313j430005j283651j020580q73143q02917o85722l10971
4030D7011608l08620J90508N83801M34160J140791J274866J237839J709067J309710
4021E4583730R77482Q90392J097767O89701O84196O54689j27396q17735j536885
4012E7095941k260109k260289k391166k154050j669823r17560q28314p25455l84736
4003D3504439Q3860l3572j7047J52568J39020L70901M08050N46077O83325Q11556
3993D6649177R95883P99727Q33513J144973J019824M57859M71655j64968n44742
3984E1662901q85969o97480n56341n95445m0144L47353L70735J012562J160091
$$ y = [67881033, 67598537, 66890535, 65177983, 63129109, 61533146, 59972822, 58372914, 56729877, 55059910, 53418597, 51988592, 50704941, 49684361, 48811218, 48008301, 47322579, 47011608, 46702988, 46893496, 47477297, 47911457, 49052248, 50327114, 51564953, 53274020, 54583730, 55561212, 56451604, 57549371, 58239072, 58923268, 59577957, 59450561, 58632826, 57095941, 54835832, 52575543, 50184377, 48030327, 46360504, 45442944, 44614630, 43889175, 43504439, 43588299, 43554727, 43537680, 43690248, 43829268, 44200169, 44608219, 45154296, 45837621, 46649177, 47645060, 48444787, 49278300, 50423273, 51443097, 51900956, 52372611, 52207643, 51662901, 50776932, 50079452, 49523111, 48927666, 48887522, 49234875, 49605610, 50618172, 51778263]
3975E1778263J561254J775976J360095J360876J471799J544604J752274K158565
3967F4763706K174135K726170K717719K945496K646753K389509K054736O38722
3959H3056946r10323k151388l239690l235577l637638l203618k451690j739361
3951F2487661j292753n55086J30142M64408K80725Q48054Q16617M10013M34717
3942F4024498k77217l11558J09469n09896p15399m35978o69552j398821j747949
3933E8067597j491550q81534o89758p9333j53422N63216Q88978O65408J455027
3924E8344629J155312J000005J136291J140445J235908J392408J579593K236869
3916F9221460K969548K760973K224932K392058J005621j6380j815775l017692
$$ y = [51778263, 53339517, 55115493, 56475588, 57836464, 59308263, 60852867, 62605141, 64763706, 66937841, 69664011, 72381730, 75327226, 77973979, 80363488, 82418224, 83056946, 82146623, 79995235, 76755545, 73519968, 69882330, 66678712, 64227022, 62487661, 61194908, 60639822, 60769964, 61234372, 61515097, 62363151, 63179768, 63589781, 64024498, 63747281, 63435723, 63545192, 63035296, 62319897, 61883919, 61214367, 59815546, 58067597, 56576047, 55694513, 55004755, 54925422, 54772000, 55335216, 56224194, 56889602, 58344629, 59499941, 60499946, 61636237, 62776682, 64012590, 65404998, 66984591, 69221460, 72191008, 74951981, 77176913, 79568971, 80574592, 80558212, 78742437, 75724745]
3908G5724745l212869k612137k374555j941964l97852j22017p5260N52028L29144
3899F5869263N95270P12021N46537O65514L90478R88557J064797J297537J106403
3890G3236377K101620K336394L040388L320915L892977M713759M929707N143454
3882A02715591M911082M327679K584849q19756m134146o458894p302180o562046
3874H9262179n920961m698019l783643k928883k399983k470536k263907k286625
3866F2509622j950897k152151j941580j404780j204008q15680j165786j055601
3858E0819139j131010j225292j227749j418552j150663p84966m11020l87681o35084
3849D2447122l27312p87205r25325q41879n78960l86477l19458o56336l40123
$$ y = [75724745, 72511876, 69899739, 67525184, 65583220, 65185368, 65063351, 64988091, 65540119, 65869263, 66464533, 67176554, 67723091, 68388605, 68779083, 69767640, 70832437, 72129974, 73236377, 75337997, 77674391, 80714779, 84035694, 87928671, 92642430, 97572137, 102715591, 107626673, 111954352, 114539201, 113719445, 109585299, 103126405, 95824225, 89262179, 83341218, 78643199, 74859556, 71930673, 69530690, 67060154, 64796247, 62509622, 60558725, 58406574, 56464994, 55060214, 53856206, 53040526, 51874740, 50819139, 49688129, 48462837, 47235088, 45816536, 44665873, 43880907, 43469887, 43082206, 42447122, 42119810, 41332605, 40407280, 39565401, 38986441, 38599964, 38280506, 37624170, 37284047]
3840C7284047n6783l30476n16459K80277m9841l05278l9825k08158j8069J12484
3830C6151919J57002K30904L6236J35541M17969K88435P533K70225J55255j41489
3820C7709530M46799J06285J13538M63614J28333N75480P75696L97061L50697
3811D1067033N76876J56070K41198L63439K41043J11855K83084N49460M76012
3802D4066070R96699P84490L34454O18360J15706j22208J42140O6400J92602k69425
3792D6925288j957J82489L45322L59530J37372J17666q5460o9803l32084l98676
3782D7179687l11810j00970l58997m20076n6330K98791R0143j42969o2116k10504
3772D5904849l1449l7903l30578j18793j53593l66926m36131m14441m44960k23982
$$ y = [37284047, 37227264, 36896788, 36380329, 36660606, 36610765, 36305487, 36265662, 36057504, 36039435, 36151919, 36308921, 36539825, 36576061, 36711602, 37129571, 37418006, 37425539, 37695764, 37851019, 37709530, 38156329, 38262614, 38376152, 38839766, 38968099, 39543579, 40319275, 40716336, 41067033, 41643909, 41799979, 42041177, 42404616, 42645659, 42757514, 43040598, 43590058, 44066070, 45062769, 45847259, 46181713, 46800073, 46915779, 46793571, 46935711, 47002111, 47194713, 46925288, 46923331, 47105820, 47451142, 47810672, 47948044, 48065710, 47980250, 47910447, 47578363, 47179687, 46867877, 46766907, 46407910, 45987834, 45931504, 46230295, 46320438, 46177469, 46115353, 45904849, 45873400, 45835497, 45504919, 45386126, 45232533, 44865607, 44429476, 44015035, 43570075, 43346093]
3762D3346093j8444J95960k37280J57860K86619j20722J61289j76830k19852n38602
3752D2836091o6852k01906l04555l04742m1295J06583J63801K74545M48311K69016
3742D3178997J01876J08951n56581p80096o49880n83625m54329m59662q2603l43365
3732C9479683p7202j025j9884K2378k26990n32751m46444p26143r60948p00694
3722C5809980n09037k45771k99676k06873l69115l36645l67517o54553o78442
3713C2142351o23609o89252o97497m50353l45804p77902l64899k25829l85282
3704B7581924j27182o224k37989j69137m3056n30648j33301n4498n29507r070
3694B5741312J41741R2094k47745k47383q524o6188J69849k00443J91518J30941
$$ y = [43346093, 43327649, 43523609, 43286329, 43444189, 43730808, 43610086, 43771375, 43594545, 43374693, 42836091, 42769239, 42567333, 42262778, 41958036, 41916741, 42023324, 42187125, 42461670, 42909981, 43178997, 43280873, 43389824, 42833243, 42053147, 41403267, 40819642, 40365313, 39905651, 39823048, 39479683, 39402481, 39401456, 39381572, 39403950, 39176960, 38644209, 38197765, 37471622, 36510674, 35809980, 35300943, 35055172, 34755496, 34548623, 34179508, 33842863, 33475346, 32820793, 32142351, 31518742, 30829490, 30131993, 29681640, 29335836, 28557934, 28193035, 27967206, 27581924, 27454742, 27448518, 27210529, 27041392, 26998336, 26467688, 26334387, 26279889, 25750382, 25741312, 25883053, 25975147, 25727402, 25480019, 25471495, 25405307, 25575156, 25374713, 25566231, 25697172]
3684B5697172l9277p6872L56445M5736K67944r5178n5767Q1925l3900P7638n0250
3673B6175616j30520Q2118K63635k64474J30736J75761n2161r8032j17916l09551
3663B5855212k38711J79893k40458k21613m08n59397m9199j59347k58401j74152
3653B4133419p1029L8613j28408k49144k41731j15251J03486l30188p764J02145
3643B3234148J42218K1114j9778j49032M6529k49503m5802J94504l20225j80188
3633B2673985n9049k40844k09590K23679j64472p9196J18019k87595m86528m51268
3623B1037141m5936l68786J72871k41944k0563L8607j90701J54283k26617L56758
3613B0665113K70266r6752j28843m2094J56897j33013m3569m24406K889L56373
$$ y = [25697172, 25657895, 25581023, 25937468, 25983204, 26251148, 26155970, 26100203, 26182128, 26148228, 26225866, 26175616, 26045096, 26127214, 26390849, 26126375, 26257111, 26432872, 26380711, 26282679, 26164763, 25855212, 25616501, 25796394, 25555936, 25334323, 25333915, 24774518, 24725319, 24565972, 24307571, 24133419, 24062390, 24101003, 23972595, 23723451, 23481720, 23366469, 23469955, 23139767, 23132003, 23234148, 23376366, 23397480, 23377702, 23228670, 23275199, 23025696, 22979894, 23174398, 22854173, 22673985, 22614936, 22374092, 22164502, 22388181, 22223709, 22144513, 22262532, 21974937, 21488409, 21037141, 20991205, 20622419, 20795290, 20553346, 20532783, 20571390, 20380689, 20534972, 20308355, 20665113, 20935379, 20838627, 20709784, 20667690, 20824587, 20691574, 20648005, 20223599, 20226488, 20582861]
3603B0582861K8941K05808j9406k9182L6948n182L2351m1257K88565K63641Q5720
3592B1429808J8260j21698j1051R1546K59312M5471J03486m7360K38254M09896
3582B2415924r6806j01619L53928K42121N15244M28053K77223k1922Q9783M64912
3572B4566841M41609N75132K97723N16320L77077O39929J234658O61975Q11946
3563C0123210Q99843J217940J059280J190763J717871J519829K118375J636486
3555D1483597J635649K108679J919168J636346J508565J481723P56446O96911
3547E3227084M81528K23583J22745K0853J40520K50186J42250J26113L4181K05775
3537E4974818l71283l79346n30137r40767j133548j026426j160986j187425q12030
$$ y = [20582861, 20611802, 20817610, 20798204, 20769022, 20805970, 20800788, 20833139, 20791882, 21080447, 21344088, 21429808, 21448068, 21326370, 21315319, 21406865, 21666177, 21711648, 21815134, 21767774, 22006028, 22415924, 22319118, 22217499, 22571427, 22813548, 23328792, 23756845, 24034068, 24012146, 24101929, 24566841, 25008450, 25583582, 25881305, 26397625, 26774702, 27414631, 28649289, 29311264, 30123210, 31023053, 32240993, 33300273, 34491036, 36208907, 37728736, 39847111, 41483597, 43119246, 45227925, 47147093, 48783439, 50292004, 51773727, 52530173, 53227084, 53708612, 53932195, 54054940, 54075793, 54216313, 54466499, 54608749, 54734862, 54769043, 54974818, 54603535, 54224189, 53694052, 52753285, 51619737, 50593311, 49432325, 48244900, 47432870]
3528D7432870o01388q77929o88744m32303m02310k69249J12949N7838p1577j96897
3518D4063260J01809k7782n10992q5677n07337m94267o51490q60152n54518o85783
3508C9787071o71411k36286m87426n12074o46348k95900n25539l02731R0267K737
3498C6202360j69609j86049k48556l43083J3679r8893k07010m41131m08469n09466
3488C3603773k57511r8584o0326k20352k95003j74769m57949k99294k84983j47048
3478C1307954j12222k61201m69128r90k74712j36382p8757L0028J59783k61000
3468B9903373N7378K07147L88901p2143L3594R2561J1424M36949K85688K80962
3458C1625834r9645K69160L48879J61740K6226M9320K21590j16930n5619J41677
$$ y = [47432870, 46831482, 45953553, 45264809, 44832506, 44430196, 44160947, 44273896, 44331734, 44260157, 44063260, 44165069, 44137287, 43626295, 43540618, 43033281, 42539014, 41887524, 41027372, 40472854, 39787071, 39115660, 38879374, 38391948, 37879874, 37233526, 36937626, 36412087, 36109356, 36199623, 36202360, 36032751, 35846702, 35598146, 35255063, 35268742, 35169849, 34962839, 34521708, 34113239, 33603773, 33346262, 33247678, 33187352, 32967000, 32671997, 32497228, 32039279, 31739985, 31455002, 31307954, 31195732, 30934531, 30465403, 30464413, 30189701, 30053319, 29974562, 30004590, 30164373, 29903373, 29960751, 30167898, 30556799, 30484656, 30518250, 30610811, 30622235, 31059184, 31344872, 31625834, 31526189, 31795349, 32144228, 32305968, 32332194, 32381514, 32603104, 32486174, 32430555, 32572232]
3448C2572232J55802O3110o3219j2349J8357K40894K45902K25187K04816J94383
3438C3845115K71690p0714L03456N59350M29316L89637J91934J90317L89048M83981
3428C6983130M15514M18538O61054P24466R59722N77017Q58114J039446J047561
3419D3684562J061611J400869J495595J705201J999641K200684K428044K914520
3411E8890727K763744L124381L315929L408813L959779L511702L268469L316950
3403H5560494L621531L129363K936494L024899L064805K666460K360745K110901
3395A08475692J979873J588864R41922P35305j51587r93487j416005k163665k509103
3386A06487809k443272k547194k305212k204979j770374j203082j109478n84439
$$ y = [32572232, 32728034, 32791144, 32727925, 32715576, 32733933, 32974827, 33220729, 33445916, 33650732, 33845115, 34116805, 34046091, 34349547, 34908897, 35338213, 35727850, 35919784, 36110101, 36499149, 36983130, 37398644, 37817182, 38478236, 39202702, 40162424, 40739441, 41597555, 42637001, 43684562, 44746173, 46147042, 47642637, 49347838, 51347479, 53548163, 55976207, 58890727, 61654471, 64778852, 68094781, 71503594, 75463373, 78975075, 82243544, 85560494, 89182025, 92311388, 95247882, 98272781, 101337586, 104004046, 106364791, 108475692, 110455565, 112044429, 112986351, 113721656, 113570069, 112576582, 111160577, 108996912, 106487809, 104044537, 101497343, 99192131, 96987152, 95216778, 94013696, 92904218, 92319779]
3378I2319779J64480R7456J54448L04822R9655K53761m41669m91415p40318q42821
3368I0878178p32289n99732n24231J9180J94353K01217r022j82542o36789q56114
3358H7752209j211284j474860j694875k128215k145955k371924k082681j671166
3350G2971249j820071j498714j355526j924583j645108j714627j509744j656182
3342E9846694j223060j312909j235193j133132p72745q55402r74761l96532p20135
3333E1222825n19573q33776k25752n73324o44697m06284l54299o47719k85102
3324D6732299o0562j25243r925r6599j48833k09757L29555M4525M07828J31951
3314D6995239N64216L22881Q2320O0106M9389l2648N77374J87855J93413L11864
$$ y = [92319779, 92484259, 92581715, 92736163, 93040985, 93140640, 93394401, 92952732, 92461317, 91720999, 90878178, 90145889, 89546157, 89021926, 89041106, 89235459, 89436676, 89427654, 89245112, 88608323, 87752209, 86540925, 85066065, 83371190, 81242975, 79097020, 76725096, 74642415, 72971249, 71151178, 69652464, 68296938, 66372355, 64727247, 63012620, 61502876, 59846694, 58623634, 57310725, 56075532, 54942400, 54169655, 53314253, 52339492, 51942960, 51222825, 50703252, 49869476, 49643724, 49070400, 48425703, 48019419, 47665120, 47017401, 46732299, 46671737, 46546494, 46536569, 46439970, 46291137, 46081380, 46410935, 46455460, 46863288, 46995239, 47559455, 47882336, 47964656, 48024762, 48074151, 48041503, 48618877, 48806732, 49000145, 49312009]
3304D9312009J69111l6148O770j36155p2737M06061p6240N0613k64204k00370
3294D9158710k7744N6779k48821n3115J26641Q7841j2340j41379K00164M53748
3284D9600484n3991L1698K2995o1566k51853j67967J6395j60672j22052j84867
3274D8668604l22442j71398l84736j70437j59470k63645k54764l67786l91221
3265D6182705l47584J14449k83476j55861j63021l56110l3035p7292j92286k4233
3255D4664256n7892N2656J86694R7536L77190J81408K50998L31356N99325L21692
3245D7005219J84605P04247M66749P80312P14171P09524J044961J441076J169807
3236E4220671J504220J712842J847072J956643K127800K517833K818511K942712
$$ y = [49312009, 49481120, 49444972, 49451742, 49315587, 49242850, 49648911, 49572671, 49623284, 49359080, 49158710, 49130966, 49187745, 48938924, 48885809, 49012450, 49100291, 49087951, 48946572, 49146736, 49600484, 49546493, 49578191, 49601186, 49539620, 49287767, 49119800, 49136195, 48975523, 48853471, 48668604, 48346162, 48174764, 47790028, 47619591, 47460121, 47196476, 46941712, 46573926, 46182705, 45835121, 45949570, 45666094, 45510233, 45347212, 44991102, 44958067, 44880775, 44688489, 44664256, 44606364, 44659020, 44845714, 44943250, 45320440, 45501848, 45752846, 46084202, 46683527, 47005219, 47189824, 47894071, 48360820, 49141132, 49855303, 50564827, 51609788, 53050864, 54220671, 55724891, 57437733, 59284805, 61241448, 63369248, 65887081, 68705592, 71648304]
3228G1648304L415704L534058L791435L507182L304042L796022M010771M265380
3220A01272898M582554M899988N558922N216099N791441N832129N171109M286975
3212A42612115L181042J645704n56749k231311m404481n492935o243645o794413
3204A21715327p007972o241659n876889n348874m243529m014488l458229k710078
3196H2813609k655733k165336j879935j451131j252048j083678p98316p48526
3188G0778906m32200O506j81954L12945k3195M02010N78186R29846J237807J143510
3178G4752367J194216J889093J807727K107528K705459K731837L050501L495858
3170I3734586L372414L703486L783694L816729L342533L013288K561866J613670
$$ y = [71648304, 75064008, 78598066, 82389501, 85896683, 89200725, 92996747, 97007518, 101272898, 105855452, 110755440, 116314362, 121530461, 127321902, 133154031, 138325140, 142612115, 145793157, 147438861, 146882112, 144650801, 140246320, 134753385, 128509740, 121715327, 114707355, 108465696, 102588807, 97239933, 92996404, 88981916, 85523687, 82813609, 80157876, 77992540, 76112605, 74661474, 73409426, 72325748, 71527432, 70778906, 70346706, 70353212, 70171258, 70484203, 70461008, 70863018, 71441204, 72371050, 73608857, 74752367, 75946583, 77835676, 79643403, 81750931, 84456390, 87188227, 90238728, 93734586, 97107000, 100810486, 104594180, 108410909, 111753442, 114766730, 117328596, 118942266]
3162A18942266J081175K46248J1721n29380q46610r55052j336657o95074q93210
3153A15025427r91624p22834n57255l07708o35682m65352j002272l90748n7954
3144A09893998n12061j99559k41845l83768K71156L32319Q46873O90299J111190
3135A11808602J185436J288748J757840J770338K048722J818617K161697J993170
3127A25833170J856770J910382J690679K030694J662719J763891J830075J643261
3119A40221641J568985J651490J681070K025563J754191J590529J533542J449635
3111A53476646J348344J484692J843660J775224K035270K107986J716464K036819
3103A67825105J594113J653630J619842J304988R51563P51137N11213M41431N11508
$$ y = [118942266, 120023441, 120269689, 120281410, 119752030, 118905420, 117950368, 116613711, 115918637, 115025427, 114033803, 113310969, 112753714, 112446006, 111810324, 111344972, 110342700, 109951952, 109893998, 109381937, 109182378, 108940533, 108556765, 108827921, 109160240, 110007113, 110697412, 111808602, 112994038, 114282786, 116040626, 117810964, 119859686, 121678303, 123840000, 125833170, 127689940, 129600322, 131291001, 133321695, 134984414, 136748305, 138578380, 140221641, 141790626, 143442116, 145123186, 147148749, 148902940, 150493469, 152027011, 153476646, 154824990, 156309682, 158153342, 159928566, 161963836, 164071822, 165788286, 167825105, 169419218, 171072848, 172692690, 173997678, 174949241, 175700378, 176211591, 176653022, 177164530]
3094A77164530P86478J083290J257414J567253J483793J298150J392340J374982
3086A87408230R46273Q38474O95592K3244o78459r51717j806942k894301l296774
3077A80283620l939187l919201l171390k583577k261112j814183j945709k544881
3069A58104380k828502l227807l602448m235994l978515m384639m101778m136499
3061A27608198l959234l930349l111157k852576k671258k482687k389680k236437
3053A03974820k201653j740220k413460k549769k288906k485429k387828k537119
3045H5370436j948531k043875j768547j325864j493922j268863j487537j373402
3037G2659895j070123q54244p69308o03650n95348q81583l29200k86203o17073
$$ y = [177164530, 177951008, 179034298, 180291712, 181858965, 183342758, 184640908, 186033248, 187408230, 188354503, 189192977, 189888569, 189911813, 189233354, 188281637, 186474695, 183580394, 180283620, 176344433, 172425232, 169253842, 166670265, 164409153, 162594970, 160649261, 158104380, 155275878, 152048071, 148445623, 144209629, 140231114, 135846475, 131744697, 127608198, 123648964, 119718615, 116607458, 113754882, 111083624, 108600937, 106211257, 103974820, 101773167, 100032947, 97619487, 95069718, 92780812, 90295383, 87907555, 85370436, 83421905, 81378030, 79609483, 78283619, 76789697, 75520834, 74033297, 72659895, 71589772, 70735528, 69966220, 69362570, 68767222, 67885639, 67556439, 67270236, 66653163]
3028F6653163l77648n33193k51377N4174p4688K3676K3142j07053k01678M39K14294
3017F5423251q6356L90863N76177O67203O04095Q98683J094038Q42162J373856
3008G1783972J620185J483673J635045J738001J819968J580117J798268J520788
3000H4980017J762357J749635J806845J486025J216973J232531P59147P56516
2992I5750046N68330N11125m0505l34082n75782j167896j105882j560500j852123
2983I0192731j602149k035296k044507k102896j743117j986234j833859j426197
2975G5418476j752029j435775j013897j212392j301460o29930q17081p96453m07596
2966F6051863l72798k81647K10137L26027N48887P51187P94202N77209N74484
$$ y = [66653163, 66275515, 65742322, 65490945, 65545119, 65470431, 65494107, 65517249, 65410196, 65208518, 65208957, 65423251, 65336895, 65727758, 66303935, 66971138, 67575233, 68473916, 69567954, 70410116, 71783972, 73404157, 74887830, 76522875, 78260876, 80080844, 81660961, 83459229, 84980017, 86742374, 88492009, 90298854, 91784879, 93001852, 94234383, 94993530, 95750046, 96318376, 96829501, 96788996, 96454914, 95879132, 94711236, 93605354, 92044854, 90192731, 88590582, 86555286, 84510779, 82407883, 80664766, 78678532, 76844673, 75418476, 73666447, 72230672, 71216775, 70004383, 68702923, 68072993, 67255912, 66459459, 66051863, 65679065, 65397418, 65607555, 65933582, 66482469, 67233656, 68027858, 68605067, 69179551]
2957F9179551R86079P17050J112685J527824J628523J497528J847434J826746
2949H0323420J780282J743460J853542K291980K337469K205613K258961J820562
2941I6615289J512161O48224P014j67501j187325k240456k632950k950961l715905
2932H5887590l617392l430825l412339l005875k310541k204527j835955j129313
2924F4940823j114688j061253r17632o87138r73932j092716j390760j611691k091434
2915E3999579k140279k008007k028393j608573j841940j632478j554133j721256
2907C9464520j487133j073002j107039j036401r37268n79288o96652n51685n42871
2898C1453181k90942n87545m99358l9254p6816k55446k95074m49178l43096m791
$$ y = [69179551, 70165630, 70882680, 71995365, 73523189, 75151712, 76649240, 78496674, 80323420, 82103702, 83847162, 85700704, 87992684, 90330153, 92535766, 94794727, 96615289, 98127450, 98775674, 98782688, 98615187, 97427862, 95187406, 92554456, 89603495, 85887590, 82270198, 78839373, 75427034, 72421159, 70110618, 67906091, 66070136, 64940823, 63826135, 62764882, 61847250, 61160112, 60186180, 59093464, 57702704, 56091013, 53999579, 51859300, 49851293, 47822900, 46214327, 44372387, 42739909, 41185776, 39464520, 37977387, 36904385, 35797346, 34760945, 33823677, 33244389, 32547737, 31996052, 31453181, 31162239, 30574694, 30075336, 30036082, 29959266, 29703820, 29408746, 28959568, 28616472, 28611681]
2888B8611681o05455l29203l21194j13055m17997l17465m52079p13144j03248
2879B5238841m32270l32886k36346k57088j84563m85304m91293j27567l00368
2870B2391156k47643r8478m17062k7769r6010n05195N3160O4465m9812k01046
2860B0865766j10343j55564r1945r5050j50523r7250p9103J13497R6018R2996
2850B0388499l91648k1032J84476r161p5220K03128J34457O3090J88012k31931
2840B0432670n5605J41182K05353K55128J68528O6926Q255j4457K17974K2487
2830B1448441l5431J05633K55829K39988J78945N46770Q0616K00638N95354K07959
2820B3824742M20353M91656M18219K78258N16446M85762K63431P03352N91899
$$ y = [28611681, 28006226, 27677023, 27355829, 27242774, 26824777, 26507312, 26055233, 25342089, 25238841, 24806571, 24473685, 24237339, 23980251, 23795688, 23310384, 22819091, 22691524, 22391156, 22143513, 22045035, 21627973, 21600204, 21504194, 20998999, 21052159, 21116624, 21066812, 20865766, 20755423, 20599859, 20507914, 20412864, 20262341, 20165091, 20085988, 20199485, 20295503, 20388499, 19996851, 19975819, 20160295, 20151134, 20075914, 20279042, 20413499, 20476589, 20664601, 20432670, 20377065, 20518247, 20723600, 20978728, 21147256, 21214182, 21222437, 21207980, 21425954, 21448441, 21413010, 21518643, 21774472, 22014460, 22193405, 22740175, 22820791, 23021429, 23616783, 23824742, 24245095, 24736751, 25154970, 25433228, 25949674, 26435436, 26698867, 27402219, 27994118]
2811B7994118P29253K51575R42552N33245M28148Q64962O18744O80423O23559
2802C3666579M49681K67262M69263M14157L72415O81122O34692M81234O36762
2793C8073167M11004O27322N07889J048430J002524J100885J100179R19377J186567
2784D5977344J099115J451641J464844J208766J353352J886887J987576J943785
2776E8373310K272196K007884K190819K407626K664078K771832L057922L124223
2768G8869890K806189K817716L571616M028597M475429N006170N860591O723493
2760A14159691P067474Q349738Q937181R610574R761598R683719R271094Q848433
2752A85689502R083462R902476J1005615J2987251J5184504J7127488J8840717
$$ y = [27994118, 28723371, 28974946, 29917498, 30450743, 30878891, 31743853, 32362597, 33043020, 33666579, 34116260, 34383522, 34852785, 35266942, 35639357, 36320479, 36955171, 37436405, 38073167, 38484171, 39111493, 39619382, 40667812, 41670336, 42771221, 43871400, 44790777, 45977344, 47076459, 48528100, 49992944, 51201710, 52555062, 54441949, 56429525, 58373310, 60645506, 62653390, 64844209, 67251835, 69915913, 72687745, 75745667, 78869890, 81676079, 84493795, 88065411, 92094008, 96569437, 101575607, 107436198, 114159691, 121227165, 129576903, 138514084, 148124658, 157886256, 167569975, 176841069, 185689502, 194772964, 204675440, 215681055, 228668306, 243852810, 260980298, 279821015]
2745B79821015J9877366J8236207J3954760O442163l260736j1357948j5961772
2738C07751055j6714507j5146864j2869333j0285986q506432o949409n992022
2731B31286502m910076l703787k799493j438438o03480M58206P44596J209732
2723B20243762J00396o59862j567105k228047j566507m31609J192828L085142
2715B18168998M844206P046798R319112J1615732J3221684J4326894J3598814
2708B92142238J0021930L955643n214522j3296950j6834067j7207606j5670923
2701B37895743j3741432j1953586j0088311q904945p845390p201308o026230n166746
2693A66967795m157768l140926k380022j843944k406627m687782p032806q200343
$$ y = [279821015, 299698381, 317934588, 331889348, 338331511, 335070775, 323712827, 307751055, 291036548, 275889684, 263020351, 252734365, 244227933, 237278524, 231286502, 226376426, 222672639, 219873146, 218434708, 217831228, 218289434, 219034030, 220243762, 220344158, 219684296, 218117191, 215889144, 214322637, 213891028, 215083856, 218168998, 223013204, 230060002, 239379114, 250994846, 264216530, 278543424, 292142238, 302164168, 306119811, 300905289, 287608339, 270774272, 253566666, 237895743, 224154311, 212200725, 202112414, 193207469, 185362079, 178160771, 172134541, 166967795, 162810027, 159669101, 157289079, 155445135, 153038508, 148350726, 141317920, 133117577]
2685A33117577q465657p889352p091602o331223n606021m999529m357593l734506
2677H4642094l376911l043956k878396k216938j944201k021872j407892j345265
2669F6406663j466115j567180j280719j561079j552628j191945j168686q66085
2661E5752226j132661r43916j217203j344072r94952j068470r25841j219945j406178
2652D5498988j640695j443731j366272j279546j265826j241461q00564p70026
2644C5690867r25924p59516q12558o00358n37238n98849p30375m86600l23083
2635B9916366p25395o36179n29103p83694r43669n16190n55063p42016l62688
2626B4122369k07304l37940l92616l47033l89595n00807l29789m64839m23236
$$ y = [133117577, 124651920, 116762568, 109670966, 103339743, 97733722, 92734193, 88376600, 84642094, 81265183, 78221227, 75342831, 73125893, 71181692, 69159820, 67751928, 66406663, 64940548, 63373368, 62092649, 60531570, 58978942, 57786997, 56618311, 55752226, 54619565, 53675649, 52458446, 51114374, 50119422, 49050952, 48125111, 46905166, 45498988, 43858293, 42414562, 41048290, 39768744, 38502918, 37261457, 36460893, 35690867, 34764943, 34005427, 33192869, 32592511, 32055273, 31456424, 30726049, 30239449, 29916366, 29190971, 28554792, 28025689, 27241995, 26298326, 25782136, 25227073, 24485057, 24122369, 23915065, 23577125, 23184509, 22837476, 22447881, 21947074, 21617285, 21152446, 20729210]
2617B0729210l80322k27792p23770q01110l43749n24051l29954j97118n44265
2608A6657079l70198l32753l47318k49071k84360k70407m42812m37773l94689
2599A3527698m94076k36831k46793p5129k52313j00778j74875m26718j6912l82307
2589A1120966j59689m5252l31061k85635j99792J0189q4567j87806r499m19556
2579I408298j31898j07380k0776j60773M0459k00002l73470K12316k78593k20347
2569H167834o9000K5257k38716n4166j52689k47963r9507K2107m5286P4237l18895
2558G063213p5530j35731O7961M2145l36450R3838n8490J3806k43577P822j28453
2547F310554q3076J23231m45786j65269L1280J66866N7707j19339p8604j27945
$$ y = [20729210, 20348888, 20121096, 19397326, 18596216, 18252467, 17728416, 17398462, 17201344, 16657079, 16286881, 15954128, 15606810, 15357739, 15073379, 14802972, 14360160, 13922387, 13527698, 13033622, 12796791, 12549998, 12474869, 12222556, 12121778, 11946903, 11520185, 11503273, 11120966, 10961277, 10916025, 10584964, 10299329, 10099537, 10109726, 10025159, 9837353, 9827854, 9408298, 9276400, 9169020, 9148244, 8987471, 9027930, 8827928, 8454458, 8666774, 8388181, 8167834, 8098834, 8124091, 7885375, 7831209, 7678520, 7430557, 7331050, 7353157, 7307871, 7382108, 7063213, 6987683, 6851952, 6919913, 6962058, 6625608, 6719446, 6660956, 6674762, 6431185, 6439007, 6310554, 6227478, 6350709, 5904923, 5739654, 5770934, 5937800, 5995507, 5876168, 5797564, 5669619]
2537E669619k4778j73053Q4082j06941m12875L21739k06881p2828K73020j47003
2527E204101n6628m5206J10196L8001r0686l93719N6428K21940m4574j28393n6530
2516D814930n5229p5753l7481J70338K2210j19213l86703J976L09183m2213j38057
2505D463988q0645J08557K27861j12152J12869o7465K03531k42690r1221j1061
2495D511572J43830K5017J57196L8858l9595j03034M6428J74945N898J92089j05272
2484E047932k16921j93012J42190k20836n5108j06117k0812n3681J09920j43094
2474D290461o2438k86075O5325L64440j04632j9127j56556q3172J27956j5613
2464D120569j92244j18595L7513q8122J66185n4361j21368L64967K96150k21489
$$ y = [5669619, 5644841, 5471788, 5555870, 5448929, 5036054, 5357793, 5150912, 5078084, 5351104, 5204101, 5147473, 5102267, 5212463, 5250464, 5159778, 4766059, 4822487, 5044427, 4999853, 4871460, 4814930, 4759701, 4683948, 4646467, 4816805, 4839015, 4719802, 4333099, 4335075, 4644258, 4602045, 4463988, 4383343, 4491900, 4719761, 4607609, 4720478, 4653013, 4856544, 4613854, 4522633, 4511572, 4655402, 4680419, 4837615, 4876473, 4836878, 4733844, 4780272, 4955217, 4961115, 5153204, 5047932, 4831011, 4637999, 4780189, 4559353, 4504245, 4398128, 4377316, 4323635, 4433555, 4290461, 4228023, 3941948, 4007273, 4371713, 4267081, 4247954, 4091398, 4008226, 4136182, 4120569, 3928325, 3809730, 3847243, 3759121, 3925306, 3870945, 3749577, 4114544, 4410694, 4189205]
2454D189205p8963M167j74098r5039J5588J31168K81361k39434l1913k09593m66890
2443C325559j2121P4496K49465j74010j49824k49608k41466L71236j96848J60926
2433C157805J17398p6278k10339k20440k1887L5713J88639p5254q8499m6791l60298
2422B399769r5852M9341Q0226L4354K1220K10399l26232r17J43793k5624j00148
2411B390329j6621M6560l63884N1710J66703q9812K59653q8790J13743l48537
2401B121054k7159k48621L7379K00969k66875K59057O3410k84824j06375R1466
2391A839481j7864L6062K18097J87211k20277k69536m9291J34439K56364J55870
2381B270556k25641k24359j50521J13804q9503J28895L23835j6891j68752k99267
$$ y = [4189205, 4110242, 4114409, 3940311, 3845272, 3860860, 3992028, 4273389, 4033955, 4002042, 3792449, 3325559, 3313438, 3387934, 3637399, 3463389, 3313565, 3063957, 2822491, 3193727, 2996879, 3157805, 3275203, 3198925, 2988586, 2768146, 2746259, 2781972, 2970611, 2895357, 2806858, 2760067, 2399769, 2303917, 2353258, 2433484, 2467838, 2489058, 2699457, 2373225, 2372308, 2516101, 2490477, 2390329, 2373708, 2420268, 2056384, 2108094, 2274797, 2184985, 2444638, 2355848, 2469591, 2121054, 2093895, 1845274, 1882653, 2083622, 1816747, 2075804, 2139214, 1854390, 1748015, 1839481, 1821617, 1857679, 2075776, 2262987, 2042710, 1773174, 1723883, 1858322, 2114686, 2270556, 2044915, 1820556, 1670035, 1783839, 1694336, 1823231, 2147066, 2130175, 1961423, 1662156]
2371A662156l68640J68948L31604j93372M57511p1230j78824j51408l4444R6532
2361A718833j75486K71509k23140J0261p0466l4132o6442Q8854J53429j77531
2351A495689k59333K97094O0439p3723P6834K05324k62637o6771M5135j93102
2341A324949J38578K01557N5947k40537Q7886k49349O898o5605J02972J3045l9501
2330A336840k19092Q0261K3941J15394J18893N4132p75P1094l83967o4400J51812
2319A284133j07109K24634k809K860K74488j02400k26956R6578K0673m24678R1257
2308A130671L35309j28138J7052j8370m25019J82506K40904l8034N2035K42019
2298A590935o6765N1445K526j15838j39854O0461J35530k75956R8746k3752m9819
$$ y = [1662156, 1293516, 1462464, 1794068, 1600696, 2058207, 1986977, 1808153, 1656745, 1622301, 1718833, 1543347, 1814856, 1591716, 1601977, 1531511, 1497379, 1430937, 1519791, 1673220, 1495689, 1236356, 1533450, 1593889, 1520166, 1597000, 1802324, 1539687, 1472916, 1518051, 1324949, 1463527, 1665084, 1721031, 1480494, 1568380, 1319031, 1325929, 1260324, 1363296, 1376341, 1336840, 1117748, 1198009, 1221950, 1337344, 1456237, 1510369, 1509594, 1580688, 1196721, 1132321, 1284133, 1177024, 1401658, 1398849, 1401709, 1676197, 1573797, 1346841, 1443419, 1464092, 1039414, 1130671, 1465980, 1337842, 1354894, 1336524, 911505, 1094011, 1334915, 1296881, 1348916, 1590935, 1524170, 1575615, 1578141, 1462303, 1322449, 1382910, 1518440, 1242484, 1341230, 1317478, 1267659]
2287A267659l0634R4476L5897q9962k45811J95488j17495J49087j6691j83917
2277A058097o4498J03071J19290J43212J27162j88389k22243N949n7137K38974
2267A263488O2167K8937k61065r535L2744O095K58548r1747J4206j47721k15798
2256I40319J31913J08473R5979q9533j45699O4720J29132j27642l3400J92232
2246A266494j86721J31500K3532l12896L37180J05615j53287n8711J63399k02921
2236A113184l639M942L3483K7315n6542K25263j76180j46457Q6398K73240k10274
2225A170733q8962J01765l046J59320l3459k18041k08792K16020j55188j10727
2215H29623K27328j38080K12987N3988j34747m4051j28238k0533J62905L52203
$$ y = [1267659, 1237025, 1331501, 1367398, 1277436, 1031625, 1227113, 1109618, 1258705, 1242014, 1058097, 993599, 1096670, 1215960, 1359172, 1486334, 1297945, 1075702, 1081651, 1024514, 1263488, 1325655, 1354592, 1093527, 1083992, 1116736, 1122831, 1381379, 1289632, 1303838, 1156117, 940319, 1072232, 1180705, 1276684, 1187151, 1041452, 1106172, 1235304, 1107662, 1074262, 1266494, 1079773, 1211273, 1234805, 921909, 1259089, 1364704, 1211417, 1152706, 1316105, 1113184, 1109545, 1114487, 1147970, 1175285, 1118743, 1344006, 1167826, 1021369, 1107767, 1381007, 1170733, 1081771, 1183536, 1180490, 1339810, 1306351, 1088310, 879518, 1095538, 940350, 829623, 1056951, 918871, 1131858, 1185846, 1051099, 1007048, 878810, 858277, 1021182, 1373385]
2205A373385k44805j50029o8949K5139L71830j87291j36000j53580r9443K40229
2195I70486J36612n5627J35341m6795P0119J6934q2688J44714L8554k7786k55458
2184A044406j17992K94329q3556K19815J05355k62596j18865K61772k55321P245
2174A094592J07964N4335J25064j35097J21043q0362j20645J22290l0073j14064
2164A145047j82330J44385J40972j90797L50112j02998k06251K99502q9721n3954
2154A253967q0541L15562r4828K26796q6626l24115J89640n2936J36365O4139
2144A547423K3546n3974j94422L4293j49925J03156J36706N9251M9953p141J3637
2133A562503j12108K21501K29528l06667N4207J43061J19191K3306K15800l07331
$$ y = [1373385, 1128580, 978551, 909602, 934741, 1306571, 1119280, 983280, 829700, 730257, 970486, 1107098, 1051471, 1186812, 1140017, 1210136, 1227070, 1144382, 1289096, 1327650, 1299864, 1044406, 926414, 1220743, 1137187, 1357002, 1462357, 1199761, 1080896, 1342668, 1087347, 1094592, 1202556, 1256891, 1381955, 1246858, 1367901, 1287539, 1166894, 1289184, 1259111, 1145047, 962717, 1107102, 1248074, 1057277, 1407389, 1304391, 1098140, 1397642, 1307921, 1253967, 1173426, 1488988, 1394160, 1620956, 1534330, 1210215, 1399855, 1346919, 1483284, 1547423, 1570969, 1516995, 1322573, 1356866, 1206941, 1310097, 1446803, 1506054, 1556007, 1548866, 1562503, 1450395, 1671896, 1901424, 1594757, 1648964, 1792025, 1911216, 1934522, 2150322, 1842991]
2123A842991k47356K10855j98962L60718L03475O9632k02976o5649r4596N7339
2113B035471J01315j35444l4070N7097P6658P6666j10092K77407r2281J66671
2103B419398q5767k7410K46943n5821J01193L4076k0834R7441L2125J74176j51115
2092B764405j72565K87809P3898K08181M7398J80469J81693L97780K06251n7702
2082D117617L34289j00968L38310L60012L10562K97861K80252N03260K26137K97843
2072F965175J133175R77173O49781R18586J536162R91023J015770J394670J544429
2063A7125944J746540K229462K865967L905984N018200O170479O740346P194887
2055E2997809P314476N126809n115752j0523168q410294p617216n995599m430846
$$ y = [1842991, 1595635, 1806490, 1607528, 1968246, 2271721, 2341353, 2138377, 2072728, 1978132, 2035471, 2136786, 2001342, 1967272, 2024369, 2101027, 2177693, 2067601, 2345008, 2252727, 2419398, 2333631, 2306221, 2553164, 2497343, 2598536, 2632612, 2611778, 2709219, 2741344, 2915520, 2764405, 2591840, 2879649, 2953547, 3161728, 3209126, 3389595, 3571288, 3969068, 4175319, 4117617, 4451906, 4350938, 4689248, 5049260, 5359822, 5657683, 5937935, 6441195, 6667332, 6965175, 8098350, 9075523, 9725304, 10643890, 12180052, 13171075, 14186845, 15581515, 17125944, 18872484, 21101946, 23967913, 27873897, 32892097, 39062576, 45802922, 52997809, 60312285, 65439094, 60323342, 49800174, 41389880, 33772664, 27777065, 23346219]
2047B3346219k739149k339172j635521j451180j002641j085084q03883r65547
2039A1324042j069449j042643o37574k89557m68913k41249l60583n06034l01981
2030F406059k94927k3526j27602k42719m35385l27701j08552l01203l65867r2341
2020D086236q7531O6526J55136k92054q5255j08363k02105j1596j28466j8128
2010C374400k39744q7188M1388j04158n7588j31515p2449j26766Q2978j89675
2000B489683k6098q7399K19898L9683m87493j5851j52495j1476J52698K17000
1990B338150o6816k19051m2547j70766J42498K42866l05024J8706k40489j89766
1980A507761N6368J96138J069k75004R7280L8567q9582l4053j44621J99252m6241
$$ y = [23346219, 20607070, 18267898, 16632377, 15181197, 14178556, 13093472, 12289589, 11324042, 10254593, 9211950, 8574376, 8284819, 7815906, 7574657, 7214074, 6708040, 6406059, 6111132, 6087606, 5960004, 5717285, 5281900, 4954199, 4845647, 4544444, 4178577, 4086236, 3998705, 4065231, 4220367, 3928313, 3843058, 3734695, 3532590, 3520994, 3392528, 3374400, 3134656, 3047468, 3088856, 2984698, 2927110, 2795595, 2723146, 2596380, 2679358, 2489683, 2463585, 2376186, 2596084, 2635767, 2148274, 2132423, 1979928, 1968452, 2121150, 2338150, 2271334, 2052283, 2009736, 1838970, 1981468, 2224334, 1919310, 1938016, 1697527, 1507761, 1564129, 1760267, 1761336, 1486332, 1583612, 1622179, 1532597, 1498544, 1353923, 1553175, 1506934]
1969A506934p9735q4515N0891j9895j27510J12963n0393k2807J17707k87296L08585
1958A424929j32727m7495R4166j16546O830P3831k7245l14045L26349j95752m4978
1947A047317r344r9078L97314j84109N7943R8277j84980p0616j03117j95518j90527
1936E63562L36414l0046L2837j66012j89577L31691j19077N3721k6496k46392
1926E40625J53799o106L49915p7359p2564j7314k1082J24567J5517j60398j16764
1915G12836k3886k14173K20681K89729M5170r4530q9722l9061j65168J71691j29563
1904F84004j10685J96813p1469j26474J06516L6925N4113k9843K75676m0252j78884
1893G96440R4575k1141j4664n1119J47318j46618j98583N720N1160j4905j0404
$$ y = [1506934, 1427199, 1342684, 1393575, 1373680, 1246170, 1359133, 1308740, 1285933, 1403640, 1116344, 1424929, 1292202, 1244707, 1338873, 1222327, 1229157, 1302988, 1275743, 961698, 1288047, 1092295, 1047317, 1037973, 938895, 1336209, 1152100, 1210043, 1308320, 1123340, 1052724, 949607, 754089, 563562, 899976, 869930, 902767, 736755, 547178, 878869, 759792, 813513, 787017, 540625, 694424, 688318, 1038233, 960874, 888310, 870996, 849914, 974481, 989998, 829600, 712836, 688950, 474777, 695458, 985187, 1030357, 935827, 846105, 807044, 641876, 813567, 684004, 573319, 770132, 698663, 572189, 678705, 715630, 769743, 739900, 1015576, 975324, 796440, 891015, 869874, 855210, 804091, 951409, 804791, 606208, 611928, 663088, 648183, 637779]
1882F37779N4810j30122K16856J35389j16040l32775J23061J5279K85751n331
1872H84657j47386Q604J871k0770n4426k2977K30280o7520j13590O2003J22557
1861H83303j49991m4931J13824l04672J80275R5617K9658j82121J53892m1778
1851G33076k09417J75813J77404j16731o3351k40639O5352p3280j69404K20824
1841D99647J2400j84531K19930L2741J49211k82750k28084j9322J68321L15451
1831F83014M9984R5383L845m7939k75380k71661R3657K63170l4370N9434j55648
1820D63489k7531J66213R3452K2671n3735M14489p7553r7809j8898l69539J82561
1809F97810k34233j27028K4229J12918N9274N0115j790l65164P9731J34678J48304
$$ y = [637779, 692589, 562467, 779323, 914712, 798672, 465897, 588958, 604237, 889988, 884657, 737271, 745875, 747746, 726976, 672550, 649573, 879853, 812333, 698743, 760746, 883303, 733312, 688381, 802205, 497533, 677808, 773425, 803083, 620962, 774854, 733076, 523659, 699472, 876876, 760145, 696794, 456155, 521507, 448227, 278823, 499647, 512047, 327516, 547446, 580187, 729398, 446648, 218564, 199242, 367563, 683014, 732998, 828381, 832226, 784287, 508907, 237246, 330903, 594073, 559703, 619137, 463489, 435958, 602171, 695623, 718294, 664559, 1079048, 1001495, 903686, 884788, 515249, 697810, 463577, 336549, 360778, 473696, 532970, 583085, 581295, 216131, 295862, 430540, 578844]
1798E78844o0396o7520K01915j13347j8866j79460J3191J01342j0817P866o6150
1787C86602R2785o7162K1686O5413j05252k4467L79390j9175j82456k09490J76104
1776E13978j14663K7788M4785r6212J66805Q0986j57470j64447m7416j89576J54722
1765B19280M99008j51813r3932j00141Q7270j05986k68762K18197O1180L45773
1755G10074k94981r6338N3786j39925J72072m6885K04603K5927q3449n588k96814
1744B02482K58019j68062J25630L1994J8642K04695l22738j21879J72819j60431
1734B41171k96119K82536K27792j19779K97443l7145k0981j10161j90513J12160
1724C86404j07352K71814N0038j15818j02947o6097j19988l3152L63114J75882
$$ y = [578844, 518448, 450928, 652843, 539496, 520630, 341170, 354361, 455703, 444886, 452752, 386602, 479387, 412225, 433911, 499324, 394072, 369605, 748995, 729820, 547364, 337874, 513978, 399315, 427103, 471888, 375676, 542481, 623467, 465997, 301550, 254134, 64558, 219280, 718288, 566475, 472543, 372402, 459672, 353686, 84924, 303121, 364301, 710074, 415093, 318755, 372541, 232616, 404688, 357803, 562406, 588333, 504884, 499296, 202482, 460501, 292439, 418069, 450063, 468705, 673400, 350662, 228783, 401602, 241171, -54948, 227588, 455380, 335601, 633044, 595899, 574918, 464757, 274244, 386404, 279052, 550866, 600904, 485086, 382139, 316042, 196054, 162902, 526016, 701898]
1714G01898j98140j16543k40237J56992j12002J96189J49759k00283O2577j45656
1704B54554J86243j39663m82J73552n6815N2614k0377l4514k01928r2365J63072
1693B83891j0527J10080r5959M1297O0634j69087K95046j71744O7164j3552K1709
1682D18952l3016J67478k00903K2922K74618l17855P2053P8137L0472j17519N2833
1671D48172J25699q8223j38537j66958P9961p70J78418N5535K3620N6450j86549
1660C86818P608p5913L4591J11578m0475o3091j92996k70674K12128J67548L21603
1649E98725k69610J65987k14901j00651N118J36162J42415R2862j56776k80522
1639A18809L3432J27200q420J83944j00214k230n6256j32319N5410k49607K40114
$$ y = [701898, 503758, 387215, 146978, 303970, 191968, 388157, 537916, 337633, 400210, 254554, 440797, 301134, 300652, 474204, 417389, 470003, 449626, 415112, 213184, 120819, 283891, 273364, 383444, 287485, 328782, 389416, 220329, 515375, 343631, 410795, 397243, 418952, 385936, 553414, 352511, 375433, 650051, 332196, 404249, 482386, 512858, 395339, 448172, 573871, 485648, 347111, 180153, 260114, 259344, 437762, 493297, 516917, 573367, 386818, 394426, 318513, 353104, 464682, 424207, 361116, 168120, -102554, 109574, 277122, 598725, 329115, 495102, 280201, 179550, 184668, 320830, 463245, 556107, 399331, 118809, 152241, 279441, 271021, 454965, 354751, 352521, 296265, 163946, 219356, -30251, 209863]
1628B09863J78149m5244j60503m9655R1817j56084K72163N5571J39893Q8708k08882
1617D15796J02739M2572n4175N4638p1900j52693o1590L2427J35104j82757P601
1606B67762J45565r5250k31981J35685r5688J42318q945l42379L3647R8397Q9383
1595A38514J87714J09630j3009p7530R9517j55840j03879r8038K07724J0709K2494
1584C28006J21543L5292j05175r3360j17896J6396J13011K22525o629k69917n5997
1573A87799r9897P2491K20400j47063J79104o4319l0463L1298O8590J47934j07605
1562D58269k4803j7172M5515k69963M4515R1836j13947K24538j13168n5177J29029
1551C99472o769j04904o8474K29967j03427M140K7703m8764Q8417J1250j00498
$$ y = [209863, 388012, 342768, 182265, 132610, 224427, 68343, 340506, 396077, 535970, 624678, 415796, 518535, 561107, 506932, 561570, 489670, 336977, 275387, 307814, 442918, 260161, 267762, 413327, 318077, 86096, 221781, 126093, 268411, 259466, -82913, -49266, 49131, 138514, 326228, 435858, 422849, 345319, 444836, 288996, 185117, 87079, 294803, 305512, 328006, 449549, 484841, 379666, 286306, 168410, 184806, 297817, 520342, 513713, 243796, 187799, 87902, 160393, 380793, 233730, 412834, 348515, 318052, 349350, 417940, 565874, 458269, 433466, 416294, 461809, 191846, 236361, 328197, 214250, 438788, 325620, 270443, 399472, 392703, 287799, 219325, 449292, 345865, 350005, 377708, 328944, 417361, 428611, 328113]
1540C28113l52448N8399J17794P3547R7678P6885k49072N9542L2930k05037J52914
1529A91245Q2962j75349J24837N7832j20294l420J29992N927k62793q2086J89230
1518A38083j44616J04797K57621j9668j02019j82367p9028R8215R5559J19500
1508B86077K95626j381l14742j22819K6740k33836N2380J39082M8658j87897J460
1497a0652J26567j54902J66027R5315n530J08175j48363p4001n5829J43885Q045
1486A98737K79133j23262k00567j20540R8959k8625K8485r5846M30481j58536
1476C08419j10199p1360n9234N7234L33164K4049j70739m4451j03460j45910J2775
1465C0288L12415j39523m706O9233j85407k824J30348n5998K38186J8970k39489
$$ y = [328113, -24335, 34064, 151858, 225405, 323083, 399968, 150896, 210438, 243368, 38331, 191245, 274207, 98858, 223695, 281527, 161233, 157813, 287805, 293732, 30939, -51147, 138083, -6533, 98264, 355885, 336217, 234198, 51831, -27197, 71018, 166577, 286077, 581703, 580322, 265580, 142761, 169501, -64335, -11955, 127127, 175785, -12112, -10652, 115915, -38987, 127040, 222355, 216825, 325000, 176637, 102636, 46807, 190692, 198737, 477870, 354608, 154041, 33501, 132460, 103835, 132320, 36474, 466955, 308419, 198220, 126860, 67626, 124860, 458024, 482073, 311334, 266883, 163423, 17513, 30288, 342703, 203180, 198474, 267707, 82300, 79476, 209824, 153826, 392012, 410982, 171493]
1454A71493j75184K86291j9409l4300l954R9131N3064l03134j53442K08804L1816
1443A61176J82669k014k42647k26069J74513R4933K426L34615r2675K3350O1567
1432D71844l94467J31702l2711r9779J24348J90052j4614m43858K68889o1982
1422A39424K6407J02240K01086l3599k75464q6046j619Q3699J40571j4313j35739
1411A46647k5494J7633J38087j42306N5696M5641r0081j12113L62376k71416L31419
1400D56089Q2983k19599n576l50860K72728J10096J46063P7978q9344k68460l77279
1389a65181L10913j59135o3618M82289O7674l5925k63123j29687j43841J84511
1379H4877J83278p7123K14480k46307k8537l0975k01981K66290N7656R0490m1006
$$ y = [171493, -3691, 282600, 263191, 228891, 224937, 324068, 377132, 73998, -79444, 129360, 161176, 343845, 341831, 99184, -126885, 47628, 142561, 144987, 479602, 386927, 410277, 471844, 77377, 209079, 176368, 76589, 200937, 390989, 376375, -67483, 201406, 139424, 165831, 268071, 469157, 435558, 160094, 74048, 72429, 156128, 296699, 282386, 146647, 121153, 138786, 276873, 134567, 190263, 235904, 145823, 33710, 396086, 124670, 456089, 539072, 319473, 313897, -36963, 235765, 345861, 491924, 569902, 480558, 212098, -165181, 145732, -13403, -77021, 405268, 472942, 437017, 173894, 44207, -99634, 84877, 268155, 191032, 405512, 159205, 130668, 99693, -102288, 164002, 221658, 312148, 271142]
1368B71142k0626J29618j30576j7204l60169J80284K20730j3945o3107M7990L3029
1357B77166l0063K6591l53147L47007K83749n18489O9628J12417j26693N4637
1347A42803o7325m7861L7657j58110l5955N8373M0129J87936j66370k25219J82451
1336e1491J99082J78379n047k34530J52004l3383K01499j89362q3448j25853J10106
1325A17956K39686r4075k48760J30246K39225j71573j5583R2623j1103j52379
1315A26263L5914k1486M1731K34211J9842j19430j19426L6388N842n4837o6029
1304A18983j55471j59034M78158o427l9172K98528r7545j00501j48919R7793m82097
1293a95704K46558J24352k21937J87344K7911m4469J1488m9152Q0070O7277Q0279
$$ y = [271142, 250516, 380134, 249558, 232354, -127815, 52469, 273199, 259254, 196147, 244137, 277166, 247103, 273694, -79453, 267554, 551303, 32814, 102442, 214859, 88166, 142803, 75478, 27617, 65274, -92836, -128791, -70418, -30289, 157647, -8723, -233942, -51491, 147591, 325970, 320923, 86393, 238397, 205014, 406513, 217151, 133703, 7850, 117956, 357642, 263567, 14807, 145053, 384278, 212705, 197122, 289745, 278642, 126263, 162177, 140691, 182422, 416633, 436475, 317045, 197619, 234007, 239849, 185012, 118983, -36488, -195522, 282636, 276209, 237037, 535565, 438020, 337519, 188600, 286393, -195704, 50854, 175206, -46731, 140613, 168524, 124055, 135543, 86391, 166461, 233738, 314017]
1282C14017j01958k2863L20725j48686k40339J82680P9353j91578L3826N3499
1272B78676q2396J0605p664j22220j8436J66666J18951j47530K1114J91277l33268
1261G5775q5203K39021p4249k79006J54609J5049K2431Q1851j23797k49262K37953
1250A5172J91140R7873O3275j38631o1000j04118J99036l88834K642J36142m2977
1239c0280q1637n277l9515l2248K05556N88012j4148j09111k26016k90885o1331
1228i6880L46236n4336L336K473n9022j62880Q0452k8654j3377K36335k65170
1217a1487k39842K02229J52183P8154K12413k83416L4756o7776J0402n9825l1736
1206c945J29958o3153q4709Q1697j67630n9012J24584K23664N9393j61663P3543
$$ y = [314017, 212059, 189196, 509921, 361235, 120896, 303576, 382929, 191351, 225177, 278676, 196280, 206885, 199221, 77001, 58565, 225231, 344182, 196652, 217766, 409043, 75775, -9428, 229593, 155344, -123662, 30947, 45996, 68427, 150278, 26481, -222781, 15172, 206312, 304185, 367460, 228829, 167829, 63711, 262747, -126087, -123445, 12697, -30280, -111917, -117194, -156709, -188957, 16599, 604611, 590463, 481352, 255336, -35549, -96880, 249356, 195020, 198356, 200829, 141807, -21073, 59379, 30725, 17348, 253683, -11487, -251329, -49100, 103083, 181237, 393650, 110234, 144990, 77214, 87616, 27791, -3945, 126013, 62860, -21849, 59848, -107782, -166794, -42210, 181454, 240847, 79184, 152727]
1195A52727k94350j5560J92817L856J8639j0557J29727j11199o388J00909l19193
1184a58572K23219K21256j54157J61522k19767P340k7677K29072j4705j96932
1174G0599O0685j76976l2569p2599j16643K35787J08771J81282q0415j29469N3312
1163A01765j51958R6467O8217j93190N1944K00186p225j36852J86682q6767J06694
1152B35963k08858R5577P0044l71027J40374J41960J15272r3514k68722K10960
1142F8029Q8627l9222j3227r2775m982k14593J03323N2445J2244l8909J95814
1131A16774J8226l00712J14205K09314q1125Q4712N5437j04707N4422J17996m44491
1120a59949J14258K13183L1548J84615j94510j20483k63447J03785r9332R1545
$$ y = [152727, -141623, -157183, 35634, 39490, 58129, 47572, 177299, 66100, 59712, 160621, -158572, 64647, 285903, 131746, 293268, 73501, 80841, 53164, 282236, 267531, 70599, 131284, -45692, -78261, -150860, -267503, -31716, 77055, 258337, 177922, 48453, 101765, -50193, 46274, 114491, -78699, -26755, 173431, 166206, 29354, 216036, 129269, 235963, 27105, 122682, 192726, -178301, -37927, 104033, 219305, 125791, -142931, 68029, 156656, 117434, 104207, 11432, 6450, -208143, -104820, -52375, -40131, -79040, 116774, 135000, -165712, -51507, 157807, 76682, 161394, 216831, 112124, 166546, 284542, -159949, -45691, 167492, 199040, 383655, 189145, 68662, -194785, -91000, -190332, -98787]
1110i8787K71891j44049N7477l38238J06979K9386J645K89982R3859J67004m45230
1099h081M2772j11677q8854N0638K8664K91849K6804l1555P2592j54071q1057
1088C8024M2609J9534j43696K42491J86696n10212M9742L4263J02397Q0603J35452
1077B77903Q6966j33925K2646j70786J29312P0143j08527J0537k83754L5292l9580
1066a03773N8112J62381J62616m29690k38536K83259K05600J54105l1385l17988
1056i5299o5273j73654J14784j07744J92556K68059j60415J5072j11709J83824
1046F0201L3892N426J34203l61241J59306J11062O8033K0841j74020J87966k67023
1035b1354n5032k5278K16443R1755k05230O4053r029M049j30525j40873K23836
$$ y = [-98787, 173104, 29055, 86532, -251706, -144727, -115341, -113696, 176286, 270145, 437149, -8081, 34691, -76986, -165840, -115202, -86538, 205311, 232115, 200560, 273152, 119081, 38024, 80633, 100167, -43529, 198962, 385658, -124554, -74812, -40549, 61848, 142451, 277903, 364869, 230944, 253590, 82804, 212116, 282259, 173732, 184269, -99485, -64193, -103773, -45661, 116720, 279336, -150354, -388890, -105631, 99969, 254074, 222689, -95299, -160572, -334226, -219442, -327186, -134630, 133429, -26986, -11914, -123623, 60201, 94093, 99519, 233722, -127519, 31787, 142849, 210882, 231723, 57703, 245669, -21354, -76386, -101664, 114779, 206534, 1304, 65357, 56328, 60377, -70148, -211021, 12815]
1024A2815j53140J45546j08389L4383Q9132J99868L4322j64304N8227k132j30413
1013A5915J80031k1898j76048j60124Q0869n3080P4446K42135l56885J30363L2323
1002a1953J41198L5047L810L8957o8801k48076j29797K54025J90140N4232P0342
991C29124j63511j12796r4005l0454J37547J09321j00065J3787n4014k91028J5508
980b40586J47211l3111K61633l7080k16796j8502J16279R1612j31950K44700k1580
969A61830J9006k31440m8881J96512j40711R1042o6520j5601l4501R3751K9719
958E4206k27144M7003J91857K33746k60288j20285m8133n3426Q3472J671O597
947i0724M7692M4918L6006j59334J49410o5656j63357J14352k26680J52484p0203
$$ y = [12815, -140325, 5221, -103168, -68785, 20347, 220215, 254537, 90233, 148460, 146328, 15915, 195946, 174048, -2000, -162124, -81255, -134335, -59889, 182246, -174639, -44276, -11953, 129245, 164292, 168102, 207059, 138258, -109818, -239615, 14410, 204550, 258782, 329124, 165613, 52817, -41188, -71642, 65905, 175226, 75161, 88948, 34934, -256094, -240586, -93375, -126486, 135147, 98067, -118729, -137231, -20952, 70660, -61290, 183410, 161830, 180836, -50604, -99485, 97027, -43684, 47358, -19162, -34763, -69264, 24487, 54206, -172938, -125935, 65922, 299668, 39380, -80905, -129038, -182464, -98992, -97321, -90724, -43032, 1886, 37892, -121442, 27968, -37688, -201045, -86693, -313373, -160889, -231092]
936b31092J36017Q3780l9589P9055j55566n3350J2823J52430J43533n6081K62411
925C34371q494n10551J39555k35139j52568N76038J80617l71055L9451j52180
915a59955o0883J55962K41438p8925J07427k64975q4172O0050j11840J23677n5216
904a27412M6981k27176j2443n9488P2140K19530n4384k8404K6118n9434J16447
893h7525M1894j93513j32425L84866N3842n4629Q4338l31225J84115N0413j89701
882a89550o2747q166p842L40325K7047p3750J41463n9344l09914L3678K16847
871D8047o4853K09752p1961K5154O5861j04574j85879J45881j25113M04822r3019
860B54118k13730p4185J57679j91366j06499k2096R1530K16503j23932M7098k09941
$$ y = [-231092, -95075, -11295, -50884, 28171, -127395, -180745, -167922, -15492, 128041, 71960, 334371, 325877, -184674, -45119, -280258, -432826, 143212, 323829, -47226, -7775, -159955, -220838, -64876, 176562, 97637, 205064, -59911, -144083, -84033, -195873, -72196, -127412, -80431, -307607, -320050, -379538, -307398, -87868, -142252, -170656, -144538, -203972, -87525, -45631, -239144, -371569, 13297, 67139, 12510, 96848, -234377, -50262, 151, -189550, -252297, -260463, -268305, 72020, 99067, 25317, 166780, 107436, -202478, -168800, 48047, -16806, 192946, 120985, 146139, 212000, 107426, -78453, 67428, -57685, 347137, 254118, 40388, -33797, 123882, -67484, -173983, -196079, -104549, 111954, -11978, 35120, -174821]
849a74821o8459J59204J60891N3267J2334L9474l20268r1654L6531L6152K5335
838a32014q1210Q9317N622r566J23908L9309P1208k67535j10750K40410j03058
827a34359k44211L28149r430k7054o7952j16021L1987K00010P5391N8228R377
816A04115m73037J63710O3337J24290J63647k31496j89995J88533p9274J39098
806b7072M588p795L7918L17810l91133o8114J31694j11399R0276J36110k2354
795I0529l0699j91994r0198K30162K62975r5580J18803k59886k05109J933l8144
784b07208J36313L30870j7818l13439R3129J5748p9368n5545J10380n694K06744
773B14112k19624m9990J39220k85442Q7295L31937k69985j41261P8916j11863
$$ y = [-174821, -243280, -84076, 76815, 130082, 142416, 181890, -138378, -230032, -193501, -157349, -132014, -213224, -123907, -118285, -127851, -3943, 35366, 106574, -160961, -271711, -31301, -134359, -378570, -50421, -59851, -86905, -154857, -270878, -238891, -38881, 36510, 94738, 104115, -368922, -205212, -141875, -17585, 146062, -85434, -275429, -86896, -166170, -27072, -22484, -30279, 7639, 325449, -65684, -133798, -2104, -113503, -23227, 112883, 90529, 59830, -132164, -222362, 7800, 270775, 175195, 293998, 34112, -170997, -169064, -207208, -70895, 259975, 242157, -71282, 21847, 37595, -41773, -97318, 13062, 7368, 214112, -5512, -55502, 83718, -201724, -114429, 217508, -52477, -193738, -114822, -226685]
763b26685m0287M28044k6910j48741L1087q8828J2997k3483M0081n2854r2709
752a88288L0062L63150J3249l53461K69376J75026m63376O6147N6118j32374M7944
741a16427J00203j90665R4739L3775p1433L65409k69325l0530j22309n0286J95432
730f1417j08391O4480L7479r5320J82135l21491q552M5881J00551J09587O757
719d8301K10520l55716J36965N9413j58192l6197L2373M7678M7466J09196J7977
708F3182l42322N0548L0789k04956L4371K07755j74013O6382J67152q997P1552
697c8557M4175r6154k06209J60764N329j44337J37903M29242j31555j94688Q2760
686D8673j40963j001L30168k5923j75728q9479j54428j329J1750j114K19660j96700
$$ y = [-226685, -266972, 161072, 134162, -14579, 16508, -72320, -59323, -82806, -42725, -95579, -188288, -158226, 204924, 218173, -135288, 134088, 309114, -154262, -88115, -31997, -164371, -116427, -16224, -206889, -112150, -78375, -149808, 215601, -53724, -84254, -206563, -256849, -61417, -169808, -105328, -67849, -163169, 18966, -302525, -311077, -265196, -164645, -55058, -48301, 162219, -193497, -56532, 2881, -155311, -191508, -159135, -111457, -63991, 45205, 63182, -279140, -228592, -197803, -402759, -368388, -160633, -334646, -268264, -101112, -110109, -38557, 5618, -90536, -296745, -135981, -130652, -274989, -137086, 292156, 160601, -34087, 48673, -92290, -93291, 236877, 210954, 35226, -54253, -208681, -210010, -198260, -199374, 20286, -176414]
674a76414j04590n9359J3965J57511Q4715J17284p6133q6034p4176j19105J87691
663a34645K3413L4868k39980K46077j24644k8965K5191l6841p2525L37967J95740
652B25656k24861n3010j20275J27466J23357o7675j62254L9550j67105K9231P5560
641a74360J27256O7188l834q4502k02363O5141R6607m5294m3211l5261j7214j95209
629d45056O1516m0238J26336J94398J50667k99877J83008p9675q1005j3050L31520
618H8544q5359r1031O2452j21593o5795P3099K2809J19174K41107j14770L4945
607A63582l42305k3927J96027K46443k59419k03719L4818j04075m2652L40262
597E035m4593p8546o480J75757k63658k56062J73528K50187J0667m4960r9100
$$ y = [-176414, -281004, -340363, -326398, -168887, -84172, 33112, -43021, -129055, -203231, -322336, -134645, -111232, -76364, -316344, -70267, -194911, -223876, -198685, -235526, -308051, 29916, 225656, 795, -52215, -172490, -45024, 78333, 10658, -151596, -112046, -279151, -249920, -174360, -47104, 20084, 16250, -68252, -270615, -205474, -108867, -154161, -197372, -232633, -249847, -445056, -383540, -423778, -297442, -103044, 47623, -252254, -69246, -148921, -229926, -242976, 88544, 3185, -87846, -25394, -146987, -212782, -139683, -116874, 2300, 243407, 128637, 163582, -178723, -202650, -6623, 239820, -19599, -223318, -188500, -292575, -335227, 5035, -39558, -118104, -124584, 51173, -212485, -468547, -295019, -44832, -34165, -79125, -178225]
586a78225k1776P1568j4075J00102j53289J87625M3727P351k07217j2409K71591
575I4973O2598l15900k24328L34871K14493l78652j15439q2812M7391j35131J13834
564c84102J01230P3580J78755j29311p2098J18302j20123M0209P2226j23828n6992
553c02152k4165j40187m7264J7200L25752J08054k19131J74943j37885j00254
543c45089J98215p9704n4745K5827p3258M3140L7164O1182l2214j4669j84554
532d18705K8507K58459j16493N3542Q3648l2297P2666k23941k22981K68077Q7017
521a62501j59311K05016j24297k27270L07857o2521j41713M54552j96461j74886
511b81535J33030J68484n0517o840j82163l3726o8014n5455Q9742N1001j77224
$$ y = [-178225, -200001, -128433, -142508, -42406, -195695, -8070, 35657, 43008, -164209, -176618, 94973, 157571, -158329, -382657, -47786, 166707, -211945, -327384, -410196, -362805, -497936, -384102, -282872, -209292, -30537, -159848, -231946, -113644, -233767, -193558, -121332, -245160, -302152, -326317, -466504, -513768, -496568, -170816, -62762, -281893, -106950, -244835, -345089, -146874, -226578, -281323, -255496, -328754, -285614, -248450, -187268, -219482, -234151, -418705, -390198, -131739, -248232, -194690, -111042, -143339, -70673, -294614, -517595, -249518, -162501, -321812, -116796, -241093, -468363, -160506, -223027, -364740, 89812, -106649, -281535, -148505, 19979, -30538, -37378, -219541, -253267, -321281, -376736, -286994, -235993, -413217]
500d13217J54843J85270p8081j17019N4563n5420M2431J30573j42990J99671p0263
489a09639m08175o8616K75959J14158K52408J70866l00525j9124j56635j78876
479d28199J85573j23804J08427J49770j88157r3077j57758K91444P5544K49279
469F9042L0034j49784k33570n2056k4842J00525J19120m0957O8866k61653j63790
458e39065K71402K52595l9412j7172J3171k7341k19884P5375o043J46906J48233
447E8765j44199j80286Q2365J85642M2001j96043j04568m4847M2978K13867j83313
436b27638J69358K31694l95037J86911n1908r9032k3849K77447l11125J92086
426e1093J15653k72171K16208j72185p0869j41811m5654M51180j6066j81650l58365
$$ y = [-413217, -258374, -73104, -151185, -268204, -213641, -269061, -226630, -96057, -239047, -39376, -109639, -517814, -586430, -310471, -196313, 56095, 226961, -73564, -92688, -249323, -428199, -242626, -366430, -258003, -108233, -296390, -389467, -547225, -255781, -180237, 69042, 99076, -50708, -284278, -336334, -361176, -260651, -141531, -182488, -113622, -375275, -539065, -267663, -15068, -54480, -71652, -58481, -85822, -305706, -230331, -236374, -89468, 58765, -85434, -265720, -183355, 2287, 44288, -151755, -256323, -301170, -258192, -44325, -227638, -58280, 173414, -221623, -34712, -86620, -185652, -209501, 67946, -243179, -51093, 64560, -207611, 8597, -163588, -234457, -376268, -421922, 29258, 13192, -168458, -526823]
415e26823J91350M5358j62114K50547j62367J11607K69958k59247Q7084k6520
405a81167M6483P6237j61654K0595j34611J71416n9101K19250J17834k14154l23074
394d21946l10566K07563j00505K16361K01270n0414j26964j33043K83289l29801
384e64756J98941M92048k25858j93249r8086j33602j33123L37283O9297l14970
374e66075J49274j92697K58434M235O96n2208k6094K30538l19529L246J46860
363c63320J79830J91341j27758Q5335l50348j133j34008J1627K53467J08230P7424
352f9313k70440j53915r6377J67508J75828R2761J05738r0766k07710j68066Q0752
341d34000N1651k19555L65436j07380M24315p1255m47278L07883j43444P7578
$$ y = [-526823, -335473, -290115, -452229, -201682, -364049, -252442, 17516, -241731, -154647, -181167, -134684, -58447, -220101, -199506, -334117, -162701, -221802, -2552, 115282, -98872, -421946, -732512, -524949, -625454, -409093, -207823, -258237, -385201, -518244, -234955, -564756, -365815, 126233, -99625, -292874, -390960, -524562, -657685, -320402, -251105, -566075, -416801, -609498, -351064, -346829, -346133, -398341, -424435, -193897, -513426, -510180, -363320, -183490, 7851, -119907, -34572, -384920, -386053, -520061, -508434, -254967, -146737, -69313, -339753, -493668, -590045, -422537, -246709, -153948, -48210, -138976, -346686, -514752, -434000, -382349, -601904, -236468, -343848, 80467, 9212, -438066, -130183, -273627, -196049]
331a96049M2257P2909j85936N0392J45304k64452k8832k1501J05478L06498j85503
320a59435j88131l0401m0289O681J23763j10939l01564L44922r0768q4249J69588
309c60822p0065Q4186r0720K06103j104M00128J60221j77915k53443m15282K95670
298b23043L0140Q2314P6521k49132R4960M5906K53715r4727l04476j3074J51094
287a49802J05448k06788l08386K9793J51533K2811J9306n0712m2009o6786J71096
276c24496o6531J2043J4526P1192m8653J58730J2312J8164Q6829k52621l5184
265c53689j17153J3980J54870p3939J38178j28481l02084N5282L51504J58048
255a03484m8816j18210j65112J5708l5377k36043P1644K89650p1330J25368j28306
$$ y = [-196049, -153792, -80883, -266819, -216427, -71123, -335575, -364407, -385908, -280430, 26068, -159435, -347566, -377967, -418256, -411575, -287812, -398751, -700315, -355393, -446161, -530410, -360822, -430887, -346701, -437421, -231318, -232422, 167706, 327927, 150012, -103431, -518713, -223043, -192903, -110589, -34068, -283200, -188240, -142334, 111381, 16654, -287822, -300896, -149802, -44354, -251142, -559528, -529735, -378202, -355391, -336085, -386797, -428806, -495592, -324496, -391027, -378984, -364458, -293266, -341919, -183189, -170877, -152713, -65884, -318505, -353689, -470842, -456862, -301992, -375931, -237753, -366234, -668318, -613036, -261532, -103484, -152300, -270510, -435622, -419914, -455291, -691334, -619690, -330040, -401370, -276002, -404308]
244d04308o5908j32286K1810L05704j13489m8721j8634r1332j1085R3132K62574
233b02543k32294j98500K31549N0194L4129k39624K32453j29431N3171J26469
223b74427N038n6960l11766K20820M5016q4388J17104j23954K10218J17876k30423
212c65846O5909j67952q6322j78494K57660O8180p1825J61879j58341J51764J51488
201a71900k39882j37958K39294r8635J88361K22830l83622l114j2659K6366n9594
190d30513J37990J77958o3583J25448l08173j73785K01072j16671P4738J06522
180b68997N5164r519k46641j55357J29144J28163j96170L50095K0158m71338M5363
169f19935M8351K37262J09429j50012o7013R9336q088M4137K07764k63291k335
$$ y = [-404308, -470216, -602502, -580692, -274988, -388477, -437198, -455832, -547164, -558249, -465117, -202543, -434837, -633337, -401788, -351594, -317465, -557089, -324636, -454067, -400896, -274427, -269389, -326349, -638115, -417295, -372279, -456667, -339563, -463517, -253299, -135423, -365846, -299937, -467889, -554211, -732705, -475045, -406865, -478690, -316811, -475152, -323388, -171900, -411782, -549740, -310446, -409081, -220720, 2110, -381512, -384626, -397285, -370919, -430513, -292523, -114565, -178148, -52700, -360873, -534658, -333586, -450257, -375519, -268997, -213833, -223352, -469993, -625350, -496206, -368043, -564213, -214118, -193960, -665298, -619935, -571584, -334322, -224893, -374905, -441918, -342582, -350670, -306533, -98769, -362060, -364395]
158c64395k03960j90551J47594K55800P8321j79301J54516q0615M9550j42541
148d75582j81577K13884K70937R6970k52952O8341j12373K4093M5501l14344K08103
137d08999M8198j44742K18862q6410j81054K61175J6447j58053L043p6782L3881
126d74434J50396j29329K55981Q9949k45632k6125j35270j07850R1737K13847
116c16730J2403L3613m1519k75841J68923j35888J67824M37657j63339m37986
106e50883N3970j14101j7031J26803M3763P6480N7146j43735m5376J88091j48622
95d73495K6732J64203k5329n5808q1694n7717r9811J9016J06261N2753n791k12771
83f43451K78051m4601n0363L3781K4330j49443J46927L862l588L9426K9863r1534
$$ y = [-364395, -568355, -758906, -611312, -355512, -277191, -456492, -301976, -382591, -333041, -475582, -657159, -443275, -172338, -75368, -328320, -259979, -372352, -348259, -302758, -617102, -408999, -360801, -505543, -286681, -373091, -554145, -292970, -276523, -434576, -431533, -508315, -474434, -324038, -453367, -197386, -107437, -353069, -379194, -514464, -622314, -530577, -316730, -304327, -270714, -312233, -588074, -419151, -555039, -387215, 50442, -112897, -550883, -496913, -611014, -628045, -501242, -457479, -380999, -323853, -467588, -512964, -324873, -473495, -446763, -282560, -307889, -363697, -445391, -503108, -602919, -583903, -477642, -424889, -430680, -643451, -365400, -410001, -460364, -426583, -402253, -551696, -404769, -400907, -404495, -365069, -335206, -426740]
71d26740J3696j07337j5565K72529p9574K0867m4318j1833j2458K8061J19804
60b42868k2323l3699j26711o1066J8812J4234J80542j60633j38107K60464j63475
49d74830j44064j16689L86359K8219k2616p8066q2588J0947j59411R0644p5440
38f37535K5479k545K6165J30036k9897q4246n3567R5212J65837j50409J41225
27c74245p0642K9874L8663j7046j22232K0379J14844m3847j6187j3864k61265
16g15568J47113m1888P8627J52850J5387q3823L5492L6864k2388p7561r1752R7756
4d68891j38213J35972K33821L0883
0b06428
$$ y = [-426740, -413044, -520381, -535946, -263417, -342991, -322124, -366442, -378275, -390733, -362672, -242868, -265191, -298890, -425601, -486667, -467855, -453621, -273079, -433712, -571819, -311355, -474830, -618894, -735583, -349224, -321005, -343621, -421687, -504275, -493328, -652739, -562095, -637535, -612056, -614601, -588436, -458400, -488297, -572543, -626110, -530898, -365061, -515470, -374245, -444887, -415013, -376350, -393396, -515628, -495249, -380405, -424252, -440439, -454303, -715568, -568455, -610343, -531716, -378866, -363479, -447302, -411810, -374946, -397334, -474895, -566647, -468891, -607104, -471132, -237311, -206428]
$$ Imaginary data points
##PAGE= N=2
##DATA TABLE= (X++(I..I)), XYDATA
16383d284710J90483O0060K58322j06290j6599Q9999o0202J72258J51142J39951
16373c405586R1395K6940j48147j01048K57506J36571M5909J32646k38922K57168
16363b945568m4719k0451P5911J92799J10576Q3256N7161j89496J00862M0011
16353b539658r9445M34456P0029O8771k9194r0852j4662K0070K55419R7934q1877
16342a909009p1138l0698Q6240J01877K87027M7221j12760R043J34618k8016j55597
16331a641192J17899J45527J94848M6068j2962j2919n4173J17344J97914j15373
16321a017019M0288J41518q4770o4397K63104P0274j7929J67632r5765K00080
16311c96984l6019J202K11878R6218K28165l17122l6280J11645J51888j5563L9211
$$ y = [-4284710, -4094227, -4034167, -3775845, -3882135, -3898734, -3808735, -3868937, -3696679, -3545537, -3405586, -3314191, -3287251, -3435398, -3536446, -3278940, -3142369, -3096460, -2963814, -3202736, -2945568, -2990287, -3010738, -2934827, -2742028, -2631452, -2548196, -2491035, -2680531, -2579669, -2539658, -2639103, -2204647, -2134618, -2065847, -2095041, -2185893, -2200555, -2180485, -1925066, -1827132, -1909009, -1980147, -2010845, -1924605, -1822728, -1535701, -1488480, -1601240, -1592197, -1457579, -1485595, -1641192, -1523293, -1377766, -1182918, -1136850, -1149812, -1162731, -1216904, -1099560, -901646, -1017019, -976731, -835213, -919983, -984380, -721276, -651002, -668931, -501299, -597064, -396984, -433003, -431801, -219923, -123705, 104460, -212662, -248942, -137297, 14591, -972, 38239]
16300C8239n3288NJ27468J04691L6813J27789J24096j02499q7179P8878n0971
16289C44042j10858K23287P3270J04177J53474r335K831j9130R0450p9385K04035
16278I76858o1052j84807J89092J33375N9200p7651K26904O0036k07416o6745
16268A047794J23498J46022r8626J74915Q029J21070J36547j99715N9312Q7586
16258A606432Q9903K59246o8996j52546k39811L19045L6183L5870r391j41508
16248A734427J45746K61623k857r2431J87954l2502q2806P0686j92695L813K32483
16237B233441J46604N4619q6098Q800K0687k1857j09953K64890M8669q8231L0904
16226B502475N209j75955N14740k34028l9706J6443M7824P0833P1152j02420J70563
$$ y = [38239, -15049, -15044, 112424, 217115, 253928, 381717, 505813, 403314, 316135, 395013, 344042, 233184, 456471, 529741, 633918, 787392, 778057, 780888, 761758, 852208, 772823, 976858, 915806, 730999, 920091, 1053466, 1112666, 1035015, 1261919, 1321955, 1114539, 1047794, 1171292, 1317314, 1218688, 1393603, 1401632, 1522702, 1659249, 1459534, 1518846, 1606432, 1696335, 1955581, 1886585, 1734039, 1494228, 1813273, 1849456, 1885326, 1875935, 1734427, 1880173, 2141796, 2138939, 2046508, 2234462, 2201960, 2119154, 2189840, 1997145, 2000958, 2233441, 2380045, 2434664, 2348566, 2357366, 2378053, 2356196, 2246243, 2511133, 2559802, 2471571, 2502475, 2507684, 2331729, 2846469, 2612441, 2572735, 2589178, 2637002, 2707835, 2778987, 2676567, 2847130]
16215B847130P5738o6599p3826J7706K14380j33976J16636Q7555k84388Q1253
16205B881609j8703j11445L16294j24685q264K4544M219j02874J29198J97225
16195C187118k4252q3331L6739N2722L420J09809N7244r7035O490J59998n7528
16184C351394k4136J1044k2024J509P4524Q2967l0253j9172q7460o4533J55022
16173C428882R8533O266J126n1795M9974K43860j72954k51477K69397m0769M7347
16162C628390k15266J91755J50053j35116J4903K9705M099K1484L39872Q3712
16152D113591l14859o0752N2995k04576L30903N461j2830r6786r7350L18432j62630
16141C871599J8589O3599j69109O1267K00644o2309j09469M8168r6270K17574
$$ y = [2847130, 2922868, 2856269, 2782443, 2800149, 3014529, 2880553, 2997189, 3084744, 2800356, 2881609, 2862906, 2751461, 3067755, 2943070, 2934806, 2959350, 2963569, 2860695, 2989893, 3187118, 3162866, 3079535, 3116274, 3168996, 3172416, 3282225, 3339469, 3242434, 3248924, 3408922, 3351394, 3327258, 3338302, 3316278, 3317787, 3392311, 3475278, 3445025, 3425853, 3338393, 3273860, 3428882, 3527415, 3533681, 3534807, 3483012, 3532986, 3776846, 3603892, 3352415, 3621812, 3581043, 3628390, 3413124, 3604879, 3754932, 3619816, 3634719, 3664424, 3668523, 3690007, 4029879, 4113591, 3798732, 3737980, 3790975, 3586399, 3917302, 3922763, 3909933, 3813147, 3715797, 4034229, 3871599, 3890188, 3953787, 3784678, 3845945, 4046589, 3984280, 3874811, 3922979, 3826709, 4044283]
$$ [...]
##END NTUPLES=NMR SPECTRUM
##END=
