##TITLE=1H_CG-1147
 CDcl3, 8 sc, 
 29.04.2021
##JCAMPDX= 6.0         $$ Bruker NMR JCAMP-DX V2.0
##DATA TYPE= NMR SPECTRUM
##DATA CLASS= NTUPLES
##ORIGIN= UXNMR, Bruker Analytische Messtechnik GmbH
##OWNER= root
$$ XWIN-NMR		Version 3.5
$$ Thu Apr 29 13:50:38 2021 Russian Standard Time (UT+4h)  she@DPX200
##.OBSERVE FREQUENCY= 200.131506
##.OBSERVE NUCLEUS= ^1H
##.ACQUISITION MODE= SIMULTANEOUS
##.ACQUISITION SCHEME= undefined
##.AVERAGES= 8
##.DIGITISER RES= 18
##SPECTROMETER/DATA SYSTEM= spect
##.PULSE SEQUENCE= zg30
##.SOLVENT NAME= CDCl3
##.SHIFT REFERENCE= (INTERNAL, CDCl3, 0, 15.9751)
##AUDIT TRAIL= $$ (NUMBER, WHEN, WHO, WHERE, WHAT)
$$ ##TITLE= Audit trail, XWIN-NMR		Version 3.5
$$ ##JCAMPDX= 5.01
$$ ##ORIGIN= Bruker BioSpin GmbH
$$ ##OWNER= she
$$ F:/spectra/data/she/nmr/H-F/1/pdata/1/auditp.txt
$$ ##AUDIT TRAIL=  $$ (NUMBER, WHEN, WHO, WHERE, WHAT)
(   1,<2021-04-29 13:49:13.82 +0400>,<she>,<DPX200>,
      <created by zg, POWCHK disabled, PULCHK disabled
       configuration hash MD5:
       00 E9 B6 7A A2 85 ED C7 34 08 36 98 17 FE 4E 26
       data hash MD5: 16K
       8C EC 0C 63 11 00 C4 62 5C 32 93 61 B0 8E EB F1>)
(   2,<2021-04-29 13:49:18.07 +0400>,<she>,<DPX200>,
      <Start of raw data processing
       efp BC_mod = 2 LB = 0.24 FT_mod = 6 PKNL = 1 PHC0 = -11117 PHC1 = 11.40102 SI = 16K 
       data hash MD5: 16K
       32 48 F0 07 D0 9E 12 8E F7 0C B4 FA 4A C8 7B 52>)
(   3,<2021-04-29 13:49:53.43 +0400>,<she>,<DPX200>,
      <pk PHC0 = -11.70242 PHC1 = 11.2 
       data hash MD5: 16K
       57 10 62 D7 27 7C C9 48 7E A0 54 7F 76 FD 3D AA>)
(   4,<2021-04-29 13:49:57.09 +0400>,<she>,<DPX200>,
      <abs ABSG = 5 
       data hash MD5: 16K
       FA 1E 70 28 B3 1A 1B AC 44 0A 5A 06 C7 6B 65 D4>)
$$ ##END=
$$ 
$$ hash MD5
$$ 4B 07 54 D0 E3 B2 8B 20 33 42 2D C7 A4 94 E4 1F
##$RELAX= 
##$RELAX= 
##$RELAX= 
##$RELAX= 
##$RELAX= 
##$RELAX= 
$$ Bruker specific parameters
$$ --------------------------
##$DU= <F:/spectra>
##$EXPNO= 1
##$NAME= <H-F>
##$PROCNO= 1
##$TYPE= <nmr>
##$USER= <she>
##$AMP= (0..31)
100 100 100 100 100 100 100 100 100 100 100 100 100 100 100 100 100 100 
100 100 100 100 100 100 100 100 100 100 100 100 100 100 
##$AQSEQ= 0
##$AQ_mod= 1
##$AUNM= <au_zg>
##$AUTOPOS= <>
##$BF1= 200.13
##$BF2= 200.13
##$BF3= 200.13
##$BF4= 200.13
##$BF5= 200.13
##$BF6= 200.13
##$BF7= 200.13
##$BF8= 200.13
##$BYTORDA= 1
##$CFDGTYP= 0
##$CFRGTYP= 5
##$CHEMSTR= <none>
##$CNST= (0..31)
1 1 145 1 1 1 1 1 1 1 1 1 1 1 1 1 1 1 1 1 1 1 1 1 1 1 1 1 1 1 1 1 
##$CPDPRG= <>
##$CPDPRG1= <>
##$CPDPRG2= <>
##$CPDPRG3= <>
##$CPDPRG4= <mlev>
##$CPDPRG5= <mlev>
##$CPDPRG6= <mlev>
##$CPDPRG7= <mlev>
##$CPDPRG8= <mlev>
##$CPDPRGB= <>
##$CPDPRGT= <>
##$D= (0..31)
0 1.2 0 0 0 0 0 0 0 0.06 0 0.03 0 0 0 0 0.0002 0 0 0 0 0 0 0 0 0 0 0 0 
0 0 0 
##$DATE= 1619689753
##$DBL= (0..7)
120 120 120 120 120 120 120 120 
##$DBP= (0..7)
150 150 150 150 150 150 150 150 
##$DBP07= 0
##$DBPNAM0= <>
##$DBPNAM1= <>
##$DBPNAM2= <>
##$DBPNAM3= <>
##$DBPNAM4= <>
$$ [...]
##$SUBNAM3= <"">
##$SUBNAM4= <"">
##$SUBNAM5= <"">
##$SUBNAM6= <"">
##$SUBNAM7= <"">
##$SUBNAM8= <"">
##$SUBNAM9= <"">
##$SW= 16.9725357007746
##$SWIBOX= (0..15)
0 0 2 0 0 0 0 0 0 0 0 0 0 0 0 0 
##$SW_h= 3396.73913043478
##$TD= 16384
##$TD0= 1
##$TE= 0
##$TE2= 300
##$TE3= 300
##$TEG= 300
##$TL= (0..7)
0 120 120 120 120 120 120 120 
##$TP= (0..7)
150 150 150 150 150 150 150 150 
##$TP07= 0
##$TPNAME0= <>
##$TPNAME1= <>
##$TPNAME2= <>
##$TPNAME3= <>
##$TPNAME4= <>
##$TPNAME5= <>
##$TPNAME6= <>
##$TPNAME7= <>
##$TPOAL= (0..7)
0.5 0.5 0.5 0.5 0.5 0.5 0.5 0.5 
##$TPOFFS= (0..7)
0 0 0 0 0 0 0 0 
##$TUNHIN= 0
##$TUNHOUT= 0
##$TUNXOUT= 0
##$USERA1= <user>
##$USERA2= <user>
##$USERA3= <user>
##$USERA4= <user>
##$USERA5= <user>
##$V9= 5
##$VALIST= <valist>
##$VCLIST= <CCCCCCCCCCCCCCC>
##$VD= 0
##$VDLIST= <DDDDDDDDDDDDDDD>
##$VPLIST= <PPPPPPPPPPPPPPP>
##$VTLIST= <TTTTTTTTTTTTTTT>
##$WBST= 1024
##$WBSW= 4
##$XGAIN= (0..3)
0 0 0 0 
##$XL= 0
##$YL= 0
##$YMAX_a= 151028
##$YMIN_a= -198524
##$ZGOPTNS= <>
##$ZL1= 120
##$ZL2= 120
##$ZL3= 120
##$ZL4= 120
##$ABSF1= 15.98128
##$ABSF2= -0.9913816
##$ABSG= 5
##$ABSL= 3
##$ALPHA= 0
##$AQORDER= 0
##$ASSFAC= 0
##$ASSFACI= 0
##$ASSFACX= 0
##$ASSWID= 0
##$AUNMP= <proc_1d>
##$AZFE= 0.1
##$AZFW= 0.1
##$BCFW= 0
##$BC_mod= 2
##$BYTORDP= 0
##$COROFFS= 0
##$CY= -3
##$DATMOD= 1
##$DC= 0
##$DFILT= <>
##$DTYPP= 0
##$F1P= 0
##$F2P= 0
##$FCOR= 1
##$FTSIZE= 16384
##$FT_mod= 6
##$GAMMA= 0
##$GB= 0
##$INTBC= 1
##$INTSCL= 1.334414e-10
##$ISEN= 128
##$LB= 0.24
##$LEV0= 0
##$LPBIN= 0
##$MAXI= 10000
##$MC2= 0
##$MEAN= 0
##$ME_mod= 0
##$MI= 1.114404
##$NCOEF= 0
##$NC_proc= -8
##$NLEV= 6
##$NOISF1= 3.799351
##$NOISF2= 2.8
##$NSP= 0
##$NTH_PI= 0
##$NZP= 0
##$OFFSET= 15.97506
##$PC= 1
##$PHC0= -11128.7
##$PHC1= 22.60102
##$PH_mod= 1
##$PKNL= yes
##$PPARMOD= 0
##$PSCAL= 0
##$PSIGN= 0
##$REVERSE= no
##$SF= 200.130007281122
##$SI= 16384
##$SIGF1= 3
##$SIGF2= 2
##$SINO= 5.538805
##$SIOLD= 16384
##$SREGLST= <1H.CDCl3>
##$SSB= 0
##$STSI= 16384
##$STSR= 0
##$SW_p= 3396.73913043479
##$SYMM= 0
##$S_DEV= 0
##$TDeff= 16384
##$TDoff= 0
##$TI= <>
##$TILT= no
##$TM1= 0
##$TM2= 0
##$TOPLEV= 0
##$USERP1= <user>
##$USERP2= <user>
##$USERP3= <user>
##$USERP4= <user>
##$USERP5= <user>
##$WDW= 1
##$XDIM= 16384
##$YMAX_p= 272260807
##$YMIN_p= -1203759
$$ End of Bruker specific parameters
$$ ---------------------------------
##NTUPLES= NMR SPECTRUM
##VAR_NAME=  FREQUENCY,     SPECTRUM/REAL,   SPECTRUM/IMAG
##SYMBOL=    X,             R,               I
##VAR_TYPE=  INDEPENDENT,   DEPENDENT,       DEPENDENT
##VAR_FORM=  AFFN,          ASDF,            ASDF
##VAR_DIM=   16384,         16384,           16384
##UNITS=     HZ,            ARBITRARY UNITS, ARBITRARY UNITS
##FACTOR=    0.207333158178282, 1,           1
##FIRST=     3197.08896676688, 0,            0
##LAST=      -199.65016366791, 0,            0
##MIN=       -199.65016366791, -1203759,     0
##MAX=       3197.08896676688, 272260807,    0
$$ Real data points
##PAGE= N=1
##DATA TABLE= (X++(R..R)), XYDATA
$$ [...]
6548 493751 441229 687532 688032 684644 576635 280156 621066 679664 594940 789633 182686
6537 182686 196904 232970 479173 646350 397354 426003 499690 488401 601497 757106 655278
6526 655278 239539 315044 857690 964453 1058637 536418 559148 866004 643620 1005224
6516 1005224 900351 655708 335683 276140 402374 348680 173698 577494 648468 466401
6506 466401 517289 430939 316628 702764 1092591 1056818 1114033 896411 793526 936895
6496 936895 830514 1042149 1316917 1160268 1303406 1432799 1476329 1333212 1738191 1743646
6486 1743646 1456015 1247162 1194130 1308131 1225944 1275381 1310484 1459783 1234739 1330830
6476 1330830 1049138 789136 1243450 1531657 1728094 1467784 983405 1082074 1158187 909955
6466 909955 671269 982150 893790 123417 291135 635423 795492 499080 692387 816975
6456 816975 574119 371602 306800 536704 476989 449839 792915 779466 640309 713641 944060
6445 944060 798484 639354 677400 143421 323674 524182 552263 742341 669111 693544
6435 693544 698276 350207 620969 864152 702883 609090 674137 959145 1047560 776838 914887
6424 914887 1017766 1267010 1163329 1055067 757259 496928 564181 679083 791402 472902
6414 472902 189261 634108 951116 1212253 1167197 657078 479298 1114142 1353335 1292307
6404 1292307 1185135 1134648 965909 822495 788998 827261 941293 1031488 1245691 1189774
6394 1189774 1710822 1851510 1891111 2303853 2087686 2192798 2192933 1873519 2010801 2333747
6384 2333747 2461806 2214618 2585069 2643975 2862634 3167675 3059351 2641812 2857181 3157665
6374 3157665 3493065 3731151 3851483 3763234 3529719 3138013 3326768 3316722 3202341 3264130
6364 3264130 2935596 2784608 2982025 3157821 3041220 2740245 2571577 2459633 2925025 3340294
6354 3340294 3436583 3263592 3218912 3177994 3270050 2971268 2799253 3118655 3347491 3013571
6344 3013571 2745278 2803856 2728710 2697232 2370001 2218346 2099485 2088547 2440443 2430743 2444345
6333 2444345 2262900 2259267 2193556 2353924 2616047 2533534 2090151 1869897 2156088 2212146
6323 2212146 2333080 2435765 2478369 2761914 3063763 3258585 3083610 2908974 3313465 3043519
6313 3043519 3070075 3068564 3320892 3361846 3545407 3731673 3815586 4010197 3737995 3747561 4212424
6302 4212424 4038142 4313479 4691248 5104443 5200260 5065009 4837691 5094815 5493046 5013760
6292 5013760 4643127 4691363 4723898 4902359 4831621 4601121 4316016 4024231 3838157 3349841
6282 3349841 3482076 3460873 2754060 2486844 2635952 2361417 2316118 2369522 2044835 2156026
6272 2156026 1818173 1396279 1748495 2071014 1924544 1642668 1631007 1765288 2178168 2333510
6262 2333510 2240863 1893614 1728209 1834674 1916561 1516201 1594813 1529051 1373434 1261505
6252 1261505 1229855 1571750 1718844 2113228 2116649 2184991 1929123 2332440 2733858 2536363
6242 2536363 2356624 2768029 2715826 2639843 2273308 2238457 2246429 2112251 1677370 1768485 1890361
6231 1890361 1760154 1898173 1948362 1692872 1601098 1540752 1155708 1464398 1673700 1342786
6221 1342786 1389921 1231999 1199399 1500225 1212045 935635 904052 726683 572863 924288
6211 924288 1056624 995179 768276 1083020 950185 1086238 1165879 1005802 998064 1166480
6201 1166480 1173357 1069510 941866 974189 1071187 1075512 846480 1069053 818260 500045 412410
6190 412410 -16599 540506 744893 855681 889803 901051 983296 730795 899657 1027921
6180 1027921 1105902 1225695 702479 952916 1585959 1285735 778384 823665 1047146 1014687
6170 1014687 1031662 514315 820725 963265 862762 883803 770886 827144 1029351 853885
6160 853885 983341 984671 1293373 1091195 1061203 1198104 1509341 1250422 827667 573368
6150 573368 916103 737303 436967 335271 463012 337589 725013 912716 907764 1418252
6140 1418252 1105272 1409935 1537954 1905749 1707304 1348607 1307642 1627787 1534471 1806631
6130 1806631 1647511 1648216 1432325 1324976 1398330 1403939 1179392 976896 1121234 995953 1106108
6119 1106108 1335117 1173328 1129134 1337870 1254494 1401440 1291760 923624 1022397 1126626
6109 1126626 1298542 1013720 779073 961497 774494 616478 824383 827755 891426 999883
6099 999883 990902 917915 937660 984198 1118237 734296 960702 1162145 1017281 649173 402911
6088 402911 810889 793255 847668 381966 396782 641962 895118 724323 496778 691122
6078 691122 763945 1042333 657742 1004110 1169588 524415 491122 683682 994428 831451
6068 831451 1087562 782715 352096 353008 458045 647343 257359 340053 327162 108538 436752
6057 436752 612704 624312 593071 458601 424333 680826 864936 889748 783150 740117 925211
6046 925211 537744 250810 426444 328328 36350 93472 238234 657345 589083 572246
6036 572246 117049 267039 397276 525234 966409 975822 491235 705750 1123281 971462
6026 971462 998266 911241 1067030 1185344 1264435 1625099 1351406 1103143 1146587 713217
6016 713217 517635 824521 1273752 1289942 1365637 1041990 1089173 1116471 1051491 1499033 1283100
6005 1283100 1019607 1148277 1308145 707033 412271 769702 787771 894445 870175 941769
5995 941769 1139679 667611 466331 570309 652349 910922 1032225 436727 162076 360153
5985 360153 354732 260855 358105 380487 132890 676779 802765 569362 630809 597026 279891
5974 279891 685857 890628 675743 577277 802238 473729 510750 588641 749662 1054244
5964 1054244 1091578 706278 1009483 1020331 1043446 1013381 1136918 1241190 1105088 805139
5954 805139 609002 680601 690731 572232 781257 989622 655821 741765 671179 800143
5944 800143 909848 1045118 639050 735248 650965 821426 943423 1094697 919122 812712
5934 812712 744864 431174 478145 627078 807036 728212 732547 722636 739494 707488 1041672
5923 1041672 1061847 380119 526457 1082800 1152218 1127787 948820 869139 686660 1055590
5913 1055590 1315648 1387112 1386970 1162317 1058630 1090896 1186015 1109643 736837 986121 973455
5902 973455 775336 740951 857349 794160 631081 726009 1048560 585806 723693 1143131
5892 1143131 1313312 1482154 1335548 1405616 1304698 1253859 979053 990807 774105 674886
5882 674886 844929 823644 538298 923249 1292534 1027115 770001 731292 661210 580020
5872 580020 816656 1322152 1285538 1114439 1252154 1416775 1479801 1124099 910303 1001215
5862 1001215 1243436 1347244 1110046 1218649 863092 814161 893770 1055140 1008021 1146649
5852 1146649 988668 621091 538256 705610 901246 1131826 1126284 702495 828426 1199659
5842 1199659 1080992 1110062 841693 976037 1226921 757001 1077449 942984 1084836 1326611
5832 1326611 833544 556295 926458 1231730 977237 1389047 1324834 1236719 1076194 1241029
5822 1241029 1453463 1060779 980315 622507 345436 691825 702592 851409 740181 487583
5812 487583 705303 702905 717948 765689 979797 1218935 940355 692421 998930 1214223
5802 1214223 1429628 1643444 1339323 1192478 949476 864108 714585 514573 585029 749419
5792 749419 798142 570220 464978 960753 1149999 1286216 1239261 1151018 1068027 738250
5782 738250 771992 1179853 1193383 1179031 1606579 1324614 1307691 882810 1013927 1193475
5772 1193475 1305677 1606959 1731122 1863710 2132253 1995777 2445634 2273808 1905625 1667851
5762 1667851 1816860 1609161 1361902 1835924 1768140 1413455 1029704 1065293 1092451 669270
5752 669270 742931 776397 1087530 825625 959256 923944 741548 1095929 927965 987052
5742 987052 1092687 1597136 1665922 1553803 1434348 1370060 1447208 1162754 1149474 1179233 1089983
5731 1089983 1195686 1031414 1135445 1073114 1171996 1197567 1290664 1330860 1632871 1693541 1277002
5720 1277002 1579792 1591352 1625038 1797388 1844489 1956078 1941494 1807813 1940919 1785543
5710 1785543 1640208 1467992 1795051 1705608 1687038 1810407 2019031 2259234 2081441 2025373
5700 2025373 2019460 1768401 1883168 2179515 1963433 2266602 2120443 2272030 2484497 2374357
5690 2374357 2226929 1987904 2174070 2264458 2288406 2399249 2403946 2565171 2666271 2339753
5680 2339753 2508063 2551229 2608710 2702940 2555271 2755685 2605911 2716218 2951881 3149241
5670 3149241 2766027 2777993 3193727 3276844 3244610 3835798 3934500 4013319 4118343 4430100
5660 4430100 4228071 4639329 4766590 5029835 5561199 5607740 5615914 5931280 5973106 5994576
5650 5994576 6105319 6440078 6736243 6421932 6674787 6658233 6976398 7149157 6912902 6889524
5640 6889524 6830760 6328448 6546552 6655365 6828921 6509164 6224914 6050241 6093417 5951888
5630 5951888 5358105 5241454 5077216 5088357 4651122 4533202 4864363 4447295 3755447 3450583
5620 3450583 3480790 3499758 3328413 2923162 3299933 3492058 2939062 2794575 2537388 3058440
5610 3058440 2908541 2363030 2458282 2376238 2369544 2098424 2005603 1944103 2019440 1980979 1808798
5599 1808798 1979257 1976727 1945905 1710226 1752685 2185353 2421622 1864867 1727100 1994409
5589 1994409 1873128 1401926 1498646 1572583 1504381 1553180 1537161 1339681 1260426 1758856 1477544
5578 1477544 1544876 1843725 1620959 1425913 1473294 1468985 1555841 1704653 1790567 1555587 1426568
5567 1426568 1465878 1628843 1419453 1049012 1253661 1468236 1220021 1534098 1638653 1314028
5557 1314028 938457 931999 1115141 1263329 1272880 1601176 1570423 1274130 1365607 1607434 1236842
5546 1236842 1048437 1333511 1673486 1429943 1753068 1254170 1033232 972851 697619 886842
5536 886842 852813 1208102 1467722 1584014 1535539 1474687 1190969 1264423 1427033 1713146
5526 1713146 1418078 1722204 1757473 1464523 1017030 1074871 1239019 1089008 1191246 1197359
5516 1197359 1404592 983691 1038784 999569 1078752 1624319 1489579 1374580 1351503 1278429
5506 1278429 1309961 1283292 1191625 1193752 1002198 1280344 1375083 1321793 1192186 1342838 1632014
5495 1632014 1581823 1123454 626619 791891 843980 749639 1195462 972798 890854 1061249
5485 1061249 1425908 1280210 897518 1324367 1614337 1799279 1800282 1547934 1472501 1508800
5475 1508800 1355033 1280402 1229975 851883 1152069 1247480 981674 755538 935536 1173660
5465 1173660 1632545 1471476 1463349 1574027 1702592 1638113 1181676 1051416 1318390 1426039
5455 1426039 1418093 1762463 1354169 1567995 1623830 1372821 1332989 1633835 1458494 1277931
5445 1277931 1253176 1374760 1704275 1365837 1210313 1172261 1454299 1456545 1160633 1245146
5435 1245146 1161453 1464726 1436731 1439084 1456966 1772905 1968463 1916084 1960870 1690587 1945191
5424 1945191 1896244 1526588 1949558 1778587 1819802 1756892 1948631 1978298 1839898 1805041
5414 1805041 1909618 1689142 1268038 1155408 1552176 1764117 1649470 1270445 1353387 1528506
5404 1528506 1701087 2002123 2159191 1981467 1804130 2059149 2066464 1867448 1678869 1903682
5394 1903682 2113547 2289876 2208271 2373916 2309484 2147961 1891213 1702927 1612370 1725704
5384 1725704 1493214 1587944 1524277 1645051 1706850 1531446 1200448 1509493 1695253 2060041
5374 2060041 1914310 2001847 1756457 1434309 1939182 1823063 1527737 1680959 1989819 1975623
5364 1975623 1942067 1729150 1579210 1308921 1652589 1924085 1934118 1708776 1656059 1359857
5354 1359857 1698441 2040990 1950939 1895366 1981005 2041644 2201303 1871665 1869509 2028731 2161726
5343 2161726 2143774 1931310 1494829 1467772 1614162 1532968 1652049 1836219 2005049 2097915
5333 2097915 2493896 2358037 2615317 2627788 2681747 2461758 2042484 2050883 2070909 2552855
5323 2552855 2815586 2840617 2694247 2915262 2849574 2921357 2903552 2626740 2701422 2651828 2701805
5312 2701805 2762052 2656334 2822921 3150037 3157391 3369814 3200515 3400981 3493549 3382541
5302 3382541 2934797 3020894 2663645 2740038 2690561 2510945 3093514 3072390 3234802 3416293
5292 3416293 3557056 3320602 3465922 3888906 3989627 3906968 3946892 4227943 4408622 4435485
5282 4435485 4223890 4351772 4202328 4244135 4389864 4436005 4610707 5004406 4564748 4190807
5272 4190807 4551529 4473875 4265929 4155509 4349675 4386823 4451624 4354682 3930561 3898283
5262 3898283 3777473 3310167 3572900 3829255 4124621 4021668 4180442 4079279 3870373 3775837
5252 3775837 3727176 3993165 3978162 4113458 4010717 4296123 4484292 4296321 4709680 4871247
5242 4871247 4908782 4920594 5021137 5176239 4882669 4713815 4770805 4602341 3903341 4047715
5232 4047715 3909772 4075718 4373383 4212760 4273131 4489723 4740323 4898434 4976314 5038978
5222 5038978 5164030 5214825 5478591 5642450 5919271 6097718 6238932 6323522 6033137 6196480
5212 6196480 6495816 6719190 6605338 6790735 6735643 6683481 6733453 6609065 6571227 6307767
5202 6307767 5998295 5842807 6264736 5913621 6021473 5888865 6050055 5975236 5865032 6058348
5192 6058348 6191719 6472753 6793455 6739430 7082964 7212497 7663053 7935292 8283116 8192786
5182 8192786 8482874 8845886 8808962 9190793 9547039 10070344 10315990 10413049 9717487 8671974
5172 8671974 8659342 8607288 8902563 8666521 8044599 7988138 8259690 8333595 8497671 8814821
5162 8814821 9232479 9605831 9513355 9930662 10528413 11017219 11236542 11582880 10969422 10624270
5152 10624270 10343841 10078790 9605780 9642234 9750335 9804862 9756524 9796436 9853968 9794184
5142 9794184 9832234 9879842 9885638 9780366 9844439 9853957 9782022 10065458 10046549 10205256 10589724
5131 10589724 11477577 11916399 12173924 12938504 13465855 13789035 14270209 14786846 14753562 14569345
5121 14569345 13774948 12661048 11970770 10940303 10349482 9870259 9518286 9593853 9432817
5112 9432817 8735441 8218130 7849462 7414024 7550892 7837842 7627609 7885196 8219127 8425875
5102 8425875 8386336 8360698 8360915 8418706 8439330 8398081 8835366 9363668 9798663 9966577 10189754
5091 10189754 10122919 9652582 9311823 9188526 8471601 7584430 7465704 7291464 7418611 7539499
5081 7539499 7137562 7057043 7006259 6948033 7043687 6805767 6567062 6377474 6108061 6394508
5071 6394508 6312079 6391286 6562928 6288518 6328703 6417157 6534803 6386385 6203593 6339134
5061 6339134 6323332 6303020 6437471 6643141 6524386 6511200 6729893 7096254 6752300 6880971
5051 6880971 7195702 7420875 7797479 7826586 7924741 8074831 8022894 8072442 7964630 8086570
5041 8086570 7916220 7785607 8023838 7673793 7649449 7412160 7494522 7671471 7543751 7792865
5031 7792865 7603300 7374990 7633456 7561403 8043924 7771013 7846001 8304954 8632264 8948174
5021 8948174 8788032 9009230 9114334 9505830 9608661 9623529 9830909 10428382 10421024 11235957
5011 11235957 10996609 10897391 10829754 10613651 10848027 10721414 10090905 9655190 9076424 8686884
5001 8686884 8672704 8853173 9155396 8995483 8755712 8485804 8426482 8579816 8716474 8667989
4991 8667989 9029457 8891166 8904173 8763270 9359390 9504044 9731465 9757162 10112028 10529987
4981 10529987 10565268 10899750 11058149 11493374 11519675 11854756 11671484 11639682 11580063 11320986
4971 11320986 11046544 10800881 10263426 9771981 9511214 9683274 9644765 9666128 9266918 8599310
4961 8599310 8639069 8532682 8678741 8838149 8719067 8634356 9012301 9408159 9543994 9121118
4951 9121118 9188337 9770610 10152432 10162436 9972284 9807038 10185616 10175821 9994284 10065779
4941 10065779 10189911 10608391 10953216 11068261 11145737 10878454 10557843 10744556 10698452 10188866
4931 10188866 10024806 9948833 10496366 10540988 10419070 10455823 10547274 10732317 10441576 10388592
4921 10388592 10723233 10801194 10686306 10386716 10742769 10807223 10751106 10850342 10726674 10610888
4911 10610888 11088450 11642415 12104731 12233628 12679856 12959665 12897299 13394450 13934245 14484650
4901 14484650 15054564 15537814 15722245 15829097 15903871 15703489 15349171 15054888 14749298 14634351
4891 14634351 14545619 14283316 13847574 13767684 12835084 12828793 13049123 12968569 13271745 13502577
4881 13502577 13389831 13452162 13916406 14010939 14285590 14798599 15135434 15489880 16240821 16821292
4871 16821292 17065204 17793557 18630607 19145385 19591016 20084810 20669357 20789159 20740936 20245415
4861 20245415 19658886 19381734 18752567 18099554 17349390 16487975 15612288 15322879 14840035
4852 14840035 14248062 14069502 13843210 13442295 13432896 13143006 12946373 13009960 12683437 12769153
4842 12769153 12832249 13031453 13096239 13059285 13168232 13925189 14139209 14510735 14997843 14997298
4832 14997298 15157078 15059950 15415892 15315692 15314980 14801606 14372025 13485346 12697726 12071775
4822 12071775 11590230 11296226 10648652 10304090 9962801 9639260 9563533 9133986 8801404 8778121
4812 8778121 8634295 8612052 8187802 8117784 8051449 8013431 8266839 8127460 7995981 7761668
4802 7761668 7771070 7893295 7870513 7974385 7940723 7805614 7667627 7662116 7315064 7195675 7177248
4791 7177248 6704646 6748996 6847075 6774169 6662352 6685063 6383710 6023797 5937383 5717313
4781 5717313 5898070 6191373 6300435 6257598 6197844 6315376 6163852 5420550 5719067 5518644
4771 5518644 5500662 5751315 5600119 5746804 5495690 5235489 5673536 5425013 5150296 4772847
4761 4772847 4937270 4834695 4834626 4671641 4778335 5016997 5283638 5472953 5505242 5510981 5639898
4750 5639898 5540079 5401432 5321207 5213749 5336481 5173879 5027696 4855956 5295188 5343996
4740 5343996 5716382 5701621 5484012 5077360 5157024 5157057 5230716 5306976 5343747 5343071 5315348 5432013
4728 5432013 5579497 5391247 5144714 4932970 5136865 5301719 5379964 5125886 5057187 5204149
4718 5204149 5324011 5006719 5028915 5298625 5495417 5219406 5312411 4999834 5178248 5405329
4708 5405329 5442892 5434335 5207707 5229811 5202819 5270076 4976236 5382305 5551991 5709307 5537750
4697 5537750 5297280 5549739 5392817 5158775 5305169 5172036 5399457 5161922 4907019 5264089
4687 5264089 5301021 5484863 5543549 5402179 5657331 5086767 5193322 5564925 5774535 5579655
4677 5579655 5694963 5763738 5670270 5610285 5478830 5269013 5360214 5474752 5600537 5751453
4667 5751453 5750728 5569569 5162595 5409267 5936511 5856426 6005824 6130705 5724180 5801736
4657 5801736 5954852 6165021 6002787 5941446 6041808 6004871 5809288 5881967 6116686 6252742
4647 6252742 5987398 6290736 6352966 6139810 6112345 6045786 6211962 6310254 6471439 6661168
4637 6661168 6307743 6273063 6591745 6641851 6538585 6703320 6704174 6404441 6647543 7239746
4627 7239746 7650141 7407851 7467157 7103337 6885020 7185591 7701055 7642323 8014542 8307728
4617 8307728 8253821 8400232 8974724 9001495 8751818 9343580 9669498 9556970 9110868 9624896
4607 9624896 10018167 9726386 9677506 9853421 9893712 10044485 10164232 10216762 10498438 10495985
4597 10495985 10331666 10106214 10550643 11035977 11368846 11547947 11815021 12016527 12731153
4588 12731153 13126860 12851512 12848721 13016129 13441391 13418303 13696318 14350576 14325479 14481048
4578 14481048 14419507 13550535 13356024 12999526 12784028 12848829 12716010 12719200 12776220 12911128
4568 12911128 12940016 12592209 12496474 12635108 13036478 13222186 12927036 13072980 13614361 14213004
4558 14213004 14504553 14472688 15284667 15515753 15407202 15562577 15247216 14706035 14055536 13571640
4548 13571640 13724023 14231266 14378412 13651110 13155386 13243929 13257166 13485598 13762151 13787392
4538 13787392 13571384 13851915 14148333 14115962 13918240 13961936 14479629 14980224 15158831 15480426
4528 15480426 16199360 16468380 17015123 17758695 18846872 19365355 19601980 19996755 20398571
4519 20398571 19975552 18810305 17639264 17326796 17381891 17356966 17265694 17067972 17495940 17651351
4509 17651351 17598971 17861874 18281376 19016375 19848211 20593713 20880351 21359102 22286133 23089017
4499 23089017 24241745 25257530 25833337 27239015 28316107 29233886 30384856 31477386
4491 31477386 32581111 34003767 35277194 36261508 37798832 39195643 40920849 41839112
4483 41839112 42925777 43796147 44431460 44820765 44861302 45068354 44729499 44047418 43323459
4474 43323459 42661083 41927222 41458630 40553851 39002449 38395140 37276366 36063697 34920598
4465 34920598 33159987 31901379 30223853 28379609 27064785 25722610 24593292 23755665
4457 23755665 22454747 20947131 20005934 18964186 18224410 17355416 16817730 15959542 15300570
4448 15300570 14951539 14446191 14106817 13855951 14017929 13900077 13563845 13400641 13265237
4439 13265237 13305776 12931973 12550203 12410443 12125696 11936652 11863943 11411597 10929376 11083234
4429 11083234 11370801 11318377 10807997 10943642 11035831 10838580 11081222 10771803 10537134 10912187
4419 10912187 10811971 10198015 9913187 10342444 10433008 10512015 10636099 10771064 10520602 10401225
4409 10401225 10474080 10038077 9824955 10268978 10683962 10723150 10890605 11021377 11418454 11758358
4399 11758358 11882016 11978898 12042609 11908263 12520469 12788732 12683097 12889441 13305621 13855480
4389 13855480 14435906 14542157 14854261 15524618 16290529 16744544 17111868 17273968 16937375
4380 16937375 16786667 15949604 15141997 14646028 14381584 13731517 13100080 12466350 12397797 12002963
4370 12002963 11689133 11752769 11741646 11589237 11713641 11598524 11033670 10795615 10983422 10914259
4360 10914259 10616939 10537319 10228432 10254061 10461976 10700880 10498464 10526161 10479692 10741941
4350 10741941 11052216 10680021 10441244 10965529 11073144 10793038 10496400 10347572 10439635 10479981
4340 10479981 10341685 10104638 10156586 10624802 10702747 10505916 10633674 10529675 10507808 10672119
4330 10672119 10844290 11055988 10879194 10573228 10883664 10763472 10840498 11195932 11511116 11464115
4320 11464115 11458102 11362138 11569995 11603227 11721689 12240950 12506548 12547302 12821745 13333651
4310 13333651 13872320 14518728 15799312 16921736 18423920 20385520 22661043 24825634
4302 24825634 26751469 28887750 30558857 30346748 28981484 25002643 20333761 17248461
4294 17248461 15332412 14184313 13159119 12423249 12118451 11939298 11277961 11135401 10802171
4285 10802171 10566640 10184397 10013260 10247332 10096275 9818461 10095294 9942213 9958235 9787663
4275 9787663 10134490 10130468 9899504 9768853 9942498 9916082 9840989 10014897 10244267 10145444
4265 10145444 10012037 9956515 9868583 9994542 10015682 10415815 10542814 10243374 9911969 9774851
4255 9774851 10060127 10178716 10324830 10413739 10366529 10279379 10183456 10225382 9930942 9687948
4245 9687948 10012748 10371657 10316283 10191595 9848345 9650370 9974131 10061745 10115300 10442209
4235 10442209 10817823 10897655 10944928 10880814 10791614 11111035 11418066 11519463 11233461 11548394
4225 11548394 11782094 11684094 11362511 11187479 11269109 11383797 11165345 10733082 10617895 10441956
4215 10441956 10166440 10668339 10816587 10774680 10750856 10909783 11036537 10916402 10919010 11325538
4205 11325538 11730537 12015316 11919588 12230730 12484962 12359660 12809006 13272894 13122280 13082876
4195 13082876 13593334 13960140 14425951 14862555 14859289 15493658 16893010 17554463 19094249
4186 19094249 20454004 21764564 23609140 25812400 27633272 29795251 30056394 27424554
4178 27424554 24419811 21721013 18843311 17208813 15830659 14655749 14061893 13772291
4170 13772291 13098796 12655581 12369312 12006818 12068389 11510973 11242207 10890835 10741662 10563658
4160 10563658 10043363 9761641 10034281 10110830 9785316 9374577 9814575 9821928 9625836 9476316
4150 9476316 9491945 9752240 9575673 9368290 9202221 9248100 9302739 9135729 9356259 9380649
4140 9380649 8903436 9041305 9168197 8745494 8628951 8867590 8812628 9043359 9224308 9202166
4130 9202166 8991485 8898605 8899963 9306066 9250536 9164681 9092310 9014705 8975556 8578603 8811306
4119 8811306 8711119 8900419 8923376 9018932 9117172 9248124 9255042 9111583 9004213 8454685
4109 8454685 8245034 8137587 7933130 7958138 8360844 8193504 8477022 8538702 8284885 8174487
4099 8174487 8184976 8436335 8301421 8223777 8516801 8738897 8998682 8809413 8331811 8172810
4089 8172810 8228192 8512164 8545200 8325791 8161624 8274754 8479388 8486714 8454325 8750946
4079 8750946 8344964 8320814 8310910 8488459 8145108 8553836 8530505 8321627 8223927 8398303
4069 8398303 8325372 7782567 7735239 7502893 7643452 7785832 7248000 7280093 7518325 7208077
4059 7208077 7126665 7128308 7211935 7135899 7235469 7170910 7099631 7210822 7145331 6953394 6582561
4048 6582561 6644041 7042193 6951100 7085273 7165152 6869190 7398117 7734954 7384373 7112334
4038 7112334 7046915 7079344 7090170 7030859 7024032 6959588 7011070 6817569 6896620 6874763 6903285
4027 6903285 7263357 7219947 7154675 7205118 7367967 7367563 7611004 7095573 6951858 7071294 7042927
4016 7042927 7104185 6900603 7253919 7492020 7794636 7627359 7488046 7769917 8154852 7975220
4006 7975220 7752707 7801051 7729726 7954782 7848626 7657431 7465434 7490735 7622457 7281942
3996 7281942 7399950 7505783 7177855 7358430 7216448 7506520 7176042 6856087 7126338 7452689
3986 7452689 7445819 7718254 7544987 7407009 7593509 7763624 7040804 6957842 7306199 7500978
3976 7500978 7130359 6893051 7123463 7197091 7212264 7545205 7538547 7485000 7554428 7480388 7318895
3965 7318895 7579238 7891569 7809304 7765306 7693573 7561713 7283731 7311760 7362617 7617083
3955 7617083 7615131 7944704 7891667 7431322 7658730 7724216 7629667 7795674 7725880 7755755 7733540
3944 7733540 7892213 8115332 8414873 8448110 8509770 8648533 8617282 8351442 8140993 8418887
3934 8418887 8472935 8352300 7975646 8211081 8175528 8345126 8772709 8762721 8754983 8904525 9181596
3923 9181596 9262307 9628198 10066249 10105263 10607508 10557371 10616092 10554017 9984238 9998320 9858757
3912 9858757 9652983 9661142 9478078 9320586 9508414 9497877 9526567 9110607 9380854 9537557
3902 9537557 9241527 9480936 9593641 9726072 9256255 9404152 9757855 9670532 9556333 9383499
3892 9383499 9501943 9545655 9985678 10045490 9970517 9823046 10115660 9752872 9683747 9521294
3882 9521294 9747369 9475721 9724809 9916462 10066138 9841469 9486676 9565176 10077002 10289505
3872 10289505 10139085 10073425 10070972 9579485 9642217 9889349 10226486 9867094 9617236 9836919
3862 9836919 9842950 9922685 10113371 10648768 10626880 10724710 10772165 10978988 11123860 11147681 11229972
3851 11229972 11345815 11117451 11506434 11795914 11588318 11560697 11743336 12176654 12423299 12930086
3841 12930086 12968304 12852655 13014518 13155066 13614262 13506135 13796505 14102936 14029719 14205042
3831 14205042 14354435 14282070 14425737 14700033 14748935 14754410 15081599 15341403 15526167 15738696
3821 15738696 15899416 15970226 16149939 16527206 16980268 17056036 17823181 18050731 17815593 17538967
3811 17538967 17396232 17048652 16787112 16388013 16547453 16705695 16647721 16638405 17046080 16997137
3801 16997137 17083689 16869118 17012536 17361344 17303438 17356155 17550508 17781300 17602625 17753284
3791 17753284 17775688 18344701 18834301 18870647 18859697 19107222 19561935 19778458 19765670 19865730
3781 19865730 20046398 20376781 20347974 20748874 20651539 20652219 21046495 21277329 21071491 20708960
3771 20708960 20903164 21277378 21335726 21436162 21977810 21967687 22244623 22653476 22638967 22758276
3761 22758276 23156034 23696208 24094124 24260746 24468006 24374997 24872389 25139303 25226636 25163118
3751 25163118 25513594 26089967 26623275 27285291 28071133 28771601 29482830 29989728 30546989
3742 30546989 30759393 31225535 32347893 33163942 33584620 33657016 34254332 34683712 35205426
3733 35205426 35500909 35996706 36883818 37549898 38145600 38929482 39470061 40485994 41957494
3724 41957494 43099717 44761441 45710140 47085924 48638659 50557140 52914223 55148412
3716 55148412 57395048 59237114 61241717 63230321 65665914 67639475 69961839 71986017
3708 71986017 73206603 74503009 76230242 77426355 78626508 79564534 79922556 79189344 78139350
3699 78139350 76413422 74254223 71589303 68020476 64643136 61366665 58552321 55546933
3691 55546933 52700254 50711783 48582127 46137151 44161645 42338965 40683047 38945968
3683 38945968 37358713 36050628 34130277 32524192 31243345 30062341 28878916 27712929
3675 27712929 26996889 26259986 25683114 25336430 24984030 24285452 23558737 22889259 22535173
3666 22535173 22246393 21757650 21693966 21211046 20659525 20389591 20293362 20037175 19797685 19865233
3656 19865233 19292005 19097397 19099628 18658744 18820122 18675107 18360569 18277124 18131356 17691231
3646 17691231 17374656 17452604 17387023 17087777 17035427 17303430 17396040 17123957 16787731 16694563
3636 16694563 16570190 16497757 16840306 16768532 16874433 16667838 16838053 16951730 16660434 16549777
3626 16549777 16540624 16465081 16360534 16477776 16882089 17072460 16890157 17318241 17439065 17677941
3616 17677941 17948043 17598755 17647030 18051710 17854016 17559585 17397196 17899099 17997243 17997914
3606 17997914 18445085 18795862 18852960 17965219 17292889 17031936 16900441 16827460 16943209 17202464
3596 17202464 17382218 17558766 17771205 17636415 17910897 18243505 18408268 18630293 18785172
3587 18785172 18965879 18763718 19042679 19606968 20199682 20270259 20332071 20515304 20698280 20816004
3577 20816004 20522566 20261073 20592778 20503272 19972812 19960564 19975409 20163111 20745224 20563970
3567 20563970 20444935 20806983 20736950 20964649 21445443 21877084 22089187 22370846 22760074 23084590
3557 23084590 23397196 23523442 23607461 23814039 24433862 24476130 24696400 25187361 25536327 25725139
3547 25725139 26008043 26143727 26850305 26952336 27493255 27666074 27927756 28423744 28675387
3538 28675387 29298516 29714699 30131616 31055770 31148331 31227796 31744244 31886533 31986778 31549405
3528 31549405 31410629 31440436 31441410 31600800 31772172 32009045 31676235 31441156 31653346 31974934
3518 31974934 31962365 31986537 32109565 32353341 32775181 33020582 33285167 32985030 33711702 34220015
3508 34220015 34645873 35530585 36561861 37226304 37803636 38254096 38938461 39833589 40586868
3499 40586868 40706288 41364983 41738434 41366640 41179791 40755278 39827070 39085984 38490056
3490 38490056 37837342 37095477 36528484 36299425 35669708 35209448 34844612 34183121 33824192
3481 33824192 33504500 33380677 33686820 33930787 34176456 33942389 33597245 34049618 34407211
3472 34407211 34529347 35144345 35447090 36155544 36969644 37467789 37859634 38435450 38732637
3463 38732637 39407848 39921826 40037355 40198744 40153130 40430084 40251434 39868057 39615060 39724953
3453 39724953 39985080 39857884 40137685 40617863 41080322 41832354 42034012 42791327 43414809
3444 43414809 43873975 44654134 45337926 46002610 46916260 48005601 49375209 50720941 53126304
3435 53126304 55384336 57897303 60836914 63932444 67416212 71661315 76055554 80671442
3427 80671442 85624231 89501516 92909642 96297243 99243684 101885910 104209982 105333030
3419 105333030 104961105 102277576 97921964 94106070 90953725 88199071 85797370 82509912
3411 82509912 77813873 72741811 67921536 63886297 61048156 58815071 57161601 55817133
3403 55817133 54176321 52617343 51303973 50300251 49622312 48570635 47152541 46007741
3395 46007741 45175404 44855370 44637397 44011947 43656287 43287932 43122147 42847537 42728593
3386 42728593 42713698 42644581 42745274 42371690 42694109 42897250 42794420 42816175 42975218 43251537
3376 43251537 43688995 44474900 44780169 45345139 45746806 46767617 47024870 47543493 48442312
3367 48442312 49605094 50372910 51711764 53005071 53899803 55260544 56116927 57192176 57555737
3358 57555737 57857308 58431942 58828025 59074702 59235094 59596984 60099611 60624928 61076884
3349 61076884 62021177 63052663 64054153 65212527 66225207 67587596 69365522 71298852
3341 71298852 73236702 75642847 78295925 81197861 84599345 88127987 92412713 97075827
3333 97075827 102106822 107601870 113342953 119079130 124571241 129010747 133149332 135943521
3325 135943521 137387400 137536916 137162539 136107457 135014244 133834656 132725498 132418706
3317 132418706 132460024 133606337 135797010 138552582 141332385 144734538 147877906 150385040
3309 150385040 151669158 151923192 150605562 147444678 142378792 135640993 127454533 118889843
3301 118889843 111370876 103815431 96914148 91320440 86138236 81936651 78330829 75368172
3293 75368172 72280914 69303602 66376969 63177792 60746026 58741071 56836914 55274416
3285 55274416 53673956 52508697 51334394 50326107 49423115 48891230 48140809 47273966 46869594
3276 46869594 46199287 45914899 45677672 45450708 44721069 44763741 44338236 43738524 43595334 43144123
3266 43144123 42938603 42479825 42532689 42420130 43250950 43735886 44056611 44563979 44775756 44678900
3256 44678900 44507297 44798588 45343825 45376398 45678195 46658395 47296822 48031881 49383681
3247 49383681 50477218 51142314 51850020 52798192 53137410 53073359 53237411 53132438 53150876 53377455
3237 53377455 54273535 55707071 56718463 58542210 60936332 63538546 66816913 69631580
3229 69631580 72062812 73907426 74143081 71848259 68919578 66171034 64100497 62953035
3221 62953035 63095077 63429287 64032176 65686430 67389800 69319043 71337439 72929644 74081722
3212 74081722 75367470 75379147 73339173 69375715 64979465 61040705 58361479 56096655
3204 56096655 54427405 52750570 51151697 49788638 48902219 48503285 47593962 47634019 47375325
3195 47375325 47306972 47375148 47030285 47404312 47752100 48023344 48191168 48742045 49478494 49529416
3185 49529416 50014661 49969263 49906285 50725982 51315421 51923174 52112726 51993553 52521885 52815195
3175 52815195 53298946 53905175 54433212 54862547 55280974 55936970 56695012 57442711 58696905
3166 58696905 59492978 60239750 60890157 61712295 63001254 64301197 65528824 67181672 69152425
3157 69152425 70915619 72081421 72840249 72997180 72473717 70680451 68791899 66886305 65219410
3148 65219410 64267540 63095453 62144266 60746443 60080153 59368694 58757109 58131086 57721258
3139 57721258 57981737 57645420 57734367 57985038 57980863 58457694 58520619 58488174 59031758 59818184
3129 59818184 60681502 61898885 63117564 64417798 65947785 67593269 69337796 71454773
3121 71454773 73567078 75305482 76378502 77397299 78998204 81016266 83195140 85576949
3113 85576949 87047410 86904742 84968249 82120851 78918515 75757739 73275073 71065308
3105 71065308 68747343 66360569 64014448 61206818 59080738 56818076 55118067 53680999
3097 53680999 52670894 51635517 50765753 50615139 50384343 50296773 50182336 50025435 49740902
3088 49740902 49645153 49756591 50479286 51357300 51238405 50882974 50237569 48759309 47208501
3079 47208501 45686000 44686964 43738231 42828044 42021173 41670151 41384243 40798531 40162359
3070 40162359 39588816 38818901 38407588 38314757 38516265 38558357 38460388 38766518 38894714 39439629
3060 39439629 39864447 39829008 39757452 40426185 40693436 40897626 41223145 41655749 41681793 41796506
3050 41796506 42103967 42349659 42379623 42779290 43383933 43679350 44104892 44067634 44229061 43976136
3040 43976136 43638293 43562082 43470732 43076002 43104072 43067171 43136129 43243901 43776822 44038467
3030 44038467 44379434 44619608 44694707 45266920 45869445 45990273 46575971 47169549 47720199 48331196
3020 48331196 48777775 49138164 49328409 49591643 49532053 49498888 49301372 48562671 48145553 48233193
3010 48233193 47138555 46889574 46795931 46180963 45979672 45889268 45411297 44844742 44467785 44004286
3000 44004286 43868625 43676731 43282195 42801766 42240814 41405868 41031527 40565480 39909256
2991 39909256 39282110 39336400 38886043 38546748 38297254 38107856 37791022 37068039 37124002 36489872
2981 36489872 36616747 36280966 36051215 35470680 34396313 33511250 32635222 32237117 32105871
2972 32105871 31865052 31481916 31468001 30831864 30746033 30488785 29641144 29307834 29269326 29338591
2962 29338591 28913084 28114143 27890872 27781242 27763225 27634043 27413110 27309424 26987295 26771473
2952 26771473 26361515 25766703 25376845 25321170 25260367 25048048 25114206 25010402 24641014 25074636
2942 25074636 24887988 24968990 24824226 24514417 24453778 24026533 23441823 23118863 22779880 22341855
2932 22341855 21975533 22065454 21706485 21506239 21581727 21293809 21430659 21397543 21127645 21057727
2922 21057727 21062358 20790834 20795644 20753823 20929121 20817709 20787733 20392767 20315022 20414485 20675226
2911 20675226 20944263 20527644 20620718 20943823 21018667 20669159 21047627 21496395 21376760 21454683
2901 21454683 21656458 21418963 21683169 21590630 22053016 22121471 21752032 22226516 21903612 22201391
2891 22201391 22069311 22067461 22407026 22615488 22564664 23038763 23189377 23622938 23748174 23589391
2881 23589391 23845136 23900116 24288039 24921931 24628001 24819085 25336973 25859539 26551382 26605466
2871 26605466 26851342 26910803 27041921 27316832 27438739 27378690 27156895 27063106 27262328 27411583
2861 27411583 27327785 27177849 26950671 26880184 27174827 27452176 27598572 27195355 27053324 27308106
2851 27308106 27602113 28035972 28125862 28283762 28663448 28867226 29155014 29124968 28999970 29094135
2841 29094135 29532622 30129641 30480112 30692832 30373881 30476237 30733891 30525193 30566789 30217167
2831 30217167 30204179 30201635 29628322 29321231 28944905 28581769 28119674 28353078 28392452 28218696
2821 28218696 28145305 28120183 28693085 28441238 28131103 27751016 27734918 27631791 27718122 27929391
2811 27929391 28018828 28177072 28171538 27848332 27977953 28290455 28266445 27962282 27774323 27928734
2801 27928734 27802714 27376560 27495923 27730911 27557996 27174189 27419417 27402001 27243033 26908539
2791 26908539 26866562 26891919 26735928 26721181 27011132 27085756 27089181 26822116 26999082 27007857 27030145
2780 27030145 26923198 26351386 26186722 26503264 26615738 26482202 26552147 26326552 26431392 26782956
2770 26782956 26853916 26957087 27603063 27631485 27632630 27190743 27047191 26820221 26868348 26574828
2760 26574828 26663750 26574455 26709203 26990422 27220641 27378709 27844381 28179022 28758697 29472523
2750 29472523 29301922 28836039 28126641 27687229 27758987 27554490 27750669 28102471 28391439 28496856
2740 28496856 28772170 29170339 29478133 29875649 30065637 30038263 30147896 30167806 30231939 30641785
2730 30641785 30635577 30079255 29829065 30054275 29946409 29852675 30077707 30441049 30208522 30279369
2720 30279369 30605138 30544678 29784175 29618861 29346695 28776174 28675379 28346235 28421911 27956472
2710 27956472 27525947 27244795 27172678 26988146 26579674 26248306 26126734 25596742 25247269 25286702
2700 25286702 25192684 25025837 25037849 24695669 24445987 24342216 24069816 24096795 23846480 23711178
2690 23711178 23555209 23471937 23089463 23253088 23473720 23610919 23618064 23267869 22996767 22970612
2680 22970612 23106838 23216894 23089438 23203348 23315499 23516005 23662634 23824197 23655812
2671 23655812 24060267 24153857 24498197 24884868 24979451 24912722 25250261 25268659 25514899 25955784
2661 25955784 26158444 26405434 26629106 26715507 26960643 27072513 27016314 27001559 27336965 27993580
2651 27993580 28054946 28523663 28603802 29035919 28942035 28726584 28785365 28859220 28855359 28709981 28422383
2640 28422383 28211221 27743076 27812180 28018504 27981568 28267413 28075145 27794540 28131050 28373554
2630 28373554 28124891 28355128 28993124 29408993 29339651 29318004 30042814 30712167 30817104 30818098
2620 30818098 31200581 31564026 32005690 32297405 32572343 33061617 33272354 33330752 33465761 33928297
2610 33928297 33778748 33720487 33247369 33310532 33414153 33239281 33025250 33173140 33116244 32864879
2600 32864879 33001322 33503716 33687905 33527902 33702636 34074783 34145660 34058440 34044279 34054560
2590 34054560 33757595 33754230 34047320 33903917 33704294 32996668 32973775 33329046 33581667 33558021
2580 33558021 33813850 34029359 34641355 35093279 35478717 35786627 36490329 36684884 36938324
2571 36938324 37418038 38115503 38695392 39644067 40310852 40950277 42265972 43340449 44461589
2562 44461589 45689348 46509276 47261889 47966313 48538395 48726388 48971712 49116420 48559882
2553 48559882 48368184 48391320 48526572 48584328 48782202 48648299 48672629 48836185 48992023 49120409
2543 49120409 49163908 49522753 50214843 50561634 50501119 50785584 50750290 51149092 51644276 51839424
2533 51839424 52165572 52207663 52304526 52371908 52791665 52729798 52398848 52124761 51831600 52026056
2523 52026056 51478240 51327761 51409106 51241114 51064939 50767522 50868732 50766135 50257692 49824155
2513 49824155 49805056 49565543 49012942 48431437 47787293 47037093 46782590 45945720 44993345 44517811
2503 44517811 44382458 44007694 43358616 42571522 42151649 41881292 41625008 41190595 40947193
2494 40947193 40621453 40383533 40115929 39807021 39745195 39563053 39575846 39645845 39387459 38897996
2484 38897996 39048252 39509012 39300236 39263219 39537936 39673392 39638697 39133696 39459794 39305262
2474 39305262 39160526 39761929 40023275 40376373 40297657 40224603 40196273 40290002 40543470 40498259
2464 40498259 40619607 40790747 40414065 40357528 40154576 40575072 41028960 40783108 40883603 40874056
2454 40874056 41169929 41494085 41644836 41831204 42019768 42360979 42442865 42497310 42272844 42223852
2444 42223852 42399715 42962032 43399468 43314558 43229809 43172596 43568215 43936269 44155449 44592852
2434 44592852 44697161 44669930 45453868 46248755 46723348 47192245 47822801 48222831 48511007 49226338
2424 49226338 50016519 50517626 50824669 51258193 51911314 52161852 52938509 53670377 54062618
2415 54062618 54575483 54541860 54672158 55073945 55091798 55642917 55688500 56054871 56185955 56529198
2405 56529198 56908570 57174052 57388236 57716631 58059355 58202414 58466913 58842856 59038202
2396 59038202 59591400 60696978 60902233 61340870 62004602 62441196 63144916 63345091 63407085
2387 63407085 63547614 63679589 63658927 63377308 63217894 63149839 62870346 62769776 63514880 63498493
2377 63498493 63309786 63093702 63064487 63305722 63150919 62793694 62616034 62196807 61823593 61136413
2367 61136413 60701999 60279128 59902776 59029785 58510952 58085286 57658594 57292955 57043500
2358 57043500 56872621 56788603 56911240 57003880 57713164 57953795 58808251 59103201 59854447 60807609
2348 60807609 61961585 63263319 64735958 66571370 67981531 69450559 71588885 74033026
2340 74033026 76444873 78712752 81441850 84539298 87326890 89536611 91162624 92323038
2332 92323038 92753662 92288370 90784263 88835432 86509402 83571001 80157013 77024922
2324 77024922 73968299 71468437 69527091 68244541 66505110 64519007 62552943 61390031
2316 61390031 60694509 60188500 59534063 58915721 58872239 58650181 58653521 58730318 58768684 58935666
2306 58935666 59223689 59263136 59586852 59689297 59687738 60001022 60319349 60684073 61047087 61611256
2296 61611256 62064983 62500535 62778555 63623187 64383828 64903013 65625404 66529452 67612461
2287 67612461 68857708 70167751 71284445 72242586 73030822 74198225 75693917 76762036
2279 76762036 77187111 78005839 79151751 80315387 81120212 81857473 82577126 83111075 84046279
2270 84046279 84663886 85366190 86123325 86981214 87708643 88827737 89963949 90851201 91751832
2261 91751832 92870269 93999240 94896397 95873424 96771533 98185904 99300192 100223446 101025387
2252 101025387 102242448 103131809 104062190 105060718 105846512 107134070 108160853 109399827 110329376
2243 110329376 111737631 113352260 115011007 116197334 117173954 118387111 119585559 120882409
2235 120882409 121778168 122870071 124384376 125455274 126360953 127871276 129155859 130318502
2227 130318502 131600143 133112603 134351847 135667679 136968234 138404123 139666453 140844201
2219 140844201 142543765 144208744 145582179 147090664 148715988 150739453 152961447 155428862
2211 155428862 157552641 159979927 162326320 165127687 168164977 171446719 174514102 178011639
2203 178011639 181475152 184639635 187729634 190718042 193921484 196730056 198891957 201515859
2195 201515859 203158523 204796055 206418608 208258535 210301074 212355747 214673612 216462838
2187 216462838 218252450 219923056 221671090 222084113 222089449 221397235 220463488 219344161 217720514
2178 217720514 215122204 212358229 209228722 205465384 200936622 196456608 191870765 187749920
2170 187749920 183054287 178512191 174342577 170401959 166828414 163259474 159870551 156121052
2162 156121052 152051529 147969881 144719473 141129548 137651205 134233420 130892755 127789102
2154 127789102 124862559 122904620 120284020 117446686 113746603 109409314 105680504 103173717
2146 103173717 101036277 99404176 98208470 97190313 96313758 95746604 95322240 94248752
2138 94248752 92067465 88474830 84541650 81010301 78635857 76414925 74440429 73114202
2130 73114202 71836134 70362488 69510813 68751400 67794787 66960147 66553487 66186945 65723335
2121 65723335 65282452 65645429 65777436 65788976 65554200 64386755 63474301 62872291 61952505
2112 61952505 61273821 60795681 60315922 59972393 59393187 59392244 59097020 58667911 58111164 57462883
2102 57462883 57311133 57074992 56727826 56459955 56184289 56302918 56234648 56090755 56332417 56800917
2092 56800917 56935466 57012825 57223901 57877800 58398091 58471021 58715737 58838517 59498821 60352036
2082 60352036 60717223 61315671 62018750 62368691 63576493 64520611 65125058 65607718 66613599
2073 66613599 67327148 67746641 68461257 68723790 69187027 69423320 69553936 69480657 69059498 68913293
2063 68913293 68837678 67991791 66642319 65780078 65118750 63871615 63397141 63256259 62862767
2054 62862767 62538347 62826943 63441202 63685960 63987321 64320555 64703012 65022057 65092016 65459748
2044 65459748 65861917 66062272 66158093 66191970 66299050 66470801 67029835 67555963 68031300 68529968
2034 68529968 69165973 70149283 71348222 72784204 74082498 75061149 76414082 77937882 79277296
2025 79277296 80275686 81024033 81627060 82286414 83308156 84395528 85307449 86311224 87246047
2016 87246047 87200336 87217176 87061745 86998291 86826739 86416278 85630228 84507637 82993535 81359682
2006 81359682 79710919 77281981 75101192 72222390 69407819 66412560 63616831 61150558
1998 61150558 58762614 56355806 54513583 53365347 51776624 49905962 48548897 47313213
1990 47313213 46045699 44576926 43139259 41915013 40430112 39180609 38510631 37712040
1982 37712040 36615724 35668053 34573133 33953398 33329142 32102686 31221066 30831805 30040421
1973 30040421 29456052 28990424 28288792 28074988 27800159 27347730 27084251 26682052 26241090
1964 26241090 25818548 25394861 25108734 25095431 25189045 24761762 24518638 24109784 23929171 23885916
1954 23885916 23865283 23468450 23680899 23636453 23077862 23006355 22638131 22282270 22533645 22565883
1944 22565883 21973151 21953313 21712951 21522617 21261321 21228858 21103074 20575178 20652367 20457745
1934 20457745 20230965 20091498 19788779 19835516 19798031 19888852 19839354 19543970 19550182 19232386
1924 19232386 19270452 19252671 19264179 19142907 19357096 19640465 19360048 19034154 18905715 19717488
1914 19717488 19859543 19810487 19342198 19647244 19972055 19985877 19914885 19965894 19441880 19565275
1904 19565275 20016098 20553486 20753869 20678434 20934035 21226267 21350380 21111842 21419267 21951767
1894 21951767 22310657 22385362 22369315 22509512 22725723 22901169 22659721 23102659 23296169 23844520
1884 23844520 24745063 25035526 24925283 25243190 25985565 26707318 27222612 27409998 27919041
1875 27919041 28191932 28800693 29406586 30090184 30515226 31098846 31525869 32179731 32545574
1866 32545574 33163328 33918023 34765007 35625189 36440591 37351414 38327302 39071295 40529086
1857 40529086 41925503 43282264 45095103 46685736 47738999 48616977 49572042 50602098
1849 50602098 51692458 52628636 53361569 53760428 54578380 55486723 56288340 56512592 56881740
1840 56881740 56909969 56848477 56889609 57054935 57489438 57480636 57607943 58234142 59260530 60481746
1830 60481746 61828944 63309688 64989621 66804796 68932079 70670982 72611148 75006964
1822 75006964 77216765 79640501 82609056 85544072 88535060 91333995 93929398 95863237
1814 95863237 97064503 98136617 99202616 100123427 101291855 102749657 103706588 105270522
1806 105270522 106984518 108623512 110981152 114262401 117539852 120586859 123879979 127594074
1798 127594074 131313050 134928272 138565820 142535465 147296531 152338944 158619091 165182629
1790 165182629 172488287 180775195 189101118 197795317 206789441 216563423 226164226 234568757
1782 234568757 241629675 246916825 250957077 255018360 259194813 262311922 263293017 261715723
1774 261715723 258614002 255944377 254075538 252989386 253126439 254059001 255893579 258376820
1766 258376820 260554828 262525730 263193589 262605410 261548487 260486333 260723569 262714327
1758 262714327 266415334 270001861 272260807 271067906 264617519 253521062 239722456 226010756
1750 226010756 213253024 201212065 190295116 181172687 173234789 167158011 162486356 159152276
1742 159152276 157215972 156647984 157601811 159468913 162160035 164869583 166220798 166061029
1734 166061029 164062644 159940467 153091668 143247134 132275975 121677380 112598651 105447954
1726 105447954 100109818 95720001 91901460 88128993 84994524 81801465 79237110 77160976
1718 77160976 74625924 72312784 70186620 68037781 66342620 65279643 63767003 62185562
1710 62185562 61175982 59784354 58326439 56990305 55547057 54090850 53222051 52860897
1702 52860897 51790241 50929851 50199505 48679772 47066990 45597256 44001823 42101302
1694 42101302 40224952 38963775 37809027 36864023 35594194 34277003 33440422 32742608 31513806
1685 31513806 30730782 29895366 29133436 28383122 28063792 27006927 25962075 25363473 25132972
1676 25132972 24689987 24047207 23554272 23335493 23390648 22462506 22202412 21994752 21693507 20773112
1666 20773112 19989983 19940085 19557988 19341767 18971174 18408349 18649089 18576916 18120110 18248902
1656 18248902 17840322 17095888 16997629 17152046 17288770 16988697 16782630 16506959 16096965 15991924
1646 15991924 16024429 15749719 15437164 14955752 14668153 14480167 14378569 14672552 14627674 14715203
1636 14715203 14865879 14673482 14365850 14008713 13774986 13214437 12642664 12632161 12557898 12481616
1626 12481616 12163003 11686334 11527581 11554565 11532154 11651526 11429184 11442762 11730449 11687221
1616 11687221 11596957 10970277 10568141 10338017 9889962 9852153 9794255 10059664 9998191 9840987
1606 9840987 9781829 9809744 10017849 10092719 9856445 9709761 9479544 9385575 9146303 8872755
1596 8872755 8872693 8459776 8407797 8420326 7879407 8129744 8399666 8255818 8357752 8371811 8068009
1585 8068009 7900412 8114693 8248005 8138728 8273400 8360010 7890699 7806422 7264960 7087770
1575 7087770 6674827 6861745 6986216 6726060 6500646 6779496 6911871 6527981 6678587 6956903
1565 6956903 6817597 6646841 6441070 6086745 6008856 5745966 5162673 5004733 4768722 5083104
1555 5083104 5186575 5157012 4720202 4710406 4929939 5025171 5451043 5490800 4992281 4924985 5190562
1544 5190562 5032594 5146506 4994032 4924221 5209855 4718375 4104115 4220216 4234373 4078373
1534 4078373 3783376 3973746 4126987 3827412 3812145 4111587 3687701 3670490 3661764 3908928
1524 3908928 3851319 3902309 4115072 4271092 4289125 3845666 3384272 3561783 3824161 4011709
1514 4011709 3775500 4011345 4107739 3725876 3347558 3416700 3798433 3668748 3648256 3696045
1504 3696045 3751727 3629450 3490675 3713875 3656782 3698805 3723825 3659532 3884695 3812765 3782021
1493 3782021 3593974 3791909 3401070 3549310 3607622 3510767 3420959 3882049 4263671 4197955
1483 4197955 3980858 4124221 4125438 3821448 4008398 4105167 3810800 3192762 3820662 4146239
1473 4146239 4327567 4670463 4620031 4029820 3994807 4191808 4379456 4095243 4207303 4437149
1463 4437149 4084654 4081970 4222960 4213165 4082864 3772375 4059673 4233809 4328485 4499873
1453 4499873 4342305 4333909 3925190 3655589 4121215 4649238 4664796 4299590 4282197 4589793
1443 4589793 4796332 4494525 4270371 3988247 3473068 3520767 3582589 3244061 3477110 3714936
1433 3714936 3643352 3606527 3173265 3290808 3104074 3002548 3057311 3042539 3021545 2824086
1423 2824086 2892303 3264670 2761735 2942341 2976484 2965779 2992643 2608615 2883047 3314957
1413 3314957 3550501 2984749 2878367 3232692 3115186 3292118 3099485 2883546 2712570 2902665
1403 2902665 3071964 2705751 2564332 2535722 2355567 2609151 2604978 2442874 2492269 2338871
1393 2338871 2192610 2001802 1516025 1259110 1637768 1810628 1955661 1848366 1831008 1914981
1383 1914981 1778448 1597264 1807326 1814994 1823174 1521320 1312418 1500555 1586733 1609681 1392469
1372 1392469 1157843 1466494 1482632 1754288 1850794 1490261 1645015 1484948 1313654 1289658
1362 1289658 1276804 1186703 1317866 1487019 1341069 1336270 1296141 1425163 1088341 1029659 1006151
1351 1006151 1386771 1562919 1522654 1268057 1142126 1410483 1239908 1099423 1115203 1380168
1341 1380168 1281169 1179083 1086764 1053204 1076514 1322369 1250566 1290706 1140276 932842 1169560
1330 1169560 1512196 1885804 1389204 701089 714789 865970 950357 1140238 1267540 1068066
1320 1068066 1114648 1031559 699587 443838 874905 1029430 1071623 706493 1044710 1271960
1310 1271960 1006272 1241770 1239860 1299706 1230106 806976 837119 883376 773182 693952 724195
1299 724195 987486 982415 1138265 683629 321424 573978 563758 246885 608522 965375
1289 965375 923008 815186 779631 888136 1062259 934152 1014955 1239095 1312921 1084277
1279 1084277 906845 669738 136782 182034 151145 237820 688910 814950 852835 697478
1269 697478 608967 984683 957114 1256934 1447704 1232500 1197575 1020723 1021320 803941 675885
1258 675885 707160 702595 618491 831359 875136 1097368 1478370 1357929 1270687 1490290 1856104
1247 1856104 1698221 1273815 1232970 1278631 1446189 1494256 1055586 1072146 1058690 660763
1237 660763 804872 795348 644361 795643 879416 968562 652201 558654 882412 1034875 1002661
1226 1002661 1228245 995720 1044301 734145 760618 1038385 961974 664781 269617 573065
1216 573065 454020 361739 116768 346045 550548 767091 886249 736879 898180 785972
1206 785972 600228 814926 778060 985696 943886 930714 1374577 1322461 1201092 951281
1196 951281 804845 895761 1111685 768293 833709 929676 903127 725351 1089848 1133510 695523
1185 695523 682265 379038 631194 614420 626314 561258 1064416 991005 991422 909338 681711
1174 681711 805190 873639 481667 670417 1026360 1128463 857575 758987 921508 939046
1164 939046 947406 724420 869691 1003421 983311 904156 771654 929970 1257318 1110037
1154 1110037 1164248 1234413 1079157 833561 625866 988891 967802 1418547 1930524 1662979
1144 1662979 1735013 1616426 2009333 1844842 1799228 1517736 1643728 1716303 1680986 1706855
1134 1706855 1652726 1934746 1822485 1942105 2189210 2037752 2319839 2124895 2008677 2271382
1124 2271382 2596578 2179260 2195852 2538321 2630816 2750684 2722398 3024999 2824723 3000200
1114 3000200 2682818 2630112 2640210 2619533 3036054 2952392 2624162 2650414 2904833 2986840 2945262
1103 2945262 3032615 2967915 3004945 3265144 3213044 3589311 3578127 3927508 3897090 3507319 4164119
1092 4164119 4040272 3769457 3384826 3116117 2933078 3080303 3202848 2944405 2611844 2586647
1082 2586647 2663967 2194272 1977213 1876537 2038317 2149673 2242165 2468777 2502363 2427513
1072 2427513 2336850 2473718 2664840 2691574 2406956 2669284 2182456 2151260 2124193 1945714
1062 1945714 2257106 2193596 2697103 2684118 2717396 3189122 2862553 2545304 2632032 2732489
1052 2732489 2959626 3242144 3160079 2811817 2724607 3108886 3236324 3131293 3018306 2878504
1042 2878504 3081179 3376042 3680315 2980973 2937633 2936320 3275319 3586332 3827157 3781312
1032 3781312 3633771 3661775 3640016 3854088 4201028 4320894 4518440 4252994 4279349 4113192
1022 4113192 4319886 4664379 4229625 4270014 4299147 4625544 4817145 4764822 4982486 4899402
1012 4899402 5166526 5328653 5601053 5433395 5595091 6313929 6479465 6410666 6161275 6554949
1002 6554949 7280275 7200264 7503871 8119809 8217468 8627685 9485201 10012000 10295790 10580343
992 10580343 11257308 11909540 12212599 12896891 13253330 14182634 14843911 15820642 17012878
983 17012878 18653543 20379128 22534141 24673739 26276715 27709720 29074284 31251489
975 31251489 33851584 37048789 41488974 46437776 52205689 59793176 70228715 82379512
967 82379512 93691860 106311436 123267863 137607629 148404362 129571697 95131266
960 95131266 72389634 57315812 48226517 41461088 36403212 32392426 29492335 26572255
952 26572255 24809325 23211448 21819653 20823803 20165295 18940859 17798976 16090504 14841526
943 14841526 13515142 13090207 12406680 11948870 11190956 10684451 10522045 10214235 9467790
934 9467790 9330087 9167703 8430350 8019795 7681278 7043005 6702128 6432077 6144163 6096054
924 6096054 5801794 5455848 5176769 4987466 4922768 4468060 4668292 4233835 4047311 4137683
914 4137683 4211815 4061580 3556419 3348455 3346670 3609439 3420915 2923978 3112473 3242507
904 3242507 2890774 2881279 3017720 3042061 3087508 2870754 2461925 2317951 2587647 2483305
894 2483305 2341782 2495524 2771222 2532902 2625390 2616143 2484616 2343695 2351349 2122434 2100366
883 2100366 2078725 1892823 1842832 2412339 2330284 1930873 1760486 1718726 1694395 1348220 1525227
872 1525227 1551179 1881109 1666413 1804546 1612549 1947152 1796393 1795456 1631168 1352186
862 1352186 1436912 1484791 1617190 1368758 1446392 1255843 1005868 1089463 1191032 924865
852 924865 1166362 1460168 1400535 1060381 758930 941784 1073117 1253023 1466873 1420233
842 1420233 992089 702851 1195858 1007765 749407 706689 555362 894270 968400 801710
832 801710 927512 767631 531865 295874 520201 622242 809975 951003 698154 776638
822 776638 962245 1095976 890166 914141 892542 1259528 1000240 962568 860622 936359 622940
811 622940 397778 239394 606211 540149 527367 880454 782014 899373 789772 660619
801 660619 499709 539643 595358 368646 563926 600137 541007 756398 651848 581630 425012
790 425012 637235 883002 817433 622141 521960 677000 476727 437236 581216 807672
780 807672 724182 454903 271024 583598 696590 410678 520027 572839 457305 228940
770 228940 342889 176448 -37952 -2153 325563 178764 36896 79686 202055 236101
760 236101 395567 299588 278768 129091 262644 468106 397622 564623 473477 302094 -107614
749 -107614 94342 163025 215753 482150 413170 83349 -76249 -135516 430364 404697 126232
738 126232 -131284 23431 21094 -177305 -239617 216238 417563 111070 -306857 -312726 -150115
727 -150115 191827 338513 99658 19606 48830 35469 -79478 158504 200955 310253 283434
716 283434 138419 193985 235925 289974 481403 308202 208246 -100325 10285 -216324 -403323
705 -403323 -205671 98691 -234558 86283 76172 172119 -75718 78473 280756 220676
695 220676 576514 751934 459023 129312 -6802 -132885 -219516 -254627 148826 436414
685 436414 242150 327350 475340 472674 392532 443396 592271 692880 827430 786079 690158
674 690158 294124 597735 657115 104730 122835 54386 -149933 -138720 85289 87885 70587
663 70587 292636 328027 -141939 -153597 -5906 -51167 98728 53578 68120 179360 2036
652 2036 -210015 -122673 -62792 -182270 -54366 148553 176914 -77610 -98291 17099 130254
641 130254 13964 215666 233934 336960 415662 67505 -174913 -184415 -119879 -191089 93112
630 93112 167253 391763 -210242 -543025 -449693 -230987 -166260 228692 -179476 -4784 9420
619 9420 68893 119747 143259 67437 -356473 -223954 -256614 -393567 -198803 -245811 56693
608 56693 -103681 -145095 43009 -212015 -281870 -686551 -360766 -177260 -233526 -29594 -19653
597 -19653 204241 690885 389529 -336439 -272831 -152268 -443238 -132964 -166389 -5181
587 -5181 -156330 -264511 -133126 -94196 -546311 -497784 70991 -28903 -108516 82545 -160207
576 -160207 -413291 -135519 -198412 -211689 -305053 -328127 -356650 -184836 -327178 -127583 1935
565 1935 -632478 -554303 35435 39662 191019 -194568 -502994 -193861 -26848 980 157603
554 157603 118111 -180045 -279279 79203 45219 -149027 -188999 -131191 -90037 -125538 -373249
543 -373249 -426760 -265442 -733816 -898364 -338612 -254381 -214103 -204565 -385679 -62799 12046
532 12046 444801 357228 278078 265313 -79083 -303110 -330253 -517855 -556597 -489528 -460349
521 -460349 -302907 -594844 -1010777 -774674 -343740 -608652 -701144 -351178 -31702 -11753
511 -11753 -374426 -419683 -411469 -314852 -332214 -441005 -658799 -800316 -587523 -414390 -389108
500 -389108 -471958 -561506 -329657 -271674 -320592 -626131 -682734 -436499 -153809 -515690 -709968
489 -709968 -693924 -322523 -233652 -559453 -408078 -121604 -36006 -363827 -519098 -435230 -355803
478 -355803 -491063 -536403 -288190 -530361 -338404 -197640 -424944 -330941 -219201 -246412
468 -246412 -642386 -418814 -382933 -508820 -268629 -269385 -662132 -308403 146061 45650 -211128
457 -211128 -61924 188350 34115 -157827 -268752 106967 -139373 -176915 -303858 -497029
447 -497029 -635147 -475095 3764 -384577 -519578 -257053 -176589 -586243 -598440 -752040
437 -752040 -1203759 -1184474 -985345 -1000444 -754306 -598218 -835175 -800854 -639095 -483011
427 -483011 -554511 -878944 -954906 -653471 -560161 -882080 -719592 -622965 -139806 29170 7527
416 7527 -542916 -982245 -820860 -723588 -475924 -581091 -459110 -222692 -560330 -463113 -167554
405 -167554 -519769 -578789 -707853 -533254 -616063 -297594 -593146 -535857 -298447 -475723
395 -475723 -266924 -688140 -727777 -555259 -400452 -505914 -571947 -496907 -699049 -632150 -692259
384 -692259 -573490 -284157 -389002 -275351 -622514 -807139 -839800 -684417 -550960 -351571
374 -351571 -837860 -671473 -320832 -595037 -401615 -431064 -657299 -680557 -583251 -513333 -799589
363 -799589 -656968 -401657 -225508 -105153 -407448 -554926 -759909 -683353 -608705 -187824
353 -187824 -299282 -540248 -559472 -547852 -810523 -697107 -552789 -688415 -658217 -897293
343 -897293 -714610 -576673 -571160 -877794 -862207 -536129 -396538 -714900 -913203 -728456
333 -728456 -558492 -359096 -280840 -488667 -222648 -113435 -468020 -413877 -902986 -803522
323 -803522 -704017 -761170 -778532 -935095 -847170 -858887 -696636 -588265 -857413 -784559 -614169
312 -614169 -1056069 -1506610 -1474069 -1224531 -1184385 -795208 -376077 -649088 -735205 -752881 -588379
301 -588379 -783115 -733774 -813237 -998794 -749262 -783788 -712540 -684787 -586349 -877170 -1052644
290 -1052644 -1233618 -1114834 -1463804 -1426919 -738951 -482020 -469842 -381395 -249647 -233474
280 -233474 -321550 -534804 -553777 -700124 -968209 -1281817 -817437 -569872 -590891 -681001 -424483
269 -424483 -821710 -511412 -659392 -1035311 -666821 -619387 -847580 -994309 -600492 -515331
259 -515331 -453706 -380270 -465953 -795824 -324086 -432926 -526338 -681191 -1063000 -1108069 -1055274
248 -1055274 -1428482 -1698901 -1619086 -927988 -419645 -399934 -474711 -591958 -557428 -796312
238 -796312 -1084300 -984279 -558384 -870144 -909066 -1019578 -916026 -973290 -1022770 -1101975 -1072024
227 -1072024 -1018437 -993392 -996959 -1222008 -1280576 -1436377 -997444 -1145632 -1029497 -961426 -840153
216 -840153 -642002 -683595 -837027 -972863 -902596 -799113 -749815 -871416 -923680 -985028 -1172390
205 -1172390 -1295552 -1154421 -1115050 -995232 -1098744 -1006226 -942460 -815033 -631174 -792696
195 -792696 -586541 -403222 -742985 -1178418 -1075806 -755663 -523533 -590726 -857311 -870335
185 -870335 -990382 -1047454 -1226588 -1426934 -1306108 -1012047 -1076609 -921787 -765816 -662595
175 -662595 -696151 -648295 -622044 -752590 -794266 -923230 -621510 -828035 -1363428 -1221480 -1170153
164 -1170153 -1268425 -999879 -1055769 -1046144 -1012082 -1190094 -1255487 -773061 -1020969 -1220101 -1236895
153 -1236895 -1392406 -1644584 -1517102 -911576 -936125 -1113349 -1348174 -1129357 -1186974 -1261686
143 -1261686 -1135064 -1359676 -1221450 -1118575 -1186585 -895626 -825376 -1256400 -1528021 -1340779
133 -1340779 -1587969 -1371918 -1220999 -1222096 -1445813 -1248563 -1167890 -1412430 -1344218 -1303999 -1243779
122 -1243779 -1154955 -959259 -1043569 -901058 -643481 -964250 -1207197 -1310819 -1229843 -886405
112 -886405 -1100820 -865955 -659488 -661645 -656506 -639410 -774028 -1048116 -1479981 -1521885 -1543429
101 -1543429 -1481249 -1430376 -1555235 -1318187 -1002681 -972450 -964008 -965980 -840876 -925928 -1039966
90 -1039966 -834346 -816930 -1028777 -1352931 -1504295 -1514861 -1376955 -1207477 -1378098 -1353176
80 -1353176 -1443795 -1309362 -1361015 -1278525 -1502292 -1453370 -1282993 -1134512 -964888 -1237060 -1358140
69 -1358140 -1240424 -1137736 -957355 -971188 -1355479 -1416770 -1240703 -1132506 -1320447 -1207958
59 -1207958 -1080081 -1162040 -1225041 -1049202 -926023 -901127 -1031592 -1312966 -1110713 -1098429 -1405592
48 -1405592 -1293630 -1262624 -1240344 -1294654 -1259333 -1359810 -1470549 -1548977 -1401460 -1518389 -1608105
37 -1608105 -1610950 -1305332 -1549558 -1677914 -1652336 -1474640 -1370703 -1264242 -1452689 -1504556 -1364851
26 -1364851 -1170100 -1203076 -1255997 -1161100 -1220912 -1406453 -1341389 -1265688 -1334526 -1638441 -1499520
15 -1499520 -1329966 -1344853 -1278555 -1178841 -1244308 -1167710 -1277290 -1524427 -1442846 -1534210 -1355458
4 -1355458 -1388451 -1398390 -1398213 -1550992
0 -1550992
$$ Imaginary data points
##PAGE= N=2
##DATA TABLE= (X++(I..I)), XYDATA
16383 -6857023 -6895609 -6803015 -6642460 -6448095 -6474379 -6394554 -6233942 -6209577 -6287045 -6186623
16373 -6186623 -6231161 -6007403 -5916902 -5953257 -6050155 -5850990 -5899164 -5419521 -5274055 -5430310
16363 -5430310 -5350430 -5409798 -5306161 -5312891 -5116820 -4984396 -4887463 -4862963 -4961842 -4711011 -4616869
16352 -4616869 -4439170 -4338517 -4352182 -4453658 -4314597 -4192261 -4027794 -3998546 -3958824 -3980720
16342 -3980720 -4092039 -3930104 -3847082 -3748652 -3889469 -3996396 -3645280 -3651213 -3580069 -3136819
16332 -3136819 -2990919 -2900101 -3151382 -3005002 -3004522 -2863256 -2739713 -2744863 -2934560 -2511370
16322 -2511370 -2318646 -2590738 -2534722 -2563641 -2367429 -2154321 -2347293 -2349278 -2086001 -1767383
16312 -1767383 -1911382 -1887219 -1690489 -1500707 -1831563 -1625814 -1507281 -1267714 -1207915 -1618634
16302 -1618634 -1734357 -1518403 -1546687 -1390663 -1462845 -1472446 -1373562 -946275 -883934 -708584
16292 -708584 -637190 -700941 -387105 -596525 -883402 -616604 -451188 -498705 -448370 -385235
16282 -385235 -557209 -386939 84412 -180790 -332818 -258817 -385886 -333702 -266572 -398612
16272 -398612 78620 -97964 92884 148021 422802 372513 413726 826022 933597 747791
16262 747791 739281 715022 436629 268907 448211 1179294 1101138 771660 903978 1262940
16252 1262940 1204550 1079697 1101929 1268760 1418197 1473091 1537411 1382197 1254297 1550957
16242 1550957 1365566 1368759 1557438 1215893 1300133 1606717 1910907 1902328 1898648 1915373 1704666
16231 1704666 1871240 1798464 1669290 1573646 1580998 1551254 1723570 2198763 1935050 1818601
16221 1818601 1765083 2332490 2261553 2270267 2459272 2309099 2463108 2251027 2060485 2123407
16211 2123407 2278507 2649272 2782705 2646158 2652537 2829262 2796681 2804344 2515287 2682749
16201 2682749 2488303 2704033 3220675 2830546 2689570 2807451 3012006 3097644 2844011 2726707
16191 2726707 2483446 2673318 3165329 3343338 3238161 2802990 2822832 3170044 3360414 3201989
16181 3201989 3314029 3513251 3421934 3477477 3285304 3626477 3799450 3390286 3555823 3737904
16171 3737904 3604016 3567796 3597843 3593334 3855755 3881327 3827888 3810195 3776645 3360591 3382883
16160 3382883 3378581 3819823 3431395 3180906 3458666 3718221 3912093 3858294 3569740 3284512
16150 3284512 3273753 3471890 3729348 3436029 3341699 3378823 3325084 3345604 3496602 3630773
16140 3630773 3868835 4083630 4197383 3747145 3931677 3814762 3918237 4030853 3958517 4047483
16130 4047483 4009362 3771521 3812765 4014012 3949802 4055959 4050831 3802013 3494360 4084723
16120 4084723 4062017 4046336 3868988 3857841 3927507 3702441 3738192 3815808 3915746 4285058 4182264
16109 4182264 4237432 4211614 4039049 4366338 4334061 4300981 4162000 4031809 3926399 3980881
16099 3980881 4214636 4226275 4216772 4146997 4142839 4415826 4560617 4408152 4106770 4442323
16089 4442323 4448501 4006836 3849168 4295574 4608583 4267225 4186940 3844919 3831339 4084995
16079 4084995 4210032 3994172 3866055 4088385 4382569 4276446 4460100 4526006 4207451 3992278
16069 3992278 4160820 4157651 4268184 4188788 4117205 3904454 4303803 4311869 4068132 4011463 4052934
16058 4052934 4162400 4395721 4612298 4339397 4488814 4481474 4235876 4251605 4117521 4472240
16048 4472240 4696997 4546018 4646286 4506653 4149984 4129156 4305951 4040475 4267816 4136021
16038 4136021 4461584 4336548 4174818 3999148 4486117 4561873 4635118 4675749 4309376 4200667
16028 4200667 4213207 4223847 4300030 3884353 4381062 4337063 4557109 4553137 4588248 4330747 4229370
16017 4229370 4336572 4902891 4788722 4808309 4618230 4279305 4338586 4100989 4119827 4157010
16007 4157010 4428372 4064021 4162666 4224496 4231653 3926008 3998214 4175827 4353848 4326207
15997 4326207 4711397 4623765 4590373 4763038 4269094 4054555 4307185 4377727 4576126 4673461
15987 4673461 4517573 4162397 4158923 4051344 3812059 3915161 4620539 4406459 4267278 4473527
15977 4473527 4491930 4520827 4412177 4327462 4694091 4244813 4019721 4302569 4191018 4098067
15967 4098067 4107628 4354327 4252881 3918018 3987311 3667554 4009293 4290591 4025059 4176422
15957 4176422 4156999 4298305 4465519 4193166 4503640 4261770 4014301 4675615 4443445 4034660
15947 4034660 4423403 4430806 4317967 4237021 4255179 4385067 4216158 4412566 4717051 4968630
15937 4968630 4545980 4033083 4484480 4549841 4466275 4827375 4461616 4500579 4408194 4236599
15927 4236599 4302400 4397169 4484266 4657642 4497523 4486264 4488434 4375322 4667105 4718473 4699567
15916 4699567 4459745 4208372 4170278 4403945 4539243 4517500 4500264 4512827 4526915 4484632
15906 4484632 4432028 4512326 4358704 4234730 4392884 4375182 4381234 4040678 3853598 4238861
15896 4238861 4135979 4022543 4305551 4796924 4785585 4220956 4165403 4170815 4352042 4274671
15886 4274671 4436130 4186077 4293914 4119120 4609824 4933212 4808232 4671488 4470338
15877 4470338 4433481 4334031 4419352 4562458 4390836 4350366 4460587 4308454 4559027 4175012
15867 4175012 4525605 4577936 4317973 4144939 3979304 3809852 4111784 4469281 4388860 4398575
15857 4398575 3977025 3974836 4359460 4301249 4134337 4092294 4487776 4889212 4613811 4312045
15847 4312045 4157983 4104956 4485231 4481297 4633748 4601110 4841141 4690880 4079128 4214234
15837 4214234 4183627 4370091 4563121 4443359 4249150 4298681 4365545 4240939 4397742 4415478
15827 4415478 4396262 4366139 4528110 4650585 4837142 4816331 4906290 4644312 4367473 4367053 4229938
15816 4229938 4424486 4314623 4553117 4402551 4400476 4739674 4870314 4634332 4143550 4305700
15806 4305700 4355576 4181484 4289158 4227231 4265336 3696782 3902572 4409649 4105480 4132947
15796 4132947 4540115 4695418 4450637 4759007 4421982 4178145 4520455 4327012 4446081
15787 4446081 4278868 4244403 4556162 4849719 4456587 4399402 4277419 4080319 4146528 4189912
15777 4189912 4230496 4356097 4340902 4409720 4303043 4288056 4883202 4754405 4219192 4209218
15767 4209218 4403704 4279997 4557234 4451860 4168427 4522163 4745674 4530946 4384795
15758 4384795 4472395 4433287 4531349 4455539 4192416 4473487 4482389 4440174 4696739 4552652 4537165
15747 4537165 4136244 3590421 4255571 4513557 4553169 4438461 4268269 4096603 4395698 4891332
15737 4891332 4661410 4606361 4789494 4755665 4860683 4392900 4338738 4306224 4591658 4570607
15727 4570607 4371645 4357501 4052140 4136496 4391524 4484087 4508510 4640552 4269814 3920194
15717 3920194 3975916 3792605 3912305 4302137 4256834 4577637 4535045 4017368 3989669 4016991
15707 4016991 4131088 4574037 4453571 4098244 4303193 4371344 4551398 4660233 4489129 4410067
15697 4410067 4551957 4472137 4527900 4756089 4533942 4274235 4126298 4367125 4456535 4341263
15687 4341263 4361114 4332233 4190207 4451141 4608247 4460765 4567130 4594492 4207421 4297657
15677 4297657 4125445 4290180 3965591 3862902 3989677 4320579 4331316 4321323 4688534 4499115
15667 4499115 4491113 4303638 4089238 4503762 4565184 4495806 4694364 4555927 4304906 4372658
15657 4372658 4387048 4505361 4611376 4495150 4184382 3977828 4207085 4107553 3986595 4018150
15647 4018150 3960071 4247555 4289762 3867434 4102167 3997186 3945288 4354159 4743086 4550839
15637 4550839 4384163 4212421 4633107 4682980 4246747 4334318 4468340 4337653 3838092 4109582
15627 4109582 4251313 4248256 4353938 4500079 4669961 4770904 4820436 4418076 4483508 4781399
15617 4781399 4620607 4705350 4774174 4473674 4680681 5029038 4771002 4527313 4583809 4670969
15607 4670969 4478937 4144772 4637671 4626989 4350343 4324340 4480553 4380481 4336680 4372520
15597 4372520 4538864 4485565 4214512 4368918 4541774 4156995 4002617 4125279 4173561 4192426
15587 4192426 4190444 3943884 4205833 4532919 4391298 3998387 4304762 4670599 4565916 4255545
15577 4255545 4076075 4443202 4680334 5081337 4738218 4490022 4798321 4559024 4443251
15568 4443251 4674069 4755095 5010311 4800269 4729618 4198293 3875575 4284578 4249547 4304835
15558 4304835 4430639 4480192 4353871 4536871 4571052 4524696 4777429 4494911 4746304 4938707
15548 4938707 4690970 4464232 4836271 4995839 4717926 4703737 4972489 4806613 4864755 4694514
15538 4694514 4708720 4666355 4807336 4577378 4944032 4881309 4593910 4735785 4537353 4667081
15528 4667081 4784726 4922836 4750392 4239924 4226242 4480346 4664729 4564607 4407048 4234774
15518 4234774 4134301 3991646 4287844 4846902 4360719 4448692 4417756 4703205 5169034 4482629
15508 4482629 4495367 4708226 4602130 4327770 4439540 4387975 4076568 4070689 4030023 4414699
15498 4414699 4512748 4650958 5117257 5064462 4804751 4533281 4181212 3971390 4027861 4149302
15488 4149302 4381256 4445449 4329052 4701639 4542663 4306389 4051238 4115670 4035142 4276352
15478 4276352 4486433 4788854 4522672 4249785 4352838 4621192 4315724 4591311 4936546
15469 4936546 4845702 4492007 4601167 4533042 4538613 4933111 4967674 4695449 4476350 4338113
15459 4338113 4404525 4270146 4470949 4498698 4313014 4795415 4720921 4646954 4502780 4781400
15449 4781400 4610881 4625415 4683465 4526477 4523812 4392442 4789732 4464197 4533176 4526819 4111652
15438 4111652 3957445 4302240 4310354 4483426 4540698 4689555 4985480 4835163 5011881 4999707
15428 4999707 4972877 5019547 5090712 5048824 4852529 4649512 5096221 4834494 4581360 4507950
15418 4507950 4474202 4756669 4816352 4809289 4514209 4359898 4314168 4035337 3918251 4289695
15408 4289695 4535925 4336773 4488263 4467935 4626502 4828966 4878117 4880273 4851438 4540460
15398 4540460 4687398 4408561 4861030 5187730 4690379 4612389 4585113 4688579 4919996 4728557
15388 4728557 5144415 5133031 5412021 4975121 4768895 4813290 4870237 4602984 4157635 4323041
15378 4323041 4323471 4314259 4569563 4578154 4362814 4338815 4069508 4063845 4246143 4420004 4677632
15367 4677632 4615886 4401888 4271798 4519445 4835221 4688789 4627589 4670182 4694997 4548140
15357 4548140 4629768 4312953 4186155 4148230 4173928 4186675 4297995 4212393 4333189 4676057
15347 4676057 4776108 4777898 4323760 4387253 4573818 4777990 5001104 4876606 4904898 4589445
15337 4589445 4674668 4322686 4455523 4644510 4680577 4811014 4769077 4706164 4832861 4820633
15327 4820633 4710637 4685359 4914214 4803340 5045742 5056687 4991619 5019455 5183536 5023283
15317 5023283 4567958 4592169 4428189 4337628 4524177 4598613 4460168 4374474 4319398 4371704
15307 4371704 4500308 4792949 4796381 4752538 4659863 4801021 5058314 5083638 4802808 4829924
15297 4829924 4663022 4084757 3996298 3978318 4069256 4284897 4355188 4443133 4623002 4736016
15287 4736016 4542407 4673434 4577456 4546692 4699255 4820262 5071558 5095304 4932846 4791557
15277 4791557 4851449 4451001 4353177 4098699 4336816 4652606 4409474 4198930 4518107 4769623
15267 4769623 4909351 5202487 4721599 4699287 4634119 4717328 4685986 4357235 4267906 4275657 4690075
15256 4690075 4497470 4672664 4541678 4508450 4461243 4140880 4429189 4343527 3963416 4516835
15246 4516835 5015973 5017657 4852734 4791801 4841087 4661633 4701768 4945728 5106315 4988530
15236 4988530 5164704 4963064 5229022 5052127 4812855 4543298 4697812 4456772 4407773 4278788
15226 4278788 4297330 4171095 4744580 4884495 4606208 4834843 4725089 4620778 4640126 4754122
15216 4754122 4506620 4654621 5147648 5281698 5032099 4536482 4502307 4639166 4624445 4775837
15206 4775837 4656454 4643757 4531471 4376703 4584786 4929708 5206297 5297624 4839100 4929707
15196 4929707 4958846 5367732 5091788 4933074 4880408 4522868 4750229 4679011 4591465 4846998
15186 4846998 4757471 4912310 4678781 4669466 4555561 4866175 4821509 4485930 4476053 4539384 5041542
15175 5041542 4684006 4333528 4129662 4483542 4762012 4625052 4805060 4915509 4656855
15166 4656855 4525120 4345517 4586791 4522952 4479084 4617390 4726803 4210337 4165159 4510072
15156 4510072 4669009 4807045 5235827 5184291 5136215 5386230 4735044 4925387 4933737 4809022
15146 4809022 4587088 4370970 4573083 4688026 4464144 4559010 4586235 4643529 4513135 4437340
15136 4437340 4910793 4975094 5065093 5472579 5099180 5000197 5030101 4754002 4615834 4436011
15126 4436011 4311441 4571825 4827665 4716970 4925789 5074127 5063821 5076737 5106329 5156237
15116 5156237 5154405 5014158 4709203 4606395 4712895 5041540 5081567 4876147 4812868 4767443
15106 4767443 4840830 4830574 4709003 4443546 4504604 4461025 4306122 4233503 4228497 4123061 4345749
15095 4345749 4280158 4428115 4442744 4518654 4327023 4686099 5178799 5280114 5181949 4906371
15085 4906371 4883856 4821700 5034373 5022148 4496092 4651419 4999200 4527212 4284109 4604063
15075 4604063 4413299 4448509 4636352 3995483 4362742 4701845 4912667 4895994 5026635 4828451
15065 4828451 4728247 4947773 4728964 5125525 5042722 5012711 4964072 4546587 4624476 4692569
15055 4692569 4739468 4391509 4389849 4559438 4496257 4386703 4373394 4229612 4455968 4556169
15045 4556169 4747104 4735539 4538224 4700094 4622959 4744375 4438728 4452015 4829457 4641328
15035 4641328 4585299 4813093 4855001 4617162 4753583 4845702 5034170 4852439 5019681 5155405
15025 5155405 4869296 4890538 4678963 4867207 4917410 4960522 5118287 4908883 4639962 4499089
15015 4499089 4146221 4190087 4176529 4400198 4425794 4677140 4941936 4657483 4956255 5064895
15005 5064895 4778086 4769459 5146456 5157656 5130774 5052249 4756254 4708070 4395677 4392471 4702417
14994 4702417 4880474 4808011 5094940 4992717 5088420 4985949 4581146 4187106 3998383 4211058
14984 4211058 4541705 4990097 4831217 4941124 4794827 4754556 4900339 4785255 4596061 4679523
14974 4679523 4907815 4842989 4211849 4180830 3911601 4453768 4719834 4576396 4523071 4418224
14964 4418224 4638168 4429889 4509725 4785363 4503568 4924700 4881345 4689579 4576541 4398191
14954 4398191 4812827 4217501 4597628 5002950 5184597 5255418 4685929 4304593 4208435 4480527
14944 4480527 4601208 4327656 4479807 4834162 5180164 5236326 5393568 5381013 5618682 5323863
14934 5323863 4910521 4716990 4885844 4756667 4434835 4214489 4666881 4722294 4458426 4577158
14924 4577158 4553621 4948904 5346025 5135876 5213277 5144364 5310324 5063618 4904747 4677037
14914 4677037 4691211 4745790 5005582 5562973 5259172 5227838 5202298 4724102 4265667 4482159
14904 4482159 4515602 4559608 4424850 4566540 4618786 4816155 4456831 4923514 4864585 4947589
14894 4947589 5023824 4960500 4883194 4967061 5062748 4823212 4802216 4815077 4653905 4924228 5114936
14883 5114936 4819137 4602378 4752321 5079263 4619974 4674301 4676400 4784355 4990986 5235274
14873 5235274 4915036 4356114 4472840 4789207 5084468 4738971 4498388 4767782 4817936 4625831
14863 4625831 4555800 4635645 4541554 4401680 4368006 4750772 4630959 4852134 4951215 4576499
14853 4576499 4806713 4752551 4658194 4633265 5092477 5217813 4864911 4449581 4633858 4485568
14843 4485568 4500693 4495039 4480172 4482020 4264590 4383987 4288415 4628231 4661122 4348619 4292022
14832 4292022 4504844 4860087 4634093 4899960 5141951 5082735 4725903 4420716 4971749 4932808
14822 4932808 4807048 4685126 4681330 4655959 4555149 4441722 4258017 4558111 4662920 4623113
14812 4623113 5013280 4881506 4637744 4606449 4679858 4743626 4650082 4776241 4821842 4873188
14802 4873188 4821659 4396490 4484860 4467528 4615092 4879970 4338971 4212217 4652772 4860221
14792 4860221 4795179 4596339 4698011 4999764 4912540 4852977 4855841 4917429 5025708 4974006 4905674
14781 4905674 4917883 5159256 4904247 4876675 4778120 4732452 4954595 4910522 4580266 4688475
14771 4688475 4903068 5255477 4922825 4647131 4639744 4557552 4694101 4675401 4845903 5146455
14761 5146455 4401078 4217433 5017925 4842132 4729890 4407693 4397575 4472795 4841945 4911800
14751 4911800 4342655 4218076 4654113 4933383 4874410 4899383 4914125 4926421 4895658 4857043
14741 4857043 4887760 5296227 5070477 4997568 4916775 4863804 4670931 4833620 5021870 5163798
14731 5163798 4958389 4590478 4862285 5208201 5118559 5024436 4913018 4435786 4605982 5018563
14721 5018563 5006687 4817650 4668373 4575791 4490623 4275474 4491908 4689334 4867576 4094188
14711 4094188 4170319 4579253 4557971 4443352 4734573 4920613 4793163 4467566 4613472 4475196
14701 4475196 4565693 4740905 4794777 4646215 4928824 4810276 4935879 4932047 4534717 4852608
14691 4852608 5160412 4973551 4715160 4846786 4626907 4782825 4965214 5069856 4852155
14682 4852155 4854500 4780051 4673263 4645710 4646008 4897441 4998987 4814148 4933962 4730583 4802159
14671 4802159 4817898 5073978 5174744 5290085 5295464 4853986 5147954 5060790 4772630 4969463
14661 4969463 4512876 4622377 4843592 4840544 4697916 4556558 4989662 5039578 4602898 4782356
14651 4782356 5308999 5222669 5298592 5227091 5106437 5086956 5227169 4996781 5093627 5205903
14641 5205903 5116889 5159725 5289290 5189004 4734073 4824007 4782450 4808983 4830416 4630128
14631 4630128 4745468 5071016 5193115 4808526 4445898 4713011 4759463 4953494 5045203 4711574
14621 4711574 5006268 4832427 4926325 5224325 5332237 5234623 5113315 4774547 4948430 4877313
14611 4877313 4761945 4787396 4641691 4706943 4554635 4745358 4886274 5065413 5022613 4772807
14601 4772807 4870311 4732357 4481648 4848071 5210193 5124726 4714492 4791559 4862320 4940046
14591 4940046 4781236 5265065 4835238 4609600 4733834 4866865 4769885 4832903 4770355 4888950
14581 4888950 4934370 4816804 5307231 5096794 4580299 4669517 5178968 5329583 5215623 5184705
14571 5184705 4757045 4459997 4706575 4926592 5241960 5136868 5167043 5204211 4936122 5024884
14561 5024884 5007414 5223852 5101719 5336641 5457336 5212282 5244449 5080887 4966428 5365331
14551 5365331 5216251 4951866 4987562 4610995 4828380 4705698 4651181 4900706 5046872 5056234
14541 5056234 5463862 5326708 5164566 5437910 5864875 5388673 5323875 5323740 4988231 5269180
14531 5269180 5235106 5259854 5077794 5296060 5398307 5453523 5116330 4779158 5009846 5181522
14521 5181522 5255313 4893946 4739739 4752769 5166443 5077069 5134553 5222841 5269774 5303180 5371865
14510 5371865 4863047 5176091 5317802 4927634 4720556 5074793 5188735 4993605 4931720 5083957
14500 5083957 5128314 4849549 4702961 4952484 4835534 4816704 4977591 5124175 5209832 5059143
14490 5059143 5051173 5209965 5107899 4752783 5277113 5407781 5510729 5468107 5042193 5002336
14480 5002336 5242574 5094303 4892451 5074419 4921777 4864059 5124000 5171268 5116152 5130327
14470 5130327 5069712 4955477 4991118 4910169 4985598 5053184 5188022 5175235 5152398 5286282 5318573
14459 5318573 5272953 5177518 4917182 4569650 4774757 4956104 5068326 4865859 4892143 5074895
14449 5074895 5216710 5007313 4786320 4922954 4611542 4953136 4828292 5067154 5035477 4753294
14439 4753294 4730744 4832757 4589552 4705940 5017961 4937859 4465925 4623147 4776596 4892285
14429 4892285 5060099 5112878 5081587 5135737 4964560 5060664 5107560 4897486 4945446 4963008 5099128
14418 5099128 5195346 5092536 5076632 4770801 4938412 4981026 4982932 4876335 4958198 4921474 4929094
14407 4929094 5086598 5295817 5389651 5114709 5115399 5189599 5164865 5124890 4765786 4900565 4564601
14396 4564601 4231132 4453213 4913124 4995881 4591517 4618879 4969677 4840449 4929850 4949277
14386 4949277 4689957 4754298 4719593 4946557 5222425 5176717 4908480 5179319 4901316 4820247
14376 4820247 4352191 4552910 4830125 4953848 4884651 5044061 4895095 4885582 4826161 4721494
14366 4721494 4800601 5096689 4969137 4836248 4596270 4817066 4755803 5039258 5120558 5250517
14356 5250517 4925659 4902839 5223203 5283725 5128300 4781518 4668477 4897006 5250338 4958355
14346 4958355 4919800 5379820 5116860 5188217 5409594 5314769 4801444 5160328 5430272 5331253
14336 5331253 4964321 5000081 5105019 4837316 4619101 4409099 5005649 4976752 4996585 5243504
14326 5243504 5111929 4628161 4988352 5059898 5009211 4766731 4870875 5045597 5123283 5556876
14316 5556876 5444819 5190659 4907531 4716232 4724733 4805612 4758197 4697659 4894659 5115110
14306 5115110 5338467 5021772 5169010 5042443 5054594 5053231 4887424 4921466 5384161 4993634
14296 4993634 4809358 4625548 4633237 5050685 4678180 4646001 4784072 4851372 5062852 5468281
14286 5468281 5406579 5351870 5442929 4872035 4878093 5098144 5272774 5589453 5848087 5679004
14276 5679004 5547700 5147968 5607269 5596756 5484872 5102918 4639389 4993025 5214755 4537654
14266 4537654 4359022 4591829 4653429 4840479 4832597 4944849 4878681 5191637 5309686 5275073
14256 5275073 5206701 5269179 5244114 5345226 5364755 5039505 4529897 4888977 5277761 5092123
14246 5092123 4714639 4663595 4779168 4647496 5140329 5453133 5554545 5486381 5823534 5694658
14236 5694658 5576442 5573591 5462246 5521454 5106958 5084977 4958106 5255017 4628905 4256893
14226 4256893 4800988 4786198 5021668 5187938 5162582 5124027 5351318 5164362 5373519 5422398
14216 5422398 5440628 5300628 5234260 4990077 5231334 5318775 5062122 4947619 4833854 5067110
14206 5067110 5272318 5410533 4836403 4730045 4666037 4959366 4887658 5153648 4822598 5120373
14196 5120373 5214225 5552903 5536945 5355653 5471684 5428353 5195020 5333561 5311633 5185681
14186 5185681 4912285 4530857 4566998 4915581 5092274 5031182 4783485 4817530 4901476 4945577
14176 4945577 4774860 4970638 5283731 5536613 5502239 5189222 5061115 5255373 5140550 5283438
14166 5283438 5701924 5513320 5351458 5020110 5091397 4848080 5155941 5208737 5179535 5073836
14156 5073836 4946100 5064566 5056945 4737256 4604753 4938675 4968180 4850713 5191855 5418216
14146 5418216 5232871 5101605 5143538 5183859 4788128 4778887 4896278 4407876 4604545 4820726
14136 4820726 4914833 5009589 5024022 5130083 5300328 5371163 5637354 5662083 5557745 5212431
14126 5212431 5178515 5116209 4970262 4808280 4680590 4324266 4550039 4890252 5046645 4871293
14116 4871293 4736663 4970924 5077936 5488053 5516073 5606045 5708849 5527343 5411012 5229149
14106 5229149 5108204 5019086 4906753 4728976 5006804 5365652 5408385 4665236 4579772 4622745
14096 4622745 5053060 5335777 5061699 4782683 4918133 5295731 5543905 5638535 5363400 5331262
14086 5331262 5290924 5139883 4972137 4855820 4831698 4897678 4832726 5140541 5002908 5001550
14076 5001550 5402404 5354073 4755759 5307239 5551673 5403037 4989363 4765135 4925910 5275438
14066 5275438 5121383 5221924 5795207 5494282 5105840 5231200 5629712 5131914 4867427
14057 4867427 5203048 5412410 5495805 5297606 5357364 5286396 4849706 5134796 5250992 5470200
14047 5470200 5558711 5369339 5201874 4998141 5285687 5519196 5642616 5421842 5433694 5129924
14037 5129924 5049795 5266249 5249308 5309112 5292343 5002535 4826282 4989027 5348756 5393579
14027 5393579 5605990 5600623 5459872 5125730 5037295 5134866 5018882 5271573 5481262 5131109
14017 5131109 4713361 4663034 4758849 5122569 5192366 5254219 5198380 5003309 4653572 5320622
14007 5320622 5703568 5400124 5005170 5102894 5347638 5432675 5595436 5554843 5273852 5491287
13997 5491287 5558444 5333939 5213027 5010124 5029258 4931979 4999659 4912973 4971258 5241070
13987 5241070 5487158 5156324 5555823 5771162 5263874 5450833 5564802 5223019 5195767 4963203
13977 4963203 5306744 5483916 5034629 5120846 4868299 4949907 5130666 5102010 5124465 5549436
13967 5549436 5318296 5317614 5113123 5040462 5497287 5242804 5255930 5202646 5195947 5150170 5092534
13956 5092534 4900295 4990423 4958132 4928320 5227409 5303947 5305492 5205501 4927344 4780504 4857290
13945 4857290 5223057 5522086 5228205 4964348 4841206 4919418 4952320 5261886 5523431 5447053
13935 5447053 5464078 5206167 5372010 5296168 5354253 5306499 5360152 5522690 5331647 5509827
13925 5509827 5493493 5307267 5300515 5650594 5804634 5529676 5470744 5476330 5628736 5704349 5365052
13914 5365052 5427857 5333713 5246768 5360417 5032732 4810606 5351193 5698605 5338959 5022005
13904 5022005 5074169 5366881 5292583 5206820 5333912 5360448 5272433 5132193 5272039 5384980
13894 5384980 5301318 5216245 5035014 5065520 4892342 4931264 4874314 5084250 4869059 5064529
13884 5064529 5372327 5291271 5026537 5050367 5240841 5427063 5322594 5250884 5814783 5638023
13874 5638023 5365277 5263758 5276536 5545419 5721548 5367935 5316412 5270561 5446241 5428389
13864 5428389 5601044 5456259 5143894 5231550 5012256 4803629 5436232 5643524 5610163 5717789
13854 5717789 5699087 5629416 5668699 5529521 5687661 5921679 5825376 5350148 5447225 5525118
13844 5525118 5275787 5168509 4983614 4944432 4911370 5117620 5206114 5339564 5246467 5131679
13834 5131679 5361376 5205574 5429759 5106552 4972180 5109088 5164289 5305227 5068214 4946422
13824 4946422 4988768 4550512 4551938 5012458 5325746 5026469 5006303 5274602 5055305 4930900
13814 4930900 5267495 5681241 5661084 5666491 5614925 5365115 5266083 5495208 5616610 5445367
13804 5445367 5168558 5298213 5044764 5157469 5351414 5127470 4983233 5043930 5051054 5447436
13794 5447436 5510641 5167475 5395341 5503064 5251551 5214247 5341398 5574060 5464839 5530518
13784 5530518 5282109 5183122 5266578 5282016 5106107 5319744 5210674 4984724 5521995 5657086
13774 5657086 5143649 5011140 5072241 5546502 5265349 5131012 5164754 5407792 5378074 5332880
13764 5332880 5049375 5095865 5128641 5052811 4820020 4875855 5147420 5176261 5323776 5164203
13754 5164203 5359600 5494691 5423719 5465371 5523358 5068298 5167413 5089556 5073293 5054427 5049328
13743 5049328 5252027 5425256 5645463 5665451 5633578 5599003 5624746 5648351 5683839 5624082 5548954
13732 5548954 5448126 5189767 5235316 5312820 5295903 5260167 5022502 5165993 5754393 5515393
13722 5515393 5282974 5314718 5472111 5472531 5491082 4963289 4789671 5025951 5187078 5666857
13712 5666857 5454802 5543081 5700210 5345835 5302433 5277334 5332715 5715467 5886251 5592540
13702 5592540 5572969 5700046 5899137 5616928 5117538 4855323 5077696 5157618 4953095 4885697
13692 4885697 5060917 5027386 5233414 5094851 5199602 5477277 5454263 5549745 5935643 5832823
13682 5832823 5734526 5837136 5473901 5362193 5791432 5791038 5834708 5593417 5177822 5295520
13672 5295520 5213804 5709099 5702390 5743083 5524848 5301095 5353749 5434001 5677123 5586537 5675940
13661 5675940 5762951 5628575 5614849 5589931 5431901 5367585 5514442 5506719 5080246 4993883 5000383
13650 5000383 5213604 5284984 5303784 5257294 5240563 5147402 5226145 5179450 5497278 5912727 5950043
13639 5950043 5767997 5684425 5500717 5394777 5471741 5101558 5471166 5398623 4956374 4898359
13629 4898359 5019313 5258220 5433219 5544415 5181235 5276357 5769599 5362451 5244099 5201716
13619 5201716 5486555 5518750 5429254 5497494 5604323 5479342 5465185 5309592 5209244 5008662
13609 5008662 5148800 5584996 5519044 5340689 5242607 5003113 5052184 5148730 5264738 5680953
13599 5680953 5832263 6051197 6087745 5516186 5322707 5398255 5102137 5181860 5017663 4928754
13589 4928754 5152520 5643017 5624147 5421683 5333661 5429749 5426278 5119973 5513263 5839447
13579 5839447 5920627 6023880 5885519 5699744 5966808 5281267 5506101 5726059 5382127 5442768
13569 5442768 5415805 5169682 5328856 5291130 5380596 5302409 5277602 5348644 5437967 5596686 5691248
13558 5691248 5396305 5487748 5758390 5545738 5870555 5728629 5775607 5589311 5267138 5341535
13548 5341535 5394818 5419211 5602738 5408557 5233053 5231155 5474030 5034595 5360740 5574265
13538 5574265 5562204 5680163 5825243 5914476 5696277 5603492 5799855 5846039 6031742 5577959
13528 5577959 5245488 5652313 5259753 5390660 5585677 5598459 5418397 5500489 5384905 5533525
13518 5533525 5920942 5762132 5967807 5732362 5542583 5379923 5693024 5827769 5648474
13509 5648474 5765678 5667950 5499920 5351660 5281476 5341441 5178849 5121202 5190841 5357970
13499 5357970 5478689 5525245 5746290 5795381 6038436 5868926 5874693 6132119 5953540 5803902
13489 5803902 5514837 5460961 5827683 5818874 5528001 5495563 5580927 5603071 5917845 5696617
13479 5696617 5469601 5671386 5649037 5881939 5986135 5826359 5661066 5571313 5393826 5715059
13469 5715059 5492935 5736972 5734466 5517644 5565932 5736693 5863579 5734138 5731509 5686482
13459 5686482 5500034 5484654 5293842 5367672 5511438 5550900 5675384 5630312 5678514 5513453
13449 5513453 5650390 5611596 5819805 5608191 5262676 5507637 5678953 5611963 5674688 5482488
13439 5482488 5344246 5436457 5409189 5392467 5766224 5220136 5749121 5636569 5231262 5354423
13429 5354423 5504572 5414215 5379577 5824643 5427533 5460869 5572957 5599500 5702193 5685828
13419 5685828 5428827 5467284 5714221 5580955 5146641 4863941 5629199 6107655 5988273 5872412
13409 5872412 5808551 5902288 5995966 5875897 5967685 5568705 5100747 5361758 5497290 5406045
13399 5406045 5410607 5638087 5961946 5563690 5370907 5348749 4895872 5000157 5052596 5223041
13389 5223041 5459418 5698356 5821015 5715624 5461619 5506921 5434267 5476335 5424023 5464761
13379 5464761 5575149 5634763 5639900 5889024 5714284 5199441 5515140 5241334 4880910 4987332
13369 4987332 5405767 5515973 5329694 5619591 5578302 5402184 5525100 5432509 5780839 5785754
13359 5785754 5612639 5715392 5470075 5348170 5672368 6142480 5871410 6007037 6082998 5770962
13349 5770962 5514450 5757713 5738866 5488785 5377203 5405650 5352544 5516363 5516264 5364657 4989528
13338 4989528 5217596 5074710 5251941 5942377 5840618 5661766 5362283 5364061 5595677 5908241
13328 5908241 6144299 5869092 5550659 5881407 5724963 5453624 5336792 5650319 5434332
13319 5434332 5326575 5549981 5654146 5707366 5427386 5730368 5990160 5902821 5674296 5644277
13309 5644277 5889121 5929251 5970503 5614091 5644225 5763286 6007824 5557908 5033395 5419442
13299 5419442 5166174 5133178 5347693 5287958 5740162 6014359 5478141 5966499 6064103 5800456
13289 5800456 6517496 6175448 5964875 5934332 5862054 5850221 5855722 5770507 5346744 5218236
13279 5218236 5246106 5183305 5356646 5339762 5341341 5492806 5550452 5818691 5559509 6092564
13269 6092564 6038798 5678407 5548026 5774434 5845371 5545675 5647028 5568429 5328987 5354919
13259 5354919 5331143 5358643 5577530 5505355 5676083 5222405 5335525 5529887 5563873 5751357
13249 5751357 5728196 5536694 5774124 5929973 5778547 5804697 5750815 5827594 5558845 5384239
13239 5384239 5399774 5343398 5671127 5564513 5135789 5313615 5241240 5487287 5745441 5935668
13229 5935668 5974267 5682610 5775351 5504860 5907205 5882323 5512776 5406855 5744667 5714505
13219 5714505 5561942 5687640 5352857 5314848 5363829 5660554 5580502 5747528 5615936 5666962
13209 5666962 6012821 6136765 5895365 6020478 5964325 5541531 5604044 5511091 5727207 5444191
13199 5444191 5298629 5421535 5852934 5710783 5321672 5461183 5663178 6018166 5861211
13190 5861211 6066573 6116561 5655098 5750133 5617481 6013976 6068814 6050235 5856729 5511457
$$ [...]
##END NTUPLES=NMR SPECTRUM
##END=
