##TITLE=1H_CG-1147-J1
 CDCl3, 8 sc, 
 29.06.2021
##JCAMPDX= 6.0         $$ Bruker NMR JCAMP-DX V2.0
##DATA TYPE= NMR SPECTRUM
##DATA CLASS= NTUPLES
##ORIGIN= UXNMR, Bruker Analytische Messtechnik GmbH
##OWNER= root
$$ XWIN-NMR		Version 3.5
$$ Tue Jun 29 11:16:24 2021 Russian Standard Time (UT+4h)  she@DPX200
##.OBSERVE FREQUENCY= 200.131506
##.OBSERVE NUCLEUS= ^1H
##.ACQUISITION MODE= SIMULTANEOUS
##.ACQUISITION SCHEME= undefined
##.AVERAGES= 8
##.DIGITISER RES= 18
##SPECTROMETER/DATA SYSTEM= spect
##.PULSE SEQUENCE= zg30
##.SOLVENT NAME= CDCl3
##.SHIFT REFERENCE= (INTERNAL, CDCl3, 0, 17.5044)
##AUDIT TRAIL= $$ (NUMBER, WHEN, WHO, WHERE, WHAT)
$$ ##TITLE= Audit trail, XWIN-NMR		Version 3.5
$$ ##JCAMPDX= 5.01
$$ ##ORIGIN= Bruker BioSpin GmbH
$$ ##OWNER= she
$$ F:/spectra/data/she/nmr/H-F/1/pdata/1/auditp.txt
$$ ##AUDIT TRAIL=  $$ (NUMBER, WHEN, WHO, WHERE, WHAT)
(   1,<2021-06-29 11:14:49.64 +0400>,<she>,<DPX200>,
      <created by zg, POWCHK disabled, PULCHK disabled
       configuration hash MD5:
       00 E9 B6 7A A2 85 ED C7 34 08 36 98 17 FE 4E 26
       data hash MD5: 16K
       B6 4D EC 8D B7 85 CB E6 2A 98 B9 53 C4 8B E8 C8>)
(   2,<2021-06-29 11:14:54.48 +0400>,<she>,<DPX200>,
      <Start of raw data processing
       efp BC_mod = 2 LB = 0.24 FT_mod = 6 PKNL = 1 PHC0 = -11922.08 PHC1 = 14.60101 SI = 16K 
       data hash MD5: 16K
       F0 BF 55 0F 4D 23 BD 6F 5F BE 7C AC 67 B0 4F 24>)
(   3,<2021-06-29 11:15:18.81 +0400>,<she>,<DPX200>,
      <pk PHC0 = 0.3464965 PHC1 = -0.8 
       data hash MD5: 16K
       50 FB 91 90 92 54 3A B0 17 AB DE F5 A3 7E 28 B9>)
(   4,<2021-06-29 11:15:22.09 +0400>,<she>,<DPX200>,
      <abs ABSG = 5 
       data hash MD5: 16K
       0D 99 E7 25 E0 BD DE 75 15 80 E0 80 9B F1 7C 6F>)
$$ ##END=
$$ 
$$ hash MD5
$$ 5B D4 69 F2 62 01 51 29 55 72 B0 34 AB 9E 65 85
##$RELAX= 
##$RELAX= 
##$RELAX= 
##$RELAX= 
##$RELAX= 
##$RELAX= 
$$ Bruker specific parameters
$$ --------------------------
##$DU= <F:/spectra>
##$EXPNO= 1
##$NAME= <H-F>
##$PROCNO= 1
##$TYPE= <nmr>
##$USER= <she>
##$AMP= (0..31)
100 100 100 100 100 100 100 100 100 100 100 100 100 100 100 100 100 100 
100 100 100 100 100 100 100 100 100 100 100 100 100 100 
##$AQSEQ= 0
##$AQ_mod= 1
##$AUNM= <au_zg>
##$AUTOPOS= <>
##$BF1= 200.13
##$BF2= 200.13
##$BF3= 200.13
##$BF4= 200.13
##$BF5= 200.13
##$BF6= 200.13
##$BF7= 200.13
##$BF8= 200.13
##$BYTORDA= 1
##$CFDGTYP= 0
##$CFRGTYP= 5
##$CHEMSTR= <none>
##$CNST= (0..31)
1 1 145 1 1 1 1 1 1 1 1 1 1 1 1 1 1 1 1 1 1 1 1 1 1 1 1 1 1 1 1 1 
##$CPDPRG= <>
##$CPDPRG1= <>
##$CPDPRG2= <>
##$CPDPRG3= <>
##$CPDPRG4= <mlev>
##$CPDPRG5= <mlev>
##$CPDPRG6= <mlev>
##$CPDPRG7= <mlev>
##$CPDPRG8= <mlev>
##$CPDPRGB= <>
##$CPDPRGT= <>
##$D= (0..31)
0 1.2 0 0 0 0 0 0 0 0.06 0 0.03 0 0 0 0 0.0002 0 0 0 0 0 0 0 0 0 0 0 0 
0 0 0 
##$DATE= 1624950889
##$DBL= (0..7)
120 120 120 120 120 120 120 120 
##$DBP= (0..7)
150 150 150 150 150 150 150 150 
##$DBP07= 0
##$DBPNAM0= <>
##$DBPNAM1= <>
##$DBPNAM2= <>
##$DBPNAM3= <>
##$DBPNAM4= <>
$$ [...]
##$SUBNAM3= <"">
##$SUBNAM4= <"">
##$SUBNAM5= <"">
##$SUBNAM6= <"">
##$SUBNAM7= <"">
##$SUBNAM8= <"">
##$SUBNAM9= <"">
##$SW= 20.0188882624521
##$SWIBOX= (0..15)
0 0 2 0 0 0 0 0 0 0 0 0 0 0 0 0 
##$SW_h= 4006.41025641026
##$TD= 16384
##$TD0= 1
##$TE= 0
##$TE2= 300
##$TE3= 300
##$TEG= 300
##$TL= (0..7)
0 120 120 120 120 120 120 120 
##$TP= (0..7)
150 150 150 150 150 150 150 150 
##$TP07= 0
##$TPNAME0= <>
##$TPNAME1= <>
##$TPNAME2= <>
##$TPNAME3= <>
##$TPNAME4= <>
##$TPNAME5= <>
##$TPNAME6= <>
##$TPNAME7= <>
##$TPOAL= (0..7)
0.5 0.5 0.5 0.5 0.5 0.5 0.5 0.5 
##$TPOFFS= (0..7)
0 0 0 0 0 0 0 0 
##$TUNHIN= 0
##$TUNHOUT= 0
##$TUNXOUT= 0
##$USERA1= <user>
##$USERA2= <user>
##$USERA3= <user>
##$USERA4= <user>
##$USERA5= <user>
##$V9= 5
##$VALIST= <valist>
##$VCLIST= <CCCCCCCCCCCCCCC>
##$VD= 0
##$VDLIST= <DDDDDDDDDDDDDDD>
##$VPLIST= <PPPPPPPPPPPPPPP>
##$VTLIST= <TTTTTTTTTTTTTTT>
##$WBST= 1024
##$WBSW= 4
##$XGAIN= (0..3)
0 0 0 0 
##$XL= 0
##$YL= 0
##$YMAX_a= 264803
##$YMIN_a= -419492
##$ZGOPTNS= <>
##$ZL1= 120
##$ZL2= 120
##$ZL3= 120
##$ZL4= 120
##$ABSF1= 17.52155
##$ABSF2= -2.49749
##$ABSG= 5
##$ABSL= 3
##$ALPHA= 0
##$AQORDER= 0
##$ASSFAC= 0
##$ASSFACI= 0
##$ASSFACX= 0
##$ASSWID= 0
##$AUNMP= <proc_1d>
##$AZFE= 0.1
##$AZFW= 0.1
##$BCFW= 0
##$BC_mod= 2
##$BYTORDP= 0
##$COROFFS= 0
##$CY= -3
##$DATMOD= 1
##$DC= 0
##$DFILT= <>
##$DTYPP= 0
##$F1P= 0
##$F2P= 0
##$FCOR= 1
##$FTSIZE= 16384
##$FT_mod= 6
##$GAMMA= 0
##$GB= 0
##$INTBC= 1
##$INTSCL= 1.334414e-10
##$ISEN= 128
##$LB= 0.24
##$LEV0= 0
##$LPBIN= 0
##$MAXI= 10000
##$MC2= 0
##$MEAN= 0
##$ME_mod= 0
##$MI= 1.114404
##$NCOEF= 0
##$NC_proc= -7
##$NLEV= 6
##$NOISF1= 3.799351
##$NOISF2= 2.8
##$NSP= 0
##$NTH_PI= 0
##$NZP= 0
##$OFFSET= 17.50444
##$PC= 1
##$PHC0= -11921.73
##$PHC1= 13.80101
##$PH_mod= 1
##$PKNL= yes
##$PPARMOD= 0
##$PSCAL= 0
##$PSIGN= 0
##$REVERSE= no
##$SF= 200.130006041737
##$SI= 16384
##$SIGF1= 3
##$SIGF2= 2
##$SINO= 5.538805
##$SIOLD= 16384
##$SREGLST= <1H.CDCl3>
##$SSB= 0
##$STSI= 16384
##$STSR= 0
##$SW_p= 4006.41025641026
##$SYMM= 0
##$S_DEV= 0
##$TDeff= 16384
##$TDoff= 0
##$TI= <>
##$TILT= no
##$TM1= 0
##$TM2= 0
##$TOPLEV= 0
##$USERP1= <user>
##$USERP2= <user>
##$USERP3= <user>
##$USERP4= <user>
##$USERP5= <user>
##$WDW= 1
##$XDIM= 16384
##$YMAX_p= 472504010
##$YMIN_p= -447517
$$ End of Bruker specific parameters
$$ ---------------------------------
##NTUPLES= NMR SPECTRUM
##VAR_NAME=  FREQUENCY,     SPECTRUM/REAL,   SPECTRUM/IMAG
##SYMBOL=    X,             R,               I
##VAR_TYPE=  INDEPENDENT,   DEPENDENT,       DEPENDENT
##VAR_FORM=  AFFN,          ASDF,            ASDF
##VAR_DIM=   16384,         16384,           16384
##UNITS=     HZ,            ARBITRARY UNITS, ARBITRARY UNITS
##FACTOR=    0.24454680195387, 1,            1
##FIRST=     3503.16374452065, 0,            0
##LAST=      -503.246511889608, 0,           0
##MIN=       -503.246511889608, -447517,     0
##MAX=       3503.16374452065, 472504010,    0
$$ Real data points
##PAGE= N=1
##DATA TABLE= (X++(R..R)), XYDATA
$$ [...]
5429A2673921j52339N4171j56003r7667L9996N5722j37815p7910O0038j1393m8022
$$ 12673921 12521582 12575753 12419750 12322083 12362079 12417801 12279986 12202076 12262114 12250721 12202699
5418A2202699o3860Q7981j35437j42989N4327q7322k0652l04056O3338j7138j24604
$$ 12202699 12138839 12226820 12091383 11948394 12002721 11915399 11894747 11590691 11654029 11636891 11512287
5407A1512287L1699K20733j26423k04780j39035J91962j20929j15370j14205k3507
$$ 11512287 11543986 11764719 11638296 11433516 11294481 11486443 11365514 11250144 11135939 11112432
5397A1112432K8496r8737k22379M5870j74850j9474l6872j31372K387R6211q9587
$$ 11112432 11140928 11042191 10819812 10865682 10690832 10671358 10634486 10503114 10505501 10601712 10512125
5386A0512125k25146l9950p32Q5320j59826k5158P5569j66761j69716n5283j09988
$$ 10512125 10286979 10247029 10246297 10331617 10171791 10146633 10222202 10055441 9885725 9830442 9720454
5375I720454P0334j14261M9617J6336j16254q8328J58246j39976J37981o3225
$$ 9720454 9790788 9676527 9726144 9742480 9626226 9537898 9696144 9556168 9694149 9630924
5365I630924L264k9332q913o2367M5554q9768m1273Q6627k05429O0801L9909j16900
$$ 9630924 9634188 9604856 9595943 9533576 9579130 9489362 9448089 9534716 9329287 9390088 9429997 9313097
5353I313097J43805J37320N9674n565q9155r7357L5808J77245L8873j38741R0040
$$ 9313097 9456902 9594222 9653896 9648331 9559176 9461819 9497627 9674872 9713745 9575004 9665044
5342I665044K1913o973Q4438l9944L0687O3619j17928J16736Q5239j10280J53023
$$ 9665044 9686957 9679984 9764422 9724478 9755165 9818784 9700856 9817592 9902831 9792551 9945574
5331I945574j01973j70330p3402o2179j04944l04616k66600P1021j22704p7751
$$ 9945574 9843601 9673271 9599869 9537690 9432746 9128130 8861530 8932551 8809847 8732096
5321H732096j82627j07611k2048j30419j52400J1324j50521J6800j1882r8438
$$ 8732096 8549469 8441858 8419810 8289391 8136991 8148315 7997794 8014594 8002712 7904274
5311G904274M5754o2055j1840k29593J98211R3675k03466P1886K90771j11784
$$ 7904274 7950028 7887973 7876133 7646540 7844751 7938426 7734960 7806846 8097617 7985833
5301G985833J07571k64493m5941L7549r4483q986j5707o0015j11616q0347q43
$$ 7985833 8093404 7828911 7782970 7820519 7726036 7717050 7701343 7641328 7529712 7449365 7448522
5290G448522J69740m0633J90456k4785j45266j88842n6937N9409o756j73003m9197
$$ 7448522 7618262 7577629 7768085 7743300 7598034 7409192 7352255 7411664 7404908 7231905 7182708
5279G182708q4785P8298o3027L2787P5886M6162n8994P1650L7070l6910k23675
$$ 7182708 7097923 7176221 7113194 7145981 7221867 7268029 7209035 7280685 7317755 7280845 7057170
5268G057170k5243o2854L3416P2258l51868p0756P4371p0505p4306R8120K8207
$$ 7057170 7031927 6969073 7002489 7074747 6722879 6652123 6726494 6655989 6581683 6679803 6708010
5257F708010J75738j975j55475L8044K524P1636q7918M8659j85143j42413K08082
$$ 6708010 6883748 6881773 6726298 6764342 6766866 6838502 6750584 6799243 6614100 6471687 6679769
5246F679769j63750K9012j9217L188j5933o6962O3791j75869J1445K36107l1380
$$ 6679769 6516019 6545031 6525814 6529002 6513069 6446107 6509898 6334029 6345474 6581581 6550201
5235F550201j04731j23645M7119n8513r3318J48645n6121j36619N1473j45827
$$ 6550201 6445470 6321825 6368944 6310431 6217113 6365758 6309637 6173018 6224491 6078664
5225F078664j63780K15199N5801j4608n4447k2641J32188k878R3529O0540m2065
$$ 6078664 5914884 6130083 6185884 6171276 6116829 6094188 6226376 6223498 6317027 6377567 6335502
5214F335502o897k6072p6621N062m9005K3770R6475J81888J47383o6079J62287
$$ 6335502 6328605 6302533 6225912 6230974 6181969 6205739 6302214 6484102 6631485 6565406 6727693
5203F727693O1154o7177K4421J17535L0939N084J8041J11881R5115j17646R0508
$$ 6727693 6788847 6721670 6746091 6863626 6894565 6899649 6917690 7029571 7124686 7007040 7097548
5192G097548q9372P4017J00660M7297J05009K76946L1728o5244J81156r8061m7434
$$ 7097548 7008176 7082193 7182853 7230150 7335159 7612105 7643833 7578589 7759745 7661684 7614250
5181G614250K21991K57384q778K9124j16194N9391N3688M0126J1818P800K66712
$$ 7614250 7836241 8093625 8084847 8113971 7997777 8057168 8110856 8150982 8162800 8170600 8437312
5170H437312M2270o5711J93706J51249J21645R5412P1908L19125J62669L17945
$$ 8437312 8479582 8413871 8607577 8758826 8880471 8975883 9047791 9366916 9529585 9847530
5160I847530L70927K75424J73363J75376K31773K78129J36646K54229M87061J52146
$$ 9847530 10218457 10493881 10667244 10842620 11074393 11352522 11489168 11743397 12230458 12382604
5150A2382604L9474K60276P8535J39098L5495J34349J57335j39687q9132J48723
$$ 12382604 12422078 12682354 12760889 12899987 12935482 13069831 13227166 13087479 12998347 13147070
5140A3147070J14208J92064L17663M82019M28870K82111M56218Q9874M84375O02754
$$ 13147070 13261278 13453342 13771005 14253024 14681894 14964005 15420223 15510097 15994472 16597226
5130A6597226N10182M01923K62001J87609Q5856P9761j0891q7939J03093K14038
$$ 16597226 17107408 17509331 17771332 17958941 18044797 18124558 18113667 18025728 18128821 18342859
5120A8342859L76997L92658K91423O22996M69513N05369P85340P40717P00771
$$ 18342859 18719856 19112514 19403937 20026933 20496446 21001815 21787155 22527872 23228643
5111B3228643N91759P09479P00436Q94010R58016M92232P01837N93595L37416
$$ 23228643 23820402 24529881 25230317 26124327 27082343 27574575 28276412 28870007 29207423
5102B9207423L05453O79217M96139L97502L71878L87625M77292O66116O65111
$$ 29207423 29512876 30192093 30688232 31085734 31457612 31845237 32322529 32988645 33653756
5093C3653756R72176J223915J469882J603026J943879K551660K536075L073167
$$ 33653756 34625932 35849847 37319729 38922755 40866634 43418294 45954369 49027536
5085D9027536L713807M019806M466056M898939N257732N932541O209466O571132
$$ 49027536 52741343 56761149 61227205 66126144 71383876 77316417 83525883 90097015
5077I0097015O643872N934446N519948M854272M087607K716600R33634j646911
$$ 90097015 96740887 102675333 108195281 113049553 117137160 119853760 120787394 119140483
5069A19140483l622942m750033n796904o295620o715661o495916o435113o135664
$$ 119140483 115517541 110767508 104970604 98674984 91959323 85463407 79028294 72892630
5061G2892630n707046m881700m499731l865406l639310k990380k525200k175055
$$ 72892630 67185584 62303884 57804153 53938747 50299437 47309057 44783857 42608802
5053D2608802j724327j285692j103831j044096q46821o93134r49953r87612m80357
$$ 42608802 40884475 39598783 38494952 37450856 36604035 35910901 34960948 33973336 33492979
5044C3492979j96372k69138l53439r94359j269809q12585l57204p27454o49418
$$ 33492979 33296607 33027469 32674030 31679671 30409862 29597277 29240073 28512619 27863201
5035B7863201n65640n59211m66038k90707P3063K3629K6459L9941J33000L36241
$$ 27863201 27297561 26738350 26272312 25981605 26054668 26078297 26104756 26144697 26277697 26613938
5025B6613938L50698L48206N71488Q19921P46352Q05319J072766J112877J327523
$$ 26613938 26964636 27312842 27884330 28704251 29450603 30255922 31328688 32441565 33769088
5016C3769088J528648J672831J549322J288543R99732J347803J748091J898719
$$ 33769088 35297736 36970567 38519889 39808432 40808164 42155967 43904058 45802777
5008D5802777K034842J677980R14352O32291L45884O78843R69758Q43552J126225
$$ 45802777 47837619 49515599 50429951 51062242 51408126 52086969 53056727 53900279 55026504
4999E5026504J168630R75381J257737J662007K146278K206996K233935K424476
$$ 55026504 56195134 57170515 58428252 60090259 62236537 64443533 66677468 69101944
4991F9101944K024230J452010J238160J486028J532996J673611J903925J133061
$$ 69101944 71126174 72578184 73816344 75302372 76835368 78508979 80412904 81545965
4983H1545965r6950j557989k278448k654408k347529k080816k018021k005056
$$ 81545965 81449015 79891026 77612578 74958170 72610641 70529825 68511804 66506748
4975F6506748j974228k298722j847222j888681j635320j225697j053707j020960
$$ 66506748 64532520 62233798 60386576 58497895 56862575 55636878 54583171 53562211
4967E3562211j151391j436900j413833j229364j007005o55670r55138j093180
$$ 53562211 52410820 50973920 49560087 48330723 47323718 46668048 45712910 44619730
4959D4619730k014671k357959k384698k017630j830480j806670j749978j639280
$$ 44619730 42605059 40247100 37862402 35844772 34014292 32207622 30457644 28818364
4951B8818364j464560j224563j251728j443343r96357q37354q92831o70152o71529
$$ 28818364 27353804 26129241 24877513 23434170 22437813 21600459 20707628 20037476 19365947
4942A9365947o06979n82358o60107n16167l99874l76334n12004k29132k82475
$$ 19365947 18758968 18176610 17516503 17000336 16600462 16224128 15712124 15482992 15200517
4933A5200517m12339m49434m04137j35650l84381l56566j04356k07109l31244
$$ 15200517 14788178 14338744 13934607 13798957 13414576 13058010 12953654 12746545 12415301
4924A2415301k42196k29580l68971k69153j33540k64521n2913k1106l90342j82850
$$ 12415301 12173105 11943525 11574554 11305401 11171861 10907340 10854427 10833321 10442979 10260129
4914A0260129O7904k59973j93896p2263m8167k61192j75076k00249k08353j23266
$$ 10260129 10328033 10068060 9874164 9801901 9753734 9492542 9317466 9117217 8908864 8785598
4904H785598k22027j99181m162j18498k81048k36651r1245m502k24302l4501N9068
$$ 8785598 8563571 8364390 8360228 8241730 7960682 7724031 7632786 7628284 7403982 7369481 7428549
4893G428549j33235j04443O5937o0213l00958P5236K03365k26098j71686j27677
$$ 7428549 7295314 7190871 7256808 7196595 6895637 6970873 7174238 6948140 6776454 6648777
4883F648777Q2712j0492R4792J50469n1301o036J08202j9567l8900o6596N3016
$$ 6648777 6731489 6720997 6815789 6966258 6914957 6908921 7017123 6997556 6958656 6892060 6945076
4872F945076M2838J3403K25727N8620J44325Q7662p8450K29863J09650q7668J14745
$$ 6945076 6987914 7001317 7227044 7285664 7429989 7517651 7439201 7669064 7778714 7691046 7805791
4861G805791K62520M09032L85001L02677O40838O49872Q18364R62616R99121J191908
$$ 7805791 8068311 8477343 8862344 9165021 9805859 10455731 11274095 12236711 13235832 14427740
4851A4427740O89100K84228K36591N86684P49537J178746J253978Q39681j463518
$$ 14427740 15116840 15401068 15637659 16224343 16973880 18152626 19406604 20246285 18782767
4842A8782767j860563j119871r94562k50912n55634q19040r59635q81440n14361
$$ 18782767 16922204 15802333 14807771 14556859 14001225 13182185 12222550 11341110 10826749
4833A0826749m58331n83600l83894k82156k59011l88967j21628k17173k09348
$$ 10826749 10368418 9784818 9400924 9118768 8859757 8470790 8349162 8131989 7922641
4824G922641j68461k19534q6206j30242r0367o2557j43495j58802J07130j12295
$$ 7922641 7754180 7534646 7448440 7318198 7227831 7165274 7021779 6862977 6970107 6857812
4814F857812j5510o1464l8892K2632L3612M4960j17727j85571K24224J2153p172
$$ 6857812 6842302 6780838 6741946 6764578 6798190 6843150 6725423 6539852 6764076 6776229 6769057
4803F769057o4170j7107O6488J0440r0431j78781r4270j08140j0511l8145o4981
$$ 6769057 6704887 6687780 6754268 6764708 6674277 6495496 6401226 6293086 6282575 6244430 6179449
4792F179449K9054j08823Q6919j86257j70448k8837j40526j17141M2866K20220
$$ 6179449 6208503 6099680 6186599 6000342 5829894 5801057 5660531 5543390 5586256 5806476
4782E806476n0694j02483j00941R7891j3964k54645o4051R540j6909O7271j66070
$$ 5806476 5755782 5653299 5552358 5650249 5636285 5381640 5317589 5327129 5310220 5377491 5211421
4771E211421l6011j7906N4327k75946l013p9739K6162j12485Q0650q710j49179
$$ 5211421 5175410 5157504 5211831 4935885 4932872 4853133 4879295 4766810 4847460 4838750 4689571
4760D689571j2273R1950J43843K3597j10346n0203l1150j58467j07918j7697N6834
$$ 4689571 4677298 4769248 4913091 4936688 4826342 4776139 4744989 4586522 4478604 4460907 4517741
4749D517741k1070j113k920p4246J8138k51774o4800J11590j52815J99231j5418
$$ 4517741 4496671 4495558 4492638 4418392 4436530 4184756 4119956 4231546 4078731 4277962 4262544
4738D262544j67326j42542p060M7673R0063J55898j13407l9272O4401N7240K0478
$$ 4262544 4095218 3952676 3945616 3993289 4083352 4239250 4125843 4086571 4150972 4208212 4228690
4727D228690L8925q127j49376o798J45264r4484J81227j65825R9227R2147n4262
$$ 4228690 4267615 4259488 4110112 4103314 4248578 4154094 4335321 4169496 4268723 4360870 4306608
4716D306608m7039J0452J52687r5143o8035N439O0589o7450K39738o6767R8566
$$ 4306608 4259569 4270021 4422708 4327565 4259530 4264969 4325558 4258108 4497846 4431079 4529645
4705D529645r7306n2422J8819j21064J59431J70697k00753q573J26171J06216
$$ 4529645 4432339 4379917 4398736 4277672 4437103 4607800 4407047 4398474 4524645 4630861
4695D630861Q2185j371J23213l2874p2907o1516R2133k5934k3093K3755J43885
$$ 4630861 4713046 4711675 4834888 4802014 4729107 4667591 4759724 4733790 4710697 4734452 4878337
4684D878337r6533k54645M1817K5849M357O41J39399j4521j40564k2891l8296
$$ 4878337 4781804 4527159 4568976 4594825 4599182 4599823 4739222 4724701 4584137 4561246 4522950
4673D522950k9167q6008K6150l0007L0923L5533j3755o227Q0305k70088j05760
$$ 4522950 4493783 4407775 4433925 4403918 4434841 4470374 4456619 4450392 4530697 4260609 4154849
4662D154849L79268L7154j74955q7224N2987j29956N9655q2262n2845K72377j28272
$$ 4154849 4534117 4571271 4396316 4309092 4362079 4232123 4291778 4209516 4156671 4429048 4300776
4651D300776j91537J01229j21707L094K4320m626j1740M9831P325l7764k9385
$$ 4300776 4109239 4210468 4088761 4091855 4116175 4111549 4099809 4149640 4156965 4119201 4089816
4640D089816o3477J1763p0204J0164O6723k2665j4477j87887K40844J78218Q8004
$$ 4089816 4026339 4038102 3967898 3978062 4044785 4022120 4007643 3819756 4060600 4238818 4326822
4629D326822k62755k2424J22212J20092j0055k25954M6779K4279j85205J42697
$$ 4326822 4064067 4041643 4163855 4283947 4273892 4047938 4094717 4118996 3933791 4076488
4619D076488k0355J23216J16900r8920j32148j62630J86404q4803J9854Q433k445
$$ 4076488 4056133 4179349 4296249 4197329 4065181 3902551 4088955 4004152 4024006 4032439 4029994
4608D029994R1172L4141r2491K29816n4050j7130m0044O4534K03786J6638q5618
$$ 4029994 4121166 4155307 4062816 4292632 4238582 4221452 4181408 4245942 4449728 4466366 4380748
4597D380748J25482k71767p8229R8770L1501J33880N6314l3112N5719j22822Q7430
$$ 4380748 4506230 4234463 4156234 4255004 4286505 4420385 4476699 4443587 4499306 4376484 4463914
4586D463914Q5651q9274J58078j45591k5070r9922L30364K7365M8798J48602J15157
$$ 4463914 4549565 4460291 4618369 4472778 4447708 4347786 4678150 4705515 4754313 4902915 5018072
4575E018072o5081N9649q3648L9290n1157J92886O8138j87504R2540l7864L8702
$$ 5018072 4952991 5012640 4928992 4968282 4917125 5110011 5178149 4990645 5083185 5045321 5084023
4564E084023q6612J93042R0288q9339K84061K37960r861J06150r7862K9330J15517
$$ 5084023 4997411 5190453 5280741 5191402 5475463 5713423 5703562 5809712 5711850 5741180 5856697
4553E856697J08293O2989R2284m6187J60193L4725Q7842O628m4449Q9966N431
$$ 5856697 5964990 6027979 6120263 6074076 6234269 6268994 6356836 6363464 6319015 6408981 6414412
4542F414412L5495M9620J84846J11048J431Q3784l1368J41218j22228p793N3541
$$ 6414412 6449907 6499527 6684373 6795421 6796852 6880636 6849268 6990486 6868258 6860465 6914006
4531F914006J35973M0828J88689K3316M842P9326J77763L0704J1982J01252J27409
$$ 6914006 7049979 7090807 7279496 7302812 7307654 7386980 7564743 7595447 7607429 7708681 7836090
4520G836090J83451L01701Q3252m8704J55542P2938K47108J7639K07547j3159
$$ 7836090 8019541 8321242 8404494 8355790 8511332 8584270 8831378 8849017 9056564 9043405
4510I043405k33398N0393K39229J10418P472J81548Q7299l1587j4651J57361L06233
$$ 9043405 8810007 8860400 9099629 9210047 9217519 9399067 9486366 9454779 9440128 9597489 9903722
4499I903722o1610K54275K49843J03780P8902K41126L58306K86674K74980L28612
$$ 9903722 9842112 10096387 10346230 10450010 10528912 10770038 11128344 11415018 11689998 12018610
4489A2018610K38864J52262M00923K91754K57675M11133R7370L81450M50815K24373
$$ 12018610 12257474 12409736 12810659 13102413 13360088 13771221 13868591 14250041 14700856 14925229
4479A4925229M11444L06929J80751J56391K56279K25278L77565L32054J83301
$$ 14925229 15336673 15643602 15824353 15980744 16237023 16462301 16839866 17171920 17355221
4470A7355221L47066N08725L12791K23180M68217O11255K66182N45009M47811
$$ 17355221 17702287 18211012 18523803 18746983 19215200 19826455 20092637 20637646 21085457
4461B1085457K96753M08022O87346O78036N38637O32685O60250P96793O56502
$$ 21085457 21382210 21790232 22477578 23155614 23694251 24326936 24987186 25783979 26440481
4452B6440481J096241R62561J164679J051201J155701J265747J242044J415672
$$ 26440481 27536722 28499283 29663962 30715163 31870864 33136611 34378655 35794327
4444C5794327J465991J653618J692490J586753J863059K150172K461863K868426
$$ 35794327 37260318 38913936 40606426 42193179 44056238 46206410 48668273 51536699
4436E1536699L016316L231153L824403M368140M779226N009908N507484O232450
$$ 51536699 54553015 57784168 61608571 65976711 70755937 75765845 81273329 87505779
4428H7505779O709605P186614P706098Q184927Q474642R033664R445828R648107
$$ 87505779 94215384 101401998 109108096 117293023 125767665 134801329 144247157 153895264
4420A53895264R571874Q890080P859453O665889N025100L272416P19990k428455
$$ 153895264 163467138 172357218 180216671 186882560 191907660 195180076 195900066 193471611
4412A93471611m658456o775362q169218r356194r633930j0074845j0293228j0129790
$$ 193471611 188813155 182037793 173868575 164512381 154878451 144803606 134510378 124380588
4404A24380588r968556r183564q467210p506696o675572n935201n182104m465365
$$ 124380588 114412032 105228468 96761258 89254562 82578990 76643789 71461685 66996320
4396F6996320m000178l751099l336001k666759k466530k522839j936597j822395
$$ 66996320 62996142 59245043 55909042 53242283 50775753 48252914 46316317 44493922
4388D4493922j769462j525959j597666j438828j273889j219075j292905j219124
$$ 44493922 42724460 41198501 39600835 38162007 36888118 35669043 34376138 33157014
4380C3157014j118644q99402j012549q08410q95662p69488o91612q06816o37679
$$ 33157014 32038370 31138968 30126419 29318009 28422347 27652859 26961247 26154431 25516752
4371B5516752n34879n57668p05976n37319o59771m06332o33334q34599l91667
$$ 25516752 24981873 24424205 23718229 23180910 22521139 22114807 21481473 20646874 20255207
4362B0255207m05837n76712m92518m09766l56769l11214l06725l30702m11501
$$ 20255207 19849370 19272658 18780140 18370374 18013605 17702391 17395666 17064964 16653463
4353A6653463n5738k54435p4741k89799l66117k40475j34289n4814m10011k21887
$$ 16653463 16597725 16343290 16268549 15978750 15612633 15372158 15237869 15183055 14773044 14551157
4343A4551157j46584k8396K159k77925k02813j08760k33847O6109l1375k01506
$$ 14551157 14404573 14376177 14378336 14100411 13897598 13788838 13554991 13621100 13589725 13388219
4333A3388219K0025j2441O7911j43258r0614j69306k05239o8956J82064l83421
$$ 13388219 13408244 13395803 13463714 13320456 13229842 13060536 12855297 12786341 12968405 12584984
4323A2584984l26689k24614k49969M8692j91242m412j26607j21323P5270l29516
$$ 12584984 12258295 12033681 11783712 11832404 11641162 11636750 11510143 11388820 11464090 11134574
4313A1134574K0835j06079j45419P153k0397j42676k23177R5749J19701j20653
$$ 11134574 11155409 11049330 10903911 10911064 10890667 10747991 10524814 10620563 10740264 10619611
4303A0619611m8513R2100L6725j12647J42366K54657J6826j23824P8111N1268
$$ 10619611 10571098 10663198 10699923 10587276 10729642 10984299 11001125 10877301 10955412 11006680
4293A1006680k59887l0599l8172K14581j39876j89988l60060J23123R6958J08467
$$ 11006680 10746793 10716194 10678022 10892603 10752727 10562739 10202679 10325802 10422760 10531227
4283A0531227J42050o0039j02468m4064M1959q0567K2392j64802l4921l6035j2020
$$ 10531227 10673277 10613238 10510770 10466706 10508665 10428098 10450490 10285688 10250767 10214732 10202712
4272A0202712q4081m0119m2983J20656J16141k46748N328K16445j08233j49750
$$ 10202712 10118631 10078512 10035529 10156185 10272326 10025578 10030906 10247351 10139118 9989368
4262I989368J63239L6917J80173J3214j561m036J86173p1373J28522M863J60803
$$ 9989368 10152607 10189524 10369697 10382911 10381350 10377314 10563487 10492114 10620636 10625499 10786302
4251A0786302J54028M9565K80016N3861o5047O612N0063J07590J99058Q0091K26312
$$ 10786302 10940330 10989895 11269911 11323772 11258725 11265337 11315400 11422990 11622048 11702139 11928451
4240A1928451J31714J23346J12932L2409J17123J31284M0285K23473K8453O1273
$$ 11928451 12060165 12183511 12296443 12328852 12445975 12577259 12617544 12841017 12869470 12930743
4230A2930743K60682q8400K63480L27683M1142J72295J60261J64925M7896Q1801
$$ 12930743 13191425 13103025 13366505 13694188 13735330 13907625 14067886 14232811 14280707 14362508
4220A4362508K83196M49249K00410K3975J53970P1451K35761K60479Q3489M4830
$$ 14362508 14645704 15094953 15295363 15319338 15473308 15544759 15780520 16040999 16124488 16169318
4210A6169318J94299M35694L7218J69820J00716K34075N32687L67113K98416K30092
$$ 16169318 16363617 16799311 16836529 17006349 17107065 17341140 17873827 18240940 18539356 18769448
4200A8769448M11862N46100M43667O13542M60931O12768O69920N82000O81555
$$ 18769448 19181310 19727410 20171077 20784619 21245550 21858318 22528238 23110238 23791793
4191B3791793N19781P20045Q16727P12836R83167Q70772J081699J299777J157086
$$ 23791793 24311574 25031619 25848346 26561182 27544349 28415121 29496820 30796597 31953683
4182C1953683J214942J309130J678634J998002J709592J786721J792624K061883
$$ 31953683 33168625 34477755 36156389 38154391 39863983 41650704 43443328 45505211
4174D5505211K277244K683157L192665L634661M063763M925500N522108O183658
$$ 45505211 47782455 50465612 53658277 57292938 61356701 66282201 71804309 77987967
4166G7987967P131576Q160682R112306J0104383J1378348J2591249J3899173J4865820
$$ 77987967 85119543 93280225 102392531 112496914 123875262 136466511 150365684 165231504
4158A65231504J4719301J3636565J2749829R555086K594955o313933j3200200
$$ 165231504 179950805 193587370 206337199 215892285 218487240 212173307 198973107
4151A98973107j7184747j8134899j7231765j5573103j3161676j1283877r614849
$$ 198973107 181788360 163653461 146421696 130848593 117686917 106403040 96788191
4144I6788191p969076o496452n645537m508181l807985l400707k987312k615950
$$ 96788191 88819115 82322663 76677126 72168945 68360960 64960253 61972941 59356991
4136E9356991k076728k101539j800300j883660j570433j334171j083994j172588
$$ 59356991 57280263 55178724 53378424 51494764 49924331 48590160 47506166 46333578
4128D6333578r69839q53206m98856m30401o48260m89602k16851n5096o6050j80314
$$ 46333578 45363739 44510533 44011677 43581276 42933016 42443414 42226563 42171467 42105417 41925103
4118D1925103J77187J20805K22107L61835L54682M54593P8457L15045N22440K41849
$$ 41925103 42102290 42223095 42445202 42807037 43161719 43616312 43694769 44009814 44532254 44774103
4108D4774103L08314J55661K83311P9838O9070J89560L92179K98328L28173K83349
$$ 44774103 45082417 45238078 45521389 45601227 45670297 45859857 46252036 46550364 46878537 47161886
4098D7161886K01982O90560O64990Q05339P54940R56097R22368J310791J428496
$$ 47161886 47363868 48054428 48719418 49524757 50279697 51235794 52158162 53468953 54897449
4089E4897449J701410J959008K229272K424332K701441K974372K944953K964405
$$ 54897449 56598859 58557867 60787139 63211471 65912912 68887284 71832237 74796642
4081G4796642K859019K555337K112103J278214K82144l87874n30138n05761m87665
$$ 74796642 77655661 80210998 82323101 83601315 83883459 83495585 82965447 82459686 81972021
4072H1972021q0292J65373O40275J219616J311269J677659K132188K559768L193722
$$ 81972021 81891729 82057102 82697377 83916993 85228262 86905921 89038109 91597877 94791599
4063I4791599L921122M421250N451123O143326O692789P859511Q856402R384458
$$ 94791599 98712721 103133971 108585094 114728420 121421209 129280720 138137122 147521580
4055A47521580R809063R916402R443116Q476751O920282N667696M675241M836044
$$ 147521580 157330643 167247045 176690161 185166912 192087194 197754890 202430131 207266175
4047B07266175N829423P836018J0393412J2117602J3599138J3027617J0202616
$$ 207266175 213095598 220931616 231325028 243442630 257041768 270069385 280272001
4040B80272001N566459j291012q444899j4320396j8591486k1034607k0707128
$$ 280272001 285838460 284547448 276102549 261782153 243190667 222156060 201448932
4033B01448932j8542332j6103868j2926095j0193523q210112o765655n187830
$$ 201448932 182906600 166802732 153876637 143683114 135473002 128707347 123519517
4026A23519517m551811m121787l959582m008526m567628m616248m601253m650576
$$ 123519517 118967706 114845919 110886337 106877811 102310183 97693935 93092682 88442106
4018H8442106m090937l420230k951062k588507j970613j559634j222290j008864
$$ 88442106 84351169 80930939 77979877 75391370 73420757 71861123 70638833 69629969
4010F9629969r19212n01736l07411o45352j074207j665562j968053k247159j921121
$$ 69629969 68710757 68209021 67901610 67256258 66182051 64516489 62548436 60301277 58380156
4001E8380156j901155j817865j576386j536990j686119j702223j661066j472522
$$ 58380156 56479001 54661136 53084750 51547760 49861641 48159418 46498352 45025830
3993D5025830j490754j245739j274297j230045r92238r66526r89336q37022q94782
$$ 45025830 43535076 42289337 41015040 39784995 38792757 37826231 36836895 35999873 35105091
3984C5105091p96545r46876q03437j104614q68121n33120p83529p37491r48574
$$ 35105091 34308546 33361670 32558233 31453619 30585498 30052378 29268849 28531358 27582784
3975B7582784p10818o83796l86312m64835o47694n14854m50404k17489n05938
$$ 27582784 26871966 26188170 25801858 25337023 24689329 24174475 23724071 23506582 23000644
3966B3000644l45940l9l38690j73841k86360k46751j21536k37697r0149j03678
$$ 23000644 22654704 22654665 22315975 22142134 21855774 21609023 21487487 21249790 21159641 21055963
3956B1055963n15213l15849j92858j09234q8722k43164k74022k19877j36558k24148
$$ 21055963 20540750 20224901 20032043 19922809 19834087 19590923 19316901 19097024 18960466 18736318
3946A8736318j37197k11523j27493l52099O2478n9827o4113J24892N3652J68041
$$ 18736318 18599121 18387598 18260105 17908006 17970484 17910657 17846544 17971436 18025088 18193129
3936A8193129J59232j30111J06687J53433P6058J78280J15002r5649J77195J87208
$$ 18193129 18352361 18222250 18328937 18482370 18558428 18736708 18851710 18756061 18933256 19120464
3926A9120464O1996J2088P8700L58181l9244L05956N41545K05209L91085L33785
$$ 19120464 19182460 19194548 19273248 19631429 19592185 19898141 20439686 20644895 21035980 21369765
3916B1369765J3169K59299J05788J8739J05819K51832J11520J14969J87955K30755
$$ 21369765 21382934 21642233 21748021 21766760 21872579 22124411 22235931 22350900 22538855 22769610
3906B2769610M04989M68120M58967O77709P50736Q08995N04630O08080N42084
$$ 22769610 23174599 23642719 24101686 24779395 25530131 26339126 26843756 27451836 27993920
3897B7993920K21901m0839k99449o33350p26285j079364r77426p72934o86399
$$ 27993920 28215821 28174982 27875533 27242183 26515898 25436534 24459108 23686174 22999775
3888B2999775k21519l52582l29899j37265p0786K87307M33270M87008O10712O99337
$$ 22999775 22778256 22425674 22095775 21958510 21887724 22175031 22608301 23095309 23706021 24405358
3878B4405358N62985N04809j1038p91718q51930j339871j397714j202265j145226
$$ 24405358 24968343 25473152 25462114 24670396 23818466 22478595 21080881 19878616 18733390
3869A8733390j200645o35378p42078n30670m87847n93877l01482j86313k67093
$$ 18733390 17532745 16897367 16155289 15624619 15136772 14542895 14241413 14055100 13788007
3860A3788007l79579k29651j84651j90385j79670k46804r6690j36283k09697k2500
$$ 13788007 13408428 13178777 12994126 12803741 12624071 12377267 12280577 12144294 11934597 11912097
3850A1912097j00604p5129j97928j5803o6633M9879j31314j70495O0063j3429
$$ 11912097 11811493 11736364 11538436 11522633 11456000 11505879 11374565 11204070 11264133 11250704
3840A1250704Q0182k40133J9884O7717q7030M6793j20422P8196m7911J77631K7400
$$ 11250704 11330886 11090753 11110637 11178354 11091324 11138117 11017695 11095891 11047980 11225611 11253011
3829A1253011p7671M6157J11925k9815J1993M9833P9775Q3021M770J51498L1760
$$ 11253011 11175340 11221497 11333422 11303607 11315600 11365433 11445208 11528229 11532999 11684497 11716257
3818A1716257M7074J91954N6943J16277N0394n9566j33570O5155J59907L19235
$$ 11716257 11763331 11955285 12012228 12128505 12178899 12119333 11985763 12050918 12210825 12530060
3808A2530060L37375L962o5355K87793K88520R3515K01493M86713M61831P5384
$$ 12530060 12867435 12871397 12806042 13093835 13382355 13475870 13677363 14164076 14625907 14701291
3798A4701291M10621L30616N0635J40401M03548K70180K80599J9595Q1984J729
$$ 14701291 15111912 15442528 15493163 15633564 16037112 16307292 16587891 16607486 16689470 16691199
3788A6691199J51164J65151J37219J04371K89974L22410K44738L80098J88642
$$ 16691199 16842363 17007514 17144733 17249104 17539078 17861488 18106226 18486324 18674966
3779A8674966P4690L27364K19313J16830L94051K97266M26106K22875L77632J82793
$$ 18674966 18749656 19077020 19296333 19413163 19807214 20104480 20530586 20753461 21131093 21313886
3769B1313886L56667P10972P10881P96891Q24525P44240Q59194Q21519O07936
$$ 21313886 21670553 22381525 23092406 23889297 24713822 25458062 26317256 27138775 27746711
3760B7746711O92630L83108L49715P75487P37105Q47734Q93225J146297J344148
$$ 27746711 28439341 28822449 29172164 29947651 30684756 31532490 32425715 33572012 34916160
3751C4916160J044819J148415J021763O90399L26230K51534J32744k0360J10676
$$ 34916160 35960979 37109394 38131157 38821556 39147786 39399320 39532064 39511704 39622380
3742C9622380K88316P29060J091946P92473R20167R97495N26647Q8200m51294
$$ 39622380 39910696 40639756 41731702 42524175 43444342 44441837 44968484 45056684 44605390
3733D4605390o86276j064602q49508p52355q06827l67678j60965j98418k08478
$$ 44605390 43919114 42854512 42005004 41252649 40445822 40078144 39917179 39718761 39510283
3724C9510283j72836l23484o24843r98202j194222j480753j319932j276787j007488
$$ 39510283 39337447 39013963 38389120 37390918 36196696 34715943 33396011 32119224 31111736
3715C1111736r97501r12615o78315n51596p99336o42937q34907p09916p76895
$$ 31111736 30114235 29201620 28523305 27971709 27172373 26529436 25694529 24984613 24207718
3706B4207718j108013j149821q88971p71192q82698p15571m79864m96977o03976
$$ 24207718 23099705 21949884 21060913 20289721 19407023 18691452 18211588 17714611 17110635
3697A7110635l03149m44721o07953n48572l56001m04523l42479n59097k91549
$$ 17110635 16807486 16362765 15754812 15206240 14850239 14445716 14103237 13544140 13252591
3688A3252591l90464m11612m32939k04282j24302l47591k64980j40257p4724k25281
$$ 13252591 12862127 12450515 12017576 11813294 11688992 11341401 11076421 10936164 10861440 10636159
3678A0636159p2186j41649l12764k54611k17340J89188j85261j48683j69957k72518
$$ 10636159 10563973 10422324 10109560 9854949 9637609 9826797 9641536 9492853 9322896 9050378
3668I050378p0805N6852q9095k08249P7633j77417k23938l1638J57470j30759
$$ 9050378 8979573 9036425 8947330 8739081 8816714 8639297 8415359 8383721 8541191 8410432
3658H410432o1654k1088n7164q3644q5288R9563L0240J06806p5101q5965k0859
$$ 8410432 8348778 8327690 8270526 8186882 8101594 8201157 8231397 8338203 8263102 8177137 8156278
3647H156278j01576n2043K9294R686n61l7084Q3284o308p3046k6084R337J37221
$$ 8156278 8054702 8002659 8031953 8041639 8041078 8003994 8087278 8080970 8007924 7981840 7991177 8128398
3635H128398Q613R372m0419O1379J3921j082L2278n0528k02827k8800J16150p2950
$$ 8128398 8137011 8146383 8105964 8167343 8181264 8180182 8212460 8161932 7959105 7930305 8046455 7973505
3623G973505M2949j04117M9710J7281j65312q6372N244l8297L5477N0979l0708
$$ 7973505 8016454 7912337 7962047 7979328 7814016 7727644 7732888 7694591 7730068 7781047 7750339
3612G750339k02328J38960q5022m1141J53445J87764J91444J1532j7118L4992
$$ 7750339 7548011 7686971 7601949 7560808 7714253 7902017 8093461 8104993 8087875 8122867
3602H122867j64004J50262J78555o7154K41882k0810p1730j17368J00219j80537
$$ 8122867 7958863 8109125 8287680 8220526 8462408 8441598 8369868 8252500 8352719 8172182
3592H172182L3260L9381J64261J91053M9277M2205J05395K07503N8012j50802
$$ 8172182 8205442 8244823 8409084 8600137 8649414 8691619 8797014 9004517 9062529 8911727
3582H911727n96K30117m1351r665K35483j8950Q3107J00329J98114P5673j09100
$$ 8911727 8911131 9141248 9099897 9090232 9325715 9306765 9389872 9490201 9688315 9763988 9654888
3571I654888J87849J54238j00931P3113j76455L6393J03716j4629k39337J41420
$$ 9654888 9842737 9996975 9896044 9969157 9792702 9829095 9932811 9918182 9678845 9820265
3561I820265J97770k07064J28330R2382j14456J11077M4721j03170J2582K05481
$$ 9820265 10018035 9810971 9939301 10031683 9917227 10028304 10073025 9969855 9982437 10187918
3551A0187918J37972K41J95831P276P7325L9950J6771J79415L17984R9700J63868
$$ 10187918 10325890 10326131 10521962 10529238 10606563 10646513 10663284 10842699 11160683 11260383 11424251
3540A1424251K33672J00969J61664J80454l9055J36350J49191Q9922K52429J50153
$$ 11424251 11657923 11758892 11920556 12101010 12061955 12198305 12347496 12437418 12689847 12840000
3530A2840000n7815N5912Q8901J02275l8461R7461M490L6648J13558K59317j82995
$$ 12840000 12782185 12838097 12926998 13029273 12990812 13088273 13092763 13129411 13242969 13502286 13319291
3519A3319291J94838J0227k0745j21976j66794P3757P3512O8981k5882N2995k65826
$$ 13319291 13514129 13524356 13503611 13381635 13214841 13288598 13362110 13431091 13405209 13458204 13192378
3508A3192378k7850m5692J91340K0549j20043J56541J8584M509j02333J91583
$$ 13192378 13164528 13118836 13310176 13330725 13210682 13367223 13385807 13390316 13287983 13479566
3498A3479566J97599O9218K83125o112K43614K08098K08605K35030P1231J02363
$$ 13479566 13677165 13746383 14029508 14023396 14267010 14475108 14683713 14918743 14989974 15092337
3488A5092337M5129k7093J80535m345R6445Q2772J51989N098P5514K29435j1062
$$ 15092337 15137466 15110373 15290908 15286563 15383008 15465780 15617769 15622867 15698381 15927816 15916754
3477A5916754M3156P5395K71688L56896J08970Q3922J37324K21445Q4430K26736
$$ 15916754 15959910 16035305 16306993 16663889 16772859 16856781 16994105 17215550 17299980 17526716
3467A7526716L47170k1542n7357L8579J53379O2035j10425k8806j28044k6184
$$ 17526716 17873886 17852344 17794987 17833566 17986945 18048980 17938555 17909749 17781705 17755521
3457A7755521Q1309K1944K38611J67371K09065P526K08644J93957M06724K04603
$$ 17755521 17836830 17858774 18097385 18264756 18473821 18481347 18689991 18883948 19290672 19495275
3447A9495275L38377M61559O7764M37119K53992J98640K67500L74126K36105K05655
$$ 19495275 19833652 20295211 20362975 20800094 21054086 21252726 21520226 21894352 22130457 22336112
3437B2336112K38006M01121N44523K22732K22915N75026M53890N27826L82953
$$ 22336112 22574118 22975239 23519762 23742494 23965409 24540435 24994325 25522151 25905104
3428B5905104L99768P34804N48945O23774O55405P17922N17832P31068P40572
$$ 25905104 26304872 27039676 27588621 28212395 28867800 29585722 30103554 30834622 31575194
3419C1575194N16526N91592Q00465P08126Q31135J008342R76381J209890J184341
$$ 31575194 32091720 32683312 33483777 34191903 35023038 36031380 37007761 38217651 39401992
3410C9401992J486596J559365J668865J937157K170109K187580K533888K686827
$$ 39401992 40888588 42447953 44116818 46053975 48224084 50411664 52945552 55632379
3402E5632379K889117K962250K697368K855960L162821L554421L761187L655133
$$ 55632379 58521496 61483746 64181114 67037074 70199895 73754316 77515503 81170636
3394H1170636L423154K711475K959631L296231L594258M122313M686458N553030
$$ 81170636 84593790 87305265 90264896 93561127 97155385 101277698 105964156 111517186
3386A11517186N823784O120380O467304O710896P093892P446299P203782P082609
$$ 111517186 117340970 123461350 129928654 136639550 143733442 151179741 158383523 165466132
3378A65466132O298558M868634L592424L073710K586837K205648J366439j023429
$$ 165466132 171764690 176633324 180225748 183299458 185886295 188091943 189458382 188434953
3370A88434953k723118l711254l192253k599439k594729k963407l588446m428651
$$ 188434953 185711835 182000581 178808328 176208889 173614160 170650753 167062307 162633656
3362A62633656m767363n205047n723800n878037o274708o545631o740512o107973
$$ 162633656 157866293 152661246 146937446 141059409 134784701 128239070 121498558 115390585
3354A15390585n641815n094802m604882m005243l378506l257719l160872l745506
$$ 115390585 109748770 104653968 100049086 96043843 92665337 89407618 86246746 82501240
3346H2501240l839156l540343l493059l031585k720684k857159k639961j934378
$$ 82501240 78662084 75121741 71628682 68597097 65876413 63019254 60379293 58444915
3338E8444915k064400j627015j560594j416688j308709j075627r55007q20191
$$ 58444915 56380515 54753500 53192906 51776218 50467509 49391882 48436875 47616684
3330D7616684q09551q35783p67064p22975p98201p37118o59662n89538q31119
$$ 47616684 46807133 45971350 45204286 44481311 43683110 42945992 42286330 41696792 40865673
3321D0865673q19885o13301n70614n38718q04338o42723l36476n36836m68399
$$ 40865673 40045788 39432487 38861873 38323155 37518817 36876094 36539618 36002782 35534383
3312C5534383m68525n93909l94053l74071l32156k85345m52826m35443k86622
$$ 35534383 35065858 34471949 34077896 33703825 33371669 33086324 32633498 32198055 31911433
3303C1911433k70125m63214n98762m45982l41425k59205k69882l48045k27839
$$ 31911433 31641308 31178094 30579332 30133350 29791925 29532720 29262838 28914793 28686954
3294B8686954k46586l50339j21811j78988l47266k97922k31738l22397r0176L8138
$$ 28686954 28440368 28090029 27968218 27789230 27441964 27144042 26912304 26589907 26499731 26537869
3284B6537869N3261p1744p7237l9333P2687J46848K49465R2852R2525r758O2525
$$ 26537869 26591130 26519386 26442149 26402816 26475503 26622351 26871816 26964668 27057193 27047435 27109960
3273B7109960N07564J22632K95575L73115R8273L07914K49615M95179L60353M09312
$$ 27109960 27617524 27740156 28035731 28408846 28507119 28815033 29064648 29559827 29920180 30329492
3263C0329492L50698M38103M79522L99542L98083K96499L40300L32942K73007
$$ 30329492 30680190 31118293 31597815 31997357 32395440 32691939 33032239 33365181 33638188
3254C3638188K72339K04367J00324M93487M82656M82960N45074N13107P07129
$$ 33638188 33910527 34114894 34215218 34708705 35191361 35674321 36219395 36732502 37439631
3245C7439631O27444J031190J045082J019779J105919J332420J431369J439521
$$ 37439631 38067075 39098265 40143347 41163126 42269045 43601465 45032834 46472355
3237D6472355J685977J710931J565701J517266J405264J449656J453836J562849
$$ 46472355 48158332 49869263 51434964 52952230 54357494 55807150 57260986 58823835
3229E8823835J300743J356975K059568K090865K383432K674922L466079M042979
$$ 58823835 60124578 61481553 63541121 65631986 68015418 70690340 74156419 78199398
3221G8199398M712777N678422O549175P347451Q187638R192664J0264383J1139546
$$ 78199398 82912175 88590597 95139772 102487223 110674861 119867525 130131908 141271454
3213A41271454J2183822J3205446J3382740J3367808J3125044J2199058J0293681
$$ 141271454 153455276 166660722 180043462 193411270 206536314 218735372 229029053
3206B29029053P599562M262964L89708l693395p600577j0910562j3050119j4743131
$$ 229029053 236628615 240891579 241281287 237587892 229987315 219076753 206026634 191283503
3198A91283503j5135215j4403238j3678494j2363059j0636650r421905p968610
$$ 191283503 176148288 161745050 148066556 135703497 125066847 115644942 107676332
3191A07676332o727133n855755m956505m383238l863788l223853k842891k402998
$$ 107676332 100949199 95093444 90136939 85753701 81889913 78666060 75823169 73420171
3183G3420171k246763j985792j788605j653994j291044j147313r87670r16630
$$ 73420171 71173408 69187616 67399011 65745017 64453973 63306660 62318990 61402360
3175F1402360r63928p99048l02656m06831j10088k40303r3939p7628l27445L05746
$$ 61402360 60438432 59639384 59336728 58929897 58819809 58579506 58485567 58407939 58080494 58386240
3165E8386240J56181K17808M67958M02810N98159N13983O33737O29018N01960
$$ 58386240 58542421 58760229 59228187 59630997 60229156 60743139 61376876 62005894 62507854
3156F2507854N28681K63408J43375J52994K32545K7189j27334N7689j96721p4367
$$ 62507854 63036535 63299943 63443318 63596312 63828857 63856046 63728712 63786401 63589680 63515313
3146F3515313k37794j44363M0692q6036j30794L3042K18297R8481J86250K36445
$$ 63515313 63277519 63133156 63173848 63087812 62957018 62990060 63208357 63306838 63493088 63729533
3136F3729533J14455J10527p8965j38698j52759l63787p7081N9194k10114n1964
$$ 63729533 63843988 63954515 63875550 63736852 63584093 63220306 63143225 63202419 62992305 62940341
3126F2940341Q834M3606L32229N98588M12724P32979Q93145Q91362R34927J133500
$$ 62940341 62949175 62992781 63325010 63923598 64336322 65069301 65962446 66853808 67788735 68922235
3116F8922235J328949J338767J588696J733777J894146K018278K162753K628401
$$ 68922235 70251184 71589951 73178647 74912424 76806570 78824848 80987601 83616002
3108H3616002K919836L287219L603980L983416M047761M537699M721195N009867
$$ 83616002 86535838 89823057 93427037 97410453 101458214 105995913 110717108 115726975
3100A15726975M811957M831843M548390M118110L775153L284800L016514K561616
$$ 115726975 120538932 125370775 129919165 134037275 137812428 141097228 144113742 146675358
3092A46675358K735716K724080L210561L314498L535434L586792L499645L350720
$$ 146675358 149411074 152135154 155345715 158660213 162195647 165782439 169282084 172632804
3084A72632804L197081K508543J881281J374564P33318K48993m41878j067653
$$ 172632804 175829885 178338428 180219709 181594273 182327591 182576584 182134706 181067053
3076A81067053j736409j999966k119460k630558l470434m107791m124829l908556
$$ 181067053 179330644 177330678 175211218 172580660 169110226 165002435 160877606 156969050
3068A56969050l650526l644877l530764l609021l769871m156587m403853m769350
$$ 156969050 153318524 149673647 146142883 142533862 138763991 134607404 130203551 125434201
3060A25434201m998860n123859n097545m951286m809088m280056m156865l664111
$$ 125434201 120435341 115311482 110213937 105262651 100453563 96173507 92016642 88352531
3052H8352531k784368k652780k134486k040146k305125j663810r96812p40112
$$ 88352531 85568163 82915383 80780897 78740751 76435626 74771816 73775004 73034892
3044G3034892j356552k611668k689966k440628k193775k062962j816912j512088
$$ 73034892 71678340 69066672 66376706 63936078 61742303 59679341 57862429 56350341
3036E6350341j274967r89124o90535n71758m39036o12161j68817j45650p7081
$$ 56350341 55075374 54086250 53395715 52823957 52384921 51772760 51603943 51458293 51381212
3027E1381212j59221k31945j00839j07495j27948j44397j12365k6825m31406l42665
$$ 51381212 51221991 50990046 50889207 50781712 50653764 50509367 50397002 50370177 49938771 49596106
3017D9596106J86256l1450n53242j013458j282262j105088q83287j086390j420585
$$ 49596106 49782362 49750912 49197670 48184212 46901950 45796862 44913575 43827185 42406600
3008D2406600j341774r72357r01090q83189n68340n26321o10534l91890m32405
$$ 42406600 41064826 40092469 39191379 38308190 37739850 37213529 36602995 36211105 35778700
2999C5778700k6259k82279l20330j13231l03360l85331P9457o9482q3172N8839
$$ 35778700 35752441 35470162 35149832 35036601 34733241 34347910 34427367 34357885 34274713 34333552
2989C4333552K12574J64626L1897J32794J55379Q174o4210R9926k8129k8040J83324
$$ 34333552 34546126 34710752 34742649 34875443 35030822 35038996 34974786 35074712 35046583 35018543 35201867
2978C5201867q1263m1069K28314K54767j9332J17487Q5909J62868R6851K33881
$$ 35201867 35120604 35079535 35307849 35562616 35543284 35660771 35746680 35909548 36006399 36240280
2968C6240280J40405M03392L78083L18131K37060M07317N19553P35920Q52376
$$ 36240280 36380685 36784077 37162160 37480291 37717351 38124668 38644221 39380141 40232517
2959D0232517R65874J075823R96126J266318J330167J422501J625800J706951
$$ 40232517 41198391 42274214 43270340 44536658 45866825 47289326 48915126 50622077
2951E0622077K008569K437782K460197K791410L377091L862216M029289M329456
$$ 50622077 52630646 55068428 57528625 60320035 63697126 67559342 71588631 75918087
2943G5918087M806987N283366N567003O002259N918165N758602N559251N043665
$$ 75918087 80725074 86008440 91575443 97577702 103495867 109254469 114813720 119857385
2935A19857385M317167L336428J848643M06907j143857k939889m278846n452491
$$ 119857385 124174552 127510980 129359623 129766530 128622673 125682784 121403938 115951447
2927A15951447o276943o813376o912412o387628o058508n724884n143764m489971
$$ 115951447 109674504 102861128 95948716 89561088 83502580 77777696 72633932 68143961
2919F8143961l716430l178818k752239k661258k382124j995756k032682j906403
$$ 68143961 64427531 61248713 58496474 55835216 53453092 51457336 49424654 47518251
2911D7518251j873702j668194j772833j585210j737716j607973j202783j427290
$$ 47518251 45644549 43976355 42203522 40618312 38880596 37272623 36069840 34642550
2903C4642550j408006j103691j163455j130640r79581p68985q95672p27896r14954
$$ 34642550 33234544 32130853 30967398 29836758 28857177 28088192 27192520 26464624 25549670
2894B5549670p50730o43683q29611m04692m41784n23292l48294m01638n15530
$$ 25549670 24798940 24155257 23325646 22920954 22479170 21955878 21607584 21205946 20690416
2885B0690416l14928j74493j53045m87369j85663l16283l72276l01781m85346
$$ 20690416 20375488 20200995 20047950 19560581 19374918 19058635 18686359 18384578 17899232
2876A7899232l05230j72262m88743k80089k65063l96169m0657k83502m25881k31011
$$ 17899232 17594002 17421740 16932997 16652908 16387845 15991676 15951019 15667517 15241636 15010625
2866A5010625l77827l77174k53837k04971k19642k41693j49992p4594j84198k90351
$$ 15010625 14632798 14255624 14001787 13796816 13577174 13335481 13185489 13110895 12926697 12636346
2856A2636346j62249m7229k15048p4608r5160j35756K02741j15677k18499j02931
$$ 12636346 12474097 12426868 12211820 12137212 12042052 11906296 12109037 11993360 11774861 11671930
2846A1671930N3015K8681J71327p258k5687j00397Q6715L3424j60242j08432q2573
$$ 11671930 11724945 11753626 11924953 11917695 11892008 11791611 11878326 11911750 11751508 11643076 11560503
2835A1560503n8919o5762J86638l7728L2439M8450L3517K3718K3442J84931O994
$$ 11560503 11501584 11435822 11622460 11584732 11617171 11665621 11699138 11722856 11746298 11931229 11938223
2824A1938223R3576L2928K3549J92889J11292K6853J47806J57264N9185J53572
$$ 11938223 12031799 12064727 12088276 12281165 12392457 12419310 12567116 12724380 12783565 12937137
2814A2937137J50500K81709K44691K11995P1634J79543N43932L10057J23646J49906
$$ 12937137 13087637 13369346 13614037 13826032 13897666 14077209 14621141 14931198 15054844 15204750
2804A5204750J30055K68799K20439K37810L08879K49551K49176K98375M43660
$$ 15204750 15334805 15603604 15824043 16061853 16370732 16620283 16869459 17167834 17611494
2795A7611494K57544J39913K1913J89125J74380J9870O0846L27984L12308K22268
$$ 17611494 17869038 18008951 18030864 18219989 18394369 18414239 18475085 18803069 19115377 19337645
2785A9337645N65685N43207M41720N51464O46073O34039P46215O48825O54490
$$ 19337645 19903330 20446537 20888257 21439721 22085794 22719833 23466048 24114873 24769363
2776B4769363P72242P62859N85632N87131N86183P81325R02861O63381P86497
$$ 24769363 25541605 26304464 26890096 27477227 28063410 28844735 29747596 30410977 31197474
2767C1197474O88249Q80221P91561P45151Q10327O28209Q49707J059126R83931
$$ 31197474 31885723 32765944 33557505 34302656 35112983 35741192 36590899 37650025 38633956
2758C8633956J095131J228233J435538J402305J365067J631518J823123K022865
$$ 38633956 39729087 40957320 42392858 43795163 45160230 46791748 48614871 50637736
2750E0637736K061329K146917K338030K512169K403711K659345K442764K681189
$$ 50637736 52699065 54845982 57184012 59696181 62099892 64759237 67202001 69883190
2742F9883190K454500K645372K706234K480180K438673K256561J819417J357531
$$ 69883190 72337690 74983062 77689296 80169476 82608149 84864710 86684127 88041658
2734H8041658R54202J015845J334301J669003K048299K363443K674793L061987
$$ 88041658 88995860 90011705 91346006 93015009 95063308 97426751 100101544 103163531
2726A03163531L229181L506008L925575M171400M515035N354306O660011P665024
$$ 103163531 106392712 109898720 113824295 117995695 122510730 127865036 134525047 142190071
2718A42190071Q817954J0211890J1828485J3112770J4314440J5682123J6664776
$$ 142190071 151008025 161219915 173048400 186161170 200475610 216157733 232822509
2711B32822509J7967571J9998322K2997916K6522550K9854311L3246341L4050956
$$ 232822509 250790080 270788402 293786318 320308868 350163179 383409520 417460476
2704D17460476L0412279K0952037L679218j5721641l0750099l9676374m1264631
$$ 417460476 447872755 468824792 472504010 456782369 426032270 386355896 345091265
2697C45091265l8073529l1798507k5695213k0757402j6751889j3530910j1450510
$$ 345091265 307017736 275219229 249524016 228766614 212014725 198483815 187033305
2690A87033305r476851p596426o032123m836363m271977m049085m412678m745417
$$ 187033305 177556454 169960028 163927905 159091542 154819565 150770480 146357802 141612385
2682A41612385n560110n838103o267718o273626n886909n507961n218288m983499
$$ 141612385 136052275 130214172 123946454 117672828 111785919 106277958 101059670 96076171
2674I6076171m616274m377658m048743l938421l702477l415310l143643k839109
$$ 96076171 91459897 87082239 83033496 79095075 75392598 71977288 68833645 65994536
2666F5994536k636974k555545k569126k247249j956774k035880j656936j646334
$$ 65994536 63357562 60802017 58232891 55985642 54028868 51992988 50336052 48689718
2658D8689718j625444j559651j522574j189059j051429j322234j089379r95965
$$ 48689718 47064274 45504623 43982049 42792990 41741561 40419327 39329948 38333983
2650C8333983j052538j144640j148285r63371j056831j190855j059402r02674
$$ 38333983 37281445 36136805 34988520 34025149 32968318 31777463 30718061 29815387
2642B9815387q35302p44228q71261o82380p06822p46159m21564n39952m45261
$$ 29815387 28980085 28235857 27364596 26682216 25975394 25229235 24807671 24267719 23822458
2633B3822458n07538o15672m79455l28662l39979m38895n82052n72742m50508
$$ 23822458 23314920 22699248 22219793 21891131 21551152 21112257 20530205 19957463 19506955
2624A9506955m44214l68825l64265m93290n11417j78492m95451n83692l14697
$$ 19506955 19062741 18693916 18329651 17836361 17324944 17146452 16651001 16067309 15752612
2615A5752612m83302l35895n16673l29250j57344l21013n02417l24278j58064
$$ 15752612 15269310 14933415 14416742 14087492 13930148 13609135 13106718 12782440 12624376
2606A2624376k72012k96951k22181k45951p7907k75542l05369l0886l26986j17432
$$ 12624376 12352364 12055413 11833232 11587281 11509374 11233832 10928463 10897577 10570591 10453159
2596A0453159l47588j70770j28788k11229j28044k34324l20837k32011j63706
$$ 10453159 10105571 9934801 9806013 9594784 9466740 9232416 8911579 8679568 8515862
2587H515862P709j11256j49003j51767p1148l64769k25869j8519j69296j06944
$$ 8515862 8523571 8412315 8263312 8111545 8040397 7675628 7449759 7431240 7261944 7155000
2577G155000m857p3681k91058j37972j81619j98008l4586l3068O7208r3316K0113
$$ 7155000 7150143 7076462 6785404 6647432 6465813 6267805 6233219 6200151 6267359 6174043 6194156
2566F194156k02967l4119l5713j59973j34439m1330L9992Q4071r2850j32674o8777
$$ 6194156 5991189 5957070 5921357 5761384 5626945 5585615 5625607 5709678 5616828 5484154 5415377
2555E415377j2845j59917m6834r270k81262p907j51775N816R7948j43903q0754
$$ 5415377 5402532 5242615 5195781 5186511 4905249 4897342 4745567 4751383 4849331 4705428 4624674
2544D624674k41256j955k2683j43724j65519j22518j31894K6298R6052n1101j00752
$$ 4624674 4383418 4381463 4358780 4215056 4049537 3927019 3795125 3821423 3917475 3866374 3765622
2533C765622P2756M4685O2643l9652j65685k63258j23349o7876j2674J06349J3824
$$ 3765622 3838378 3883063 3945706 3906054 3740369 3477111 3353762 3285886 3273212 3379561 3393385
2522C393385Q7713k53803j2998j27310o5992o4699J27807r9689q4498j45404J26333
$$ 3393385 3481098 3227295 3214297 3086987 3020995 2956296 3084103 2984414 2899916 2754512 2880845
2511B880845j09772n3199l1326L1153j36726N8479K1744L2453q4373j45518J53521
$$ 2880845 2771073 2717874 2686548 2717701 2580975 2639454 2661198 2693651 2609278 2463760 2617281
2500B617281n1224j80453J80662O4887J93279k63120j62484k0187j41327M5617
$$ 2617281 2566057 2385604 2566266 2631153 2824432 2561312 2398828 2378641 2237314 2282931
2490B282931J9139K27842j75158j67080P2838o7621j62839O4608l8729K8510J07011
$$ 2282931 2302070 2529912 2354754 2187674 2260512 2192891 2030052 2094660 2055931 2084441 2191452
2479B191452J0277j02453M082O6271j41911O4435O7195q2338N4844J21050m5164
$$ 2191452 2201729 2099276 2103358 2169629 2027718 2092153 2159348 2077010 2131854 2252904 2207740
2468B207740n5272K42241k58424k9172l2976R989K81915Q4131m7580J68312j67029
$$ 2207740 2152468 2394709 2136285 2107113 2074137 2084126 2366041 2450172 2402592 2570904 2403875
2457B403875k3750J58674J09809J45251l7593J09596J17584L25841K63138L5998
$$ 2403875 2380125 2538799 2648608 2793859 2756266 2865862 2983446 3309287 3572425 3608423
2447C608423k19473r6379K2000n2966j65051l12977j85629j35629k51070r3769
$$ 3608423 3388950 3292571 3314571 3261605 3096554 2783577 2597948 2462319 2211249 2117480
2437B117480J47497j2867j47539k19612j1294m9654j23393K7846P1043p790K4617
$$ 2117480 2264977 2252110 2104571 1884959 1873665 1824011 1700618 1728464 1799507 1791717 1816334
2426A816334p3747r7613J1987p6105o4711K5573j81124l0351o1731j2507l9669
$$ 1816334 1742587 1644974 1656961 1580856 1516145 1541718 1360594 1330243 1268512 1256005 1216336
2415A216336J21275Q7720O3859j91392J5949o9742q6713j2351m4743L4429l6750
$$ 1216336 1337611 1425331 1489190 1297798 1313747 1244005 1157292 1144941 1100198 1134627 1097877
2404A097877J9709K8496K04363j09931m9826R1012k22771j22384N1607n3200j6179
$$ 1097877 1117586 1146082 1350445 1240514 1190688 1281700 1058929 936545 988152 934952 918773
2393I18773M5035M4068J3874M3199m2618j16365P2367p719j70405j03098J06394
$$ 918773 963808 1007876 1021750 1064949 1022331 905966 978333 970614 800209 697111 803505
2382H03505K8309R0080q2396M2814M3516r9571n2203J43758j7126J23322m364
$$ 803505 831814 921894 839498 882312 925828 826257 774054 917812 900686 1024008 1019644
2371A019644j49859l6362j88556K08342J12829l3843j19763r1207j96826J35180
$$ 1019644 869785 833423 644867 853209 966038 932195 812432 721225 524399 659579
2361F59579J27692n8010r6077J35830n2751j1326J65070J11458j76154p8943o3204
$$ 659579 787271 729261 633184 769014 716263 704937 870007 981465 805311 726368 663164
2350F63164M1098J0538l5780j12332k25096J14881Q7364Q9686O7449r814R5447
$$ 663164 704262 714800 679020 566688 341592 456473 543837 633523 700972 691158 786605
2339G86605r1595k1748r9327K0654K9474m333J1279O4907m3340j39877k0530Q5666
$$ 786605 695010 673262 573935 594589 624063 619730 631009 695916 652576 512699 492169 577835
2327E77835M1414K6338O5399n0142o0171P294j08816J49510P5416k47859k6030
$$ 577835 619249 645587 710986 660844 600673 607967 499151 648661 724077 476218 450188
2316D50188J77392j21354q1160R0084j1455P7914R697J7614R4552j21214L2583
$$ 450188 627580 506226 425066 515150 503695 581609 591306 608920 703472 582258 614841
2305F14841j3649j5918J50007o671j05237Q3861L2628M8171l4965j12458K08812
$$ 614841 601192 585274 735281 728610 623373 707234 739862 788033 753068 640610 849422
2294H49422k7934N6904j88827j46974n9621K6649j05218M5070Q7969o2226k00755
$$ 849422 821488 878392 689565 542591 482970 509619 404401 449471 537440 475214 274459
2283B74459J43009O1314O7536P8030J2132j27585n2714P0904J71930j17951j49227
$$ 274459 417468 478782 546318 624348 636480 508895 456181 527085 699015 581064 431837
2272D31837J36440M475k09269p5254J2940L4047l3431M2488O1746L6445J58911
$$ 431837 568277 572752 363483 288229 301169 335216 301785 344273 406019 442464 601375
2261F01375j85142K9399K905J52208j74354j24637L7112J57937P3361j79576j2317
$$ 601375 416233 445632 448537 600745 426391 301754 338866 496803 570164 390588 378271
2250C78271J99277o0421j4848p1615p1428k14263Q5235J09447N1667R8675o1224
$$ 378271 577548 517127 502279 430664 359236 144973 230208 339655 391322 489997 428773
2239D28773R7701j22366J49287N8726j75813l3120j11667K7971J24483J48541
$$ 428773 526474 404108 553395 612121 436308 403188 291521 319492 443975 592516
2229E92516j10993K948O8545J2533K7391q4149J555q4469M3390j8936k09303K4905
$$ 592516 481523 484471 553016 565549 592940 508791 510346 425877 469267 450331 241028 265933
2217B65933j2503l2071J41570m9688j91844L0484J99997r5161n9068K57805J75167
$$ 265933 253430 221359 362929 313241 121397 151881 351878 256717 197649 455454 630621
2206F30621k8697m3187k73495J52763O2388L8911j03794k8032l0577J2352J12639
$$ 630621 601924 558737 285242 438005 500393 539304 435510 407478 376901 389253 501892
2195E01892j21355k80249R0125K53292o147Q5787n3898j77166J43805M6099o5347
$$ 501892 380537 100288 190413 443705 437558 523345 469447 292281 436086 482185 416838
2184D16838q7777M093J66720Q9382Q127N1898m6324j31020J20180j3578K6633
$$ 416838 329061 333154 499874 589256 597383 649281 602957 471937 592117 578539 605172
2173F05172k02845q6563J65779L3392j29446J6193O7293p821J3140j6517K3676
$$ 605172 402327 315764 481543 514935 385489 401682 468975 461154 474294 457777 481453
2162D81453Q4509J21575j38201J08387r0978k3706K54112N1039q5050J27884r7117
$$ 481453 565962 687537 549336 657723 566745 543039 797151 848190 763140 891024 793907
2151G93907l2590j63905J26148J78849o0835Q1149n6530N1341p0986J336k1047
$$ 793907 761317 597412 723560 902409 841574 922723 866193 917534 846548 847884 826837
2140H26837K3900j85067n0680J38631l3555n4472L9337J85663j2808j78647K21581
$$ 826837 850737 665670 614990 753621 720066 665594 704931 890594 877786 699139 920720
2129I20720o3426p8026J42308m7498K7472M0532J6816O8350K92630j05768j11647
$$ 920720 857294 779268 921576 874078 901550 942082 958898 1027248 1319878 1214110 1102463
2118A102463L5383J6303J85189j74940J35027J33996M4958m8065L0372l6939K1076
$$ 1102463 1137846 1154149 1339338 1164398 1299425 1433421 1478379 1430314 1460686 1423747 1444823
2107A444823m2954J0486J92742Q6026J40148L240k13055R0694K29244K55502J33540
$$ 1444823 1401869 1412355 1605097 1691123 1831271 1834511 1621456 1712150 1941394 2196896 2330436
2096B330436N8805K5205n2416J32473J82360j1861l3975J14862J97791p4799J57845
$$ 2330436 2389241 2414446 2362030 2494503 2676863 2665002 2631027 2745889 2943680 2868881 3026726
2085C026726L33169L70896L57045K13374J79212K53729J38656L55545M45760M64151
$$ 3026726 3359895 3730791 4087836 4301210 4480422 4734151 4872807 5228352 5674112 6138263
2075F138263O16406P58359Q34274J073513R63341J058392J325146J454856J232993
$$ 6138263 6754669 7513028 8347302 9420815 10384156 11442548 12767694 14222550 15455543
2066A5455543J820823K263558K834302L312401L924490M962071O817646N753064
$$ 15455543 17276366 19539924 22374226 25686627 29611117 34573188 41390834 47143898
2058D7143898O084721J383817n510360n438957p217169p048605n424857l742970
$$ 47143898 53228619 54612436 49102076 43663119 36445950 29397345 23972488 20229518
2050B0229518k740220j956303j841491j245531q35639r69276p28470m89603o92731
$$ 20229518 17489298 15532995 13691504 12445973 11610334 10641058 9912588 9422985 8730254
2041H730254n01915o19259m95667m22819k52263n92572l67235l70616k22584j41630
$$ 8730254 8228339 7609080 7113413 6690594 6438331 5845759 5478524 5107908 4885324 4743694
2031D743694k26379k92093m5088k07243j20353k31064O941j25023j86898k77735
$$ 4743694 4517315 4225222 4180134 3972891 3852538 3621474 3628415 3503392 3316494 3038759
2021C038759J9422J5702j81910p0050k27194M3017j60410j34292J35849J18777
$$ 3038759 3058181 3073883 2891973 2821923 2594729 2637746 2477336 2343044 2478893 2597670
2011B597670k55578k39623N4228J7965j40034p4606q9370M0653q0252R0129l00739
$$ 2597670 2342092 2102469 2156697 2174662 2034628 1960022 1870652 1911305 1831053 1921182 1620443
2000A620443p5012j8697j50579J5286j10976j27015K32395j3033j40765m0926
$$ 1620443 1545431 1526734 1376155 1391441 1280465 1153450 1385845 1372812 1232047 1191121
1990A191121J16630q0846P0454k8691k03868M2799Q8591k06644k816Q3042o548
$$ 1191121 1307751 1226905 1297359 1268668 1064800 1107599 1196190 989546 986730 1069772 1063224
1979A063224j87809l7092m375j16620M9374J34228J31788l26130o4697R4619J04513
$$ 1063224 875415 838323 833948 717328 766702 900930 1032718 706588 641891 736510 841023
1968H41023o1914j04257k43406j18259K24678O2383q3415j45892J8085J11869
$$ 841023 779109 674852 431446 313187 537865 600248 516833 370941 389026 500895
1958E00895L5379n7940K4632q9253q6012N1177K27568M5772M0817p5399j26101
$$ 500895 536274 478334 502966 413713 327701 378878 606446 652218 693035 617636 491535
1947D91535j98357j37600L71766j2114j12684R8345o7482p6995L7311m2332q9599
$$ 491535 293178 155578 527344 515230 402546 500891 433409 356414 393725 351393 261794
1936B61794j3046R9467M8853Q142m088M0233p0243J8862N6989l4277J76609j31654
$$ 261794 248748 348215 397068 405210 401122 441355 371112 389974 446963 412686 589295 457641
1924D57641R4599j69656k8666p254k8155P4257n9607k7463J50349k85178k6330
$$ 457641 552240 382584 353918 346664 318509 392766 333159 305696 456045 170867 144537
1913A44537p527l628J92710j21518l6905J43818P8493j51610L7253k0723J62833
$$ 144537 137010 133382 326092 204574 167669 311487 389980 238370 275623 254900 417733
1902D17733p0972j62996j40955K35646j2420Q6098j0665J06968j7735P4497j45325
$$ 417733 346761 183765 42810 278456 266036 352134 341469 448437 430702 505199 359874
1891C59874j08209J31138k30992J85829J79164j84937j15812J47368J22649k9265
$$ 359874 251665 382803 151811 337640 516804 331867 216055 363423 486072 456807
1881D56807j03913j89988J58234m3770j82098k0924J1837J51294r7777Q4496N1993
$$ 456807 352894 162906 321140 277370 95272 74348 86185 237479 139702 224198 276191
1870B76191q0750j11112P2690p6948K1725J25127q9557q6207O0018J05833P1866
$$ 276191 195441 84329 157019 80071 101796 226923 137366 51159 111177 217010 288876
1859B88876j16013o8406o6357l8907J78194Q0302r3220N2886K9957n5545j3101
$$ 288876 172863 104457 38100 -807 177387 257689 164469 217355 247312 191767 178666
1848A78666j1239j421K0221J21442q6556n4443j0755L079k7158r7092M6565J0103
$$ 178666 167427 166006 186227 307669 221113 166670 155915 158994 131836 34744 81309 91412
1836I1412M805o0485J06451K1498j24417J18674n1698k3274q171j12282N0616
$$ 91412 96217 35732 142183 163681 39264 157938 106240 82966 74795 -37487 13129
1825A3129R7501J2271J7191K34099J6734Q650j42889j48883J99116p492N0209
$$ 13129 110630 122901 140092 374191 390925 399575 256686 107803 306919 299427 349636
1814C49636P2486j21193j68814L2106m7169M1384J26178r107p3682k6039O0074
$$ 349636 422122 300929 132115 164221 117052 158436 284614 275507 201825 175786 235860
1803B35860M1869k52722Q1204L8182l7523r286O5463j4198l3989n013j06742J04600
$$ 235860 277729 25007 106211 144393 106870 97584 163047 148849 114860 109847 3105 107705
1791A07705J35190L3046j27709j1878j17802l3722j21324J89704k7460r3359M0084
$$ 107705 242895 275941 148232 136354 18552 -15170 -136494 53210 25750 -67609 -27525
1780b7525p2252k1640P6505J05042O2897M959k02620J5860J61846l3506j7773
$$ -27525 -99777 -121417 -44912 60130 123027 127986 -74634 -58774 103072 69566 51793
1769E1793j41376J6630o9598K16629J06571k58317r039J05514J59036N4551j32190
$$ 51793 -89583 -72953 -142551 74078 180649 -77668 -86707 18807 177843 232394 100204
1758A00204j53284P210j48048K87740J43858j32971n9967L0801p0377J49390R1978
$$ 100204 -53080 -45870 -193918 93822 237680 104709 44742 75543 5166 154556 246534
1747B46534j96906J5475L692o6021R146k06547K5065k2815O7388Q0486r3708P5663
$$ 246534 49628 65103 68795 2774 11920 -194627 -169562 -192377 -124989 -44503 -138211 -62548
1735f2548M9126L9259K4782N0911j16006O7811k41285j576K22481J48626Q638
$$ -62548 -13422 25837 50619 101530 -14476 53335 -187950 -189526 32955 181581 190219
1724A90219j58171l8823J77866P1283p3585r5816J49643j70119J22324Q2356p0665
$$ 190219 32048 -6775 171091 242374 168789 72973 222616 52497 174821 257177 186512
1713A86512j01272m7556M1233j36532K22089j59320j00911M8932L684O3760K87338
$$ 186512 85240 37684 78917 -57615 164474 5154 -95757 -46825 -43141 20619 307957
1702C07957j80562m5027k05466o0906L9446J631J78305P1055r2078J45778p0751
$$ 307957 127395 82368 -123098 -184004 -144558 -142927 35378 106433 14355 160133 89382
1691H9382q4259P1189r4660P3889l0940K7257K8540j30696J50447q832r5135n644
$$ 89382 5123 76312 -18348 55541 24601 51858 80398 -50298 100149 91317 -3818 -9462
1679i462J40807O2795r6576K5153m6646K1875j96683M5548R4219M3303J63918
$$ -9462 131345 194140 97564 122717 76071 97946 -98737 -53189 41030 84333 248251
1668B48251j52875q4010J5672j0245o4845J2900K02392k4702N8705k64016l5610
$$ 248251 95376 11366 27038 16793 -48052 -35152 167240 142538 201243 -62773 -98383
1657i8383Q9990M7319N4466j69114M8070J33857j14399M1717j15235K5737o3035
$$ -98383 -8393 38926 93392 -75722 -27652 106205 -8194 33523 -81712 -55975 -119010
1646a19010N5237r462n574N1862N2801N9360o6829j2453J20622J26474j67052
$$ -119010 -63773 -73235 -78809 -26947 25854 85214 18385 5932 126554 253028 85976
1635H5976j412j0598L675k61804J68165J64686j69494j27639J15222J42973l706
$$ 85976 84564 73966 77641 -184163 -15998 148688 -20806 -148445 -33223 109750 106044
1624A06044j10942O0822k6153K9156j18067Q3889m7037K6472K3984q9659n990
$$ 106044 -4898 55924 29771 58927 -59140 24749 -22288 4184 28168 -61491 -67481
1613f7481j06537K30741r458J27338j01581N3294j18317N8372R0925k16082O0376
$$ -67481 -174018 56723 47265 174603 73022 126316 7999 66371 157296 -58786 1590
1602A590P2996l4722P5726k49936O1667J08157R9393J8463K12115j64208j88323
$$ 1590 74586 39864 115590 -134346 -72679 35478 134871 153334 365449 201241 12918
1591A2918P8365L9431O0267k0540p6452j0989k857j27178k9124J2998R0746p4945
$$ 12918 91283 130714 190981 170441 93989 83000 80143 -47035 -76159 -63161 27585 -47360
1579d7360n2728K656O7807J733J1615Q8644J05137R6817j30366j52537J98909
$$ -47360 -100088 -97432 -29625 -27892 -16277 72367 177504 274321 143955 -8582 190327
1568A90327p4720j78174J01233J01000o6295N380R191K0331j55922M0673Q8101
$$ 190327 115607 -62567 38666 139666 73371 78751 87942 108273 -47649 -6976 81125
1557H1125O8154p8118j0926o3112r9905J60187J00740N593r1320p4772J19072
$$ 81125 149279 71161 60235 -2877 -102782 57405 158145 163738 72418 -2354 116718
1546A16718J0435j10348Q6427j84928O1831J2404n9805K6543r5175J06192j5472
$$ 116718 127153 16805 103232 -81696 -19865 -7461 -67266 -40723 -135898 -29706 -45178
1535d5178N9833L2663p1198N734j16087M096O5715k8454J97339o256N5345r5188
$$ -45178 14655 47318 -23880 -18146 -134233 -130137 -64422 -92876 104463 98207 153552 58364
1523E8364J0316j53333J41564j17142q2766J18599l5252L3792j25674r1156L1044
$$ 58364 68680 -84653 56911 -60231 -142997 -24398 -59650 -25858 -151532 -242688 -211644
1512b11644J72429J19363L313M1564k30326P3852J12474q7252j9570l473L0553
$$ -211644 -39215 80148 83461 125025 -105301 -31449 81025 -6227 -25797 -29270 1283
1501A283O9289j5188j51461n8161R6720J26666j2583q9847j6291k232l6636j7759
$$ 1283 70572 55384 -96077 -154238 -57518 69148 56565 -33282 -49573 -51805 -88441 -106200
1489a06200k8060J91804m3787J58613N9518j58248j37042j09284j32222K56905
$$ -106200 -134260 57544 13757 172370 231888 73640 -63402 -172686 -304908 -48003
1479d8003J52583j05007j4259j29494j89026j5240K66823r5325L6157L511R0840
$$ -48003 104580 -427 -14686 -144180 -333206 -348446 -81623 -176948 -140791 -137280 -46440
1468d6440J24671j68678O6511J08688j40360J7745l6481j4668K99395L4321M94
$$ -46440 78231 -90447 -23936 84752 -55608 -37863 -74344 -89012 210383 244704 245198
1457B45198j39646K9944j65370j2992L3337J70353j17j74243J50040J8093n8225
$$ 245198 105552 135496 -29874 -42866 -9529 160824 160707 -13536 136504 154597 96372
1446I6372q3400j95538M0607J29417l407R268j1723j41693o0650M5488J84839
$$ 96372 12972 -182566 -141959 -12542 -15949 -6681 -18404 -160097 -220747 -175259 9580
1435I580N7896j06317m9443P5515J2128k4858J44860j5483j45194m4850O6418
$$ 9580 67476 -38841 -88284 -12769 -641 -25499 119361 103878 -41316 -86166 -19748
1424a9748J64143j01101o1985j52654J16462L4197J3611n5272m3551J39200n362
$$ -19748 144395 43294 -18691 -171345 -54883 -20686 -7075 -62347 -105898 33302 27940
1413B7940k63008Q5137R2378j1239N7700K2678K04492l64006L2204M622R1090
$$ 27940 -235068 -149931 -57553 -68792 -11092 11586 216078 -147928 -115724 -111102 -20012
1402b0012j82059J62305M2388o4345Q9795j17487J06787j69459J39829J81086
$$ -20012 -202071 -39766 2622 -61723 28072 -89415 17372 -152087 -12258 168828
1392A68828p7883j40172J32921N9082l4509j64348l6730K0370J33408J3038j02091
$$ 168828 90945 -49227 83694 142776 108267 -56081 -92811 -72441 60967 74005 -28086
1381b8086P261N5060r9500O0478J48311j90583O8415N9020m3409J19426j25322
$$ -28086 -20825 34235 -65265 -4787 143524 -47059 21356 80376 36967 156393 31071
1370C1071j4074L4478j18895j1278l2008k6659k1031k0290J10726J34023J70966
$$ 31071 16997 51475 -67420 -78698 -110706 -137365 -158396 -178686 -67960 66063 237029
1359B37029n9374j23827L038p4589n5203O5358P5983N218m8000J43950R9997k54189
$$ 237029 177655 53828 56866 -17723 -72926 -7568 68415 73633 25633 169583 269580 15391
1347A5391N6566J0961k10045J08861J83059j55112K06548M0245j06303j84386
$$ 15391 71957 82918 -127127 -18266 164793 9681 216229 256474 150171 -34215
1337c4215O0159m5656L3669J9681j2086J11202k12900j07243M2824q8034M8379
$$ -34215 25944 -19712 13957 33638 21552 132754 -80146 -187389 -144565 -232599 -184220
1326a84220Q8353L30382k02818K4377J8916r5271j95491k3815J99299j222P4307
$$ -184220 -95867 234515 31697 56074 74990 -20281 -215772 -239587 -40288 -41510 32797
1315C2797K7292n8026j900m7159j40533o9985M778J78558Q9231r8768J43278n532
$$ 32797 60089 2063 163 -46996 -187529 -257514 -252736 -74178 15053 -83715 59563 54031
1303E4031L0204j74013o1944J17446q3187k3777p095K51362q6787J0416K2347
$$ 54031 84235 -89778 -151722 -34276 -117463 -141240 -148335 103027 16240 26656 49003
1292D9003q2003J95506j41322j9641J52401O097J9818o8357q622o7334k4404m4169
$$ 49003 -33000 162506 21184 1543 153944 160041 179859 111502 102880 35546 11142 -33027
1280c3027J29265J0001j96503O5105o6945R492n1172P3197J36358j65910N444
$$ -33027 96238 106239 -90264 -25159 -92104 -82612 -133784 -60587 75771 -90139 -84695
1269h4695k1600r3669j3788J7186j00361J02904K36075K44158j70467P3329j48834
$$ -84695 -106295 -199964 -213752 -196566 -296927 -194023 42052 286210 115743 189072 40238
1258D0238J6061R00n8836j75341J36732J18698O2047K008n991k3877k0032o4231
$$ 40238 56299 57199 -1637 -176978 -40246 78452 140499 142507 136516 112639 92607 28376
1246B8376K6112l5236J1322p1352J6n273O2540Q3775q5812k0775J10659K7828
$$ 28376 54488 19252 30574 -40778 -40762 -46035 16505 100280 14468 -6307 104352 132180
1234A32180k4104R8997p4063j03019N639j70169J25845J40276j00569Q9666q7943
$$ 132180 108076 207073 133010 29991 35630 -134539 -8694 131582 31013 120679 32736
1223C2736p6994q5550J93199M2397L0173o7641k24118J75397j4573p2106q4709
$$ 32736 -44258 -129808 63391 105788 135961 68320 -155798 19599 5026 -67080 -151789
1212a51789r236J12970k9195J3523L6270j14728j33284J2726J95458J11785M4591
$$ -151789 -161025 -48055 -77250 -63727 -27457 -142185 -275469 -262743 -67285 44500 89091
1201H9091j0081r0608J54780p2999j61213l4428P9134j25733l1446p5502K21902
$$ 89091 79010 -11598 143182 70183 -91030 -125458 -46324 -172057 -203503 -279005 -57103
1190e7103O360P5141m6851j48088M5646J01432j23825n9594J61865J34892j21829
$$ -57103 -50743 24398 -22453 -170541 -124895 -23463 -147288 -206882 -45017 89875 -31954
1179c1954n8307j81493J8098K21954l2394j267j12402k4208N7138J80701O2736
$$ -31954 -90261 -271754 -253656 -31702 -64096 -65363 -177765 -201973 -144835 35866 98602
1168I8602l5086R5070J00554k08796J06633j52190j8164K84259p7935j52683k01585
$$ 98602 63516 158586 259140 50344 156977 4787 -13377 270882 192947 40264 -161321
1157a61321J56989J3180N0626L4782k03014j2989j08722L2665P3599N7689L1269
$$ -161321 -4332 8848 59474 94256 -108758 -121747 -230469 -197804 -124205 -66516 -35247
1146c5247J2809j00384k3506Q5324m9681J40104J31852R4451J30431j28467j73948
$$ -35247 -22438 -122822 -146328 -61004 -110685 29419 161271 255722 386153 257686 83738
1135H3738K5824m5663N41R8325n4758j31241O2435K7635J57403q2203o3981j72428
$$ 83738 109562 63899 64440 162765 108007 -23234 39201 66836 224239 142036 78055 -94373
1123i4373J0710O1158n2414K85627j94763j33364M9917j7293j35147N4189N3146
$$ -94373 -83663 -22505 -74919 210708 15945 -117419 -67502 -84795 -219942 -165753 -112607
1112a12607J55842m6356n734P7262K088J02205L4158J4443j39842m6034Q9963
$$ -112607 43235 -3121 -8855 68407 70495 172700 206858 221301 81459 35425 125388
1101A25388j84970j20577J77983L2907l176n4389J69821k24448O2604R7052k72576
$$ 125388 -59582 -180159 -2176 30731 27555 -26834 142987 -81461 -18857 78195 -194381
1090a94381j84505K07999K41424j6718q8025K2809n4934P6219Q3083O0235J02314
$$ -194381 -378886 -170887 70537 53819 -34206 -11397 -66331 9888 92971 153206 255520
1079B55520l86416k6302l5264M5405J13917Q780k2452J0677J12906k42442k7739
$$ 255520 -130896 -157198 -192462 -147057 -33140 -24360 -46812 -36135 76771 -165671 -193410
1068a93410K7613R9800J0472M0425j91977R8770L62267n8421J47061o7076k83422
$$ -193410 -165797 -65997 -55525 -15100 -207077 -108307 253960 195539 342600 275524 -7898
1057g898L3604k5394j59810K3134J54362K7119j02336j3823R2879N8914j20610
$$ -7898 25706 312 -159498 -136364 17998 45117 -57219 -71042 21837 80751 -39859
1046c9859j23821j2166j1383K4756J54044R1599j37187o2392R5974K03693J6929
$$ -39859 -163680 -175846 -187229 -162473 -8429 83170 -54017 -116409 -20435 183258 200187
1035B00187q6705J43309k46210j78100J50585K953Q2115Q1453k4458K6299k7355
$$ 200187 113482 256791 10581 -167519 -16934 -13981 68134 149587 125129 151428 124073
1024A24073J11328j76323j1137l170J080q8371J07017L754j33256J8748J37149
$$ 124073 235401 59078 47941 44771 45851 -42520 64497 68251 -65005 -46257 90892
1013I0892j2334K73489o1549j61671O585J31241k14895m6641J68433k1240k25939
$$ 90892 78558 352047 290498 128827 135412 266653 51758 5117 173550 152310 -73629
1002g3629j11117N7516J00312j04699J96264J69271k13050Q0520P6013q0102l3048
$$ -73629 -184746 -127230 -26918 -131617 64647 233918 20868 101388 177401 97299 64251
991F4251L376J70622J4371l4370j00064l7812M2117j18256r8809j41074K21601
$$ 64251 67627 238249 252620 218250 118186 80374 122491 4235 -94574 -235648 -14047
980a4047K0373L4136j17943j03572k7362K85345o1520J08752O2477q5240l1273
$$ -14047 6326 40462 -77481 -181053 -208415 76930 15410 124162 186639 101399 70126
969G0126p8036o7408N1700j535j16784J62651j23050M5193O7130l0407k0621M8031
$$ 70126 -7910 -75318 -23618 -25153 -141937 20714 -102336 -57143 9987 -20420 -41041 6990
957F990O6316q8276l6172p2586q9987J741K5736j3516J73950R6247L150q641j67603
$$ 6990 73306 -14970 -51142 -123728 -213715 -211974 -186238 -199754 -25804 70443 73593 64952 -102651
944a02651R2525k285j80642J18401R3847J79101p0107N8685j75272j54082N7398
$$ -102651 -10126 -12411 -193053 -74652 19195 198296 128189 186874 11602 -142480 -85082
933h5082J32348j69148J56759j2492j03621P3267m0993p7945K8426j5316J67154
$$ -85082 47266 -121882 34877 22385 -81236 -7969 -48962 -126907 -98481 -113797 53357
922E3357n5496O034o2568J81059m827R4835k0042k70849N2610J63626j77217j4471
$$ 53357 -2139 3895 -58673 122386 117559 212394 192352 -78497 -25887 137739 -39478 -53949
910e3949L5510O9892j05656k5822J74842m2311q1939K71J1527j13083N5033J8113
$$ -53949 -18439 51453 -54203 -80025 94817 52506 -29433 -29162 -17635 -130718 -75685 -57572
898e7572m1755L0015j03033j1605M5123j00733N038Q2727R1866p362K09822r1776
$$ -57572 -99327 -69312 -172345 -183950 -138827 -239560 -234522 -151795 -59929 -67291 142531 50755
886E0755J02776k47021K59788L5401r2830p6837J47814J8416j25564o9775J25001
$$ 50755 153531 -93490 166298 201699 108869 32032 179846 198262 72698 2923 127924
875A27924K664N2672k22392p5018M9678P2758p9428p5893p0354K4452M2661J17845
$$ 127924 130588 183260 -39132 -114150 -64472 8286 -71142 -147035 -217389 -192937 -150276 -32431
863c2431N6061p4149j0630P8710k8602k39840l223J73346N7800n1870j01513j1510
$$ -32431 23630 -50519 -61149 17561 -11041 -250881 -254104 -80758 -22958 -74828 -176341 -187851
851a87851K7188M7954O4181p4751L1630j11482p680K00588J7169j08943J82858
$$ -187851 -160663 -112709 -48528 -123279 -91649 -203131 -210811 -10223 6946 -101997 80861
840H0861o9409j91969J38498R2597l3965l3965j43799p1866K17351L656j5572
$$ 80861 11452 -180517 -42019 50578 16613 -17352 -161151 -233017 -15666 -12010 -27582
829b7582J53485M2713j33105j55797o7201O2191J80291j25986k9346J77601k0937
$$ -27582 125903 168616 35511 -120286 -187487 -125296 54995 -70991 -100337 77264 56327
818E6327n7088R8963m5034o2175M1097k7711j55123J59102Q1051j43384J18792
$$ 56327 -761 98202 53168 -9007 32090 4379 -150744 8358 89409 -53975 64817
807F4817l0640J6124l5055j85319m8615Q7750K60503P3508j17705k0268l9496
$$ 64817 34177 50301 15246 -170073 -218688 -130938 129565 203073 85368 65100 25604
796B5604J27156r2509j11268j09541j77561L79185n9286J0471q608j31223j25403
$$ 25604 152760 60251 -51017 -160558 -338119 41066 -18220 -7749 -16357 -147580 -272983
785b72983K63684K7547K1328L2571N1428j24597q5658O73o6835J56261K24276
$$ -272983 -9299 18248 39576 72147 123575 -1022 -86680 -86007 -152842 3419 227695
774B27695j56205j46856j3565M8718J04025m2303N991O3705j36264J62988q0186
$$ 227695 71490 -75366 -88931 -40213 63812 21509 27500 91205 -45059 117929 37743
763C7743r7382J540j22323Q9329K54763m1447j54744K9762O9892m3875o0883J68293
$$ 37743 -59639 -58099 -180422 -91093 163670 122223 -32521 -2759 67133 23258 -37625 130668
751A30668q0477M8843k05007m5937J76220O1896k1415J83071j50081j19384q8122
$$ 130668 50191 99034 -105973 -151910 24310 86206 64791 247862 97781 -21603 -109725
740a09725M3369j28852J71307p0083j82138q487N8237P2099J00519o007j47553
$$ -109725 -66356 -195208 -23901 -93984 -276122 -284609 -226372 -154273 -53754 -59761 -207314
729b07314R3806M534K0747L8246k5525J35908J6371j84235j58272Q32j12502n8187
$$ -207314 -113508 -108974 -88227 -49981 -75506 60402 76773 -107462 -265734 -264902 -377404 -435591
717d35591L19453O2682K7524O2833P4246j07419l6324J37025M9002j58981J9686
$$ -435591 -116138 -53456 -25932 36901 111147 3728 -32596 104429 153431 -5550 14136
706A4136K80672j37923k11666M296Q6229N3213j66412J04299m6193j7835l3983
$$ 14136 294808 156885 -54781 -50485 35744 88957 -77455 26844 -19349 -37184 -71167
695g1167L5655J18452P4560j33187j38489J11786r0738k2261J84814M7496j84802
$$ -71167 -35512 82940 157500 24313 -114176 -2390 -93128 -115389 69425 116921 -67881
684f7881p2702K7200M9099j23641P3019n851j16169L5810Q3882n8311o8211J34865
$$ -67881 -140583 -113383 -64284 -187925 -114906 -120757 -236926 -201116 -117234 -175545 -243756 -108891
672a08891R3924l285p7258M5617M1862o7222O1593P0500k9312J2n5787j3747o4707
$$ -108891 -14967 -18252 -95510 -49893 -8031 -75253 -13660 56840 27528 27540 -28247 -41994 -106701
659a06701P2259J9287N3011M0466j58700o165l081J05027j3457Q480r2742L8074
$$ -106701 -34442 -15155 37856 78322 -80378 -86543 -89624 15403 1946 10426 -82316 -44242
647d4242J09592j58224K64157n7913p3206j15298r1955N6243Q0609M0011r3892
$$ -44242 65350 -92874 171283 113370 40164 -75134 -167089 -110846 -30237 9774 -84118
636h4118j29463j06354K53655N9318j69760k3752K10280M9506L2318j60729J37009
$$ -84118 -213581 -319935 -66280 -6962 -176722 -200474 9806 59312 91630 -69099 67910
625F7910r3634r7935J01202K4108j81370R6443O1633J7135r797j9779j05788j33615
$$ 67910 -25724 -123659 -22457 1651 -179719 -83276 -21643 -4508 -14305 -34084 -139872 -273487
613b73487L81620n4422Q8794j07976N6942J1412k73763J53857q274K0200n4355
$$ -273487 108133 53711 142505 34529 91471 102883 -170880 -17023 -25297 -5097 -59452
602e9452L292k3292J00838k25512P0509L91524p4285l0674p5219P267j7497J73439
$$ -59452 -56160 -79452 21386 -204126 -133617 257907 183622 152948 77729 84996 67499 240938
590B40938n3068j53545k9031N46P761k5685r881p2609M2393Q6457n8277K30208
$$ 240938 187870 34325 5294 5840 13601 -12084 -21965 -94574 -52181 34276 -24001 206207
578B06207l16628m5844O9049j14143K10759j56330p1480J69235J42740L6111j31857
$$ 206207 -110421 -156265 -87216 -201359 9400 -146930 -218410 -49175 93565 129676 -2181
567b181j42530N3920J93204j7700q0383j1091r9706o464k2958N7219Q546j10758
$$ -2181 -144711 -90791 102413 84713 4330 -6761 -106467 -112931 -135889 -78670 -70124 -180882
555a80882j04905j720P1334R9193O0879q2486L2635K5987m2609M7048J43791K1474
$$ -180882 -285787 -287507 -216173 -116980 -56101 -138587 -105952 -79965 -122574 -75526 68265 89739
543H9739j69452o0969m0485J475M2669O1413N8165o4121k9484m6206J5097L09235
$$ 89739 -79713 -140682 -181167 -179692 -137023 -75610 -17445 -81566 -111050 -157256 -142159 167076
531A67076K09232l02593k0254j1445m8014j38928R5824j15257N5035R6711l2365
$$ 167076 376308 73715 53461 42016 -5998 -144926 -49102 -164359 -109324 -12613 -44978
520d4978n3884n7454J72137l1275o6362J35383k7878L3348J40117q2780k9057
$$ -44978 -98862 -156316 15821 -15454 -81816 53567 25689 59037 199154 116374 87317
509H7317j33119J3104k2103Q9437j00538n5993o1551M7870J40710q1776J07649
$$ 87317 -45802 -32698 -54801 34636 -65902 -121895 -183446 -135576 5134 -76642 31007
498C1007J85618m4935j39071j06057P1628Q0696J4067j40677J1284L5232J30537
$$ 31007 216625 171690 32619 -73438 -1810 78886 92953 -47724 -36440 -1208 129329
487A29329k79387K2231K67591j51903K4982q7449k7239J20249n5251j0396K2349
$$ 129329 -150058 -127827 139764 -12139 12843 -74606 -101845 18404 -36847 -47243 -24894
476b4894N9808r401j17607K0147J43649o4221j4770j3896R0674o1166l3811J07185
$$ -24894 34914 25513 -92094 -71947 71702 7481 -7289 -21185 69489 8323 -25488 81697
464H1697k2540j28053N0935P8342J28334j10466k34358K8132J00321P8775j1760
$$ 81697 59157 -68896 -17961 60381 188715 78249 -156109 -127977 -27656 51119 39359
453C9359p5183N5172K31984O6754m7731m4986r826k05432o0829j39937N892N8319
$$ 39359 -35824 19348 251332 318086 270355 225369 215543 10111 -50718 -190655 -184763 -126444
441a26444r878J33407J78599j83387q7065J21162Q0915J15063j14997j24871l0036
$$ -126444 -136322 -2915 175684 -7703 -94768 26394 107309 222372 107375 -17496 -47532
430d7532o4374k02343K35930J62199j44494N1749o1018K2505J33408M8122j11561
$$ -47532 -111906 -314249 -78319 83880 -60614 -8865 -69883 -47378 86030 134152 22591
419B2591q716j01780j27653R9632P0248k3952j08911M998J63661n4857m2709p7788
$$ 22591 13875 -87905 -215558 -115926 -45678 -69630 -178541 -173543 -9882 -64739 -107448 -185236
407a85236J8430O5740M5789j6107J283j3911J05213k36938m8002J03085j5697
$$ -185236 -166806 -101066 -55277 -71384 -70101 -84012 21201 -215737 -263739 -160654 -176351
396a76351R478J55657J15702m0716K203m6268k43780J63691P6343q0618k1782
$$ -176351 -166873 -11216 104486 63770 65973 19705 -224075 -60384 15959 -64659 -86441
385h6441j37241J55972j72105R4962L4875J02724j19465J1427K05891n574m1415
$$ -86441 -223682 -67710 -239815 -144853 -109978 -7254 -126719 -115292 90599 85025 43610
374D3610p2228l0856q626R9490l2060j86200O1215J5029L4303r7528k6147J71991
$$ 43610 -28618 -59474 -68100 31390 -670 -186870 -125655 -110626 -76323 -173851 -199998 -28007
362b8007n0957J12453L4302j55275O8097j30775J81778P4433j35564p6250j02531
$$ -28007 -78964 33489 67791 -87484 -19387 -150162 31616 106049 -29515 -105765 -208296
351b08296K91935q4506K48J149O5114q9813n0139P4431j00829L0525o6491j03366
$$ -208296 83639 -867 -619 530 65644 -24169 -74308 123 -100706 -70181 -136672 -240038
339b40038l5498J52231j22052R3950J26967j37600K0032L1010N9134J2062l8436
$$ -240038 -275536 -123305 -245357 -151407 -24440 -162040 -142008 -110998 -51864 -39802 -78238
328g8238j75995K2659J99796J59426j26447j47812K2421J33038l0926J9112k7043
$$ -78238 -254233 -231574 -31778 127648 1201 -146611 -124190 8848 -22078 -2966 -30009
317c0009o6440J39586n6642n9494L6973L5259j05242r8723P5215N110J26093j2650
$$ -30009 -96449 43137 -13505 -72999 -36026 -767 -106009 -204732 -129517 -124407 1686 -10964
305a0964R614j10405j61172Q7044P5964q2834j55835J48246R9378J60334O1205
$$ -10964 -1350 -111755 -272927 -185883 -109919 -192753 -348588 -200342 -100964 59370 120575
294A20575j20464j16667K1432q9445j5201p5612J22485K84033j47579j61651P0133
$$ 120575 111 -116556 -95124 -184569 -199770 -275382 -152897 131136 -16443 -178094 -107961
283a07961k14593Q5877J81815j98899Q7250J82778J08908l6353k33472N2379n061
$$ -107961 -322554 -236677 -54862 -253761 -166511 16267 125175 88822 -144650 -92271 -97332
272i7332j07666K25550J2206j11344l3284k0497J07814l3192p0789m4016r2038
$$ -97332 -204998 20552 32758 -78586 -111870 -132367 -24553 -57745 -128534 -172550 -264588
261b64588J24411j28414k1407K75213J01976P0724k14870j61690J15189j88479
$$ -264588 -140177 -268591 -289998 -14785 87191 157915 -56955 -218645 -103456 -291935
251b91935J23900J42126p0153o3213P4148J40086J17951j09352r0688j00493o1317
$$ -291935 -168035 -25909 -96062 -159275 -85127 54959 172910 63558 -27130 -127623 -188940
240a88940R1404R7321O5402m7845k98623k19537K80108P3320J35493J14192l9459
$$ -188940 -97536 -215 65187 17342 -281281 -500818 -220710 -147390 -11897 102295 62836
229F2836P6446l8204j57795l2065K3384L693R0820N6238L2196q0957q2344r6521
$$ 62836 139282 101078 -56717 -88782 -65398 -61705 29115 85353 117549 36592 -45752 -142273
217a42273j34511K0653Q6580R449k9954J80678M0511j3818j66486k7501j6160
$$ -142273 -276784 -256131 -169551 -160102 -190056 -9378 31133 17315 -149171 -176672 -192832
206a92832J5340r749J33431J17228o6999l6017Q5406m6272L1304l3312p6003N2295
$$ -192832 -177492 -187241 -53810 63418 -3581 -39598 45808 -464 30840 -2472 -78475 -26180
194b6180J20632m7739p1432p9059O0471j64511k1912J92440M6195j65484j8268
$$ -26180 94452 46713 -24719 -103778 -43307 -207818 -229730 -37290 8905 -156579 -174847
183a74847J04672R24P1851N6258r1114j40523J0442J71574K3619k6379o1965J1223
$$ -174847 -70175 -69251 2600 58858 -32256 -172779 -162337 9237 32856 6477 -55488 -44265
171d4265n7469k59363K73428J49757Q540k37501P4481m8266O1717k3166l5092
$$ -44265 -101734 -361097 -87669 62088 70628 -166873 -92392 -140658 -78941 -102107 -137199
160a37199m6937K4466n8366J14936Q1680j54544j25569J48993J0728j03617K19671
$$ -137199 -184136 -159670 -218036 -103100 -21420 -175964 -301533 -152540 -141812 -245429 -25758
149b5758L2486R873j852q6480M818j07097P0574q5804P944L9382m6546J28094
$$ -25758 6728 16601 14749 -71731 -66913 -174010 -103436 -189240 -181296 -141914 -188460 -60366
137f0366j20949r4053K36620j04635J00470O4294j4371L2394q2774M4344O5288
$$ -60366 -181315 -275368 -38748 -143383 -42913 21381 7010 39404 -43370 974 66262
126F6262q3714j18828m9270J13099L7444K8764p4028J1268J66633k78748K00974
$$ 66262 -17452 -136280 -185550 -72451 -35007 -6243 -80271 -69003 97630 -181118 19856
115A9856n2287j06979R7149l5919J12784L3348j03499o6849P6708K2029O385j31313
$$ 19856 -32431 -139410 -42261 -78180 34604 67952 -35547 -102396 -25688 -3659 2726 -128587
103a28587J5448J27752q8689n7465P1638J68789j24674k64182J39147J01701o8542
$$ -128587 -113139 14613 -74076 -131541 -59903 108886 -15788 -279970 -140823 -39122 -107664
92a07664n3936K9013J37374j37364k4392q039Q3710p1341P3815o9020l1199j57037
$$ -107664 -161600 -132587 4787 -132577 -156969 -165008 -81298 -152639 -78824 -147844 -179043 -336080
80c36080K13676J20541l3315J7697L4440j68481j07553O338k543K07090Q1789
$$ -336080 -122404 -1863 -35178 -17481 16959 -151522 -259075 -252737 -255280 -48190 33599
69C3599j2704k9245m9540J0449L6047q8586j70895P1604L3345p1988J96014Q597
$$ 33599 20895 -8350 -57890 -47441 -11394 -99980 -270875 -199271 -165926 -237914 -41900 -33303
57c3303r8914l876K1253K6940M046M450J28600j10149q667l3433K5620J7209M1
$$ -33303 -132217 -136093 -114840 -87900 -83854 -79404 49196 -60953 -69620 -103053 -77433 -60224 -60183
44f0183n1511m7022Q1614j6501K5920J74272r7569j7711P434J06538j33268K0023
$$ -60183 -111694 -158716 -77102 -93603 -67683 106589 9020 -8691 -1257 105281 -27987 -7964
32g964k3694r818O2381r8358j2805m689k6252J2981M2493j20526R6691j41247
$$ -7964 -31658 -41476 20905 -77453 -90258 -94947 -121199 -108218 -65725 -186251 -89560 -230807
20b30807Q2640J73292k6355n7435L1897j25940J05602M3955j03538R723o2994
$$ -230807 -148167 25125 -1230 -58665 -26768 -152708 -47106 -3151 -106689 -96966 -159960
9a59960N6754K9034M4453l0281j60648J11385p8197M5471K18669
$$ -159960 -103206 -74172 -29719 -60000 -220648 -109263 -187460 -141989 76680
0G6680
$$ 76680
$$ Imaginary data points
##PAGE= N=2
##DATA TABLE= (X++(I..I)), XYDATA
16383c737576J77121L1106Q040m4261m507J55147O2561M3824J5633P603Q7891
$$ -3737576 -3560455 -3529349 -3521309 -3565570 -3570077 -3414930 -3352369 -3308545 -3292912 -3285309 -3197418
16372c197418J99586p7074N5088j4013J35559L6261K6435R2708K8911m895j2957
$$ -3197418 -2997832 -3074906 -3019818 -3033831 -2898272 -2862011 -2835576 -2742868 -2713957 -2718852 -2731809
16361b731809N7875O8121K2645M7907J03436O8940J656J43554N2911M8161q4205
$$ -2731809 -2673934 -2605813 -2583168 -2535261 -2431825 -2362885 -2361229 -2217675 -2164764 -2116603 -2200808
16350b200808J62081J8447l9736L2301J26941N3728J12702J50726p3422K1415
$$ -2200808 -2038727 -2020280 -2060016 -2027715 -1900774 -1847046 -1734344 -1583618 -1657040 -1635625
16340a635625L8325N5825J765k6001K8852K12389N1363p1195o6650p033K94323
$$ -1635625 -1597300 -1541475 -1539710 -1565711 -1536859 -1324470 -1273107 -1344302 -1410952 -1417985 -1123662
16329a123662J12449L8239L1535J70O5257R3520O1899N58P70r6770k2358K25256
$$ -1123662 -1011213 -972974 -941439 -941269 -876012 -782492 -720593 -720035 -719265 -816035 -838393 -613137
16317f13137O9647n6291Q5847o699l2488m7388K73416L7199n2261J00201j4292
$$ -613137 -543490 -599781 -513934 -520633 -553121 -600509 -327093 -289894 -342155 -241954 -256246
16306b56246K3117N9880R0390J28094r888M9865P2957p2287J32407q0795P9831
$$ -256246 -233129 -173249 -82859 45235 35347 85212 158169 85882 218289 137494 217325
16295B17325n5166l3359J87809o6116O902M2128J35544L3466j3712N9229Q2874
$$ 217325 162159 128800 316609 250493 257395 299523 435067 468533 454821 514050 596924
16284E96924R0322J7970k2936K4230l4417j4740J69979J29710q2773O951J01503
$$ 596924 687246 705216 682280 706510 672093 657353 827332 957042 874269 881220 982723
16273I82723J27269p2929J31991J01348L5910p3312K7459n9210j17519l3977J52727
$$ 982723 1109992 1037063 1169054 1270402 1306312 1233000 1260459 1201249 1083730 1049753 1202480
16262A202480q264P8561M349Q8578P420J21960N7724P5500m1703M4698o7882K493
$$ 1202480 1194216 1272777 1277126 1365704 1373124 1495084 1552808 1628308 1586605 1631303 1563421 1565914
16250A565914L8840O277j4603K4924J11889k6664J01676K09154j58456L7505m3034
$$ 1565914 1604754 1611031 1596428 1621352 1733241 1706577 1808253 2017407 1858951 1896456 1853422
16239A853422o400K2633J79434L3954r3131J86704j83068K5417J23216J28880
$$ 1853422 1847022 1869655 2049089 2083043 1989912 2176616 1993548 2018965 2142181 2271061
16229B271061k8375j48844k7973J18287L8928J12240k4968j8135N2018M709p151
$$ 2271061 2242686 2093842 2065869 2184156 2223084 2335324 2310356 2292221 2344239 2348948 2341797
16218B341797J42699L5303n7219o5695j4635R4877m9835j00199O3225p358K74519
$$ 2341797 2484496 2519799 2462580 2396885 2382250 2477127 2427292 2327093 2390318 2382960 2657479
16207B657479o1101J9431M4726N3571L8067O1499Q774j47599j4796K9080K7044
$$ 2657479 2596378 2615809 2660535 2714106 2752173 2813672 2822446 2674847 2660051 2689131 2716175
16196B716175J69663L5379O3855R3778n1182o7147P5940q8481J90559n6145R7032
$$ 2716175 2885838 2921217 2985072 3078850 3027668 2960521 3036461 2947980 3138539 3082394 3179426
16185C179426J29905p0043j23378o0304J18573N9793j41992j08053K94639L9300
$$ 3179426 3309331 3239288 3115910 3055606 3174179 3233972 3091980 2983927 3278566 3317866
16175C317866j49399k8840N4095p3236p5426K38731M0581n569j3795q0179j6837
$$ 3317866 3168467 3139627 3193722 3120486 3045060 3283791 3324372 3318803 3305008 3224829 3207992
16164C207992J32207k8107l6483O7986k63r3297L908J25793j48808p9156K46936
$$ 3207992 3340199 3312092 3275609 3343595 3343332 3250035 3253943 3379736 3230928 3151772 3398708
16153C398708K00877M2633j38733j14789O4030N3324o2536m60R6532j18159q2605
$$ 3398708 3599585 3642218 3503485 3388696 3452726 3506050 3443514 3443054 3539586 3421427 3338822
16142C338822K80566O2722j13557r019j2273L9739r1768K3387J3075J6461N954
$$ 3338822 3619388 3682110 3568553 3559534 3547261 3587000 3495232 3518619 3531694 3548155 3554109
16131C554109p0338r5709J99926p99l5328P1154k8425M1003J17649L0129j56535
$$ 3554109 3483771 3388062 3587988 3587189 3551861 3623015 3594590 3635593 3753242 3783371 3626836
16120C626836J707m9596L4841J2682M8339m9452n4171k3886J57459P4366j93367
$$ 3626836 3628543 3578947 3613788 3626470 3674809 3625357 3571186 3547300 3704759 3779125 3585758
16109C585758k1954R8136K0648J27284O1219k26529J05298j69736K6912l609J86537
$$ 3585758 3563804 3661940 3682588 3809872 3871091 3644562 3749860 3580124 3607036 3603427 3789964
16098C789964j63970n6457K67622j6010j55253P4731J23975j47222K6995K3865
$$ 3789964 3625994 3569537 3837159 3821149 3665896 3740627 3864602 3717380 3744375 3768240
16088C768240l0643k8279J33574Q1790q9847j6280J02970m8590j23334m5011j1476
$$ 3768240 3737597 3709318 3842892 3924682 3834835 3818555 3921525 3872935 3749601 3704590 3693114
16077C693114J04642O1096J27161J514P447p0063r0290Q7599J8377q0378m0921
$$ 3693114 3797756 3858852 3986013 3987527 3994974 3924911 3834621 3922220 3940597 3860219 3819298
16066C819298q1534o5628r2781K02616N167r927L1105r5012j17254J41451m3384
$$ 3819298 3737764 3672136 3579355 3781971 3787138 3777211 3808316 3713304 3596050 3737501 3694117
16055C694117l5544J3366M7310j3029N1299j04029O5096K31846j53548M1559J7240
$$ 3694117 3658573 3671939 3719249 3706220 3757519 3653490 3718586 3950432 3796884 3838443 3855683
16044C855683m7661r7649J63828J81074k73922K2013j09078l6772J85601J27366
$$ 3855683 3808022 3710373 3874201 4055275 3781353 3803366 3694288 3657516 3843117 3970483
16034C970483K4290q5421j98199R2999j04176k04096R5948Q5166L03435R4307
$$ 3970483 3994773 3909352 3711153 3804152 3699976 3495880 3591828 3676994 3980429 4074736
16024D074736j4610O5360j47780j41347K13127j87172P9987l6708N7668k6562
$$ 4074736 4060126 4125486 3977706 3836359 4049486 3862314 3942301 3905593 3963261 3936699
16014C936699j70247K53116P2024j29791K2221j87147m9964P2990L7568j00819
$$ 3936699 3766452 4019568 4091592 3961801 3984022 3796875 3746911 3819901 3857469 3756650
16004C756650j27474J48774R423R2722M1524r6942l5069k33548J87950J02390
$$ 3756650 3629176 3777950 3787373 3880095 3921619 3824677 3789608 3556060 3744010 3846400
15994C846400p5035n5606Q0201p2488J08248l9058J02996q2967o427o5897O0888
$$ 3846400 3771365 3715759 3795960 3723472 3831720 3792662 3895658 3812691 3806264 3740367 3801255
15983C801255Q9406J59883k3277p9574q901r5471k6860K07509N2830k47994n2668
$$ 3801255 3890661 4050544 4027267 3947693 3938792 3843321 3816461 4023970 4076800 3828806 3776138
15972C776138P3960j52990L2241L9035m4254K1117J13924j26402O8928J69037
$$ 3776138 3850098 3697108 3729349 3768384 3724130 3745247 3859171 3732769 3801697 3970734
$$ [...]
##END NTUPLES=NMR SPECTRUM
##END=
