##TITLE=1H_CG-1147-J
 CDCl3, 8 sc, 
 29.06.2021
##JCAMPDX= 6.0         $$ Bruker NMR JCAMP-DX V2.0
##DATA TYPE= NMR SPECTRUM
##DATA CLASS= NTUPLES
##ORIGIN= UXNMR, Bruker Analytische Messtechnik GmbH
##OWNER= root
$$ XWIN-NMR		Version 3.5
$$ Tue Jun 29 10:06:01 2021 Russian Standard Time (UT+4h)  she@DPX200
##.OBSERVE FREQUENCY= 200.131506
##.OBSERVE NUCLEUS= ^1H
##.ACQUISITION MODE= SIMULTANEOUS
##.ACQUISITION SCHEME= undefined
##.AVERAGES= 8
##.DIGITISER RES= 18
##SPECTROMETER/DATA SYSTEM= spect
##.PULSE SEQUENCE= zg30
##.SOLVENT NAME= CDCl3
##.SHIFT REFERENCE= (INTERNAL, CDCl3, 0, 17.502)
##AUDIT TRAIL= $$ (NUMBER, WHEN, WHO, WHERE, WHAT)
$$ ##TITLE= Audit trail, XWIN-NMR		Version 3.5
$$ ##JCAMPDX= 5.01
$$ ##ORIGIN= Bruker BioSpin GmbH
$$ ##OWNER= she
$$ F:/spectra/data/she/nmr/H-F/1/pdata/1/auditp.txt
$$ ##AUDIT TRAIL=  $$ (NUMBER, WHEN, WHO, WHERE, WHAT)
(   1,<2021-06-29 10:04:31.17 +0400>,<she>,<DPX200>,
      <created by zg, POWCHK disabled, PULCHK disabled
       configuration hash MD5:
       00 E9 B6 7A A2 85 ED C7 34 08 36 98 17 FE 4E 26
       data hash MD5: 16K
       20 A3 59 AE C2 0E 7D E3 17 90 DE DB 4D 0E 35 D1>)
(   2,<2021-06-29 10:04:33.23 +0400>,<she>,<DPX200>,
      <Start of raw data processing
       efp BC_mod = 2 LB = 0.24 FT_mod = 6 PKNL = 1 PHC0 = -11718.41 PHC1 = -3.598991 SI = 16K 
       data hash MD5: 16K
       DA 40 F8 FE D8 81 54 7E A7 D8 DE 0C E1 98 16 C5>)
(   3,<2021-06-29 10:04:56.71 +0400>,<she>,<DPX200>,
      <pk PHC0 = -198.3585 PHC1 = 0 
       data hash MD5: 16K
       61 52 32 F8 91 D8 A8 29 05 AC 27 49 AF B3 CC E4>)
(   4,<2021-06-29 10:05:00.68 +0400>,<she>,<DPX200>,
      <abs ABSG = 5 
       data hash MD5: 16K
       86 9C A7 51 02 DC 6A 3E 9D 14 46 70 AC 22 A8 20>)
$$ ##END=
$$ 
$$ hash MD5
$$ F6 7B CE 3A 15 C1 94 41 8A 10 2A D4 A8 F8 2C ED
##$RELAX= 
##$RELAX= 
##$RELAX= 
##$RELAX= 
##$RELAX= 
##$RELAX= 
$$ Bruker specific parameters
$$ --------------------------
##$DU= <F:/spectra>
##$EXPNO= 1
##$NAME= <H-F>
##$PROCNO= 1
##$TYPE= <nmr>
##$USER= <she>
##$AMP= (0..31)
100 100 100 100 100 100 100 100 100 100 100 100 100 100 100 100 100 100 
100 100 100 100 100 100 100 100 100 100 100 100 100 100 
##$AQSEQ= 0
##$AQ_mod= 1
##$AUNM= <au_zg>
##$AUTOPOS= <>
##$BF1= 200.13
##$BF2= 200.13
##$BF3= 200.13
##$BF4= 200.13
##$BF5= 200.13
##$BF6= 200.13
##$BF7= 200.13
##$BF8= 200.13
##$BYTORDA= 1
##$CFDGTYP= 0
##$CFRGTYP= 5
##$CHEMSTR= <none>
##$CNST= (0..31)
1 1 145 1 1 1 1 1 1 1 1 1 1 1 1 1 1 1 1 1 1 1 1 1 1 1 1 1 1 1 1 1 
##$CPDPRG= <>
##$CPDPRG1= <>
##$CPDPRG2= <>
##$CPDPRG3= <>
##$CPDPRG4= <mlev>
##$CPDPRG5= <mlev>
##$CPDPRG6= <mlev>
##$CPDPRG7= <mlev>
##$CPDPRG8= <mlev>
##$CPDPRGB= <>
##$CPDPRGT= <>
##$D= (0..31)
0 1.2 0 0 0 0 0 0 0 0.06 0 0.03 0 0 0 0 0.0002 0 0 0 0 0 0 0 0 0 0 0 0 
0 0 0 
##$DATE= 1624946670
##$DBL= (0..7)
120 120 120 120 120 120 120 120 
##$DBP= (0..7)
150 150 150 150 150 150 150 150 
##$DBP07= 0
##$DBPNAM0= <>
##$DBPNAM1= <>
##$DBPNAM2= <>
##$DBPNAM3= <>
##$DBPNAM4= <>
$$ [...]
##$SUBNAM3= <"">
##$SUBNAM4= <"">
##$SUBNAM5= <"">
##$SUBNAM6= <"">
##$SUBNAM7= <"">
##$SUBNAM8= <"">
##$SUBNAM9= <"">
##$SW= 20.0188882624521
##$SWIBOX= (0..15)
0 0 2 0 0 0 0 0 0 0 0 0 0 0 0 0 
##$SW_h= 4006.41025641026
##$TD= 16384
##$TD0= 1
##$TE= 0
##$TE2= 300
##$TE3= 300
##$TEG= 300
##$TL= (0..7)
0 120 120 120 120 120 120 120 
##$TP= (0..7)
150 150 150 150 150 150 150 150 
##$TP07= 0
##$TPNAME0= <>
##$TPNAME1= <>
##$TPNAME2= <>
##$TPNAME3= <>
##$TPNAME4= <>
##$TPNAME5= <>
##$TPNAME6= <>
##$TPNAME7= <>
##$TPOAL= (0..7)
0.5 0.5 0.5 0.5 0.5 0.5 0.5 0.5 
##$TPOFFS= (0..7)
0 0 0 0 0 0 0 0 
##$TUNHIN= 0
##$TUNHOUT= 0
##$TUNXOUT= 0
##$USERA1= <user>
##$USERA2= <user>
##$USERA3= <user>
##$USERA4= <user>
##$USERA5= <user>
##$V9= 5
##$VALIST= <valist>
##$VCLIST= <CCCCCCCCCCCCCCC>
##$VD= 0
##$VDLIST= <DDDDDDDDDDDDDDD>
##$VPLIST= <PPPPPPPPPPPPPPP>
##$VTLIST= <TTTTTTTTTTTTTTT>
##$WBST= 1024
##$WBSW= 4
##$XGAIN= (0..3)
0 0 0 0 
##$XL= 0
##$YL= 0
##$YMAX_a= 581692
##$YMIN_a= -681258
##$ZGOPTNS= <>
##$ZL1= 120
##$ZL2= 120
##$ZL3= 120
##$ZL4= 120
##$ABSF1= 17.52399
##$ABSF2= -2.495049
##$ABSG= 5
##$ABSL= 3
##$ALPHA= 0
##$AQORDER= 0
##$ASSFAC= 0
##$ASSFACI= 0
##$ASSFACX= 0
##$ASSWID= 0
##$AUNMP= <proc_1d>
##$AZFE= 0.1
##$AZFW= 0.1
##$BCFW= 0
##$BC_mod= 2
##$BYTORDP= 0
##$COROFFS= 0
##$CY= -3
##$DATMOD= 1
##$DC= 0
##$DFILT= <>
##$DTYPP= 0
##$F1P= 0
##$F2P= 0
##$FCOR= 1
##$FTSIZE= 16384
##$FT_mod= 6
##$GAMMA= 0
##$GB= 0
##$INTBC= 1
##$INTSCL= 1.334414e-10
##$ISEN= 128
##$LB= 0.24
##$LEV0= 0
##$LPBIN= 0
##$MAXI= 10000
##$MC2= 0
##$MEAN= 0
##$ME_mod= 0
##$MI= 1.114404
##$NCOEF= 0
##$NC_proc= -6
##$NLEV= 6
##$NOISF1= 3.799351
##$NOISF2= 2.8
##$NSP= 0
##$NTH_PI= 0
##$NZP= 0
##$OFFSET= 17.502
##$PC= 1
##$PHC0= -11916.77
##$PHC1= -3.598991
##$PH_mod= 1
##$PKNL= yes
##$PPARMOD= 0
##$PSCAL= 0
##$PSIGN= 0
##$REVERSE= no
##$SF= 200.130006530946
##$SI= 16384
##$SIGF1= 3
##$SIGF2= 2
##$SINO= 5.538805
##$SIOLD= 16384
##$SREGLST= <1H.CDCl3>
##$SSB= 0
##$STSI= 16384
##$STSR= 0
##$SW_p= 4006.41025641026
##$SYMM= 0
##$S_DEV= 0
##$TDeff= 16384
##$TDoff= 0
##$TI= <>
##$TILT= no
##$TM1= 0
##$TM2= 0
##$TOPLEV= 0
##$USERP1= <user>
##$USERP2= <user>
##$USERP3= <user>
##$USERP4= <user>
##$USERP5= <user>
##$WDW= 1
##$XDIM= 16384
##$YMAX_p= 416197077
##$YMIN_p= -395119
$$ End of Bruker specific parameters
$$ ---------------------------------
##NTUPLES= NMR SPECTRUM
##VAR_NAME=  FREQUENCY,     SPECTRUM/REAL,   SPECTRUM/IMAG
##SYMBOL=    X,             R,               I
##VAR_TYPE=  INDEPENDENT,   DEPENDENT,       DEPENDENT
##VAR_FORM=  AFFN,          ASDF,            ASDF
##VAR_DIM=   16384,         16384,           16384
##UNITS=     HZ,            ARBITRARY UNITS, ARBITRARY UNITS
##FACTOR=    0.24454680195387, 1,            1
##FIRST=     3502.67553615292, 0,            0
##LAST=      -503.734720257341, 0,           0
##MIN=       -503.734720257341, -395119,     0
##MAX=       3502.67553615292, 416197077,    0
$$ Real data points
##PAGE= N=1
##DATA TABLE= (X++(R..R)), XYDATA
$$ [...]
5440C578274J8725j11109q3498L0741j31072n8250P1057k961o2690r7978O2293
$$ 3578274 3596999 3485890 3402392 3433133 3302061 3243811 3314868 3311907 3249217 3151239 3213532
5429C213532R2538j50806q3786M907l4549J54630Q210j00165j4938J186J6248
$$ 3213532 3306070 3155264 3071478 3076385 3041836 3196466 3204676 3104511 3089573 3090759 3107007
5418C107007R2826J69652j00230J53590M3511K5763o7429j63782k2098p473o2582
$$ 3107007 3199833 3369485 3269255 3422845 3466356 3492119 3424690 3260908 3238810 3231337 3168755
5407C168755J3186n5245j0076K8167r0613l9311q381Q7365l3442L1412L3692M1407
$$ 3168755 3181941 3126696 3116620 3144787 3054174 3014863 3006482 3093847 3060405 3091817 3125509 3166916
5395C166916J03080p839j08977k6843K305N4160l4623j41103O3624m8898j08414
$$ 3166916 3269996 3262157 3153180 3126337 3128642 3182802 3148179 3007076 3070700 3021802 2913388
5384B913388P3421K0036p5567J3314l2428K2625j2870M6761P1284R4643K6606
$$ 2913388 2986809 3006845 2931278 2944592 2912164 2934789 2921919 2968680 3039964 3134607 3161213
5373C161213l0777O8918L6051j29764j02219P5350M0661O0877M563j02883L637
$$ 3161213 3130436 3199354 3235405 3105641 3003422 3078772 3119433 3180310 3184873 3081990 3085627
5362C085627N1181N4807k559k3336M657J37076K4320k6651M7684J2884J03678
$$ 3085627 3136808 3191615 3189056 3165720 3170377 3307453 3331773 3305122 3352806 3365690 3469368
5351C469368J33068Q5162J0603O3617L1411r3139j09595L3065P8885M4943L7445
$$ 3469368 3602436 3687598 3698201 3761818 3793229 3700090 3590495 3623560 3702445 3747388 3784833
5340C784833p4164K9138J25193n4154L3051j15494P3955J37608r7975p5997J25989
$$ 3784833 3710669 3739807 3865000 3810846 3843897 3728403 3802358 3939966 3841991 3765994 3891983
5329C891983J16683M7709N8066N2045M8853l8585N0898k4642M7568J46628n8345
$$ 3891983 4008666 4056375 4114441 4166486 4215339 4176754 4227652 4203010 4250578 4397206 4338861
5318D338861P8362M6080J09120j5687J9051j8410n5439j08342J368m694J36823
$$ 4338861 4417223 4463303 4572423 4556736 4575787 4557377 4501938 4393596 4394964 4390270 4527093
5307D527093l1106P446Q6379n9660j16731l943L5377J4810j0230L9285P1661o6791
$$ 4527093 4495987 4503433 4589812 4530152 4413421 4409478 4444855 4459665 4449435 4488720 4560381 4493590
5295D493590Q4522J47049K6617J2164K6191J16609K6509l0799O4140p2763n6055
$$ 4493590 4578112 4725161 4751778 4763942 4790133 4906742 4933251 4902452 4966592 4893829 4837774
5284D837774j0912k9775q5737M5997q0260j3642k815k1203O8766m9847K9065K0190
$$ 4837774 4826862 4797087 4711350 4757347 4677087 4663445 4660630 4639427 4708193 4658346 4687411 4707601
5272D707601j4826r4799m4138L7655j50500N2573j17015K894K5359M8501q1184
$$ 4707601 4692775 4597976 4553838 4591493 4440993 4493566 4376551 4379445 4404804 4453305 4372121
5261D372121K6792p1341j974J61026m5133o1218o5217p2354k2263R3774m6290
$$ 4372121 4398913 4327572 4325598 4486624 4441491 4380273 4315056 4242702 4220439 4314213 4267923
5250D267923q2510M5836J0932j4501m3853m4622K3204k1214N8859j7265J3345
$$ 4267923 4185413 4231249 4242181 4227680 4183827 4139205 4162409 4141195 4200054 4182789 4196134
5239D196134l5590J11517J6994o0215K3690j73365M6163j2815q1572l525N6697
$$ 4196134 4160544 4272061 4289055 4228840 4252530 4079165 4125328 4112513 4030941 4027416 4084113
5228D084113k4148N1043J3754N9669j9825R6732J4785j0374O9904m1685L3161
$$ 4084113 4059965 4111008 4124762 4184431 4164606 4261338 4276123 4265749 4335653 4293968 4327129
5217D327129n9353J4885k4984J01144J27607N9535Q4559M2993J13159N0021P424
$$ 4327129 4267776 4282661 4257677 4358821 4486428 4545963 4630522 4673515 4786674 4836695 4844119
5206D844119J14311K8114J93578J18705M8126J965J55029n5332J23562L2548j00687
$$ 4844119 4958430 4986544 5180122 5298827 5346953 5348918 5503947 5448615 5572177 5604725 5504038
5195E504038J34936j10789k1673j7512L4517J0875j9194O8192J2254K7598K3979
$$ 5504038 5638974 5528185 5506512 5489000 5523517 5534392 5515198 5583390 5595644 5623242 5647221
5184E647221N2009J2851R7507j8588n0597R8528N7333K26777O886M6506R2680
$$ 5647221 5699230 5712081 5809588 5791000 5740403 5838931 5896264 6123041 6129927 6176433 6269113
5173F269113M9948J47895J27094M0996M7481O9118J02702K7139m4627K2529K12212
$$ 6269113 6319061 6466956 6594050 6635046 6682527 6751645 6854347 6881486 6836859 6859388 7071600
5162G071600J81503Q8632O1294K51569J91177O6943K01256L16918K32816K97786
$$ 7071600 7253103 7341735 7403029 7654598 7845775 7912718 8113974 8430892 8663708 8961494
5152H961494K93224J85506M14871N49711N63912N79720N22459N82961N74346N24749
$$ 8961494 9254718 9440224 9855095 10404806 10968718 11548438 12070897 12653858 13228204 13752953
5142A3752953P65707P76312N58384j9935k00794j44880q2968j04870j06518p7374
$$ 13752953 14518660 15294972 15853356 15833421 15632627 15487747 15404779 15299909 15193391 15116017
5132A5116017M9581L80237L60265K82090L26201L33171K95112M17646O40871O40293
$$ 15116017 15165598 15545835 15906100 16188190 16514391 16847562 17142674 17560320 18201191 18841484
5122A8841484N34853M42324O25901R29222J079257J102564Q19872O95333J080296
$$ 18841484 19376337 19818661 20444562 21373784 22453041 23555605 24375477 25070810 26151106
5113B6151106P93186l94617j283802j315779j017613q43539p24846n75644m13514
$$ 26151106 26944292 26549675 25265873 23950094 22932481 22088942 21364096 20788452 20374938
5104B0374938k25315n7361l30130l80363k62674l62189j30809j130M5214j8931
$$ 20374938 20149623 20092262 19762132 19381769 19119095 18756906 18626097 18624967 18670181 18651250
5094A8651250k6893j5665K06141L43285N31327K82535m2620P5181J09074l52813
$$ 18651250 18624357 18608692 18814833 19158118 19689445 19971980 19929360 20004541 20113615 19760802
5084A9760802r09511r16110q63934n83535k50262k06113j46542j49318j05814
$$ 19760802 18851291 17935181 17071247 16487712 16237450 16031337 15884795 15735477 15629663
5075A5629663j66391l7000J77127J15253J34318J95207K46883K50797L60522M20585
$$ 15629663 15463272 15426272 15603399 15718652 15852970 16048177 16295060 16545857 16906379 17326964
5065A7326964M53582M67966O54148P16970Q36916P95324Q07168J003354J055061
$$ 17326964 17780546 18248512 18902660 19619630 20456546 21251870 22059038 23062392 24117453
5056B4117453R16365P53932P22928R58575J271649J369720J643102K029494K133060
$$ 24117453 25033818 25787750 26510678 27469253 28740902 30110622 31753724 33783218 35916278
5047C5916278K473257K909743L177646L553826M229047M465873M807725N310145
$$ 35916278 38389535 41299278 44476924 48030750 52259797 56725670 61533395 66843540
5039F6843540N449016N476046N211134M927023M088532L266713K176462Q35101
$$ 66843540 72292556 77768602 82979736 87906759 91995291 95262004 97438466 98273567
5031I8273567r46105k835766m121273n013357n434799n677704n775060n589386
$$ 98273567 97327462 94491696 90370423 85357066 79922267 74244563 68469503 62880117
5023F2880117n330624m960439m367178l985992l616559l179158k595296k339789
$$ 62880117 57549493 52589054 48221876 44235884 40619325 37440167 34844871 32505082
5015C2505082k057381j694696j537821j335204j185314r27945q10638o80290o33270
$$ 32505082 30447701 28753005 27215184 25879980 24694666 23766721 22956083 22275793 21642523
5006B1642523m26069n47507l99628k95834k19446m66583l07069k14038n07420
$$ 21642523 21216454 20668947 20269319 19973485 19754039 19287456 18980387 18766349 18258929
4997A8258929n69314o81396n02238m94897l51130l35335l50417k95254k25998
$$ 18258929 17689615 17008219 16505981 16011084 15659954 15324619 14974202 14678948 14452950
4988A4452950l38957k03577k73867l03851j11693r4814j74045n698O0670O616
$$ 14452950 14113993 13910416 13636549 13332698 13221005 13126191 12952146 12946448 13007118 13013734
4978A3013734k4946M9080N1152q242l1025J00957k27162k60724l69260n35214
$$ 13013734 12988788 13037868 13089020 13080778 13049753 13150710 12923548 12662824 12293564 11758350
4968A1758350m34221m44065l49387j22001k23925j61363j86520j09152K7645k10410
$$ 11758350 11324129 10880064 10530677 10408676 10184751 10023388 9836868 9727716 9755361 9544951
4958I544951q8992n8439m9907k1234L2522n9597K043Q8570J4744J89333k2524
$$ 9544951 9455959 9397520 9347613 9326379 9358901 9299304 9301347 9389917 9404661 9593994 9571470
4947I571470P7516J7251p8009j63346j21812j35692k60530j98397j56099r1598
$$ 9571470 9648986 9666237 9588228 9424882 9303070 9167378 8906848 8708451 8552352 8460754
4937H460754k39058m9920K4550k6456j08419n0955p5493l4516l7653j14304p7229
$$ 8460754 8221696 8171776 8196326 8169870 8061451 8010496 7935003 7900487 7862834 7748530 7671301
4926G671301n3402j41937p3385j22713p9320j15645j09717j40539j09786j15991
$$ 7671301 7617899 7475962 7402577 7279864 7200544 7084899 6975182 6834643 6724857 6608866
4916F608866o327q803r3227q1299k4907j97867k8848J4964J28520N5486j06036
$$ 6608866 6602539 6593736 6500509 6419210 6394303 6196436 6167588 6182552 6311072 6366558 6260522
4905F260522o9765n2378q4894m2839p5632j00909m3687Q2862k10j09194l7496
$$ 6260522 6190757 6138379 6053485 6010646 5935014 5834105 5790418 5873280 5873070 5763876 5726380
4894E726380k7029J0705j33015o8878J13253N3395j20686Q1661J04952L0159o8096
$$ 5726380 5699351 5710056 5577041 5508163 5621416 5674811 5554125 5635786 5740738 5770897 5702801
4883E702801l1954k247n8511l5396J42281O9088l4490p6119J55809N4851k9295
$$ 5702801 5670847 5668600 5610089 5574693 5716974 5786062 5751572 5675453 5831262 5886113 5856818
4872E856818j6972q5564q3648N3156k910j18349l7178N8461k7194m8313J8253
$$ 5856818 5839846 5754282 5670634 5723790 5720880 5602531 5565353 5623814 5596620 5548307 5566560
4861E566560k7617l989j7098J43658L7002l2820P0045O8456N2799R0110O2486
$$ 5566560 5538943 5534954 5517856 5661514 5698516 5665696 5735741 5804197 5856996 5947106 6009592
4850F009592K7976K6658J32607O4538J11007J36816P9786R5976O4689J98981K39264
$$ 6009592 6037568 6064226 6196833 6261371 6372378 6509194 6588980 6684956 6749645 6948626 7187890
4839G187890P5781J86553K88678K25444M36270N31933Q18638Q95684J048760J153042
$$ 7187890 7263671 7450224 7738902 7964346 8400616 8932549 9751187 10646871 11695631 12848673
4829A2848673O32788O44201J339051J382409n81822k210613k299923j562835j069853
$$ 12848673 13481461 14125662 15464713 16847122 16265300 14054687 11754764 10191929 9122076
4820I122076n70502l67262m15143k94041k83071k13478j69885k62634k47700j75735
$$ 9122076 8551574 8184312 7769169 7475128 7192057 6978579 6808694 6546060 6298360 6122625
4810F122625r9108j49952m7710m0832j18947L5164p0391P918K6311K6434M9243
$$ 6122625 6023517 5873565 5825855 5785023 5666076 5701240 5630849 5638767 5665078 5691512 5740755
4799E740755L3000k6442k4009p613J16574K1257P2054P8854J00819L0542M0674
$$ 5740755 5773755 5747313 5723304 5715691 5832265 5853522 5925576 6004430 6105249 6135791 6176465
4788F176465J03682J46625K43381N18272L06235L81367M99206K63913M45981N66432
$$ 6176465 6280147 6426772 6670153 7188425 7494660 7876027 8375233 8639146 9085127 9651559
4778I651559k22922p39971o74310p06629n58365j71822j54847k39678j08389k37896
$$ 9651559 9428637 8688666 8014356 7307727 6749362 6577540 6422693 6183015 6074626 5836730
4768E836730k58730r1142p0135k4785L8913j36009j59872n6294m8048m4837o6574
$$ 5836730 5578000 5486858 5416723 5391938 5430851 5294842 5134970 5078676 5030628 4985791 4919217
4757D919217l3506p0506j8108m2886n8111J1971q6795p560m0716J4540r067q9341
$$ 4919217 4885711 4815205 4797097 4754211 4696100 4708071 4621276 4613716 4573000 4587540 4578473 4489132
4745D489132R173J08318n3752j18537P439Q3518L389j48351k3276p9335j44358
$$ 4489132 4498305 4606623 4552871 4434334 4441773 4525291 4528680 4380329 4357053 4277718 4133360
4734D133360O1951M0576L0919j14447m4021k0068k7312q1809l1113k5841j45497
$$ 4133360 4195311 4235887 4266806 4152359 4108338 4088270 4060958 3979149 3948036 3922195 3776698
4723C776698l2642r842p3954l356n3536J0069k9094l0443k0429K052M4495j13738
$$ 3776698 3744056 3734214 3660260 3656904 3603368 3613437 3584343 3553900 3533471 3535523 3580018 3466280
4711C466280n8331J38987M4424j54688M0533N8179q5739J89337o7401m1877O877
$$ 3466280 3407949 3546936 3591360 3436672 3477205 3535384 3449645 3638982 3571581 3529704 3536581
4700C536581n7630N0058o141K7763q1539M6888N7927N054q9070J26206N5477n5775
$$ 3536581 3478951 3529009 3522868 3550631 3469092 3515980 3573907 3578961 3489891 3616097 3671574 3615799
4688C615799o1478O37N6160L0827L1852p6122L5246l933q05O6909p525j17232
$$ 3615799 3554321 3554958 3611118 3641945 3673797 3597675 3632921 3628988 3628183 3695092 3687567 3570335
4676C570335L9296R693Q8623K3902k3461J10106j44758K9913j7279j4693J07190
$$ 3570335 3609631 3619324 3707947 3731849 3708388 3818494 3673736 3703649 3686370 3671677 3778867
4665C778867P8671L1274Q8043J51106m4336p5284j4651m5627j3629O0596j884
$$ 3778867 3857538 3888812 3976855 4127961 4083625 4008341 3993690 3948063 3934434 3995030 3993146
4654C993146k5540J01160K583q3036p3057j1024Q7827M4155O5661J47508J23504
$$ 3993146 3967606 4068766 4071349 3988313 3915256 3904232 3992059 4036214 4101875 4249383 4372887
4643D372887k28L6118L2001o4196n4211J0456j54455j66915L0992N4141n286j50926
$$ 4372887 4372659 4408777 4440778 4376582 4322371 4332827 4178372 4011457 4042449 4096590 4091304 3940378
4631C940378L8116k9155J879J67333m8735O9347j2947n7257j39349M787K1521
$$ 3940378 3978494 3949339 3951218 4118551 4069816 4139163 4126216 4068959 3929610 3934397 3955918
4620C955918J8483J37708n2382P3903l1769O927p2710j18318J27601K2431K4473
$$ 3955918 3974401 4112109 4059727 4133630 4101861 4108788 4036078 3917760 4045361 4067792 4092265
4609D092265N4802k4240q3844r4505J22257R1971j00180n3430J40785R3903l6279
$$ 4092265 4147067 4122827 4038983 3944478 4066735 4158706 4058526 4005096 4145881 4239784 4203505
4598D203505Q3976P4314l8594m6675R1483M6891J340K45575l2193j9498R5217
$$ 4203505 4287481 4361795 4323201 4276526 4368009 4414900 4416240 4661815 4629622 4610124 4705341
4587D705341L0352K8473m579M6618J43676J50190M6875J94850Q5182J57827K08442
$$ 4705341 4735693 4764166 4759587 4806205 4949881 5100071 5146946 5341796 5426978 5584805 5793247
4576E793247J71256P4216K04094J51293N9873O5076M7788L1132J19105J02159
$$ 5793247 5964503 6038719 6242813 6394106 6453979 6519055 6566843 6597975 6717080 6819239
4566F819239J51585K65938J89216L23112M68067N40876N88310N76556O66276N79863
$$ 6819239 6970824 7236762 7425978 7749090 8217157 8758033 9346343 9922899 10589175 11169038
4556A1169038N45961P05541M33690j28419p41546q95915q24478n17225k84230
$$ 11169038 11714999 12420540 12854230 12725811 11984265 11088350 10263872 9746647 9462417
4547I462417j77858j81203j40960j51126j28381j83392k81894j60986j75364k53523
$$ 9462417 9284559 9103356 8962396 8811270 8682889 8499497 8217603 8056617 7881253 7627730
4537G627730q0942o4598k6345O31N485J054k9037o1996n4423m4065Q8929n5123
$$ 7627730 7546788 7482190 7455845 7456476 7461961 7463015 7433978 7371982 7317559 7273494 7362423 7307300
4525G307300l4705J355J2856O1662N7776j6353O7430J23195J60366P6263J0724
$$ 7307300 7272595 7273950 7286806 7348468 7406244 7389891 7457321 7580516 7740882 7817145 7827869
4514G827869J73070j2793L2565p9385o5540m9220J26257N5236O2579p0287J15331
$$ 7827869 8000939 7988146 8020711 7941326 7875786 7826566 7952823 8008059 8070638 8000351 8115682
4503H115682m96j23445J26812K0945o274L0012N0898J97375J15559L5987J86320
$$ 8115682 8115186 7991741 8118553 8139498 8133224 8163236 8214134 8411509 8527068 8563055 8749375
4492H749375J69995J11754L05444L91144K81124J82540L07226K86341J65171K66632
$$ 8749375 8919370 9031124 9336568 9727712 10008836 10191376 10498602 10784943 10950114 11216746
4482A1216746Q0461J39179J65865k9531k1473J5425P1029K36247K18548J90890
$$ 11216746 11297207 11436386 11602251 11572720 11551247 11566672 11637701 11873948 12092496 12283386
4472A2283386M72870N11862N79815P00077P85483J071824P89823O12205J100662
$$ 12283386 12756256 13268118 13847933 14548010 15333493 16405317 17195140 17807345 18908007
4463A8908007J350929K40657j034627j377695r31904n78041k83140k92892j76484
$$ 18908007 20258936 20499593 19464966 18087271 17155367 16577326 16294186 16001294 15824810
4454A5824810l7387m9028N783L9311J61349P1875J72873J21817P0663J64500J92660
$$ 15824810 15787423 15738395 15744178 15783489 15944838 16016713 16189586 16311403 16382066 16546566 16739226
4443A6739226K33680K67195L46291J69489K04444L11718L52088L01255M07790
$$ 16739226 16972906 17240101 17586392 17755881 17960325 18272043 18624131 18925386 19333176
4434A9333176K65752L26076N13038L74491L33961M11960N75757N72014O73515
$$ 19333176 19598928 19925004 20438042 20812533 21146494 21558454 22134211 22706225 23379740
4425B3379740M66869N24630O12911O49760O99908P67492P12456Q16804R07334
$$ 23379740 23846609 24371239 24984150 25633910 26333818 27101310 27813766 28630570 29537904
4416B9537904Q94307R53971J075834J175386J244042J343540J585213J857931
$$ 29537904 30432211 31386182 32462016 33637402 34881444 36224984 37810197 39668128
4408C9668128K006583K246643K416711K488946K655847K691607K702533K693019
$$ 39668128 41674711 43921354 46338065 48827011 51482858 54174465 56876998 59570017
4400E9570017K909708K899659K958925L188005L224702L163603L171228L307752
$$ 59570017 62479725 65379384 68338309 71526314 74751016 77914619 81085847 84393599
4392H4393599L567989L819744M102953M404634M313623M244796M122135L735641
$$ 84393599 87961588 91781332 95884285 100288919 104602542 108847338 112969473 116705114
4384A16705114L110380K186488J281812K33974r89469k297136l552430m452473
$$ 116705114 119815494 122001982 123283794 123517768 122528299 120231163 116678733 112226260
4376A12226260n089233n636799n786571n039479m127533l251345k607862k342623
$$ 112226260 107137027 101500228 95713657 90674178 86546645 83295300 80687438 78344815
4368G8344815k381239k747348l691710m212968m689070m788994m203029l747708
$$ 78344815 75963576 73216228 69524518 65311550 60622480 55833486 51630457 47882749
4360D7882749l115547k684435k324805k113126j758509j472078j225282j203417
$$ 47882749 44767202 42082767 39757962 37644836 35886327 34414249 33188967 31985550
4352C1985550j078402q98885p87930o77269o93179o20526o13188o52779o73490
$$ 31985550 30907148 30008263 29220333 28543064 27849885 27229359 26616171 25963392 25289902
4343B5289902p56017o78209o50219o74069n43020o64762n49679n39320m98206
$$ 25289902 24533885 23855676 23205457 22531388 21988368 21323606 20773927 20234607 19736401
4334A9736401n66058m94316m38070l95469l62424m34091m82393m65441n71904
$$ 19736401 19170343 18676027 18237957 17842488 17480064 17045973 16563580 16098139 15526235
4325A5526235n49723k80644m30635k78558k81445l09096j76735j75882j29745
$$ 15526235 14976512 14695868 14265233 13986675 13705230 13396134 13219399 13043517 12913772
4316A2913772j59650j01490j83351j93049l9563q5069j22794L321m7490r1371
$$ 12913772 12754122 12652632 12469281 12276232 12236669 12151600 12028806 12032127 11984637 11893266
4306A1893266j24550l8476l3193K4090j61645n262R7962j17008m3818j32107j94401
$$ 11893266 11768716 11730240 11697047 11721137 11559492 11554230 11652192 11535184 11491366 11359259 11164858
4295A1164858l03619k69186r050p0368j70923l8681L3259r2001j06938k3079j28173
$$ 11164858 10861239 10592053 10583003 10512635 10341712 10303031 10336290 10244289 10137351 10114272 9986099
4284I986099m4401j8375l2206n6456q051j48235O230k7751L7187J23934p900j3028
$$ 9986099 9941698 9923323 9891117 9834661 9826610 9678375 9684605 9656854 9694041 9817975 9810075 9797047
4272I797047M5956m0720j41772N2613o2993k7465J34792J03569n3606J2983J7469
$$ 9797047 9843003 9802283 9660511 9713124 9650131 9622666 9757458 9861027 9807421 9820404 9837873
4261I837873N1908R9383P5017O2584L0204p0066J02890O1616J146j3344P9182
$$ 9837873 9889781 9989164 10064181 10126765 10156969 10086903 10189793 10251409 10252555 10239211 10318393
4250A0318393R938k7060p9388N7160J17568j8984Q1506J20549M6510N9639J60397
$$ 10318393 10328331 10301271 10221883 10279043 10396611 10377627 10459133 10579682 10626192 10685831 10846228
4239A0846228O6525O6056J12300K67967J50654J18366K13975K21426J07211j82741
$$ 10846228 10912753 10978809 11091109 11359076 11509730 11628096 11842071 12063497 12170708 11987967
4229A1987967j58025j13773o5024L8224O0352J66724J30423O9565J80243K49168
$$ 11987967 11829942 11716169 11651145 11689369 11749721 11916445 12046868 12116433 12296676 12545844
4219A2545844P5930J74466K18131Q7766J69748J96840n4172P4137Q8378M9321
$$ 12545844 12621774 12796240 13014371 13102137 13271885 13468725 13414553 13488690 13577068 13626389
4209A3626389l1853J16766J9482M1367J14080J58245Q1781K25037J47989J92293
$$ 13626389 13594536 13711302 13730784 13772151 13886231 14044476 14126257 14351294 14499283 14691576
4199A4691576K47528K57819K24261J35547K50571L45418J00184P0647N4389j57491
$$ 14691576 14939104 15196923 15421184 15556731 15807302 16152720 16252904 16323551 16377940 16220449
4189A6220449m5245J6486J2249M8895P0708K5127K65020J34983K23239K35182
$$ 16220449 16175204 16191690 16203939 16252834 16323542 16348669 16613689 16748672 16971911 17207093
4179A7207093J65737L30572K91642K01927L43422M56081M68757N22231M45524
$$ 17207093 17372830 17703402 17995044 18196971 18540393 18996474 19465231 19987462 20432986
4170B0432986O02165O37361M53806N04383P04889Q29991R12067R80760R39891
$$ 20432986 21035151 21672512 22126318 22630701 23335590 24165581 25077648 26058408 26998299
4161B6998299J046050J075627J338179J342244J374289J519503J666122J896283
$$ 26998299 28044349 29119976 30458155 31800399 33174688 34694191 36360313 38256596
4153C8256596K019250K072164K479839K661070K712859L207345L675928M234245
$$ 38256596 40275846 42348010 44827849 47488919 50201778 53409123 57085051 61319296
4145F1319296M780877N609979O416501P409198Q631544R960376J1518060J2984065
$$ 61319296 66100173 71710152 78126653 85535851 94167395 104127771 115645831 128629896
4137A28629896J4078673J3865255J2793980J1021519Q649732K277163p846356
$$ 128629896 142708569 156573824 169367804 180389323 189039055 191316218 183469862
4130A83469862j6450525k0028539j8893469j5823507j2675217r828848p866784
$$ 183469862 167019337 146990798 128097329 112273822 99598605 89769757 81902973
4123H1902973o432422n238665m506162l823644l135881k743941k376146j895911
$$ 81902973 75470551 70231886 65725724 61902080 58766199 56022258 53646112 51750201
4115E1750201j623844j533604j123796q49855p54142o17166m77650n40265m46540
$$ 51750201 50126357 48592753 47468957 46619102 45864960 45247794 44770144 44229879 43783339
4106D3783339j16435k21443k54401r5105l6326N2676p5935J54615L92240L25113
$$ 43783339 43666904 43445461 43191060 43095955 43059629 43112305 43036370 43190985 43583225 43908338
4096D3908338L91479M92184N56872N01708O24449P20609P61366Q20948J028266
$$ 43908338 44299817 44792001 45348873 45850581 46475030 47195639 47957005 48777953 49806219
4087D9806219J109969J314804J458071J634034J777183K063169K235683K475028
$$ 49806219 50916188 52230992 53689063 55323097 57100280 59163449 61399132 63874160
4079F3874160K760227K857427K966993K983584K740188K521892K020168J234177
$$ 63874160 66634387 69491814 72458807 75442391 78182579 80704471 82724639 83958816
4071H3958816P88946N17003M59559R64714J298885K042417K357143K647959L031253
$$ 83958816 84747762 85264765 85724324 86689038 87987923 90030340 92387483 95035442 98066695
4062I8066695L125419L347990L538787L773015M345088M941448N564913O449052
$$ 98066695 101192114 104540104 108078891 111851906 116196994 121138442 126703355 133152407
4054A33152407P603826Q869931J0374683J2267627J4021443J5461809J6196340
$$ 133152407 140756233 149626164 160000847 172268474 186289917 201751726 217948066
4047B17948066J6176993J4985957J1914951O041396n80146p307907j3761753j8260349
$$ 217948066 234125059 249111016 261025967 267067363 266487217 259179310 245417557 227157208
4039B27157208k1138997k2058620k0627265j7678456j4246171j1349141r273591
$$ 227157208 206018211 183959591 163332326 145653870 131407699 120058558 110784967
4032A10784967p629894o533954n447896m479139l839216l033850k373491j896460
$$ 110784967 103155073 96621119 91173223 86694084 82854868 79821018 77447527 75551067
4024G5551067j475400j024316p99608q76568q34417j062394j621557k456947l111991
$$ 75551067 74075667 73051351 72251743 71375175 70540758 69478364 67856807 65399860 62287869
4015F2287869l433308l306437l042244k820661k451718k019237j816109j735285
$$ 62287869 58854561 55548124 52505880 49685219 47233501 45214264 43398155 41662870
4007D1662870j439412j200608j162181j056068q73050q36537p26234p47746p26897
$$ 41662870 40223458 39022850 37860669 36804601 35931551 35095014 34368780 33621034 32894137
3998C2894137p44839p55886o86204o93063n63558n11494o23236m59750l26229
$$ 32894137 32149298 31393412 30707208 30014145 29450587 28939093 28315857 27856107 27529878
3989B7529878l49318m36584l76883k76075j66984j82336r9509r206Q0046J65052
$$ 27529878 27180560 26743976 26367093 26091018 25924034 25741698 25642189 25632983 25713029 25878081
3979B5878081L33189L35444N20102O61615P41412Q59798O17406N88739N19376
$$ 25878081 26211270 26546714 27066816 27728431 28469843 29329641 29947047 30535786 31055162
3970C1055162K02337n12613j435947j477469j413896j203975q27053p47728n81459
$$ 31055162 31257499 30744886 29308939 27831470 26417574 25213599 24386546 23638818 23057359
3961B3057359l91550k00229k80060j94314k6212j14917j13305o1373M4391J43670
$$ 23057359 22665809 22465580 22185520 21991206 21964994 21850077 21736772 21675399 21719790 21863460
3951B1863460N009J61170O2998O414j25450j40318m7603n4765k28374k16713j85015
$$ 21863460 21868469 22029639 22092637 22099051 21973601 21833283 21785680 21730915 21502541 21285828 21100813
3940B1100813k65313l63984l35660k73801k62490j77034k23585k73517n701o4736
$$ 21100813 20835500 20471516 20135856 19862055 19599565 19422531 19198946 18925429 18919728 18854992
3930A8854992k43946n6094q3874j08529p3860q7804j80334j88392P4315q2709
$$ 18854992 18611046 18554952 18471078 18362549 18288689 18200885 18020551 17832159 17906474 17823765
3920A7823765N1266K06333J22134K69110K90090L06946K06845K57001L06760N2499
$$ 17823765 17875031 18081364 18203498 18472608 18762698 19069644 19276489 19533490 19840250 19892749
3910A9892749K6307P011l25532k68217k70800k83066l21332j08922k11086p0610
$$ 19892749 19919056 19926067 19600535 19332318 19061518 18778452 18457120 18348198 18137112 18066502
3900A8066502j40777j68050p8220j00501j16388j84733q9061j41106M8406J50131
$$ 18066502 17925725 17757675 17679455 17578954 17462566 17277833 17188772 17047666 17096072 17246203
3890A7246203J96409K06889J52334K60759M89002M62286N04845O34180Q95398
$$ 17246203 17442612 17649501 17801835 18062594 18551596 19013882 19518727 20152907 21048305
3881B1048305Q98734P88014O91409P38928N89345j16617o33765q83560o65120
$$ 21048305 21947039 22735053 23426462 24165390 24754735 24638118 24004353 23120793 22455673
3872B2455673m45379m10291m98905m65658k83665j66048l17036L9596M2357J97148
$$ 22455673 22010294 21600003 21101098 20635440 20351775 20185727 19868691 19908287 19950644 20147792
3862B0147792L07351L91413M89203P19718O20837N97934N00152N11731L57997
$$ 20147792 20455143 20846556 21335759 22055477 22676314 23274248 23774400 24286131 24644128
3853B4644128K02302j22055n70512n86453r97627q87320q51978p26568p20791
$$ 24644128 24846430 24724375 24153863 23567410 22569783 21682463 20830485 20103917 19383126
3844A9383126n13864m02755l74904k37540j63724j98058j29760j11058M5577r6733
$$ 19383126 18869262 18466507 18091603 17854063 17690339 17492281 17362521 17251463 17297040 17200307
3834A7200307N6869l7586L5868K85682K37779J63120K09579L82362K41310K47196
$$ 17200307 17257176 17219590 17255458 17541140 17778919 17942039 18151618 18533980 18775290 19022486
3824A9022486K67414K97190O0663N1648N5411K2561J21317N1112N9710J09382
$$ 19022486 19289900 19587090 19647753 19699401 19754812 19777373 19898690 19949802 20009512 20118894
3814B0118894J03620J07885J74421J33402J15938J11541J06919R3830R3119K18370
$$ 20118894 20222514 20330399 20504820 20638222 20754160 20865701 20972620 21066450 21159569 21377939
3804B1377939J88211J63358K30800J62166J54665J41611K06051J08460J62697
$$ 21377939 21566150 21729508 21960308 22122474 22277139 22418750 22624801 22733261 22895958
3795B2895958P5495J24176N8302K44578K68108K43974J47500K74413L59029K65617
$$ 22895958 22971453 23095629 23153931 23398509 23666617 23910591 24058091 24332504 24691533 24957150
3785B4957150J17809n9679j25285p8224j11771L6425j23013Q895J95023K35033
$$ 24957150 25074959 25015280 24889995 24811771 24700000 24736425 24613412 24622307 24817330 25052363
3775B5052363J37582K02120M32089M82968N25001M61275O53686N51191N89017
$$ 25052363 25189945 25392065 25824154 26307122 26832123 27293398 27947084 28498275 29087292
3766B9087292P42392P00740M85673N89367N74319P13386O93945R72738R23039
$$ 29087292 29829684 30530424 31016097 31605464 32179783 32893169 33587114 34559852 35482891
3757C5482891R52439R12019J020631R93392N13078K41635j438k1553j82741l4707
$$ 35482891 36435330 37347349 38367980 39361372 39874450 40116085 40114647 40093094 39910353 39875646
3747C9875646J77296L40912N96755O90612P69365P06554O01616M04531N2868m46553
$$ 39875646 40052942 40393854 40990609 41681221 42450586 43157140 43758756 44163287 44216155 43769602
3737D3769602p36953r87760q69324o20111m12777r5973r3209n0951M588j27037
$$ 43769602 43032649 42044889 41175565 40555454 40142677 40046704 39953495 39902544 39907132 39780095
3727C9780095k39376m47944q99472j194674j138634j331257j225554j093792q50075
$$ 39780095 39540719 39092775 38193303 36998629 35859995 34528738 33303184 32209392 31359317
3718C1359317o59770n83408n25139o18304p05998o47342r94642q74393j070555
$$ 31359317 30699547 30116139 29591000 28972696 28266698 27619356 26624714 25750321 24679766
3709B4679766j017164p83341p73137o46339n98122n59624m96946m08686m27797
$$ 24679766 23662602 22879261 22106124 21459785 20861663 20302039 19805093 19396407 18968610
3700A8968610l14022n69016l59754k40289k92236k37878j70170l52966k01471
$$ 18968610 18654588 18085572 17725818 17485529 17193293 16955415 16785245 16432279 16230808
3691A6230808j85620j53377k27130k19015k10981l36815k50855k57035k60845
$$ 16230808 16045188 15891811 15664681 15445666 15234685 14897870 14647015 14389980 14129135
3682A4129135j69746k88642j88909j03185k23328p7190k36376j35071j927r7110
$$ 14129135 13959389 13670747 13481838 13378653 13155325 13078135 12841759 12706688 12704761 12607651
3672A2607651j46447r6101j97962j92986l8161r0114q9709k9035j13593j4740
$$ 12607651 12461204 12365103 12167141 11974155 11935994 11845880 11756171 11727136 11613543 11598803
3662A1598803p5663p9446r8140r1839r914q882o1760M8748k2017o1375q8192Q9265
$$ 11598803 11523140 11443694 11345554 11253715 11243801 11234919 11173159 11221907 11199890 11138515 11050323 11139588
3650A1139588L9108r908L4316J03394K9771k306J89894j33944P3299N9028M7542
$$ 11139588 11178696 11168788 11203104 11306498 11336269 11333963 11523857 11389913 11463212 11522240 11569782
3639A1569782J2879O8665j30828M173J7367K9299N5357J9504N6400O1816J10200
$$ 11569782 11582661 11651326 11520498 11524671 11542038 11571337 11626694 11646198 11702598 11764414 11874614
3628A1874614R3374O8979J22942K87817J62862Q0405J38766J93539J46637Q2268
$$ 11874614 11967988 12036967 12159909 12447726 12610588 12690993 12829759 13023298 13169935 13252203
3618A3252203O0736L1118P5676O4859J15163J53277N6278O6009K29935K39672
$$ 13252203 13312939 13344057 13419733 13484592 13599755 13753032 13809310 13875319 14105254 14344926
3608A4344926K23595K77126L68594L51116M88779M05486N52084O72811N53518
$$ 14344926 14568521 14845647 15214241 15565357 16054136 16459622 17011706 17684517 18238035
3599A8238035Q13191O53512P53507P02467P44384J007867N38469J47670m2312
$$ 18238035 19051226 19704738 20458245 21160712 21905096 22912963 23451432 23599102 23556790
3590B3556790j54126r6922Q4901J74053N43310P87017P90688O84446N71120O10576
$$ 23556790 23402664 23305742 23390643 23564696 24108006 24895023 25685711 26370157 26941277 27551853
3580B7551853M23480R4219J52132J55787L33195M00747O38467R51417J045239
$$ 27551853 27975333 28069552 28221684 28377471 28710666 29111413 29749880 30701297 31746536
3571C1746536J313664J449663J327600J378970J558634P64361r02490j864105
$$ 31746536 33060200 34509863 35837463 37216433 38775067 39539428 38636938 36772833
3563C6772833j627299j102907m45678l3919K70786L06786L80854L68916L44229
$$ 36772833 35145534 34042627 33596949 33563030 33833816 34140602 34521456 34890372 35234601
3554C5234601K89186K87258K19205m725j71361l15456j86807k01869m2997J81146
$$ 35234601 35523787 35811045 36030250 36025525 35854164 35538708 35351901 35150032 35107035 35288181
3544C5288181J14483J72595J80351n028n8910l05428p91726j010687j133069q76429
$$ 35288181 35402664 35575259 35755610 35750582 35691672 35386244 34594518 33583831 32450762 31574333
3534C1574333p46045o95577n33192p42394p82977o54937o87990n67937n03532
$$ 31574333 30828288 30132711 29599519 28857125 28074148 27419211 26731221 26163284 25659752
3525B5659752n26639o27933n35961n53029n20347n12395m61907m74537l69583
$$ 25659752 25133113 24505180 23969219 23416190 22895843 22383448 21921541 21447004 21077421
3516B1077421m47777l63553l18980l45201k57250k41531k14513k71952l04744
$$ 21077421 20629644 20266091 19947111 19601910 19344660 19103129 18888616 18616664 18311920
3507A8311920j36650j52731k50135j72450r2000p0909r6647p8365j9745k9715
$$ 18311920 18175270 18022539 17772404 17599954 17507954 17437045 17340398 17262033 17242288 17212573
3497A7212573J9661n2715n3137r768J8538m1934j00833p7798l0184Q5893K0295
$$ 17212573 17232234 17179519 17126382 17116614 17135152 17093218 16992385 16914587 16884403 16970296 16990591
3486A6990591K5149J68717k888J55697L0478M9437R6071O3501O0178K0958J44716
$$ 16990591 17015740 17184457 17181569 17337266 17367744 17417181 17513252 17576753 17636931 17657889 17802605
3475A7802605J62189J37695L5651J42803R9196J77605O6137Q9061P3826J32107
$$ 17802605 17964794 18102489 18138140 18280943 18380139 18557744 18623881 18712942 18786768 18918875
3465A8918875N079R7657K13388M5252R3450J47321J81028K39956K09143L39673
$$ 18918875 18923954 19021611 19234999 19280251 19373701 19521022 19702050 19942006 20151149 20490822
3455B0490822K20366K11907J50820K67348K72067K01654K72290K75766K89666
$$ 20490822 20711188 20923095 21073915 21341263 21613330 21814984 22087274 22363040 22652706
3446B2652706K95370K93019L54190L72432M02242L18786M14695M11649L93263
$$ 22652706 22948076 23241095 23595285 23967717 24369959 24688745 25103440 25515089 25908352
3437B5908352M57866L50504L03623N30280M99704K85356K60117M18574M30292
$$ 25908352 26366218 26716722 27020345 27550625 28050329 28335685 28595802 29014376 29444668
3428B9444668L97782M13634L69336N22466N56369M64731N56153M78932M90702
$$ 29444668 29842450 30256084 30625420 31147886 31704255 32168986 32725139 33204071 33694773
3419C3694773N62685O53980Q09143Q52757Q13065R22447J049583J048780J223702
$$ 33694773 34257458 34911438 35720581 36573338 37386403 38308850 39358433 40407213 41630915
3410D1630915J178835J343872J419017J400770J343035J350809J345840J513074
$$ 41630915 42809750 44153622 45572639 46973409 48316444 49667253 51013093 52526167
3402E2526167J446827J418363J569199J768824J859921J934341K338794K382963
$$ 52526167 53972994 55391357 56960556 58729380 60589301 62523642 64862436 67245399
3394F7245399K446660K728085K827380K870635L141286L082005L254344L431626
$$ 67245399 69692059 72420144 75247524 78118159 81259445 84341450 87595794 91027420
3386I1027420L588320L503234L480557L467142K974706K431830J734113R45805
$$ 91027420 94615740 98118974 101599531 105066673 108041379 110473209 112207322 113153127
3378A13153127J56010o89103j387224j645392j958344j858298j678818j447162
$$ 113153127 113309137 112620034 111232810 109587418 107629074 105770776 104091958 102644796
3370A02644796j009793r97993j070462j508752j969253k483585l161257l825182
$$ 102644796 101635003 100637010 99566548 98057796 96088543 93604958 90443701 86618519
3362H6618519m253625m476429m508326m371231m198315l785503l448578k932282
$$ 86618519 82364894 77888465 73380139 69008908 64810593 61025090 57576512 54644230
3354E4644230k526159k223841j909879j586921j492412j371245j191844r71220
$$ 54644230 52118071 49894230 47984351 46397430 44905018 43533773 42341929 41370709
3346D1370709q96660r21059q22146o74702n49681n23115m92264m76255l22270
$$ 41370709 40474049 39552990 38730844 38056142 37506461 36983346 36491082 36014827 35692557
3337C5692557l88860k66920k74905l24418k77073l46701j60469l12393j36538
$$ 35692557 35303697 35036777 34761872 34437454 34160381 33813680 33653211 33340818 33204280
3328C3204280L3419j79116k30524q1053k51180j69751l3535j92685k62509n2971
$$ 33204280 33237699 33058583 32828059 32747006 32495826 32326075 32292540 32099855 31837346 31784375
3318C1784375k7194k37188k19031p0319j83839j58911j42340j67975j50257k5560
$$ 31784375 31757181 31519993 31300962 31230643 31046804 30887893 30745553 30577578 30427321 30401761
3308C0401761j64550p1169L8637j45074m3121L250l8858l1088O4325O3019p7606
$$ 30401761 30237211 30166042 30204679 30059605 30016484 30019734 29980876 29949788 30014113 30077132 29999526
3297B9999526K27206J32804M3679J93612J93452O8055K36605J25012J34847J58271
$$ 29999526 30226732 30359536 30403215 30596827 30790279 30858334 31094939 31219951 31354798 31513069
3287C1513069J06118J20567O424O1370l3649K7313m2511p1588r1920k0348j00511
$$ 31513069 31619187 31739754 31746178 31807548 31773899 31801212 31758701 31687113 31595193 31574845 31474334
3276C1474334J5871R8984m0340o1963J54044R4893J23541J76005K98243L10792
$$ 31474334 31490205 31589189 31548849 31486886 31640930 31735823 31859364 32035369 32333612 32644404
3266C2644404K60308K59319L19078L25912K19371J60542K40510L16489M89900
$$ 32644404 32904712 33164031 33483109 33809021 34028392 34188934 34429444 34745933 35235833
3257C5235833L69574L10722M71108O64424O88419Q14946O95513Q24306Q82984
$$ 35235833 35605407 35916129 36387237 37051661 37740080 38555026 39250539 40074845 40957829
3248D0957829J098196J127061J103314J092213J308792J472019J510258J639891
$$ 40957829 42056025 43183086 44286400 45378613 46687405 48159424 49669682 51309573
3240E1309573J839616K024303K146109K524078K609674K683016K780009K894719
$$ 51309573 53149189 55173492 57319601 59843679 62453353 65136369 67916378 70811097
3232G0811097K931626L071478L397451L426407L413958L589095L866030M723096
$$ 70811097 73742723 76814201 80211652 83638059 87052017 90641112 94507142 99230238
3224I9230238N613313O439083P159344Q191457R078938J0093661J0885486J1408589
$$ 99230238 104843551 111282634 118441978 126633435 135712373 145806034 156691520 168100109
3216A68100109J1624919J1226463J0197616Q339230N904798K329977j681162n631285
$$ 168100109 179725028 190951491 201149107 209488337 215393135 217723112 216041950 210410665
3208B10410665r188885j1838885j3391715j4102589j3877529j2611822j1244917
$$ 210410665 201221780 189382895 175991180 161888591 148011062 135399240 124154323
3201A24154323r814330q385130o956325n862291n040757m174159l319188k680013
$$ 124154323 114339993 105954863 98998538 93136247 88095490 83921331 80602143 77922130
3193G7922130k328676j777061j368262j070752n54806o08399k90504j87685j27712
$$ 77922130 75593454 73816393 72448131 71377379 70822573 70214174 69923670 69735985 69608273
3184F9608273o5801j24731Q357l11230n39996q54284r45010r23019n51926m22286
$$ 69608273 69542472 69417741 69426098 69114868 68574872 67720588 66775578 65852559 65300633 64878347
3174F4878347l44192k32707j02235R9306K41335J71717K11069L65762L00398L42578
$$ 64878347 64534155 64301448 64199213 64298519 64539854 64711571 64922640 65288402 65588800 65931378
3164F5931378L88421L39930L85492L76410K44542L14671M30105N21827N25546
$$ 65931378 66319799 66659729 67045221 67421631 67666173 67980844 68410949 68932776 69458322
3155F9458322M69527N48777M87459L84535L82258L65281K65476J22865N1277J72743
$$ 69458322 69927849 70476626 70964085 71348620 71730878 72096159 72361635 72484500 72535777 72708520
3145G2708520L15866J07772L06415L65213L61644M31521M52186M75915L53178
$$ 72708520 73024386 73132158 73438573 73803786 74165430 74596951 75049137 75525052 75878230
3136G5878230J79047L39441K77531K66153K70645K68813K27919L99396N28047
$$ 75878230 76057277 76396718 76674249 76940402 77211047 77479860 77707779 78107175 78635222
3127G8635222M41699N47493P37737O93557P74556Q67456R96230J103523J116427
$$ 78635222 79076921 79624414 80362151 81055708 81830264 82697720 83693950 84797473 85913900
3118H5913900J384729J433462J463868J821704J876652K159642K451217K719155
$$ 85913900 87298629 88732091 90195959 92017663 93894315 96053957 98505174 101224329
3110A01224329L100224L271959L445887L953985M255165M265342M500787M428655
$$ 101224329 104324553 107596512 111042399 114996384 119251549 123516891 128017678 132446333
3102A32446333M201433M008069L677088L528853L510440L505969L356367L539398
$$ 132446333 136647766 140655835 144332923 147861776 151372216 154878185 158234552 161773950
3094A61773950L824751M082687M453727M504568M390871L739516K880098J583354
$$ 161773950 165598701 169681388 174135115 178639683 183030554 186770070 189650168 191233522
3086A91233522K70023j569102l063504l817661l919012l847576l567046l490488
$$ 191233522 191503545 189934443 186870939 183053278 179134266 175286690 171719644 168229156
3078A68229156l370008k987893l313463l818319l989191l629021l241564l186310
$$ 168229156 164859148 161871255 158557792 154739473 150750282 147121261 143879697 140693387
3070A40693387l117865l144478l273734l586712l843354m057355m209639m485458
$$ 140693387 137575522 134431044 131157310 127570598 123727244 119669889 115460250 110974792
3062A10974792m362030m112588l505331k821708k402033j838620j052940q76089
$$ 110974792 106612762 102500174 98994843 96173135 93771102 91932482 90879542 90003453
3054I0003453r14296o85681o06113j431230l179920m528258m776976m206147l270554
$$ 90003453 89089157 88403476 87797363 86366133 83186213 78657955 73880979 69674832 66404278
3045F6404278k495505k009349j553073j173025q92379n76190m61480l47751o0808
$$ 66404278 63908773 61899424 60346351 59173326 58280947 57704757 57243277 56895526 56834718
3036E6834718N0394k97632q58926r81979j076763r66896p00492m76032m65993
$$ 56834718 56885112 56587480 55728554 54746575 53669812 52702916 52002424 51526392 51060399
3027E1060399m27152l18354l49273l28179j04843j11554k2106q4669N0265N6277
$$ 51060399 50633247 50314893 49965620 49637441 49532598 49421044 49398938 49314269 49364534 49420811
3017D9420811P1645J44523J13896K35420J95719J32121K30787L80996O08576N32420
$$ 49420811 49492456 49636979 49750875 49986295 50182014 50314135 50544922 50925918 51534494 52066914
3007E2066914J68907r1801q1630j71459N6170J3288k5412K16276J51893L00973
$$ 52066914 52235821 52144020 52062390 51890931 51947101 51960389 51934977 52151253 52303146 52604119
2997E2604119J57530J11883J23461L2703j24699k04240k78575m31287m42186n07394
$$ 52604119 52761649 52873532 52996993 53029696 52904997 52700757 52422182 51990895 51548709 51041315
2987E1041315n66442o49396o15867o85323n20238n37150o23367n82401p36311
$$ 51041315 50474873 49825477 49209610 48524287 48004049 47466899 46843532 46261131 45524820
2978D5524820o03634m85561l71493k73285k16586j45496q2357k2486O7929J04877
$$ 45524820 44921186 44435625 44064132 43790847 43574261 43428765 43346408 43323922 43391851 43496728
2968D3496728J29835J95251K71785L79286L95537N79695P69043R20759R82613
$$ 43496728 43626563 43821814 44093599 44472885 44868422 45448117 46217160 47137919 48120532
2959D8120532J215857J228288J383028J501331J767132K078388K234118K634446
$$ 48120532 49336389 50564677 51947705 53449036 55216168 57294556 59528674 62163120
2951F2163120K999425L261767L407019L377392L654660L971672M407611M866048
$$ 62163120 65162545 68424312 71831331 75208723 78863383 82835055 87242666 92108714
2943I2108714M852926M635342M439734L870790L080505K171300R40621k99143
$$ 92108714 96961640 101596982 106036716 109907506 112988011 115159311 116099932 115800789
2935A15800789j684239l024927m147455m983669n523115n737123n728590n421869
$$ 115800789 114116550 111091623 106944168 101960499 96437384 90700261 84971671 79549802
2927G9549802n141732m478550l988834l472980k989383k595831k573564k480398
$$ 79549802 74408070 69929520 65940686 62467706 59478323 56882492 54308928 51828530
2919E1828530k430599k332767k372144k422375k202481k021658j930250j690815
$$ 51828530 49397931 47065164 44693020 42270645 40068164 38046506 36116256 34425441
2911C4425441j455706j431958j289408j146030j010583r48906q79585p48542p26424
$$ 34425441 32969735 31537777 30248369 29102339 28091756 27142850 26263265 25514723 24788299
2902B4788299p00841o05345n27450o01046m54962m12736l37794l60979m27764
$$ 24788299 24087458 23482113 22954663 22353617 21898655 21485919 21148125 20787146 20359382
2893B0359382l72959k46535k57519l64030l13374j69846k77364k93136p4455k53024
$$ 20359382 19986423 19739888 19482369 19118339 18804965 18635119 18357755 18064619 17990164 17737140
2883A7737140k06818k68721k19208k90743j52198k45911k03347j46061p9331j51948
$$ 17737140 17530322 17261601 17042393 16751650 16599452 16353541 16150194 16004133 15924802 15772854
2873A5772854k32262p5540o8667P815n9526j11932J6330L4691p8821l5227m0000
$$ 15772854 15540592 15465052 15396385 15404200 15344674 15232742 15249072 15283763 15204942 15169715 15129715
2862A5129715n0095P877m3918J36831j5865n4354P4327j24963n5519p1807j02029
$$ 15129715 15079620 15087497 15043579 15180410 15164545 15110191 15184518 15059555 15004036 14932229 14830200
2851A4830200n3482O3263m329j1159k3096M5494L6048J26614R9010R5844O1543
$$ 14830200 14776718 14839981 14835652 14824493 14801397 14846891 14882939 15009553 15108563 15204407 15265950
2840A5265950J87613J44272M7981K18009P6410P3138J86317J79933J52530J89026
$$ 15265950 15453563 15597835 15645816 15863825 15940235 16013373 16199690 16379623 16532153 16721179
2830A6721179K25478J41020J51613J12847J98518K70575K03356K79067J85525
$$ 16721179 16946657 17087677 17239290 17352137 17550655 17821230 18024586 18303653 18489178
2821A8489178L08200L54252K73430L44501L57394L09063K88714L04228K78441
$$ 18489178 18797378 19151630 19425060 19769561 20126955 20436018 20724732 21028960 21307401
2812B1307401L57830L50603L54973M68543L87102M14953M63763L09096K86995
$$ 21307401 21665231 22015834 22370807 22839350 23226452 23641405 24105168 24414264 24701259
2803B4701259L98315N81789M02000L08291M87172M22878L47635M60308O73092
$$ 24701259 25099574 25681363 26083363 26391654 26878826 27301704 27649339 28109647 28782739
2794B8782739N39091O11923O74327P71364Q70031J083655R68246J131771J295398
$$ 28782739 29321830 29933753 30608080 31379444 32249475 33333130 34301376 35433147 36728545
2785C6728545J473475J363627J383452J425482J320098J130456J158099J079351
$$ 36728545 38202020 39565647 40949099 42374581 43694679 44825135 45983234 47062585
2777D7062585R38858R74157R81828J416415J445536J637088J993822J982851K225111
$$ 47062585 48001443 48975600 49957428 51373843 52819379 54456467 56450289 58433140 60658251
2768F0658251K541349K627602K901844K986102L224604L517776L599177L901169
$$ 60658251 63199600 65827202 68729046 71715148 74939752 78457528 82056705 85957874
2760H5957874M246665M444071M712866M759675M768498M960730M937990M948439
$$ 85957874 90204539 94648610 99361476 104121151 108889649 113850379 118788369 123736808
2752A23736808M867927M888632M239982K900623J908838J164442J028039K84427
$$ 123736808 128604735 133493367 137733349 140633972 142542810 143707252 144735291 145019718
2744A45019718j250917l030039m122224m400156l991037l439590l026150k667234
$$ 145019718 143768801 140738762 136616538 132216382 128225345 124785755 121759605 119092371
2736A19092371k169311j765933r81767k59789M52013J011968J485580K114267
$$ 119092371 116923060 115157127 114175360 113915571 114367584 115379552 116865132 118979399
2728A18979399K684610L096575L468567M145610M954122N705824O453739P627256
$$ 118979399 121664009 124760584 128229151 132374761 137328883 143034707 149488446 157115702
2720A57115702R217804J0867506J2634579J4925895J7254579J9806025K2710780
$$ 157115702 166333506 177201012 189835591 204761486 222016065 241822090 264532870
2713B64532870K5340972K6895578K7036664K5171471K2411945J8218945O588632
$$ 264532870 289873842 316769420 343806084 368977555 391389500 409608445 416197077
2706D16197077j3163592l2031788m1281409m0632300l4726081k7640254k1674035
$$ 416197077 403033485 371001697 329720288 289087988 254361907 226721653 205047618
2699B05047618j7127343j3889677j1724051j0192306q805150p507473o430374
$$ 205047618 187920275 174030598 162306547 152114241 143309091 135801618 129371244
2692A29371244n472925m904294m921971n350420o242577o700551o349210n812201
$$ 129371244 123898319 118994025 114072054 108721634 102479057 95778506 89429296 83617095
2684H3617095n211859m323704l710581l161155k969618k760271k641590k422105
$$ 83617095 78405236 74081532 70370951 67209796 64240178 61479907 58838317 56416212
2676E6416212k260075k089788j942356j863318j762600j818052j744221j556171
$$ 56416212 54156137 52066349 50123993 48260675 46498075 44680023 42935802 41379631
2668D1379631j399191j393021j213036j167349j193269j184733j030739r66610
$$ 41379631 39980440 38587419 37374383 36207034 35013765 33829032 32798293 31831683
2660C1831683r22575r62452q48992q39928q24560p09453p50778p60015m98060
$$ 31831683 30909108 29946656 29097664 28257736 27433176 26723723 25972945 25212930 24714870
2651B4714870m26835n00757m74287m71336l45904k16962k12967m28671l35627
$$ 24714870 24288035 23787278 23312991 22841655 22495751 22278789 22065822 21637151 21301524
2642B1301524k64225m39896n45746m60560n54763o22115m04277n43516n10613
$$ 21301524 21037299 20597403 20051657 19591097 19036334 18414219 18009942 17466426 16955813
2633A6955813n07478m98410n87123m15771l98657l50116l71073l53118l99375
$$ 16955813 16448335 15949925 15362802 14947031 14548374 14198258 13827185 13474067 13074692
2624A3074692m11197k82542k98447j95334l83268k64515k57377l04832k46033
$$ 13074692 12663495 12380953 12082506 11887172 11503904 11239389 10982012 10677180 10431147
2615A0431147k68382j65942k22131k81040k27167l10215j85897j96028k16208
$$ 10431147 10162765 9996823 9774692 9493652 9266485 8956270 8770373 8574345 8358137
2606H358137j95020j64830j96774k86726j66607r8259k03281j35719p4577j72630
$$ 8358137 8163117 7998287 7801513 7514787 7348180 7249921 7046640 6910921 6836344 6663714
2596F663714j00542k10056j59163k4340j3505k43258j83182j8257j47243q8510
$$ 6663714 6563172 6353116 6193953 6169613 6156108 5912850 5729668 5711411 5564168 5475658
2586E475658q6370n9685j49020k3436o2691o8400r3924k7559p2534M9216j03321
$$ 5475658 5389288 5329603 5180583 5157147 5094456 5026056 4932132 4904573 4832039 4881255 4777934
2575D777934l783j11766j30762j49697m212j13032m1855j15834j36530M5284j33477
$$ 4777934 4774151 4662385 4531623 4381926 4377714 4264682 4222827 4106993 3970463 4015747 3882270
2564C882270o6511j26268N4598j59276j53599r210o1230r4246l6359o4451O1033
$$ 3882270 3815759 3689491 3744089 3584813 3431214 3422004 3360774 3266528 3230169 3165718 3226751
2553C226751m3934j03413q3948J32331j4463n7895m0225j21181l5908k9396j13776
$$ 3226751 3182817 3079404 2995456 3127787 3113324 3055429 3015204 2894023 2858115 2828719 2714943
2542B714943J1609p0253j113J17672q3856k00309j16453K4218j124J3316N2948
$$ 2714943 2726552 2656299 2655186 2772858 2689002 2488693 2372240 2396458 2395334 2408650 2461598
2531B461598k8261j0672p408l8271o1787Q317n3509J0k9266m3189o0846J1717
$$ 2461598 2433337 2422665 2415257 2376986 2315199 2323516 2270007 2270017 2240751 2197562 2136716 2148433
2519B148433j6399N079J10311j48076l6627k4695n1342L2080N6691p9897p2478
$$ 2148433 2132034 2137113 2247424 2099348 2062721 2038026 1986684 2018764 2075455 1995558 1923080
2508A923080o4865k5995K5157O1720J09790m9692j05111P0580O7137p9922q6723
$$ 1923080 1858215 1832220 1857377 1919097 2028887 1979195 1874084 1944664 2011801 1931879 1845156
2497A845156N0942j0699O6053j691m2273J4702j3123j865J0054l4514j03786j5865
$$ 1845156 1896098 1885399 1951452 1949761 1907488 1922190 1909067 1907202 1917256 1882742 1778956 1763091
2485A763091L0340o0159j06077l2977j4284M7775j249K1721j3465p9197p2820
$$ 1763091 1793431 1733272 1627195 1594218 1579934 1627709 1626460 1648181 1634716 1555519 1482699
2474A482699P422Q0711J1133n7137K8252Q6114J22993k04282j5201J03164m576
$$ 1482699 1490121 1570832 1581965 1524828 1553080 1639194 1762187 1557905 1542704 1645868 1641292
2463A641292K4063J83042M0949P7807N7392n1568J31750J40191J56191J9728J17163
$$ 1641292 1665355 1848397 1889346 1967153 2024545 1972977 2104727 2244918 2401109 2420837 2538000
2452B538000P1155l9795j58150q6726k51393k08043j34710j53506o7203o5613
$$ 2538000 2609155 2569360 2411210 2324484 2073091 1865048 1730338 1576832 1509629 1444016
2442A444016n3020j48364J8004r3223j68121J13332j14848L5844K3746j20072
$$ 1444016 1390996 1242632 1260636 1167413 999292 1112624 997776 1033620 1057366 937294
2432I37294o4123l4133p0690j6370N5643p0299j17625L5300j7368M1129n2642
$$ 937294 873171 839038 768348 751978 807621 737322 619697 654997 637629 678758 626116
2421F26116n4635p6041j9244q05L5371o6692n9254o9866n3887N2415k8193K1982
$$ 626116 571481 495440 476196 475391 510762 444070 384816 314950 261063 313478 285285 307267
2409C07267o9006J01345K425j5702o246J3682m2765q654j5799j4848K6296o3702
$$ 307267 238261 339606 342031 326329 320083 333765 291000 282346 266547 251699 277995 214293
2397B14293N0325O3012m9378k8992k8115P531j07602K4065J9227o6264M0755q0515
$$ 214293 264618 327630 278252 249260 221145 228676 121074 145139 164366 98102 138857 58342
2385E8342k5767R0674L3170L2772o6055j41243Q775N5125K3463J7642P783O3243
$$ 58342 32575 123249 156419 189191 123136 -18107 -9332 45793 69256 86898 94681 157924
2373A57924k3551N8749n3006J3319l4495l1033K8784K9796j0623l3422M9041P4846
$$ 157924 134373 193122 140116 153435 118940 87907 116691 146487 135864 102442 151483 226329
2361B26329p8893j2596j6581L0177O404N7175q509n3734r3889k0512K5723k2199
$$ 226329 147436 134840 118259 148436 154840 212015 203506 149772 55883 35371 61094 38895
2349C8895Q4609n357j2691j69708O1214L4614q134P1189j1620q6175P3601l1088
$$ 38895 123504 118147 105456 -64252 -3038 31576 23442 94631 83011 -3164 70437 39349
2337C9349J13169j17177r9908J03438p8868N431k8428k413J42229L3765k4522
$$ 39349 152518 35341 -64567 38871 -39997 -34566 -62994 -65407 76822 110587 86065
2326H6065K6199o9742k7683K0861k0352o2494o5803O4396R5325p9492q522P8613
$$ 86065 112264 42522 14839 35700 15348 -47146 -112949 -48553 46772 -32720 -41242 37371
2314C7371k1383K7765n5994k6549o9786L6308o433O5783Q3920j36024p1103J46266
$$ 37371 15988 43753 -12241 -38790 -108576 -72268 -78701 -12918 71002 -65022 -136125 10141
2302A0141l9658n4075J3099o9306l5828P2147j1145m8843L7269l2848N440J16644
$$ 10141 -29517 -83592 -70493 -139799 -175627 -103480 -114625 -163468 -126199 -159047 -153607 -36963
2290c6963k3603r6738L0025P8597N1509l5624j121o9386K3282O905m7245N7557
$$ -36963 -60566 -157304 -127279 -48682 2827 -32797 -33918 -103304 -80022 -73117 -120362 -62805
2278f2805q6420K7480M040o9672K1635m5845K436J8132J080P5670l6027Q3667
$$ -62805 -149225 -121745 -117705 -187377 -165742 -211587 -209151 -191019 -189939 -114269 -150296 -66629
2266f6629N2547p1643m4474k4345N5451j30158O1806l1333J2128j05596Q8588
$$ -66629 -14082 -85725 -130199 -154544 -99093 -229251 -167445 -198778 -186650 -292246 -203658
2255b03658N4716L7052M2311L6910r2526p4077j4041m5996K3846L7185K6474N2701
$$ -203658 -148942 -111890 -69579 -32669 -125195 -199272 -213313 -259309 -235463 -198278 -171804 -119103
2243a19103q6233J1232K2088N1918Q0194l7448n4292m1107P8273q2535l0446p9582
$$ -119103 -205336 -194104 -172016 -120098 -39904 -77352 -131644 -172751 -94478 -177013 -207459 -287041
2231b87041R9176N5650p520J3090l0651J7549m0922r3617m464Q4276M8757j1986
$$ -287041 -187865 -132215 -139735 -126645 -157296 -139747 -180669 -274286 -278750 -194474 -145717 -157703
2219a57703J13819l6483p9164P6429j4579q5784J5651O1170L0023K8281j6828
$$ -157703 -43884 -80367 -159531 -83102 -97681 -183465 -167814 -106644 -76621 -48340 -65168
2208f5168L7984Q6149m9031j7772l9939O180m5122L7828r4999k3450J62346q1450
$$ -65168 -27184 58965 9934 -7838 -47777 -41597 -86719 -48891 -143890 -167340 -4994 -86444
2196h6444l3928M3390k8257n9027L8831K829n4322m0693J15859M0515K2701r288
$$ -86444 -120372 -76982 -105239 -164266 -125435 -122606 -176928 -217621 -101762 -61247 -38546 -47834
2184d7834R6203j15208j15097O8232J47954L9013K2649l1716n1523M1141l7401
$$ -47834 48369 -66839 -181936 -113704 34250 73263 95912 64196 12673 53814 16413
2173A6413L9803R637j4531n5352P6028o8961p9242N8740M3146k302J6578P7129
$$ 16413 56216 65853 51322 -4030 71998 3037 -76205 -17465 25681 23379 39957 117086
2161A17086N1736j2259p1066j5611L0101m9897q671M4512R656m262N2284L5161
$$ 117086 168822 156563 85497 69886 99987 50090 41419 85931 95587 91325 143609 178770
2149A78770q305j1294N525j4707l2775M6096K0640L0061p034J14173m0073L974
$$ 178770 170465 159171 164696 149989 117214 163310 183950 214011 206977 321150 281077 285051
2137B85051M985O6954J11067M8745J416K5087N9531K8839O2683o6856o6567J9160
$$ 285051 290036 356990 468057 516802 518218 543305 602836 631675 694358 627502 560935 580095
2125E80095R3011k2912j2789m186N053J6863N3692j38741J1959Q7377M5429o3542
$$ 580095 673106 650194 637405 633219 638272 655135 708827 570086 582045 669422 714851 651309
2113F51309N2836K8280j2937M7874n4392m6815P0865L8669J51938j7207L9856
$$ 651309 704145 732425 719488 767362 712970 666155 737020 775689 927627 910420 950276
2102I50276R4610j07346M8372J22429N0005J16330L284p572p367J38948M7292
$$ 950276 1044886 937540 985912 1108341 1158346 1274676 1277960 1270388 1263021 1401969 1449261
2091A449261J03553J56496K53779J02001M8572J51232K33944J42565J45181K76686
$$ 1449261 1552814 1709310 1963089 2065090 2113662 2264894 2498838 2641403 2786584 3063270
2081C063270K16734K17579L37522L04410M08878L31108M40975M91246M23206O48851
$$ 3063270 3280004 3497583 3835105 4139515 4548393 4879501 5320476 5811722 6234928 6883779
2071F883779O68628Q41728J153727J407506J760255K186899K752130L093665J924726
$$ 6883779 7552407 8394135 9547862 10955368 12715623 14902522 17654652 20748317 22673043
2062B2673043J781526L949233K240251l452305n883915n515027l484782k259911
$$ 22673043 24454569 28403802 30644053 27191748 21307833 15792806 12308024 10048113
2054A0048113j541421j205150r17078o25255n23077l72209l40608l44269l06287
$$ 10048113 8506692 7301542 6384464 5759209 5236132 4863923 4523315 4179046 3872759
2045C872759m17745m38653l03443k31153k30537n137j74165k23881p7793m4127
$$ 3872759 3455014 3016361 2712918 2481765 2251228 2246091 2071926 1848045 1770252 1726125
2035A726125j58670r7846J2511n7602j5976k1792r4087j13468k6557p7924j10481
$$ 1726125 1567455 1469609 1482120 1424518 1408542 1386750 1292663 1179195 1152638 1074714 964233
2024I64233m2891l4895K1725j49654Q3728L4358j91080J3972o3924j0395j0136
$$ 964233 921342 886447 908172 758518 842246 876604 685524 699496 635572 625177 615041
2013F15041o7827M1057J0998J8967j26290j25357j39138O9494M7854l2354k2499
$$ 615041 547214 588271 599269 618236 491946 366589 227451 296945 344799 312445 289946
2002B89946L2057n8986K244K7651j0414J7935m2959K2517j18608O2787n2936r3746
$$ 289946 322003 263017 265261 292912 282498 300433 257474 279991 161383 224170 171234 77488
1990G7488J26853P129j02890L6456j13501J48517l2429J4479k2899K1560l491
$$ 77488 204341 211470 108580 145036 31535 180052 147623 162102 139203 160763 157272
1979A57272p5412j08073J3687J15475N9648p3487n6027n265L5339L2218m328k4763
$$ 157272 81860 -26213 -12526 102949 162597 89110 33083 27818 63157 95375 91047 66284
1967F6284o1410m760O606l9427l2039J50166j00541p9197P6472m6299P4667l4051
$$ 66284 4874 114 6720 -32707 -64746 85420 -15121 -94318 -17846 -64145 10522 -23529
1955b3529o1823M7974K199Q678L7908q660j5942l6396O1137l7565m0964m549k8463
$$ -23529 -85352 -37378 -35179 -26501 11407 2747 -13195 -49591 11546 -26019 -66983 -71532 -99995
1942i9995n8961j8006q9391J93630J20888j11079j9044K2271O5522k1859j00611
$$ -99995 -158956 -176962 -266353 -72723 48165 -62914 -81958 -59687 5835 -16024 -116635
1931a16635R334K5785m717p3604P0925J2038m4404N1169L0711L5215o9402k2451
$$ -116635 -107301 -81516 -86233 -159837 -88912 -76874 -121278 -70109 -39398 -4183 -73585 -96036
1919i6036L5462q7130L3539M1390o8414j50161J27285J50585j02361q0684l917
$$ -96036 -60574 -147704 -114165 -72775 -141189 -291350 -164065 -13480 -115841 -196525 -200442
1908b00442k8109J9913J8138m9011K5882J26554R9447m2948Q3994j28116j5923
$$ -200442 -228551 -208638 -190500 -239511 -213629 -87075 12372 -30576 53418 -74698 -90621
1897i0621K6293M603r3327j33783L1852J8358K8488M8823j3434K5814j06977L9069
$$ -90621 -64328 -59725 -153052 -286835 -254983 -236625 -208137 -159314 -172748 -146934 -253911 -214842
1885b14842P2988m6405R2185J4134k2089N5352P8811l8722m4020k1291l7206k8488
$$ -214842 -141854 -188259 -96074 -81940 -104029 -48677 30134 -8588 -52608 -73899 -111105 -139593
1873a39593O324J16479l5712m585j9018n202n1090r3199l580M993p8364J31287
$$ -139593 -133269 -16790 -52502 -57087 -76105 -81307 -132397 -225596 -229176 -224183 -302547 -171260
1861a71260n2265M729j769J5563p1355N4129Q9000K1444k3532L3953M3608j40969
$$ -171260 -223525 -218796 -220565 -205002 -276357 -222228 -133228 -111784 -135316 -101363 -57755 -198724
1849a98724L7646P6278j1902k5409J5301L147j1808k6942r4342j4685M1327O1223
$$ -198724 -161078 -84800 -96702 -122111 -106810 -103663 -115471 -142413 -236755 -251440 -210113 -148890
1837a48890N7801J06440p7922p4240j8391j446N5773J6957k6073o1646k9770K8051
$$ -148890 -91089 15351 -62571 -136811 -155202 -156648 -100875 -83918 -109991 -171637 -201407 -173356
1825a73356O5351m8464l1020R1164n0903j5859M4919R75Q6863J7366k9225j37896
$$ -173356 -108005 -156469 -187489 -96325 -147228 -163087 -118168 -117193 -30330 -12964 -42189 -180085
1813a80085l0900J09120R7260p1725J131L694n6313r5686K7206O9273k4022m7517
$$ -180085 -210985 -101865 -4605 -76330 -75199 -71505 -127818 -223504 -196298 -127025 -151047 -198564
1801a98564k1276J10057L6971r6346Q8849l3315L8224k3123m3558j3618P5119
$$ -198564 -219840 -109783 -72812 -169158 -80309 -113624 -75400 -98523 -142081 -155699 -80580
1790h0580n2208l0522M2413n1549J9740O6623K4437j16648q7164k0098J0681L0438
$$ -80580 -132788 -163310 -120897 -172446 -152706 -86083 -61646 -178294 -265458 -285556 -274875 -244437
1778b44437Q2673N940R4535j3053m4365j5499O7989n4715J9970K5169m7004J3241
$$ -244437 -161764 -155824 -61289 -74342 -118707 -134206 -66217 -120932 -100962 -75793 -122797 -109556
1766a09556q1141K6833k3399N0406q0211M4571n7094m0789O959K3629l1631O269
$$ -109556 -190697 -163864 -187263 -136857 -217068 -172497 -229591 -270380 -263421 -239792 -271423 -265154
1754b65154Q9721R7497j2839p9317M3031J07737k8049j24402J06849O8412k0755
$$ -265154 -175433 -77936 -90775 -170092 -127061 -19324 -47373 -171775 -64926 3486 -17269
1743a7269N1678j11331p5815o0820P6881M0080j07953J12761J02672M7104j31266
$$ -17269 34409 -76922 -152737 -213557 -136676 -96596 -204549 -91788 10884 57988 -73278
1732g3278j45587j19646J02175P8532J00584n0778l7130m1014o1990j209M2827
$$ -73278 -218865 -338511 -236336 -157804 -57220 -107998 -145128 -186142 -248132 -249341 -206514
1721b06514J07335q5956J6090L3855K8229j4055m6713K9964P6662n0993m9596
$$ -206514 -99179 -185135 -169045 -135190 -106961 -121016 -167729 -137765 -61103 -112096 -161692
1710a61692j9291K2639J4466n2038M7967J4941n3326j8277j1175J2050r2507J13930
$$ -161692 -180983 -158344 -143878 -195916 -147949 -133008 -186334 -204611 -215786 -203736 -296243 -182313
1698a82313j7611n7775J08164m1500M9064L4975k9699j0212l3007N9357L1510
$$ -182313 -199924 -257699 -149535 -191035 -141971 -106996 -136695 -146907 -179914 -120557 -89047
1687h9047n0277j1435J7200m4781j28658K2566K1924L6425J52023J4510j07452
$$ -89047 -139324 -150759 -133559 -178340 -306998 -284432 -262508 -226083 -74060 -59550 -167002
1676a67002K2550J5061O3809O882n0436l4384K9152J02187n3030k7701P7967q0517
$$ -167002 -144452 -129391 -65582 -58700 -109136 -143520 -114368 -12181 -65211 -92912 -14945 -95462
1664i5462L4368m8640Q7493j45049m401M143N0398j0034n8933m786j00255N5398
$$ -95462 -61094 -109734 -22241 -167290 -171691 -167548 -117150 -127184 -186117 -190903 -291158 -235760
1652b35760J09986O0580j34149n073j938R4569N0044n1585k4668r115j1820R9987
$$ -235760 -125774 -65194 -199343 -204416 -206354 -111785 -61741 -113326 -137994 -147109 -158929 -58942
1640e8942j4775k3920m275j6753J7346L1699n5670O5776j03615m8344K9003j13429
$$ -58942 -73717 -97637 -101912 -118665 -101319 -69620 -125290 -59514 -163129 -211473 -182470 -295899
1628b95899Q5513R0069L7132L0993O3680n2382n7263p2114O5911K4666p9956L35
$$ -295899 -210386 -120317 -83185 -52192 11488 -40894 -98157 -170271 -104360 -79694 -159650 -159315
1616a59315j1799P2920k3562P104j045K7949l5829n1125J0928l6068P5993L9921
$$ -159315 -171114 -98194 -121756 -114652 -115697 -87748 -123577 -174702 -163774 -199842 -123849 -83928
1604h3928j1672j3864n960N0628n128j9736P4227j792o8639j08348O6985J44240
$$ -83928 -95600 -109464 -115424 -64796 -69924 -89660 -15433 -17225 -85864 -194212 -127227 17013
1592A7013m7141j01045O3425p6026q0042M4832Q7154m3421J597o1125o7627J21090
$$ 17013 -30128 -131173 -67748 -143774 -223816 -178984 -91830 -135251 -133654 -194779 -262406 -141316
1580a41316K6265J11914P1062p0892M3226N7644j25980o0731J1334k2823L4075
$$ -141316 -115051 -3137 67925 -2967 40259 97903 -28077 -88808 -77474 -100297 -66222
1569f6222k1987m9673P0966l4227O0318l2981p9831Q5726K8969k0311q1186k0363
$$ -66222 -88209 -137882 -66916 -101143 -40825 -73806 -153637 -67911 -38942 -59253 -140439 -160802
1557a60802J579l6957J01418r9411l4120K0644L2919J38166n5617L8103K7425
$$ -160802 -159223 -196180 -94762 -194173 -228293 -207649 -174730 -36564 -92181 -54078 -26653
1546b6653j02722m4223J31298J7900j41533Q7941o725P1048m1416j00513L0013
$$ -26653 -129375 -173598 -42300 -24400 -165933 -77992 -84717 -13669 -55085 -155598 -125585
1535a25585K1637m472N9654j7268o3591L3463j16405K5578J8323l626Q9390j16797
$$ -125585 -103948 -108420 -48766 -66034 -129625 -96162 -212567 -186989 -168666 -172292 -82902 -199699
1523a99699p1520M3214Q5518N8048J4835k0822J02144l8624m9412O7984K251m0683
$$ -199699 -271219 -228005 -142487 -84439 -69604 -90426 11718 -26906 -76318 -8334 -6083 -46766
1511d6766n73L9018q9727M102q2407M5817O8768J5579r7228j1366l0974Q7628
$$ -46766 -47339 -8321 -98048 -93946 -176353 -130536 -61768 -46189 -143417 -154783 -185757 -98129
1499i8129m2789L361R5238m144L2482j00895J12272m780j5822n9167n2436k9953
$$ -98129 -140918 -137557 -42319 -46463 -13981 -114876 -2604 -7384 -23206 -82373 -134809 -164762
1487a64762O7481j2444K2991P8975o7564j7978J02394l9049k9037j811k0327J1358
$$ -164762 -97281 -109725 -86734 -7759 -75323 -93301 9093 -29956 -58993 -60804 -81131 -69773
1475f9773o2475M9373L4718R1480l0502j2935j2542p965p2064k5801R1081r0920
$$ -69773 -132248 -82875 -48157 43323 12821 -114 -12656 -20621 -92685 -118486 -27405 -118325
1463a18325q0844N9713L9916Q362J4653k1428m7310J07048m8498l9516K6591k9110
$$ -118325 -199169 -139456 -99540 -91178 -76525 -97953 -145263 -38215 -86713 -126229 -99638 -128748
1451a28748p9098k876L6275j8661R3795k2540P408N0568m0062O448j2372L9550
$$ -128748 -207846 -210722 -174447 -193108 -99313 -121853 -114445 -63877 -103939 -97491 -109863 -70313
1439g0313k9902j2148k9301k9924J22007k0460p5496O106L0686o2752O0681K0274
$$ -70313 -100215 -112363 -141664 -171588 -49581 -70041 -145537 -139431 -108745 -171497 -110816 -90542
1427i0542p903P9586j25045n2853P1060N6586j1140l3251M3433l0302M5787M3043
$$ -90542 -98445 -18859 -143904 -196757 -125697 -69111 -80251 -113502 -70069 -100371 -54584 -11541
1415a1541J13779J9381j57929r2083l418n9269K0316J71147J9935n2041K3992
$$ -11541 102238 121619 -36310 -128393 -131811 -191080 -170764 383 20318 -31723 -7731
1404g731j4874L1638j064r3922o99R0391j02715M1256M1735K0605K6463r2274
$$ -7731 -22605 9033 7969 -85953 -86652 3739 -98976 -57720 -15985 4620 31083 -61191
1392f1191q615q1823Q2335l6574l0480Q1320P2164J636J2945m1989j04141O2916
$$ -61191 -69806 -151629 -69294 -105868 -136348 -55028 17136 18772 31717 -10272 -114413 -51497
1380e1497J09842l0677O052j3624l2913o503L9225l0164m9796K879k5381O7404
$$ -51497 58345 27668 33720 20096 -12817 -19320 19905 -10259 -60055 -57176 -82557 -15153
1368a5153O7032r7595M18M2141r272Q034k4617m22m5672j23191R894N8984p0592
$$ -15153 51879 -45716 -45298 -3157 -12429 -4395 -29012 -29434 -75106 -198297 -188403 -129419 -200011
1355b00011J49790J38851K15m9195j11650N846L0468K0998R2570j15967n696o4628
$$ -200011 -50221 88630 88845 39650 -72000 -66154 -35686 -14688 77882 -38085 -43781 -108409
1343a08409m0156N2481M838P6207j7065m4093j9450M3368K1487m542N0027p7700
$$ -108409 -148565 -96084 -91246 -15039 -32104 -76197 -95647 -52279 -30792 -35334 14693 -63007
1331f3007J2470L0660o2836k441L3428M666K8274L533k5738J6730n516Q0397n85
$$ -63007 -50537 -19877 -82713 -85154 -51726 -47060 -18786 -15253 -40991 -24261 -29777 50620 50035
1318E0035r1251m8757O6200l3152N5904L0433k128q9913p9514N3190J11934O6669
$$ 50035 -41216 -89973 -23773 -56925 -1021 29412 27284 -62629 -142143 -88953 22981 89650
1306H9650k0638j26683n011L5941k1939r4542o44J21558k5049n1590n8427O3678
$$ 89650 69012 -57671 -62682 -26741 -48680 -143222 -143866 -22308 -47357 -98947 -157374 -93696
1294i3696m5662J0455N7831K0146K534J6406R337N7712j79079L5781J6055L4783
$$ -93696 -139358 -128903 -71072 -50926 -48392 -31986 -22649 35063 -144016 -108235 -92180 -57397
1282e7397N0675k1155k6518n525K4146j4790o8300R6038R1278p5893M7297j26781
$$ -57397 -6722 -27877 -54395 -59920 -35774 -50564 -118864 -22826 68452 -7441 39856 -86925
1270h6925O9718N8719J7504j37755k3412O2568K3785O34q5419L5927Q7599l8132
$$ -86925 -17207 41512 59016 -78739 -102151 -39583 -15798 -15164 -100583 -64656 22943 -15189
1258a5189k4738j0238r921l175O1042l7052q0495K9299k8447O5484o6256J6063
$$ -15189 -39927 -50165 -60086 -63261 -2219 -39271 -119766 -90467 -118914 -53430 -119686 -103623
1246a03623M5345N1853K7001j01968R0635m8993N128N3937j27971K1313Q0406
$$ -103623 -58278 -6425 20576 -81392 9243 -39750 -34622 19315 -108656 -87343 -6937
1235f937n4037J13572o2776M335o5041r480N470M9822p745n677P1709l4249N5827
$$ -6937 -60974 52598 -10178 -5843 -70884 -80364 -74894 -25072 -32817 -38494 33215 -1034 54793
1222E4793r7446J7357m4391M3803N2417m3477n4242L5298J4628L5711p2148k5378
$$ 54793 -42653 -25296 -69687 -25884 26533 -16944 -71186 -35888 -21260 14451 -57697 -83075
1210h3075n6760R3843R71N6318q3519L3430l4010l5089J192L6956N1084J9482
$$ -83075 -139835 -45992 -45021 11297 -72222 -38792 -72802 -107891 -106699 -69743 -18659 823
1198H23m145J5160m7184j00682P5362r0736J53111O2402j4579O7711j00372m2042
$$ 823 -3322 11838 -35346 -136028 -60666 -151402 1709 64111 49532 117243 16871 -25171
1186b5171M9809j14391O7016P49m320J5971J2661q014o2383M6354N0061n6853
$$ -25171 24638 -89753 -22737 -21988 -26308 -10337 2324 -5690 -68073 -21719 28342 -28511
1174b8511J4412L304L5614R476p5487j0780P400n2124O6278O7166l4173n5734
$$ -28511 -14099 -10795 24819 34295 -41192 -51972 -44572 -96696 -30418 36748 2575 -53159
1162e3159m672l1104L1254R9719J0890j00036O022J095O5712k6965O4195j7079
$$ -53159 -57831 -88935 -57681 42038 52928 -47108 -41086 -39991 25721 -1244 62951 45872
1150D5872l5982n2710J6464L7777l0833m0193l0845N0255J7060K0230l856J4280
$$ 45872 9890 -42820 -26356 11421 -19412 -59605 -90450 -40195 -23135 -2905 -6761 7519
1138G519r3747J33499P8143j04792n4127n1899k8831l9857N246M9156k9229q810
$$ 7519 -86228 47271 125414 20622 -33505 -85404 -114235 -154092 -148846 -99690 -128919 -137729
1126a37729j3626J03972o1080L1145P7814K2979p4148L4271M622L4090k3683o4205
$$ -137729 -151355 -47383 -108463 -77318 496 23475 -50673 -16402 -11780 22310 -1373 -65578
1114f5578n4412L2642J27761p5454J9747p872J83300j20241j45988J7807m107
$$ -65578 -119990 -87348 40413 -35041 -15294 -23166 160134 39893 -106095 -88288 -92395
1103i2395k9813Q9575p0157M2880J19712j44505O7864m9282J1837O3295J2876
$$ -92395 -122208 -32633 -102790 -59910 59802 -84703 -16839 -66121 -54284 9011 21887
1092B1887M8215M7295m9968O134j43798M9667L0002k6575n0225j1041P4033J4842
$$ 21887 70102 117397 67429 73563 -70235 -20568 9434 -17141 -67366 -78407 -4374 10468
1080A0468R4607p5378r1376m021O0617Q6273j3534j46984j3503J2542L3809P4707
$$ 10468 105075 29697 -61679 -65700 -5083 81190 67656 -79328 -92831 -80289 -46480 28227
1068B8227Q2354m8073J19538p4837j19323K0242N8912l6034p2580k7514J7784
$$ 28227 110581 62508 182046 107209 -12114 8128 67040 31006 -41574 -69088 -51304
1057e1304J0923L9054R0316m7545l5634N5162p0800K9901l8307K5432l1314m4966
$$ -51304 -40381 -1327 88989 41444 5810 60972 -9828 20073 -18234 7198 -24116 -69082
1045f9082J33398q1852o2046N1354P2384l1172l2066p2231J79156m2109k6299
$$ -69082 64316 -17536 -79582 -28228 44156 12984 -19082 -91313 87843 45734 19435
1034A9435J51497K8702j40693o1397K226R6175O4488o5613m0391p8864p3121R9228
$$ 19435 170932 199634 58941 -2456 -230 95945 160433 94820 54429 -24435 -97556 1672
1022A672L6433L2056p5635M5883Q8633k9310m8570k0116P4515j030l9789j5348
$$ 1672 38105 70161 -5474 40409 129042 99732 51162 31046 105561 104531 64742 49394
1010D9394j2443m43o757k1974Q760J79521O618j09199k3500j4786j31619n7816
$$ 49394 36951 36508 29751 7777 16537 196058 202676 93477 69977 55191 -76428 -134244
998a34244N9085j9939R9356J12384j33275J6016R6228q2737Q1331J6904j42402
$$ -134244 -75159 -95098 4258 116642 -16633 -617 95611 12874 94205 111109 -31293
987c1293k1363R0707l5271M6275j38728K2034J9391J0714J00054K1640Q6463j37309
$$ -31293 -52656 38051 2780 49055 -89673 -67639 -48248 -37534 62520 84160 170623 33314
975C3314P931q5973q5175J16688M2484L0245o0266k2637P1898k501L1151j36209
$$ 33314 41245 -44728 -129903 -13215 29269 59514 -752 -23389 48509 46008 77159 -59050
963e9050K1946p008O7451J36805l3778q0274J13834Q179o3507j8120p6558M0918
$$ -59050 -37104 -44112 23339 160144 126366 46092 159926 168105 104598 86478 9920 50838
951E0838J0344R418q3057o8962n6692J16589J3284Q6212j01013M5325q0828L2190
$$ 50838 61182 70600 -12457 -81419 -138111 -21522 -8238 77974 -23039 22286 -58542 -26352
939b6352N1202l4954R804R6209n8575m1221p3782O0139q323n2260Q0650J2040
$$ -26352 24850 -10104 -300 95909 37334 -3887 -77669 -17530 -25853 -78113 2537 14577
927A4577O8047q2690J2194j9297l3427J49433o1133M6914q142N0568j16980o3892
$$ 14577 82624 -66 12128 -7169 -40596 108837 47704 94618 86476 137044 20064 -43828
915d3828q4677N3190N9661K4535J0844l1219N8285p0516j9077l0493K5300K2247
$$ -43828 -128505 -75315 -15654 8881 19725 -11494 46791 -23725 -42802 -73295 -47995 -25748
903b5748J33708p2107J9705n7498L0851Q2726k5787o1265O3197n5501j2276m7777
$$ -25748 107960 35853 55558 -1940 28911 111637 85850 24585 87782 32281 20005 -27772
891b7772M8302J3142R5131k2664o3412p9948P488O1391m1337p869O4650J1603
$$ -27772 20530 33672 128803 106139 42727 -37221 -29733 31658 -9679 -17548 47102 58705
879E8705n379K6318L00r351J6199m1959K8579J7539r0404J3212j8781Q5107l0413
$$ 58705 53326 79644 79944 70593 86792 44833 73412 90951 547 13759 -5022 80085 49672
866D9672m4884m7378P6852P4773L4986m6460j00432O0089J9132m3277j08941R8263
$$ 49672 4788 -42590 34262 109035 144021 97561 -2871 57218 76350 33073 -75868 22395
854B2395K6185O5864k1986j06258M5991O6075o0377r6304l1487J36982P3522m886
$$ 22395 48580 114444 92458 -13800 32191 98266 37889 -58415 -89902 47080 120602 115716
842A15716j8553m7938o9078L2926J40003j36461M3485K5001K9081o5565q3247
$$ 115716 97163 49225 -19853 13073 153076 16615 60100 85101 114182 48617 -34630
831c4630P4244j06312L5441O7219l7417p220K1383O5438l5450j19798R639J29232
$$ -34630 39614 -66698 -31257 35962 -1455 -8675 12708 78146 42696 -77102 -67463 61769
819F1769k9284o0906k247O4983L7268l5793L5552L0534K1211p741K4640m3262
$$ 61769 32485 -28421 -30668 34315 71583 35790 71342 101876 123087 115346 139986 96724
807I6724k3711O5391j15736l7710K6359O256m9349L4808K15398j62490p6103R876
$$ 96724 73013 138404 22668 -15042 11317 17573 -31776 3032 218430 55940 -20163 -10287
795a0287M1184o1592J2997K1100J2097J1792N7338p4192p0853N2549q6276l4062
$$ -10287 30897 -30695 -17698 3402 15499 27291 84629 10437 -60416 -7867 -94143 -128205
783a28205O0855O4091K987L463O3543k9112K2319M8927l1474m381k5760o2364
$$ -128205 -67350 -3259 -272 3191 66734 37622 59941 108868 77394 73013 47253 -15111
771a5111N7084J60915p0046l6055m532K1682M2335q1335k8126J09951r3203k9771
$$ -15111 41973 202888 132842 96787 92255 113937 156272 74937 46811 156762 63559 33788
759C3788n9549J06538j1251N1030l3438K8108l4859j8401M9932p9391M1031N4744
$$ 33788 -25761 80777 69526 120556 87118 115226 80367 61966 111898 32507 73538 128282
747A28282l468l6168r8343L5368q1004L0837R233k968N6641P0252r9343K7079
$$ 128282 124814 88646 -9697 25671 -55333 -24496 -15263 -18231 38410 108662 9319 36398
735C6398O6706P845L9125q6668J0803L7282L3673r5742P789p8138M6903J06037
$$ 36398 103104 110949 150074 63406 74209 111491 145164 49422 57211 -20927 25976 132013
723A32013r1606n9898J10704l9752p9811M423L7520J7658O6643l802J3929j8113
$$ 132013 40407 -19491 91213 51461 -28350 -23927 13593 31251 97894 94092 108021 89908
711H9908O882o1108k599M7679N0764J1250r1464O4748n1383J4454r4991J6117
$$ 89908 96790 35682 33083 80762 131526 142776 51312 116060 64677 79131 -15860 257
699B57J18344l293j1302l631Q6357o7842o0197k974l7633J9880Q8012L3060M699
$$ 257 118601 115308 104006 100375 186732 118890 58693 55719 18086 37966 125978 159038 163737
686A63737p3829K3362L9375n2815l7337P6073M3390q0397o4104M5150p667p5707
$$ 163737 89908 113270 152645 99830 62493 138566 181956 101559 37455 82605 74938 -769
674g69l448O7455m0974J9229N3307j2300L749m7161J6201j3068j005J5866J20172
$$ -769 -4217 63238 22264 41493 94800 82500 86249 39088 55289 42221 41216 57082 177254
661A77254J151l4649p178M548q153n0932m9251K6841O0434N6165q0041p2148J08234
$$ 177254 178405 143756 136578 141126 132973 82041 32790 59631 120065 176230 96189 24041 132275
648A32275o4220O104n036L5782l3815L8435K9377n7866k2923K689k9188p1196
$$ 132275 68055 74159 69123 104905 71090 109525 138902 81036 58113 60802 31614 -39582
636c9582R7257j3216k5166R4851N5165k8902Q447r6236k8931J627n5941J17983
$$ -39582 57675 44459 19293 114144 169309 140407 148854 52618 23687 25314 -30627 87356
624H7356k4111R8378J6972k3219j50154l9695J00738n3282O2488M9661o6808l6487
$$ 87356 63245 161623 178595 155376 5222 -34473 66265 12983 75471 125132 58324 21837
612B1837j4074J15091M8425r8930j35192M5496J64935j7526j11183L847L0915
$$ 21837 7763 122854 171279 72349 -62843 -17347 147588 130062 18879 22726 53641
601E3641Q2888N1742j18649J7598K4269J8132n0090q1288L3680Q3241p1635q011
$$ 53641 136529 188271 69622 87220 111489 129621 79531 -1757 31923 115164 43529 35518
589C5518k4196L0002L2474j9007n0840o3420O0960q823J09597N6598n3188k9949
$$ 35518 11322 41324 73798 54791 3951 -59469 1491 -7332 102265 158863 105675 75726
577G5726R477p8604O8446P5457m2093l3127l25r6687j731K9044l2307J30088O4067
$$ 75726 85203 6599 75045 150502 108409 75282 74957 -21730 -23461 5583 -26724 103364 167431
564A67431K5330j5212j49514j2385J40782k7842P935m6040N0554p1536o724o1205
$$ 167431 192761 177549 28035 15650 156432 128590 136525 90485 141039 69503 62779 1574
552A574N7513m7283k5413O1486Q8671J2374j02058J2933q597P3644j07085q2479
$$ 1574 59087 11804 -13609 47877 136548 148922 46864 59797 51200 124844 17759 -64720
540f4720J35550k7159r318P1959l5096Q212o2001j00504N8212P8865N7689K2942
$$ -64720 70830 43671 34353 106312 71216 79428 17427 -83077 -24865 54000 111689 134631
528A34631l3622L0346o1687J1532J1710K3934q9088j9795J6465J693J01944p6199
$$ 134631 101009 131355 69668 81200 92910 116844 27756 7961 24426 26119 128063 51864
516E1864j19059M9715J7347J7235M1695K7661P6798j1638k6621m8908k2391K0944
$$ 51864 -67195 -17480 -133 17102 58797 86458 163256 151618 124997 76089 53698 74642
504G4642Q4532L7668J0543k6183o4773o0290q687j8733K9005K3280p267o1000
$$ 74642 159174 196842 207385 181202 116429 56139 47452 28719 57724 81004 73737 12737
492A2737l4877N0395m7523q0489P0265J37749k3740m0990n5307p2179K2779m3167
$$ 12737 -22140 28255 -19268 -99757 -29492 108257 84517 43527 -11780 -83959 -61180 -104347
480a04347J24122Q765m4214q0365P2417J29947p774j17342N1501L4172l2234j3844
$$ -104347 19775 28540 -15674 -96039 -23622 106325 98551 -18791 32710 66882 34648 20804
468B0804K651K9292q1003M2880j03788L8394M5584J14609K029n465n1033N3566
$$ 20804 23455 52747 -28256 14624 -89164 -50770 -5186 109423 111452 105987 54954 108520
456A08520k5479j8442q8243K3641Q9489l6449m221N0096m305m0680k1364j2553
$$ 108520 83041 64599 -23644 -3 89486 53037 48816 98912 94607 53927 32563 20010
444B0010P6677o7886M4451P7387N5147j18443j370p2637O0869J25670r6950m6187
$$ 20010 96687 28801 73252 150639 205786 87343 85973 13336 74205 199875 102925 56738
432E6738K6029P593n7676K0092M8761J0699l2599m168l6591N2731Q1805q26p1855
$$ 56738 82767 90360 32684 52776 101537 112236 79637 75469 38878 91609 173414 172588 100733
419A00733P2925J85o7082n3564Q9899n4834j00388J1747K7860M0241k9092k4252
$$ 100733 173658 173843 106761 53197 143096 88262 -12126 -379 27481 67722 38630 14378
407A4378L0499M0343o582j361O6139j3539k2799j8942M7131l2552J2070M9153
$$ 14378 44877 85220 78638 77277 143416 129877 107078 88136 135267 102715 114785 163938
395A63938k3925l3143j9623k5421m4579K8415j9208J7720J29896r8546m6942J4898
$$ 163938 140013 106870 87247 61826 17247 45662 26454 44174 174070 75524 28582 43480
383D3480l6059J07972j03500M9707K9703R64j1268K2404K1600o1679P3778k5347
$$ 43480 7421 115393 11893 61600 91303 92267 80999 103403 125003 63324 137102 111755
371A11755j4701r486j15683Q7648K9780P0627q4423q1873L3123j1328K4515J11306
$$ 111755 97054 87568 -28115 59533 89313 159940 75517 -6356 26767 15439 39954 151260
359A51260L5960j6407j02308k7305l5163K2394N9065j7741P1528j10394L0937
$$ 151260 187220 170813 68505 41200 6037 28431 87496 69755 141283 30889 61826
348F1826K1506j6829k1531N2339l268j8520m8701L2508N0877N1498l5177q4608
$$ 61826 83332 66503 44972 97311 94043 75523 26822 59330 110207 161705 126528 41920
336D1920k209p8119J67928N3155j38646j5646O6553K2172o4509o6946J37621L144
$$ 41920 39711 -38408 129520 182675 44029 28383 94936 117108 52599 -14347 123274 126418
324A26418o7526O8809l7179m4904J16190j1489Q598J4592r2951k4506M8317K8596
$$ 126418 58892 127701 90522 45618 161808 150319 158917 173509 80558 56052 104369 132965
312A32965J9887K9660j31593m1100K7983n4392o4463Q8584J29878k7139j7593
$$ 132965 152852 182512 50919 9819 37802 -16590 -81053 7531 137409 110270 92677
301I2677l8520L3267K1743k0333K1438n079p7135L061P5121O413p5688L9004n448
$$ 92677 54157 87424 109167 88834 110272 105193 28058 31119 106240 112653 36965 75969 70521
288G0521j5621J6536o0679p7189J6208J05765P0678n407M7149J4829m7567J28
$$ 70521 54900 71436 10757 -66432 -50224 55541 126219 120812 167961 182790 135223 135351
276A35351N8301O048k4490l1786m4949o5498q8948J22231k5839o6769J22087l4256
$$ 135351 193652 199700 175210 143424 98475 32977 -55971 66260 40421 -26348 95739 61483
264F1483L2969L7747n0136M5537K3180m1102J3398N7490n1911m6270j01595J3156
$$ 61483 94452 132199 82063 127600 150780 109678 123076 180566 128655 82385 -19210 -6054
252f054K6945Q8541l292p0327N884J2204j4272k1766k073J30150j4023j07911
$$ -6054 20891 109432 106140 35813 41697 53901 39629 17863 15790 145940 131917 24006
240B4006J9533L4686n6381N9848j4175O3865o0531n7233J23987q5756k7308k435
$$ 24006 43539 78225 21844 81692 67517 131382 70851 13618 137605 51849 24541 22106
228B2106R8765K5130l0012q547K104J8626J3146k7789L2949n0598m7655P665L5078
$$ 22106 120871 146001 115989 107442 109546 128172 141318 113529 146478 95880 48225 55890 90968
215I0968P5153n5714L1344M2710j9448j54425p7764J13545j9427Q5489P3767j32329
$$ 90968 166121 110407 141751 184461 165013 10588 -67176 46369 26942 112431 186198 53869
203E3869K6833M3463M9477l9775m1062k1222k8904l8046J5154P8099R1791l9557
$$ 53869 80702 124165 173642 133867 92805 71583 42679 4633 19787 97886 189677 150120
191A50120j33795J0595Q4479r1709P0404N3430j39468L3385j4992L072N1043m2601
$$ 150120 16325 26920 111399 19690 90094 143524 4056 37441 22449 25521 76564 33963
179C3963q7102J2506J0389N2405M5878P1835j32310J3101Q6554p721P1522M906
$$ 33963 -53139 -40633 -30244 22161 68039 139874 7564 20665 107219 99498 171020 175926
167A75926j33587R983q662O1063l3693l4713Q7087J9760l3031L3854K4696l2844
$$ 175926 42339 52322 43660 104723 71030 36317 123404 143164 110133 143987 168683 135839
155A35839Q032J9972m7753o1032L6901L8404l4257m4677j4290l4410J5077R337
$$ 135839 143871 163843 116090 55058 91959 130363 96106 51429 37139 2729 17806 27143
143B7143j856O4511j989p4182N8828k6055o3234J658L8874K6873L6246r9115J00007
$$ 27143 25287 89798 87809 13627 72455 46400 -16834 -15176 23698 50571 86817 -12298 87709
130H7709j1893K3595K0968N8259K7131l5532o169o5122M1020q3531K4230P973
$$ 87709 75816 99411 120379 178638 205769 170237 164068 98946 139966 56435 80665 88638
118H8638k4757j5605L2402K7410L0249k4493j6070K5961M405q4390J18766O196
$$ 88638 63881 48276 80678 108088 138337 113844 97774 123735 128140 43750 162516 168712
106A68712r319M9074n3414J1713k8203n7209n9764J1948J8833N7540K7810R696
$$ 168712 159393 208467 155053 166766 138563 81354 21590 33538 52371 109911 137721 147417
94A47417m1152K653k230n5793l2536M2362K9560Q657q8593N7393N1084o6419L7926
$$ 147417 106265 108918 106688 50895 18359 60721 90281 98938 10345 67738 118822 52403 90329
81I0329M3631L8883p4345k1180N3984l2812p910m7246O6467m838k4607o1813j6468
$$ 90329 133960 172843 98498 77318 131302 98490 90580 43334 109801 104963 80356 18543 2075
68B075K6113J727k1830M746O636K9554O8695l7326k5795l2018R2885k6509m4504
$$ 2075 28188 29915 8085 12831 19467 49021 117716 80390 54595 22577 115462 88953 44449
55D4449m993L7739L3237M4175L5019o7949j0912m3019K5159k6233m2281J9135
$$ 44449 39456 77195 110432 154607 189626 121677 110765 67746 92905 66672 24391 43526
43D3526M1564n140k3428m3228j4634R3269m0723k9970L1978M281N7562L8367o5694
$$ 43526 85090 79950 56522 13294 -1340 91929 51206 21236 53214 57495 115057 153424 87730
30H7730p840n3625J304O5474K4480P511J7205j7850j9020Q4701J277o5145n4349
$$ 87730 79890 26265 27569 93043 117523 125034 142239 124389 105369 190070 191347 126202 71853
17G1853o8821J13889j7121o368N5380j3831p1121K4009p178N1473n1376l0850
$$ 71853 3032 116921 99800 93432 148812 134981 63860 87869 80691 132164 80788 49938
5D9938J9792m7698L9151N1081o1809
$$ 49938 69730 22032 61183 112264 50455
0E0455
$$ 50455
$$ Imaginary data points
##PAGE= N=2
##DATA TABLE= (X++(I..I)), XYDATA
16383c658517N5167N1451L971R1016j2628L4794N3559M8429L5484O957Q1782M2675
$$ -3658517 -3603350 -3551899 -3547928 -3456912 -3469540 -3434746 -3381187 -3332758 -3297274 -3290317 -3208535 -3165860
16371c165860J4915M4432J44852P8237n3761q18P8729L1663L0422J43078o1960
$$ -3165860 -3150945 -3106513 -2961661 -2883424 -2937185 -2938003 -2859274 -2827611 -2797189 -2654111 -2716071
16360b716071R2527O4286R0098m0999k1386J31758K8809P8953L2497K3060l9495
$$ -2716071 -2623544 -2559258 -2469160 -2510159 -2531545 -2399787 -2370978 -2292025 -2259528 -2236468 -2275963
16349b275963J9214J34662N6221J7530M3540R4540J5812J5182L9803O3051M3740
$$ -2275963 -2256749 -2122087 -2065866 -2048336 -2004796 -1910256 -1894444 -1879262 -1839459 -1776408 -1732668
16338a732668P2338O7948L869m7648J8432J33824N1534k8583P6385J08579L7582
$$ -1732668 -1660330 -1592382 -1588513 -1636161 -1617729 -1483905 -1432371 -1460954 -1384569 -1275990 -1238408
16327a238408M7858L7866J49749j38240l4991J31964P0781R2242p0514J8211R5075
$$ -1238408 -1190550 -1152684 -1002935 -1141175 -1176166 -1044202 -973421 -881179 -951693 -933482 -838407
16316h38407j3948N4094L9012j599k2250J09983J65652O2831j7343O7859O9531
$$ -838407 -852355 -798261 -759249 -760848 -783098 -673115 -507463 -444632 -461975 -394116 -324585
16305c24585k3709n6143O2926J8024N1638N4846L0747k8963J17066L2481K1396
$$ -324585 -348294 -404437 -341511 -323487 -271849 -217003 -186256 -215219 -98153 -65672 -44276
16294d4276O1222O8999P8014l3084P4726O2744m4184L5572m7948M4640j8261j5460
$$ -44276 16946 85945 163959 130875 205601 268345 224161 259733 211785 256425 238164 222704
16282B22704N3748M8812R6414N3672L7686L422O5217P0076o521K1991J7801L8184
$$ 222704 276452 325264 421678 475350 513036 516458 581675 651751 645230 667221 685022 723206
16270G23206P6948o4917O6009k0455P4045N098J6742P3431k3597m06J371P5812
$$ 723206 800154 735237 801246 780791 854836 859934 876676 950107 926510 926104 927475 1003287
16258A003287J33776k5077l2918M4580L190J49578P922M6075J6804O1061o3732
$$ 1003287 1137063 1111986 1079068 1123648 1126838 1276416 1284338 1330413 1347217 1408278 1344546
16247A344546l5890K3604P1575Q3347J4338k4619K0049O3044L5335P0536o3665
$$ 1344546 1308656 1332260 1403835 1487182 1501520 1476901 1496950 1559994 1595329 1665865 1602200
16236A602200j4232K5912M1260N3093L6253n8736k1279P1156O5244P5611k7212
$$ 1602200 1587968 1613880 1655140 1708233 1744486 1685750 1664471 1735627 1800871 1876482 1849270
16225A849270K724O1518l0584J20673L7920j8245r115n996l7881M5890L0888R8620
$$ 1849270 1851994 1913512 1882928 2003601 2041521 2023276 2014161 2008165 1970284 2016174 2047062 2145682
16213B145682M4704P3545l664l6500R823j6444l9206N5987k2919J28604p7177
$$ 2145682 2190386 2263931 2260267 2223767 2233590 2217146 2177940 2233927 2211008 2339612 2262435
16202B262435Q0762M8571r8776P5664O9988Q2308l7260j0986L2938P5615l5515
$$ 2262435 2343197 2391768 2292992 2368656 2438644 2520952 2483692 2472706 2505644 2581259 2545744
16191B545744Q533n0503L9036J2490q484M4074L7197O5943P4613o4912K6888K5609
$$ 2545744 2554277 2503774 2542810 2555300 2546816 2590890 2628087 2694030 2768643 2703731 2730619 2756228
16179B756228j46974j08611J07290O2727O2918M5064j03228K1168r027K5243q1549
$$ 2756228 2609254 2500643 2607933 2670660 2733578 2778642 2675414 2696582 2687555 2712798 2631249
16168B631249L847N6839L4043J6339m6734J18047P3622r7953M0294N2908n1177
$$ 2631249 2635096 2691935 2725978 2742317 2695583 2813630 2887252 2789299 2829593 2882501 2831324
16157B831324J09269p5008L6076j13198p792L9342L6199P3015q1240r535J3505
$$ 2831324 2940593 2865585 2901661 2788463 2780671 2820013 2856212 2929227 2847987 2838452 2851957
16146B851957M9119Q6869N2625l5732L0465l942k766J5009N6124j5248O9468N8082
$$ 2851957 2901076 2987945 3040570 3004838 3035303 3031361 3028595 3043604 3099728 3084480 3153948 3212030
16134C212030r7558q5792m8366J41304J04795l9928m9407k1454J6907j903J1180
$$ 3212030 3114472 3028680 2980314 3121618 3226413 3186485 3137078 3115624 3132531 3130628 3141808
16123C141808L5067q930j1359K6771J0144J08j44783n6609J34529l4498m2141
$$ 3141808 3176875 3167945 3156586 3183357 3193501 3193609 3048826 2992217 3126746 3092248 3050107
16112C050107K5534J06235R3941n2717r808Q8771P426l6067o3812n2060j7424
$$ 3050107 3075641 3181876 3275817 3223100 3213292 3302063 3309489 3273422 3209610 3157550 3140126
16101C140126R2107l9357n788j7907P144j2545k9497J6086n9468P4071l8402J10713
$$ 3140126 3232233 3192876 3187088 3169181 3176325 3163780 3134283 3150369 3090901 3164972 3126570 3237283
16089C237283p606L925J09807j4642l6322k6246j15912Q0409P9306l2022p8020
$$ 3237283 3229677 3233602 3343409 3328767 3292445 3266199 3150287 3230696 3310002 3277980 3199960
16078C199960P1907j8911k7887J41057N3075l5559r3815n686p2734k6055R221
$$ 3199960 3271867 3252956 3225069 3366126 3419201 3383642 3289827 3284141 3211407 3185352 3194573
16067C194573J44616P496j00852K242J04188J44506j2335r328m0588q8356n2949
$$ 3194573 3339189 3346685 3245833 3248075 3352263 3496769 3484434 3475106 3434518 3346162 3293213
16056C293213m6354O1094J8726K3247l0985Q355O278J9808k9543l1025K2461J7033
$$ 3293213 3246859 3307953 3326679 3349926 3318941 3327296 3333574 3353382 3323839 3292814 3315275 3332308
16044C332308N0821m9969p3197M2736p0207n7918O2842P5419K4199O6427m9847
$$ 3332308 3383129 3333160 3259963 3302699 3232492 3174574 3237416 3312835 3337034 3403461 3353614
16033C353614n4259k3040Q95m2384Q7691j1630o8844m8389Q7401Q4773j89075
$$ 3353614 3299355 3276315 3277210 3234826 3322517 3310887 3242043 3193654 3281055 3365828 3176753
16022C176753L6829O7812l7859m6281Q0723N5J9686n2746j6862J20872J3151o3024
$$ 3176753 3213582 3281394 3243535 3197254 3277977 3278032 3297718 3244972 3228110 3348982 3362133 3299109
16010C299109o3103J09516m7178q5566Q9075M7630l0129k339N4221o6494k7825
$$ 3299109 3236006 3345522 3298344 3212778 3301853 3349483 3319354 3317015 3371236 3304742 3276917
15999C276917J39756k7879q2013N0614j4973M6706n4552M3647l9828j6787o8733
$$ 3276917 3416673 3388794 3306781 3357395 3342422 3389128 3334576 3378223 3338395 3321608 3252875
15988C252875J87682j28216r3305J93273N0318p4397J317j70770P1584l3336j6033
$$ 3252875 3440557 3312341 3219036 3412309 3462627 3388230 3389547 3218777 3290361 3257025 3240992
15977C240992L0840L4004J2220o1242J65575L1304m0416p2806R2982j8056P4942
$$ 3240992 3271832 3305836 3318056 3256814 3422389 3453693 3413277 3340471 3433453 3415397 3490339
15966C490339q005j04195j23907J16456P5686j06397q9094L902J41782O0612j63372
$$ 3490339 3482334 3378139 3254232 3370688 3446374 3339977 3250883 3254785 3396567 3457179 3293807
15955C293807o6266j9383O346L8723J13265j4404K687n7842J9891O8440M1211
$$ 3293807 3227541 3208158 3214504 3253227 3366492 3352088 3354775 3296933 3316824 3385264 3426475
15944C426475p0553o6748N7924l6311K1567k7535J0494k1080l1592j6765q673
$$ 3426475 3355922 3289174 3347098 3310787 3332354 3304819 3315313 3294233 3262641 3245876 3237203
15933C237203J13687L6212M3852L9711j07600P075N7814j38194N8719P8622N364
$$ 3237203 3350890 3387102 3430954 3470665 3363065 3370140 3427954 3289760 3348479 3427101 3432465
15922C432465j8344l8831K1042J6360K410R871j1505P8225n7414n4300r6870q786
$$ 3432465 3414121 3375290 3396332 3412692 3415102 3424973 3413468 3491693 3434279 3379979 3283109 3274323
15910C274323J15204l7093N28p2110N3780m7354O9585O506p2993j6353Q4668N657
$$ 3274323 3389527 3352434 3352962 3280852 3334632 3287278 3356863 3363369 3290376 3274023 3358691 3364348
15898C364348k9586N095R899L4070k4107K0040J267q685P567O4239j66341J24431
$$ 3364348 3334762 3339857 3349756 3383826 3359719 3379759 3381026 3372341 3379908 3444147 3277806 3402237
15886C402237k6510L949P8931k4385k0105k1122K76O7043k1686m7556p060m8081
$$ 3402237 3375727 3379676 3458607 3434222 3414117 3392995 3393271 3460314 3438628 3391072 3384012 3335931
15874C335931L8791o5835J33328J23087n8385j03889M9869j16870q5681O8054
$$ 3335931 3374722 3308887 3442215 3565302 3506917 3403028 3452897 3336027 3250346 3318400
15864C318400L9085P5878k878p9374n479J46802n5573q0749L3955K1504J8924
$$ 3318400 3357485 3433363 3430485 3351111 3345632 3492434 3436861 3356112 3390067 3411571 3430495
15853C430495L5541L0860j73263N5812k4813m7518K0167J22484p5995o77k319
$$ 3430495 3466036 3496896 3323633 3379445 3354632 3307114 3327281 3449765 3373770 3373093 3370774
15842C370774P354K944o3705K2961k7007J21731L5051q06K1126m7098r6169p4618
$$ 3370774 3378128 3381072 3317367 3340328 3313321 3435052 3470103 3469297 3490423 3443325 3347156 3272538
$$ [...]
##END NTUPLES=NMR SPECTRUM
##END=
