##TITLE=1H_CG-1147-H
 CDCl3, 8 sc, 
 2.07.2021
##JCAMPDX= 6.0         $$ Bruker NMR JCAMP-DX V2.0
##DATA TYPE= NMR SPECTRUM
##DATA CLASS= NTUPLES
##ORIGIN= UXNMR, Bruker Analytische Messtechnik GmbH
##OWNER= root
$$ XWIN-NMR		Version 3.5
$$ Fri Jul  2 11:01:28 2021 Russian Standard Time (UT+4h)  she@DPX200
##.OBSERVE FREQUENCY= 200.131506
##.OBSERVE NUCLEUS= ^1H
##.ACQUISITION MODE= SIMULTANEOUS
##.ACQUISITION SCHEME= undefined
##.AVERAGES= 8
##.DIGITISER RES= 18
##SPECTROMETER/DATA SYSTEM= spect
##.PULSE SEQUENCE= zg30
##.SOLVENT NAME= CDCl3
##.SHIFT REFERENCE= (INTERNAL, CDCl3, 0, 17.4971)
##AUDIT TRAIL= $$ (NUMBER, WHEN, WHO, WHERE, WHAT)
$$ ##TITLE= Audit trail, XWIN-NMR		Version 3.5
$$ ##JCAMPDX= 5.01
$$ ##ORIGIN= Bruker BioSpin GmbH
$$ ##OWNER= she
$$ F:/spectra/data/she/nmr/H-F/1/pdata/1/auditp.txt
$$ ##AUDIT TRAIL=  $$ (NUMBER, WHEN, WHO, WHERE, WHAT)
(   1,<2021-07-02 11:00:22.70 +0400>,<she>,<DPX200>,
      <created by zg, POWCHK disabled, PULCHK disabled
       configuration hash MD5:
       00 E9 B6 7A A2 85 ED C7 34 08 36 98 17 FE 4E 26
       data hash MD5: 16K
       F8 C4 89 28 06 20 08 50 EE 81 97 96 01 85 3C E2>)
(   2,<2021-07-02 11:00:25.53 +0400>,<she>,<DPX200>,
      <Start of raw data processing
       efp BC_mod = 2 LB = 0.24 FT_mod = 6 PKNL = 1 PHC0 = -11911.73 PHC1 = 9.40099 SI = 16K 
       data hash MD5: 16K
       52 FE AE 15 4E B1 E6 5C 7F 71 4C D7 36 9F 99 F4>)
(   3,<2021-07-02 11:00:45.12 +0400>,<she>,<DPX200>,
      <pk PHC0 = 2.97439 PHC1 = -0.8 
       data hash MD5: 16K
       64 27 4C 38 79 38 CA 2A F8 1D E9 A9 E5 FC F5 3C>)
(   4,<2021-07-02 11:00:48.28 +0400>,<she>,<DPX200>,
      <abs ABSG = 5 
       data hash MD5: 16K
       2C CD BE A7 59 FE C9 A5 61 88 FA 5D FD D8 0F 17>)
$$ ##END=
$$ 
$$ hash MD5
$$ BF D6 C3 0E 18 BF 1C 6C 35 37 90 DA 88 CF E9 96
##$RELAX= 
##$RELAX= 
##$RELAX= 
##$RELAX= 
##$RELAX= 
##$RELAX= 
$$ Bruker specific parameters
$$ --------------------------
##$DU= <F:/spectra>
##$EXPNO= 1
##$NAME= <H-F>
##$PROCNO= 1
##$TYPE= <nmr>
##$USER= <she>
##$AMP= (0..31)
100 100 100 100 100 100 100 100 100 100 100 100 100 100 100 100 100 100 
100 100 100 100 100 100 100 100 100 100 100 100 100 100 
##$AQSEQ= 0
##$AQ_mod= 1
##$AUNM= <au_zg>
##$AUTOPOS= <>
##$BF1= 200.13
##$BF2= 200.13
##$BF3= 200.13
##$BF4= 200.13
##$BF5= 200.13
##$BF6= 200.13
##$BF7= 200.13
##$BF8= 200.13
##$BYTORDA= 1
##$CFDGTYP= 0
##$CFRGTYP= 5
##$CHEMSTR= <none>
##$CNST= (0..31)
1 1 145 1 1 1 1 1 1 1 1 1 1 1 1 1 1 1 1 1 1 1 1 1 1 1 1 1 1 1 1 1 
##$CPDPRG= <>
##$CPDPRG1= <>
##$CPDPRG2= <>
##$CPDPRG3= <>
##$CPDPRG4= <mlev>
##$CPDPRG5= <mlev>
##$CPDPRG6= <mlev>
##$CPDPRG7= <mlev>
##$CPDPRG8= <mlev>
##$CPDPRGB= <>
##$CPDPRGT= <>
##$D= (0..31)
0 1.2 0 0 0 0 0 0 0 0.06 0 0.03 0 0 0 0 0.0002 0 0 0 0 0 0 0 0 0 0 0 0 
0 0 0 
##$DATE= 1625209222
##$DBL= (0..7)
120 120 120 120 120 120 120 120 
##$DBP= (0..7)
150 150 150 150 150 150 150 150 
##$DBP07= 0
##$DBPNAM0= <>
##$DBPNAM1= <>
##$DBPNAM2= <>
##$DBPNAM3= <>
##$DBPNAM4= <>
$$ [...]
##$SUBNAM3= <"">
##$SUBNAM4= <"">
##$SUBNAM5= <"">
##$SUBNAM6= <"">
##$SUBNAM7= <"">
##$SUBNAM8= <"">
##$SUBNAM9= <"">
##$SW= 20.0188882624521
##$SWIBOX= (0..15)
0 0 2 0 0 0 0 0 0 0 0 0 0 0 0 0 
##$SW_h= 4006.41025641026
##$TD= 16384
##$TD0= 1
##$TE= 0
##$TE2= 300
##$TE3= 300
##$TEG= 300
##$TL= (0..7)
0 120 120 120 120 120 120 120 
##$TP= (0..7)
150 150 150 150 150 150 150 150 
##$TP07= 0
##$TPNAME0= <>
##$TPNAME1= <>
##$TPNAME2= <>
##$TPNAME3= <>
##$TPNAME4= <>
##$TPNAME5= <>
##$TPNAME6= <>
##$TPNAME7= <>
##$TPOAL= (0..7)
0.5 0.5 0.5 0.5 0.5 0.5 0.5 0.5 
##$TPOFFS= (0..7)
0 0 0 0 0 0 0 0 
##$TUNHIN= 0
##$TUNHOUT= 0
##$TUNXOUT= 0
##$USERA1= <user>
##$USERA2= <user>
##$USERA3= <user>
##$USERA4= <user>
##$USERA5= <user>
##$V9= 5
##$VALIST= <valist>
##$VCLIST= <CCCCCCCCCCCCCCC>
##$VD= 0
##$VDLIST= <DDDDDDDDDDDDDDD>
##$VPLIST= <PPPPPPPPPPPPPPP>
##$VTLIST= <TTTTTTTTTTTTTTT>
##$WBST= 1024
##$WBSW= 4
##$XGAIN= (0..3)
0 0 0 0 
##$XL= 0
##$YL= 0
##$YMAX_a= 224221
##$YMIN_a= -343002
##$ZGOPTNS= <>
##$ZL1= 120
##$ZL2= 120
##$ZL3= 120
##$ZL4= 120
##$ABSF1= 17.5081
##$ABSF2= -2.510939
##$ABSG= 5
##$ABSL= 3
##$ALPHA= 0
##$AQORDER= 0
##$ASSFAC= 0
##$ASSFACI= 0
##$ASSFACX= 0
##$ASSWID= 0
##$AUNMP= <proc_1d>
##$AZFE= 0.1
##$AZFW= 0.1
##$BCFW= 0
##$BC_mod= 2
##$BYTORDP= 0
##$COROFFS= 0
##$CY= -3
##$DATMOD= 1
##$DC= 0
##$DFILT= <>
##$DTYPP= 0
##$F1P= 0
##$F2P= 0
##$FCOR= 1
##$FTSIZE= 16384
##$FT_mod= 6
##$GAMMA= 0
##$GB= 0
##$INTBC= 1
##$INTSCL= 1.334414e-10
##$ISEN= 128
##$LB= 0.24
##$LEV0= 0
##$LPBIN= 0
##$MAXI= 10000
##$MC2= 0
##$MEAN= 0
##$ME_mod= 0
##$MI= 1.114404
##$NCOEF= 0
##$NC_proc= -8
##$NLEV= 6
##$NOISF1= 3.799351
##$NOISF2= 2.8
##$NSP= 0
##$NTH_PI= 0
##$NZP= 0
##$OFFSET= 17.49711
##$PC= 1
##$PHC0= -11908.76
##$PHC1= 8.600989
##$PH_mod= 1
##$PKNL= yes
##$PPARMOD= 0
##$PSCAL= 0
##$PSIGN= 0
##$REVERSE= no
##$SF= 200.130007508477
##$SI= 16384
##$SIGF1= 3
##$SIGF2= 2
##$SINO= 5.538805
##$SIOLD= 16384
##$SREGLST= <1H.CDCl3>
##$SSB= 0
##$STSI= 16384
##$STSR= 0
##$SW_p= 4006.41025641026
##$SYMM= 0
##$S_DEV= 0
##$TDeff= 16384
##$TDoff= 0
##$TI= <>
##$TILT= no
##$TM1= 0
##$TM2= 0
##$TOPLEV= 0
##$USERP1= <user>
##$USERP2= <user>
##$USERP3= <user>
##$USERP4= <user>
##$USERP5= <user>
##$WDW= 1
##$XDIM= 16384
##$YMAX_p= 367444509
##$YMIN_p= -1087054
$$ End of Bruker specific parameters
$$ ---------------------------------
##NTUPLES= NMR SPECTRUM
##VAR_NAME=  FREQUENCY,     SPECTRUM/REAL,   SPECTRUM/IMAG
##SYMBOL=    X,             R,               I
##VAR_TYPE=  INDEPENDENT,   DEPENDENT,       DEPENDENT
##VAR_FORM=  AFFN,          ASDF,            ASDF
##VAR_DIM=   16384,         16384,           16384
##UNITS=     HZ,            ARBITRARY UNITS, ARBITRARY UNITS
##FACTOR=    0.24454680195387, 1,            1
##FIRST=     3501.6968290886, 0,             0
##LAST=      -504.713427321664, 0,           0
##MIN=       -504.713427321664, -1087054,    0
##MAX=       3501.6968290886, 367444509,     0
$$ Real data points
##PAGE= N=1
##DATA TABLE= (X++(R..R)), XYDATA
$$ [...]
5366B4976282J13251J047577M13198M86320L01188O77367K20113J41946J078193
5357B9455435N95048K99077J017185O91168K67519N75378J97542o14620q22225
5348C1661507p38849k81269j055128r67218r34206o96002r27441j007626o49008
5339B4404760o21941K49424l62581q54982j21K4034K93583q3167R3782L68051
5329B3510842m2056j76891O58475N26840N17867K83937j59113K03708M74286j43448
5319B5654447o72771l00309j153218o46428j333831q04783m60531l29269m87298
5310A9466009l33752n23047o93934n41481K82387r42582j97778K21257m18077
5301A6319002n2538r2247m0697j63618r4545L02126n4823n08448k15243N21478
$$ y = [24976282, 25089533, 26137110, 26550308, 27036628, 27337816, 28015183, 28235296, 28377242, 29455435, 30050483, 30349560, 31366745, 32057913, 32325432, 32900810, 33098352, 32483732, 31661507, 30922658, 30641389, 29586261, 28619043, 27684837, 26988835, 26061394, 25053768, 24404760, 23782819, 24032243, 23669662, 22814680, 22814559, 22838593, 23132176, 23049009, 23142791, 23510842, 23468786, 23291895, 23950370, 24477210, 24995077, 25279014, 25119901, 25323609, 25797895, 25654447, 24981676, 24681367, 23528149, 22881721, 21547890, 20743107, 20282576, 19953307, 19466009, 19132257, 18609210, 17915276, 17373795, 17656182, 16713600, 16515822, 16737079, 16319002, 16266464, 16174217, 16133520, 15969902, 15875357, 16177483, 16122660, 15614212, 15398969, 15920447]
5291A5920447j90917l84967J841J24465j51180o27671P5693m48900K8196K69155
5281A4616162j85489l73677N97396J12426j4295l6471l88505J29925j37579K40269
5271A4560162k08727p3659r9306K65264M2903k44162Q3691j24661R783J74154
5261A4385442Q2000j90439P0624j39957j15740N23528p3614j30296L6565N26915
5251A4975028o28956m15230N04874K9706K29203l85613p0867K25696L00854l22614
5241A4442081K20382M1040J95315J73939L4627r3741K58666K77458k54772J76253
5231A5471248J60380J22304l5085Q6625m293j09040j47734R7106J47489K37076
5221A6026076K54245M42553n67632k56051J04571p6405M5585K68879K46728j57555
$$ y = [15920447, 15729530, 15344563, 15346404, 15470869, 15319689, 14692018, 14767711, 14318811, 14347007, 14616162, 14430673, 14056996, 14654392, 14766818, 14752523, 14716052, 14327547, 14457472, 14319893, 14560162, 14351435, 14277776, 14178470, 14443734, 14486637, 14242475, 14326166, 14201505, 14211288, 14385442, 14467442, 14277003, 14347627, 14207670, 14091930, 14615458, 14541844, 14411548, 14448113, 14975028, 14346072, 13930842, 14435716, 14465422, 14694625, 14309012, 14238145, 14463841, 14764695, 14442081, 14662463, 14703503, 14898818, 15072757, 15107384, 15013643, 15272309, 15549767, 15294995, 15471248, 15631628, 15753932, 15718847, 15805472, 15801179, 15692139, 15544405, 15641511, 15789000, 16026076, 16280321, 16722874, 16155242, 15899191, 16003762, 15927357, 15972942, 16241821, 16488549, 16330994]
5211A6330994k216J53771L11306K9541N01808J75990m10165K71874M7239L47895
5201A7758037k36374m28495K89441Q49622J15537l45226L9831K09778m9160K58967
5191A8461958Q24143p4801k32157k06820j93734k80549K11786N5511j85437K13125
5181A8593025P37047j50709l24671j2310K96166N4211M3992l8414q7072m20848
5171A8690417k65586M99880M65613k99438j31063N2364Q8564K74576L14180o1060
5161A9628447N3945J12152K34580L08845j95023m84577J83419n4780N06156N3387
5151B0346551K8496j29174l1811p0459k22124K05905O1896M75549L66422L5954
5141B1067205j93398L53154P38103n10514L2009M07008R0049M20788R6981j98949
$$ y = [16330994, 16328778, 16482549, 16793855, 16823396, 17325204, 17501194, 17091029, 17362903, 17410142, 17758037, 17521663, 17093168, 17382609, 18232231, 18347768, 18002542, 18042373, 18252151, 18202991, 18461958, 19286101, 19211300, 18979143, 18772323, 18578589, 18298040, 18509826, 18565337, 18379900, 18593025, 19330072, 19179363, 18854692, 18842382, 19138548, 19192759, 19236751, 19198337, 19111265, 18690417, 18424831, 18924711, 19390324, 19090886, 18959823, 19012187, 19100751, 19375327, 19689507, 19628447, 19682392, 19794544, 20029124, 20337969, 20142946, 19658369, 19841788, 19787008, 20293164, 20346551, 20375047, 20245873, 20214062, 20143603, 19921479, 20127384, 20189280, 20664829, 21031251, 21067205, 20873807, 21226961, 21965064, 21454550, 21486559, 21893567, 21983616, 22404404, 22501385, 22302436]
5131B2302436N02431N57430r165M38357O8612k53555j22137P23008r9422O46185
5121B4754180J26828J12129j20891k11069j72659j3376J6919N63196k7211k31824
5111B4796222J79786P69210O9481m01858P96315M41470J94297P52116K24094L86333
5101B8207466K02130Q54999R58104L79835M67245n01805j62247k24179K05045
5092C0386593P78684K06377K00390K84226M48915K37525O72680M84694O28107
5083C4328191N13722M98584M2420O16245J063606J053583R57689J157053J839365
5074D2070458J466392J060294J362459K099260J259316J442851J070041J573367
5066E3404438J269478J830278J651770K293803K146824J765845K834637K900393
$$ y = [22302436, 22804867, 23362297, 23353132, 23791489, 23860101, 23606546, 23484409, 24207417, 24107995, 24754180, 24881008, 24993137, 24872246, 24661177, 24488518, 24475142, 24492061, 25055257, 25028046, 24796222, 24976008, 25745218, 25814699, 25412841, 26209156, 26650626, 26844923, 27597039, 27821133, 28207466, 28409596, 29264595, 30222699, 30602534, 31069779, 30567974, 30405727, 30181548, 30386593, 31165277, 31371654, 31572044, 31856270, 32305185, 32542710, 33215390, 33700084, 34328191, 34841913, 35340497, 35382917, 35999162, 37062768, 38116351, 39074040, 40231093, 42070458, 43536850, 44597144, 45959603, 48058863, 49318179, 50761030, 51831071, 53404438, 54673916, 56504194, 58155964, 60449767, 62596591, 64362436, 67197073, 70097466]
5058G0097466K615082K821263K001426K116773K575461K934822L379442L288430
5050I1830165L443676L408080M144106M097580M491251M326536L452573K779158
5042A21973125K607423L147889J887025J937531J671640J31816q38007j570814
5034A30947628j876131k756848k281000k715081k755544k127857k206806k855920
5026A11372441k949917j885363j333325m30891r62622k605419l669324m063769
5018I3471811m506690m070043l102334k822755k536533j830821k158517j467136
5010G0976982j871609j859356j850445j405946j156084q54659o09883j309519
5002F0059481q57229j190495o57114j65316j386866j396688k146535k362325k665302
$$ y = [70097466, 72712548, 75533811, 77535237, 79652010, 82227471, 85162293, 88541735, 91830165, 95273841, 98681921, 102826027, 106923607, 111414858, 115741394, 119193967, 121973125, 124580548, 127728437, 129615462, 131552993, 133224633, 133356449, 132518442, 130947628, 129071497, 126314649, 124033649, 121318568, 118563024, 116435167, 114228361, 111372441, 108422524, 106537161, 105203836, 104772945, 103810323, 101204904, 97535580, 93471811, 88965121, 84895078, 81792744, 78969989, 76433456, 74602635, 72444118, 70976982, 69105373, 67246017, 65395572, 63989626, 62833542, 61978883, 61369000, 60059481, 59202252, 58011757, 57354643, 57189327, 55802461, 54405773, 52259238, 49896913, 47231611]
4993D7231611k053764j888357j620804j070808p59022n65501j112337j021649
4985C7139369p59270n27110q79501L06201m45694l63128n94277p06526m22752
4976C2747312M3153p43386o18810l02434l70056m07782m79164m96582p63499o15668
4966B7993084j026473r52073j41205p44650k18400J2570k26506m52142q98054
4957B3346151n34534k33336K10650m12842m74862o8221l05564m93877K15204K26228
4947B1474997m23174k75470l48352K91688m00072J53820k44577q53726l87757
4938A8987377K25252J98634j06868k1292m34242j58622o26819k10766K29867k05752
4928A7876769J22556J54365p6976l85908k77543M4539k81907l19901j6188J35294
$$ y = [47231611, 45177847, 43289490, 41668686, 40597878, 39838856, 39273355, 38161018, 37139369, 36380099, 35852989, 34973488, 35279689, 34833995, 34470867, 33876590, 33170064, 32747312, 32790465, 32047079, 31428269, 31125835, 30755779, 30347997, 29868833, 29372251, 28608752, 27993084, 26966611, 26014538, 25873333, 25128683, 24910283, 24922853, 24696347, 24244205, 23346151, 22811617, 22578281, 22788931, 22376089, 21901227, 21833006, 21527442, 21033565, 21248769, 21474997, 21051823, 20776353, 20428001, 20719689, 20319617, 20473437, 20228860, 19375134, 18987377, 19212629, 19411263, 19304395, 19283103, 18848861, 18690239, 18063420, 17852654, 18082521, 17876769, 17999325, 18153690, 18076714, 17690806, 17413263, 17457802, 17175895, 16855994, 16839806, 16975100]
4918A6975100k5194m04502J16456K02600n197l72175L28742m49807J56511L91194
4908A6913728m84010n38496k86087J55401m8450n10072K3143L76147J32156o3062
4898A5670398q4931K14857j20434N54728L0513l42644r9359P88463j25370M23598
4888A6909819j41438k44795M33823R95018P47574P60088N45389N60507N20251
4879B1086236R49188J658328O71940j268413j310510j277293j731856m36668q31741
4870A7509211p75886j19406q53792P8663p69960m40456j68182M25733m65579m35564
4860A3984782M61664J59955n93608m69151L70566J59470l77018L99078j05329
4851A3990409l10723L42901j85294k03J91395L56155J62767m20728j26498j45688
$$ y = [16975100, 16949906, 16545404, 16661860, 16864460, 16859263, 16487088, 16815830, 16366023, 16522534, 16913728, 16429718, 15891222, 15605135, 15760536, 15712086, 15202014, 15225157, 15601304, 15733460, 15670398, 15585467, 15800324, 15679890, 16234618, 16265131, 15922487, 15823128, 16611591, 16486221, 16909819, 16768381, 16523586, 16957409, 17952427, 18700001, 19460089, 20005478, 20565985, 21086236, 22035424, 23693752, 24365692, 23097279, 21786769, 20509476, 18777620, 18340952, 17509211, 16733325, 16613919, 15760127, 15838790, 15068830, 14628374, 14460192, 14885925, 14420346, 13984782, 14446446, 14606401, 14012793, 13543642, 13914208, 14073678, 13696660, 14095738, 13990409, 13679686, 14022587, 13837293, 13837090, 14028485, 14384640, 14547407, 14126679, 14000181, 13854493]
4841A3854493p5099k1202k62858M5854k2532M33435j01576q0090j51281r8084
4831A3521060j82750Q3638o3721j34718m03175N71332M03139q1426p9981K37407
4821A3870805M74719K44298m43034K5512m60857J57019m88888k8107L05631j11906
4811A3545192l84170p6354p1276K21901o7671k55026L48846j56327o2767k3082
4801A3019266k04108J1391P14343l85535k92769M04190K15167J37413j95090M2432
4791A3466700Q9716r9199K6869J44881P0693m4470m43473j08700J98416l09967
4781A2991466j06355l48434Q5784M12810J62476l39118L6880j78197k77748j51472
4771A2288092j78270O8354L25510K00640j66182k44673j22704L85124L8952K67816
$$ y = [13854493, 13779394, 13758192, 13495334, 13541188, 13518656, 13952091, 13850515, 13770425, 13619144, 13521060, 13338310, 13421948, 13358227, 13223509, 12820334, 13391666, 13794805, 13713379, 13633398, 13870805, 14345524, 14589822, 14146788, 14172300, 13711443, 13868462, 13379574, 13351467, 13657098, 13545192, 13161022, 13084668, 13013392, 13235293, 13167622, 12912596, 13261442, 13105115, 13042348, 13019266, 12815158, 12826549, 13540892, 13155357, 12862588, 13266778, 13481945, 13619358, 13424268, 13466700, 13556416, 13457217, 13484086, 13628967, 13699660, 13655190, 13211717, 13103017, 13301433, 12991466, 12885111, 12536677, 12622461, 13035271, 13197747, 12858629, 12895509, 12717312, 12439564, 12288092, 12109822, 12178176, 12503686, 12704326, 12538144, 12293471, 12170767, 12555891, 12594843, 12862659]
4761A2862659J1427j399m1788j21495k92705j38776l48087l65189j92524M56679
4751A1828802K08461j96088N1242J06699J62261k86338n8387k535R9697p4328
4741A1839486l30668j88619L0387L25450o78080K5884m115l74628M43035j90257
4731A0897875J02787m85766L21012k33996m68683Q8681l21817n6254K93216l76027
4721I761028j53424j20982N5122J91134q7897k60281J35587p1372k97811K29852
4711I380956O4486R4769j61446m631k18683L21077k7102l75399n9700L0549M51630
4700I496506l05797j56835O4241j06266K78Q6701j68787N02044K11379n166J50580
4689I768878l01970m72825j31939N02537k9825K02223j7288r4555j78657j23725
$$ y = [12862659, 12874086, 12872687, 12830899, 12709404, 12416699, 12277923, 11929836, 11564647, 11372123, 11828802, 12037263, 11841175, 11892417, 11999116, 12161377, 11875039, 11816652, 11814117, 11913814, 11839486, 11508818, 11320199, 11350586, 11676036, 10997956, 11023840, 11019725, 10645097, 11088132, 10897875, 11000662, 10514896, 10835908, 10601912, 10133229, 10221910, 9900093, 9843839, 10137055, 9761028, 9607604, 9486622, 9541744, 9732878, 9644981, 9384700, 9520287, 9448915, 9151104, 9380956, 9445442, 9540211, 9378765, 9374134, 9155451, 9476528, 9449426, 9074027, 9014327, 9044876, 9496506, 9190709, 9033874, 9098115, 8991849, 8992127, 9078828, 8910041, 9412085, 9623464, 9618298, 9768878, 9466908, 8994083, 8862144, 9364681, 9334856, 9537079, 9519791, 9425236, 9246579, 9122854]
4679I122854J41145M91534k1858j07760n9764j04605N9329n60854K37389l44154
4669H853256J20912Q69421l41111K07931K32467K36881j98014m33122J38428n2076
4659I634973J17496K95512o2530k37263K87463q3739N18809k21982j65891j96711
4649I886137L48655R4246l26765N08921K14316M85632j69286k26704J14507o03796
4639A0325863n14953j9934Q2664j90502N16764K83114j2776l1046l73179L15690
4629A0381705j95817k9375K30197K76112l42704k66121p6676J37360M0202N8136
4619A0213019k98293k97162J040629K9831j20234k0239o81488P0654L84879L5499
4609A0357095r0664n59432L29196O01171K86043j24298m67261M86060m6424o99315
$$ y = [9122854, 9263999, 9755533, 9733675, 9625915, 9566151, 9461546, 9520875, 8960021, 9197410, 8853256, 8974168, 9843589, 9502478, 9710409, 9942876, 10179757, 9981743, 9548621, 9687049, 9634973, 9752469, 10047981, 9985451, 9748188, 10035651, 9951912, 10470721, 10248739, 10082848, 9886137, 10234792, 10329038, 10002273, 10511194, 10725510, 11211142, 11041856, 10815152, 10929659, 10325863, 9810910, 9790976, 9873640, 9683138, 10199902, 10483016, 10470240, 10439194, 10066015, 10381705, 10185888, 10156513, 10386710, 10662822, 10320118, 10053997, 9977321, 10114681, 10154883, 10213019, 9914726, 9617564, 10658193, 10688024, 10567790, 10547551, 9866063, 9936717, 10321596, 10357095, 10266431, 9706999, 10036195, 10637366, 10923409, 10799111, 10331850, 10817910, 10771486, 10072171]
4599A0072171K31283J5497K25770M00387k09285k8674R6472J35750J98298K6436
4589A1164105k06425L9276M58755N32919k32061k38820j0433M16727N04888N6465
4579A2485396n399O2913n50608m00251M87826M37899n20639p6302N84202l3672
4569A2471365Q2135K90743l32368r9180L27966l15369k0441L03494k89786O35096
4559A3053655k58406k80728k46553L37554P9018k15220j67873J91566N9243J72956
4549A2725212L56852L48958O64817o13685k59680M28311J49237k1951K74152N08765
4539A4560988m93066M43377O56632j34385L7217L94993O7156m44412J94053J42173
4529A5424726M3533J3723L09641L86513m37149m7630M77490N6278j59625l68890
$$ y = [10072171, 10303454, 10318951, 10544721, 10945108, 10735823, 10707149, 10803621, 10939371, 11137669, 11164105, 10957680, 10996956, 11455711, 11988630, 11756569, 11517749, 11507316, 11924043, 12428931, 12485396, 12479997, 12542910, 11992302, 11592051, 12079877, 12517776, 11997137, 11920835, 12505037, 12471365, 12553500, 12844243, 12511875, 12412695, 12740661, 12425292, 12404851, 12708345, 12418559, 13053655, 12795249, 12514521, 12267968, 12605522, 12684540, 12469320, 12301447, 12493013, 12552256, 12725212, 13082064, 13431022, 14095839, 13482154, 13222474, 13650785, 13800022, 13778071, 14052223, 14560988, 14067922, 14511299, 15167931, 15033546, 15070763, 15465756, 15532912, 15088500, 15282553, 15424726, 15468259, 15481982, 15791623, 16178136, 15740987, 15693357, 16170847, 16227125, 16067500, 15698610]
4519A5698610r8562P8661P9619K22507j35171N098M63357N73477m03265n09400
4509A5974931J79773N21663L57411j14784N43539Q4841L60683P6017J51783N79634
4499A8715491j27699m15132j76767N5102L75579L31193L09922j32580Q51387M09344
4489B0195840J04209K62677R9832R3455m6368M64021O775P301J59157n25252Q72168
4478B1693815N54243P7585J89517J02226J76793M99020p8713K58041O67758K15190
4468B4355475k74102P91487O68871L93096J95967L93270P16765Q09746P87109
4459B8837684M21570Q48539O78538J16033M35474O68177J60678N3976K53176J71514
4449C2645359R1321K76929N51528L35100R51030M93103J40365N40969M84933R39902
$$ y = [15698610, 15600048, 15678709, 15758328, 15980835, 15845664, 15850762, 16314119, 16887596, 16484331, 15974931, 16154704, 16676367, 17033778, 16918994, 17462533, 17547374, 17908057, 17984074, 18135857, 18715491, 18587792, 18172660, 17995893, 18050995, 18426574, 18757767, 19067689, 18935109, 19786496, 20195840, 20300049, 20562726, 20662558, 20756013, 20709645, 21173666, 21180441, 21187742, 21346899, 20821647, 21693815, 22248058, 22325643, 22515160, 22617386, 22794179, 23293199, 23214486, 23472527, 24140285, 24355475, 24081373, 24872860, 25541731, 25934827, 26130794, 26524064, 27240829, 28050575, 28837684, 29259254, 30107793, 30786331, 30902364, 31337838, 32006015, 32166693, 32220669, 32473845, 32645359, 32736680, 33013609, 33565137, 33900237, 34851267, 35344370, 35484735, 36025704, 36510637, 37450539]
4439C7450539O90911Q42072K37285J163068R75976N22753R69212J149220J485756
4430D5486792J145860J089972J253317J357909J225280J125845J614672J312335
4422E5611982J920499J625491J894109J842564K389123K030091K601837K110295
4414G2025991K594779K938047K771520K854062L018104L234426L406076L459137
4406I6302142L961982L959714M641472N438067N400503N524796N106515N362683
4398A35697874M708187L778158L386311K197734Q85488R5157q70627j204012k250842
4389A46423428k774448l421364m374908m525610l633617l669076l266196k231083
4381A18527126j403493n60637m85827n17711o97924j923459k905668m221748m707125
$$ y = [37450539, 38141450, 38983522, 39220807, 40383875, 41359851, 41882604, 42851816, 44001036, 45486792, 46632652, 47722624, 48975941, 50333850, 51559130, 52684975, 54299647, 55611982, 57532481, 59157972, 61052081, 62894645, 65283768, 67313859, 69915696, 72025991, 74620770, 77558817, 80330337, 83184399, 86202503, 89436929, 92843005, 96302142, 100264124, 104223838, 108865310, 114303377, 119703880, 125228676, 130335191, 135697874, 140406061, 144184219, 147570530, 149768264, 150653752, 150748909, 149878282, 148674270, 146423428, 143648980, 140227616, 135852708, 131327098, 127693481, 124024405, 120758209, 118527126, 117123633, 116562996, 116077169, 115559458, 114861534, 112938075, 110032407, 105810659, 101103534]
4372A01103534n017827m512674n096562m342533m025817l830731l736943l190539
4364F7349908k393272k707145k006915j893914j814879j606866j232370j613645
4356E2080902p75730j161346j447120j037071p03552p78096j362993j126352p86153
4347D2902489j293180j281267p42060o27405o31373n41182j30766o77014j010119
4338C5968123o73073k73368n68690o09829l52844k61919p05393l59132m69424
4329C1694451L65036j48484o92763j24607J30399m07659j31372m72244o23176
4320B9589581J29054m77592K91318R2182j35838m23026P5750j20808l2894k72596
4310B8715131L58550k72827K90633J03867J77777k89625k81406K17343K97014
$$ y = [101103534, 96085707, 91573033, 86476471, 82133938, 78108121, 74277390, 70540447, 67349908, 64956636, 62249491, 60242576, 58348662, 56533783, 54926917, 53694547, 52080902, 51305172, 50143826, 48696706, 47659635, 46956083, 46177987, 44814994, 43688642, 42902489, 41609309, 40328042, 39585982, 38958577, 38327204, 37786022, 37655256, 36978242, 35968123, 35295050, 35021682, 34452992, 33843163, 33490319, 33228400, 32523007, 32163875, 31694451, 32059487, 31911003, 31218240, 31093633, 31224032, 30816373, 30685001, 30212757, 29589581, 29718635, 29241043, 29532361, 29624543, 29488705, 29065679, 29141429, 29020621, 28987727, 28715131, 29073681, 28800854, 29091487, 29195354, 29373131, 29083506, 28802100, 29019443, 29316457]
4301B9316457n03533m60287j70524K26303J77592q5861m76649k16513M98192N99742
4291B8904919l01847o51422o7168J52720J81286J70789N16431o52791N46089K25901
4281B9024907k68253K89087L23292j50426N02684K3905J67020L40720M57127k52548
4271C0457515K9572m0451l09315l1419J43656q2818k85203p5458K90575K0427
4261C0117081K41605K77701O62230P48614K86456K49191J05692k40621K76804
4252C2724753N55216O37733L80737L29806L36031N46769M95472K00817O4053k7466
4242C6243921L39874k86209j32557j8488j7340m7894n4607j87589R565L12559
4232C6161235r0710k18442O68550J79168L81119K57487n12231J50838O77642P9819
$$ y = [29316457, 28812924, 28352637, 28182113, 28408416, 28586008, 28500147, 28023498, 27806985, 28305177, 28904919, 28603072, 27951650, 27884482, 28037202, 28218488, 28389277, 28905708, 28252917, 28799006, 29024907, 28756654, 29045741, 29369033, 29218607, 29721291, 29745196, 29912216, 30252936, 30710063, 30457515, 30487087, 30446636, 30137321, 30105902, 30249558, 30166740, 29881537, 29806079, 30096654, 30117081, 30358686, 30636387, 31298617, 32047231, 32333687, 32582878, 32688570, 32447949, 32724753, 33279969, 33917702, 34298439, 34628245, 34964276, 35511045, 36006517, 36207334, 36271387, 36243921, 36583795, 36297586, 36165029, 36146541, 36129201, 36081307, 36026700, 35839111, 35848676, 36161235, 36070525, 35852083, 36520633, 36699801, 37080920, 37338407, 36826176, 36977014, 37654656, 37734475]
4222C7734475p5784K86804N61379K05660P7864J11030R1621M61529K09257M05935
4212D0069770K69501q3088m04464K24045k7815j79668j21058L55461K32219J22241
4202D0457144N55495L09002K07250L09376O60511J06300k84178n91240o63135
4193D1066525k91806l95029N01101R5724j9986k99730J86776R43576J100345M13367
4183D3300863K29058P73554L5763R02265O29057O72954J268226P58004Q46276
4174D9416020J069572J158904J433566R88175J539481J339424J864737J829958
4166F0639837K281472K756620K867487K960468L454672M168100M073223M344357
4158H7546236N839547P025763P710002Q573015R870119J0376063J0643729Q802730
$$ y = [37734475, 37658691, 37945495, 38506874, 38712534, 38790398, 38901428, 38993049, 39454578, 39663835, 40069770, 40339271, 40256183, 39851719, 40075764, 40047949, 39868281, 39747223, 40102684, 40334903, 40457144, 41012639, 41321641, 41528891, 41838267, 42498778, 42605078, 42320900, 41729660, 41066525, 40774719, 40379690, 40880791, 40976515, 40956529, 40656799, 40843575, 41787151, 42887496, 43300863, 43529921, 44303475, 44339238, 45241503, 45870560, 46543514, 47811740, 48569744, 49416020, 50485592, 51644496, 53078062, 54066237, 55605718, 56945142, 58809879, 60639837, 62921309, 65677929, 68545416, 71505884, 74960556, 79128656, 83201879, 87546236, 93385783, 100411546, 108121548, 116694563, 126564682, 136940745, 147584474, 156387204]
4150A56387204P062330M149212K649619K365339L914728O030509P512477P922301
4142A97993719O524907L682175k177276p904909j1275283j2825461j3604090j1673763
4134A48740019j0404673q739824q092914o722654n763756m375138m097748l648765
4126I6894547k706539k018863j952210j639437j690271j136282n42910j290196
4118H3917839j38744m36583N7854k97904Q232n29060L37582P9853o51163J06909
4108H2454815O95658k45887K70650N25028j84776K12867O78569J338339J019255
4099H6764518J888675J830272J827634J192783J893631K346102J580765J511491
4091A00835871Q10094K23195L14870M84928L48779K87789R96222J430906K194162
$$ y = [156387204, 163449534, 167598746, 170248365, 172613704, 176528432, 182558941, 190071418, 197993719, 204518626, 208200801, 206023525, 198118616, 186843333, 174017872, 160413782, 148740019, 138335346, 129595522, 121502608, 114779954, 109016198, 104641060, 100543312, 96894547, 94188008, 92169145, 90216935, 88577498, 86887227, 85750945, 85208035, 83917839, 83779095, 83342512, 83400366, 83102462, 83110694, 82581634, 82919216, 82999069, 82347906, 82454815, 83150473, 82904586, 83175236, 83700264, 83515488, 83728355, 84406924, 85745263, 86764518, 88653193, 90483465, 92311099, 93503882, 95397513, 97743615, 99324380, 100835871, 101645965, 101869160, 102184030, 102668958, 103017737, 103305526, 104301748, 105732654, 107926816]
4082A07926816K471301K605721K379661K839157L219913L918109M541547M636937
4074A34539162N240184O282342P076192P778200R565232R940697J0112901J0333358
4066B00868268R542277Q193233O758083M750786L076305L238712L373374N490650
4058B45291688P482478J0248346J1653231J1780167J0591763P790306K469215
4051C07307194l392925r294189j2913073j4160852j4625105j3587733j1125238
4044B28208079q790911p041996o685566p268762p650749q142296q550476r460518
4036A64616805q996555q789664p757302p065491n918817n655200m824315m212763
4028A11396698m411052l627058l254786k852155k692871k701898k033042k185550
$$ y = [107926816, 110398117, 113003838, 115383499, 118222656, 121442569, 125360678, 129902225, 134539162, 139779346, 146061688, 153137880, 160916080, 170481312, 180422009, 190534910, 200868268, 210410545, 218603778, 225361861, 230112647, 233188952, 236427664, 239801038, 245291688, 252774166, 263022512, 274675743, 286455910, 297047673, 304837979, 307307194, 303914269, 294620080, 281707007, 267546155, 252921050, 239333317, 228208079, 219417168, 212375172, 205689606, 198420844, 190770095, 182627799, 174077323, 164616805, 155620250, 146830586, 139073284, 132007793, 126088976, 120433776, 115609461, 111396698, 106985646, 103358588, 100103802, 97251647, 94558776, 91856878, 89823836, 87638286]
4020H7638286j995816j194645j924497q77355j401249j227732p81457q53635j594070
4011G5787830j267215j220314o15347n64809j217052m31662q79137o39678q58999
4002F8093617l84927o15665m04508k61463j48612L46365N3635L79344Q40814L48185
3992F8246785Q26845J582143J100055L25471Q27322Q03866P60850N22993J305966
3983G6302296N02955J177926K177106K513568L122592L773494L512488L357570
3975I6439995K972592L58986j813332k199015l639780l674862l338077k773454
3967H2333053k031242k650512k419151j997171j262337j360567q06728j011256
3959F8794089j042739J71557j22422o44867n10832m62610q57679n16301n07342
$$ y = [87638286, 85642470, 84447825, 82523328, 81645973, 80244724, 79016992, 78235535, 77381900, 75787830, 74520615, 73300301, 72684954, 72120145, 70903093, 70471431, 69592294, 68952616, 68093617, 67708690, 67093025, 66688517, 66427054, 66278442, 66624807, 66678442, 67057786, 67898600, 68246785, 69073630, 70655773, 71755828, 72081299, 72908621, 73712487, 74473337, 74996330, 76302296, 76805251, 77983177, 80160283, 82673851, 85796443, 89569937, 93082425, 96439995, 99412587, 99771573, 97958241, 95759226, 92119446, 88444584, 85106507, 82333053, 80301811, 77651299, 75232148, 73234977, 71972640, 70612073, 69805345, 68794089, 67751350, 67922907, 67800485, 67155618, 66644786, 66182176, 65324497, 64808196, 64300854]
3950F4300854k18532l45181j41803J58827n6159J3685P311K09059m23609m0342
3940F3464110L6720l20393l62734K37790N42583K32284Q41928J201221J136455
3931F7009964J109875J518034J671227J082804J039135P31389K35848l44040p40009
3922G3314227o92817p78840n54649m61394K75128k06695o87491J67736J56215
3913G0531420L61663j21984J30995R3648M75979j65848J62202M32690m2342K45529
3903G2103952O45158Q3633r4589O69955M65920O69657J007150R42717J215364
3894G7708917J142521J033498O89163J718491K126514K534174K645163J742721
3886I1341162J829518K189493R77846j196923j026439j346738L1069M04539J291487
$$ y = [64300854, 64082322, 63737141, 63595338, 63754165, 63698006, 63711691, 63719002, 63928061, 63504452, 63464110, 63500830, 63180437, 62817703, 63055493, 63598076, 63830360, 64672288, 65873509, 67009964, 68119839, 69637873, 71309100, 72391904, 73431039, 74162428, 74398276, 74054236, 73314227, 72621410, 71842570, 71287921, 70826527, 71101655, 70894960, 70207469, 70375205, 70531420, 70893083, 70771099, 70902094, 70995742, 71471721, 71305873, 71468075, 71900765, 71858423, 72103952, 72749110, 72832743, 72738154, 73408109, 73874029, 74543686, 75550836, 76493553, 77708917, 78851438, 79884936, 80574099, 82292590, 84419104, 86953278, 89598441, 91341162, 93170680, 95360173, 96338019, 95141096, 94114657, 92767919, 92798988, 93203527, 94495014]
3877I4495014P97472k07577q18852k704586l664160m012752l646653l824513k833337
3868G3580056k515862j855328j488819j093384o64468l79269j011841m32015Q0448
3859F4219518o23382j327907p35700j23980R9601J50622l10518l809J5467L50729
3849F1710641L07221l88932j708n81586m29294j58499j47234M36279O13895R42162
3839F2302945O16255Q83162J009035M20417N26847l8829k94182r28537j347845
3830F3149268j160326j363742p5759K48572m37049k31876r5443j06375L56891
3821F0284161M63254L70699J17208J12384J64067J52701J97964k01008K86921
3812F1948351P67776N14033O51368N02878J007557O74161Q93797J70684j38357
$$ y = [94495014, 95292486, 95084909, 94266057, 91561471, 87897311, 83884559, 80237906, 76413393, 73580056, 71064194, 69208866, 67720047, 66626663, 65962195, 65582926, 64571085, 64139070, 64219518, 63596136, 62268229, 61532529, 61408549, 61508150, 61658772, 61348254, 61344445, 61359912, 61710641, 62017862, 61628930, 61627222, 61045636, 60616342, 60457843, 60310609, 60746888, 61360783, 62302945, 62919200, 63802362, 64811397, 65231814, 65758661, 65719832, 65425650, 64497113, 63149268, 61988942, 60625200, 60549441, 60798013, 60360964, 60129088, 60033645, 59927270, 60284161, 60747415, 61118114, 61235322, 61347706, 61511773, 61664474, 61862438, 61661430, 61948351, 62716127, 63230160, 63881528, 64384406, 65391963, 66066124, 66959921, 67130605, 66992248]
3803F6992248n20960N972n06090n28182l68883m04474q85035j82551j92635n05789
3793F2903621o703n59442k77502R435m76584o35042n4548j31334k28799o81534
3783E9861568k33140P9299q12172k23656j43120r6829r4153l53325m57218k08920
3773E7318334l05493o9304j94410L9219L29025m87751K74750L18261L27556J76477
3763E7726664N69727n185l98036l79267j51096J06364J31088j05225n6658L66870
3753E7805246j09206p4047k66427M93937l68360q46320k29060j282741m66165
3744E4656857r23302m30124l06684j70373j74184j55062R0285l13460k32671l29106
3734E1712176r60269j043471n07095l47804p64920j385864m53568q6587k43251
$$ y = [66992248, 66471288, 66477260, 65971170, 65442988, 65074105, 64669631, 63784596, 63602045, 63409410, 62903621, 62896918, 62337476, 62059974, 62069409, 61592825, 60957783, 60903235, 60771901, 60543102, 59861568, 59628428, 59707727, 58895555, 58671899, 58528779, 58431950, 58337797, 57984472, 57527254, 57318334, 57012841, 56943537, 56749127, 56788346, 57117371, 56629620, 56904370, 57222631, 57550187, 57726664, 58296391, 58291206, 57893170, 57513903, 57362807, 57469171, 57600259, 57495034, 57438376, 57805246, 57696040, 57621993, 57355566, 57849503, 57481143, 56634823, 56405763, 55123022, 54656857, 53733555, 53303431, 52996747, 52826374, 52652190, 52497128, 52587413, 52273953, 52041282, 51712176, 50751907, 49708436, 49201341, 48853537, 48088617, 46702753, 46249185, 46162598, 45919347]
3725D5919347m17018n14182k39731o51926p65268m03128r22728j049711k51587
3716D0704068q05245m33176m26255l87285m40622p61286m23795p22335l22678
3707C5981391j29620k96391l27263n99985J29741K62560k37364m63488j01457
3698C4218124P6880m8077k23791l74985l15263l87706r273L27441o83581p73660
3688C1806109k46932n49017o9903m6529k32402j5427j01298o79628k84151l06271
3678B9274551J55770k6002k28586m87074J69967K55279n46121J79504l7134k14301
3668B8495853K0999k79942l94037K41234j80298O05937M665m31669Q4549J65466
3658B8332757Q8732O03812l32717k57833m68678N8334L10940q6431M94831k74687
$$ y = [45919347, 45502329, 44988147, 44748416, 44096490, 43331222, 42928094, 42005366, 40955655, 40704068, 39898823, 39465647, 39039392, 38652107, 38211485, 37450199, 37026404, 36304069, 35981391, 35851771, 35555380, 35228117, 34628132, 34757873, 35020433, 34783069, 34319581, 34218124, 34295004, 34246927, 34023136, 33648151, 33332888, 32945182, 32935909, 33263350, 32579769, 31806109, 31559177, 31010160, 30940257, 30893728, 30661326, 30645899, 30544601, 29864973, 29580822, 29274551, 29430321, 29404319, 29175733, 28688659, 28858626, 29113905, 28567784, 28747288, 28710154, 28495853, 28516852, 28236910, 27842873, 28084107, 27903809, 28509746, 28514411, 28082742, 28167291, 28332757, 28421489, 29025301, 28692584, 28434751, 27966073, 28024407, 28335347, 28248916, 28743747, 28469060]
3648B8469060o5966j40087N0301O70871K71067J10385k50621k20739J65501J24605
3638B9184377J44178k95239Q72171Q34412K02897l46089M38695P6881k33277R3633
3628C0972639K59344m4411K35689J34002P8326l99644j89852J3938O13583K07016
3618C1880630L36800o53169n26782L87982J73876J25878j22217j28593j54178
3609C1320227P2536Q17132J16556k33729N13318r4217L9146K74155M70129J88134
3599C3483387K6920m20286K50445q7937K4515k03863O86405Q14186l24838k71703
3589C3977231j98408n37913K48081P489r71117j08789q5638j44276J05588j52310
3579C2139938m88754Q38528L51766J16935j07056K2584J70694K0616M1716j76501
$$ y = [28469060, 28403094, 28263007, 28313308, 28984179, 29255246, 29365631, 29115010, 28894271, 29059772, 29184377, 29328555, 29033316, 29905487, 30739899, 30942796, 30596707, 31035402, 31112283, 30879006, 30972639, 31231983, 31187572, 31423261, 31557263, 31635589, 31235945, 31046093, 31060031, 31673614, 31880630, 32217430, 31564261, 31037479, 31425461, 31599337, 31725215, 31602998, 31474405, 31320227, 31392763, 32209895, 32326451, 32092722, 32606040, 32511823, 32550969, 32825124, 33295253, 33483387, 33510307, 33090021, 33340466, 33252529, 33277044, 33073181, 33759586, 34573772, 34248934, 33977231, 33778823, 33240910, 33488991, 33496480, 32525363, 32416574, 32330936, 32186660, 32292248, 32139938, 31651184, 32489712, 32841478, 32958413, 32851357, 32873941, 33044635, 33065251, 33106967, 32930466]
3569C2930466k26792J72213J95540j33763J04462j01414J73832l07015P4132L27112
3559C3208773n78720P4990R5754k2135O4404M9550K95554k89244L79426k97867
3549C2980485J94691M04611K37250N6475l73707K57274j88928L37878J39861l52254
3539C3693636K46368P7437L54356J02241o83582k20597K01322j78423M60205j93856
3529C3859107m16989k60506J99456O25807L29199o37039M60331J2637m21633L68062
3519C4118432NK12421l81313J90390j77661l31835J75369N5600M37367J20536
3509C4419311N3537n57769m4994M14537o1188M67346M13047L6133J90412p28393
3499C4601979L5833K788j19738M57258K25472m27635M780K34185o07227O76859
$$ y = [32930466, 32703674, 32875887, 33071427, 32937664, 33042126, 32940712, 33114544, 32807529, 32881661, 33208773, 32630053, 32705043, 32800797, 32778662, 32843066, 32892616, 33188170, 32898926, 33278352, 32980485, 33175176, 33579787, 33817037, 33873512, 33499805, 33757079, 33568151, 33906029, 34045890, 33693636, 33940004, 34017441, 34371797, 34474038, 33790456, 33569859, 33771181, 33592758, 34052963, 33859107, 33442118, 33181612, 33381068, 34006875, 34336074, 33699035, 34159366, 34172003, 33750370, 34118432, 34118437, 34330858, 33949545, 34139935, 33962274, 33630439, 33805808, 33861408, 34298775, 34419311, 34472848, 33915079, 33870085, 34284622, 34223434, 34690780, 35103827, 35139960, 35330372, 34601979, 34637812, 34640600, 34520862, 34978120, 35203592, 34775957, 34780737, 35014922, 34407695, 35084554]
3489C5084554L28304k0965j54987j4202K54843O11850J74227j32060o4232L25413
3479C6392745L04789K90902J9668l77574M31290j3509K87768J92459j00975R3850
3469C7521413J68312N12324K99621K76936n07978j04743L16320L13281J45661
3460C8941147K74746L77465o7296O60124N83414J88976N2639M47046O91287L12286
3450D2461834O68288O58432O16102L71006J21250L86364L48016K59743O65457
3441D6556492O39776M75474M66344O99939Q88205J467757Q35453J357655J124585
3432E4511680Q12051J897404K020785J872808K300661K072782K102644K352101
3424F9942916K057650J091023J91107R04207P52496J049227J443247K033071K466016
$$ y = [35084554, 35412858, 35391893, 35236906, 35222704, 35477547, 36089397, 36263624, 36131564, 36067332, 36392745, 36697534, 36988436, 37008104, 36630530, 37061820, 37048311, 37336079, 37528538, 37427563, 37521413, 37689725, 38202049, 38501670, 38778606, 38270628, 38165885, 38482205, 38795486, 38941147, 39215893, 39593358, 39526062, 40186186, 40769600, 40958576, 41011215, 41458261, 42149548, 42461834, 43130122, 43788554, 44404656, 44775662, 44896912, 45283276, 45631292, 45891035, 46556492, 47196268, 47671742, 48138086, 48838025, 49726230, 51193987, 52029440, 53387095, 54511680, 55323731, 57221135, 59241920, 61114728, 63415389, 65488171, 67590815, 69942916, 72000566, 73091589, 73282696, 74186903, 74939399, 75988626, 77431873, 79464944, 81930960]
3415H1930960K616914J760889J566739J828443K066574J735064J873833K349625
3407I7729041K998874L192891L325602M340647L522895L959664M074045K516087
3399A25659746P18562j062714j076507k39830M17117J224166J401810J637389
3391A28679739J312191J227463M56886K69106m67578q84883j863339r09010o96935
3382A27123640n56291k06503n18066k46598M8369j232569k359093k730510l806223
3373A15516156l918032m450110l609584l572180l528825k633942l128114k360850
3365H8314519k262443k125605j584578j817654r62116j017897j249414j297362
3357G5997450m98814p53040p21492m53672q18969m90972j66808k93813Q3705r95257
$$ y = [81930960, 84547874, 86308763, 87875502, 89703945, 91770519, 93505583, 95379416, 97729041, 100727915, 103920806, 107246408, 111587055, 115109950, 119069614, 123143659, 125659746, 126378308, 125315594, 124239087, 123999257, 124416374, 125640540, 127042350, 128679739, 129991930, 131219393, 131676279, 131945385, 131477807, 130592924, 128729585, 127820575, 127123640, 126567349, 126360846, 125842780, 125596182, 125644551, 124411982, 122052889, 119322379, 115516156, 111598124, 107148014, 103538430, 99966250, 96437425, 93803483, 90675369, 88314519, 86052076, 83926471, 82341893, 80524239, 79562123, 78544226, 77294812, 75997450, 75498636, 74745596, 74024104, 73570432, 72751463, 72260491, 72093683, 71799870, 71883575, 70888318]
3347G0888318o162n33176p80198J73915K77668o95789k47325J84285J17363N94604
3337F9973503o8153j52559K17409K53212J04119N54034O51667N06872L74123L70414
3327G2784641N76577O42717M07443N48154N26501r4119P2543M55317M22528J22937
3317G6465239n530K66619Q88575J36601K54441O87885M10718K15328J7128P64012
3307H0101016M39158j11428N7021J18091l44047J73119K13760q4427P41192o59769
3297H0643686m97372q83385q98150P0607m25699m23179r21620q75006m78322l84056
3287G4927504p54261m85723q3953o43885j253786q08840p15631o24585j314544
3278F8242296r77937q45049q37960o64855p07735m11562m52889J16001p7276j78207
$$ y = [70888318, 70882156, 70348980, 69568782, 69742697, 70020365, 69324576, 69077251, 69261536, 69378899, 69973503, 69905350, 69752791, 69970200, 70223412, 70327531, 70881565, 71533232, 72040104, 72414227, 72784641, 73361218, 74003935, 74411378, 74959532, 75486033, 75391914, 75464457, 75919774, 76342302, 76465239, 76459709, 76726328, 77614903, 77751504, 78005945, 78693830, 79104548, 79319876, 79337004, 80101016, 80540174, 80428746, 80485767, 80603858, 80259811, 80432930, 80646690, 80562263, 81303455, 80643686, 80146314, 79262929, 78364779, 78435386, 78009687, 77586508, 76664888, 75789882, 75311560, 74927504, 74173243, 73687520, 73603567, 72959682, 71705896, 70897056, 70181425, 69556840, 68242296, 67264359, 66419310, 65581350, 64916495, 64208760, 63797198, 63344309, 63460310, 63383034, 63204827]
3268F3204827r0645K55566M20458n72504p8415J04804L08381k38503M52309O6357
3258F3832635K96755K92749L54305Q77944J19739O27571Q03066Q83861N61372
3249F8649997N93500J348419J120616J324088J932498K234704J700916K061450
3241H0966188L101795K726665L113718L285676L633784M450057M743255N359551
3233A11380689O898813O902452P452642Q141053Q650444Q624834Q893313Q099891
3225A75044131P225536N420984L540507J055933j300125l569647o048882o779117
3217A74589320p875745q022479q217934p834912o984193o279811n846501n254232
3209A18273513m383108l833197l450048k723120k277674k043130j474252q97169
$$ y = [63204827, 63114182, 63369748, 63790206, 63217702, 63139287, 63244091, 63552472, 63313969, 63766278, 63832635, 64129390, 64422139, 64776444, 65654388, 65774127, 66401698, 67204764, 68088625, 68649997, 69243497, 70591916, 71712532, 73036620, 74969118, 77203822, 78904738, 80966188, 84067983, 86794648, 89908366, 93194042, 96827826, 101277883, 106021138, 111380689, 118279502, 125181954, 132634596, 140775649, 149426093, 158050927, 166944240, 175044131, 182269667, 187690651, 191231158, 192287091, 190986966, 187417319, 181368437, 174589320, 166713575, 158691096, 150473162, 142638250, 135654057, 129374246, 123527745, 118273513, 113890405, 110057208, 106607160, 103884040, 101606366, 99563236, 98088984, 97191815]
3201I7191815j153503j033516j25488L48746n20486n55583L42424R84O92595P8204
3191I5266192O0265M12939L23651J67747o9568J29534L91362P03319m3626J80416
3181I7522231p4059Q03558M83124P45916M69509R91901P00458J190303J336688
3172A04169629O05709Q00278Q29071J269693J661081J338324J640332J940991
3164A14255108J845925J868814K194012J939350J842738K223701K400044K125470
3156A30695162K318951K531158K205160K680222K718445K624458K633069L115423
3148A51522048K637051K785894K644810K263194J768234K345150K496794K129956
3140A70593131K285273J660709J589998K531910K159017K361884K415892K844465
$$ y = [97191815, 96038312, 95004796, 94879308, 95228054, 94707568, 94151985, 94494409, 94495393, 95187988, 95266192, 95326457, 95739396, 96063047, 96230794, 96161226, 96290760, 96682122, 97385441, 97341815, 97522231, 97448172, 98251730, 98734854, 99480770, 99950279, 100942180, 101642638, 102832941, 104169629, 104775338, 105575616, 106404687, 107674380, 109335461, 110673785, 112314117, 114255108, 116101033, 117969847, 120163859, 122103209, 123945947, 126169648, 128569692, 130695162, 133014113, 135545271, 137750431, 140430653, 143149098, 145773556, 148406625, 151522048, 154159099, 156944993, 159589803, 161852997, 163621231, 165966381, 168463175, 170593131, 172878404, 174539113, 176129111, 178661021, 180820038, 183181922, 185597814, 188442279]
3132A88442279K511824L139102L306022K708292K927300K907514K575559K780221
3124B11298113K867190L211780K840855L048777M246017M015517L769464M499516
3116B39797229M358729M530172L766501L418204L109939K393205K532330J774744
3108B65681053P64424P24477O31254N45270R60860M58173o471K17464J29659n16326
3098B69589837j376125r74510j946571k587530l088186l665879m570942n371759
3090B46008335n526465n631456m994608n607955o430055o073330n848173n606528
3082B00289765n441667n557199n020658n270003m689706m023594m347898m968229
3074A60970811m674517m824980m633565m178139l536819l948569l095810l107176
$$ y = [188442279, 190954103, 194093205, 197399227, 200107519, 203034819, 205942333, 208517892, 211298113, 214165303, 217377083, 220217938, 223266715, 227512732, 231528249, 235297713, 239797229, 244155958, 248686130, 252452631, 255870835, 258980774, 261373979, 263906309, 265681053, 266445477, 267169954, 267801208, 268346478, 269307338, 269765511, 269759040, 269976504, 270106163, 269589837, 268213712, 267239202, 265292631, 262705101, 259616915, 255951036, 251380094, 246008335, 240481870, 234850414, 229855806, 224247851, 217817796, 211744466, 205896293, 200289765, 194848098, 189290899, 184270241, 179000238, 174310532, 170286938, 165939040, 160970811, 156296294, 151471314, 146837749, 142659610, 139122791, 135174222, 132078412, 128971236]
3066A28971236k777350k126590k772926l879505l513885l294530k754427k190573
3058A05661450k300675j420047j722424j626171j119510j200625j044340n78726
3050I4648932k24318j238052m65976n1119M4639m3871n03175J29332m0673N68439
3040I2824158L76408K37586R08810P36383J110977J72667J80623k4169J19537
3031I6642980n53021j46943k0522n56369O3188r50689p22024q42525q89314q92874
3021I1131887j107475r84805p53768q25938j236982o53119o51253p78055j14722
3012H4025770l93119n8698j63049J0520N08864J24651J64007N99154K86151L21152
3002H5425403L21310N06875O56536L01186N19405R24657M47427L7120L9897J96954
$$ y = [128971236, 126193886, 124067296, 121294370, 117414865, 113900980, 110606450, 107852023, 105661450, 103360775, 101940728, 100218304, 98592133, 97472623, 96271998, 95227658, 94648932, 94424614, 93186562, 92720586, 92669467, 92714106, 92670235, 92167060, 92296392, 92255719, 92824158, 93200566, 93438152, 94346962, 95083345, 96194322, 96366989, 96547612, 96523443, 96642980, 96089959, 95943016, 95922494, 95366125, 95429313, 94478624, 93756600, 92914075, 92024761, 91131887, 90024412, 89039607, 88285839, 87459901, 86222919, 85569800, 84918547, 84140492, 84025770, 83632651, 83573953, 83410904, 83421424, 83930288, 84054939, 84218946, 84818100, 85104251, 85425403, 85746713, 86253588, 86910124, 87211310, 87730715, 88655372, 89102799, 89139919, 89179816, 89376770]
2992H9376770M49743P56983M32279L74188J9538K74059L20665J16349j08975M68699
2982I2480298L98150J20210q0008Q645N46540O49864j00061M48439L32579Q29436
2972I5634092J299090J296796J424664J669944J321150J522117J895564J758980
2964A07822397J931704J719119K547705K451210K965101K144699K025748K279170
2956A25886853J394657K277174J389599J079214J181806O59386M25567l4685o41636
2947A33617935r16514j544340k068600k394016l551272m236758m793086m592811
2939A09520538m609089m755100m365828m122046l792803k748323l525695k959690
2931G8641964k796381k212906k594114j926856j810826k257306j817393j743887
$$ y = [89376770, 89826513, 90583496, 91015775, 91389963, 91409501, 91683560, 92004225, 92120574, 92011599, 92480298, 92878448, 92998658, 92918650, 92927295, 93473835, 94123699, 94023638, 94472077, 94804656, 95634092, 96933182, 98229978, 99654642, 101324586, 102645736, 104167853, 106063417, 107822397, 109754101, 111473220, 114020925, 116472135, 119437236, 121581935, 123607683, 125886853, 127281510, 129558684, 130948283, 132027497, 133209303, 133868689, 134294256, 134259571, 133617935, 132701421, 131157081, 129088481, 126694465, 123143193, 118906435, 114113349, 109520538, 104911449, 100156349, 95790521, 91668475, 87875672, 85127349, 81601654, 78641964, 75845583, 73632677, 71038563, 69111707, 67300881, 65043575, 63226182, 61482295]
2923F1482295j989562k001892j592943j495637j667443j158002o87649j145769
2915D9743398j343995j128365n52053o18345n43299o41818o84586o13145j024164
2906D2593628n57139j25103n07833l32949r21678k92142p458n97417j47313l44235
2896C8760361o63944m62839p7295k72519l24482M99992j95527o69751j31864l13368
2886C6148764m53994k68967k29513q12030l03294o82192q63331l06392n60315
2877C1668736m51883O439o56609K24429m67277n31464Q6580l81478K6438k91593
2867B9232318j54989k47955O4457P4992r3145J18209J71902j53011Q8474l11515
2857B8789737k9177K37206J94414j94970J29460L34282K9405j0720k40620l7661
$$ y = [61482295, 59492733, 57490841, 55897898, 54402261, 52734818, 51576816, 50889167, 49743398, 48399403, 47271038, 46718985, 46100640, 45557341, 44915523, 44230937, 43617792, 42593628, 42036489, 41911386, 41403553, 41070604, 40148926, 39856784, 39849326, 39251909, 39104596, 38760361, 38096417, 37633578, 37556283, 37283764, 36959282, 37459274, 37263747, 36593996, 36462132, 36148764, 35694770, 35425803, 35196290, 34384260, 34080966, 33398774, 32535443, 32229051, 31668736, 31216853, 31223292, 30566683, 30791112, 30323835, 29792371, 29878951, 29497473, 29523911, 29232318, 29077329, 28829374, 28893831, 28968823, 28875678, 28993887, 29165789, 29012778, 29101252, 28789737, 28760560, 28997766, 29192180, 28997210, 29126670, 29460952, 29490357, 29479637, 29239017, 29201356]
2847B9201356k13211L10137Q27847k09458N5002L1196J12193M17712m12062J19463
2837C0240175P5379K29595N31721L17734K28822O99271L94596R4890O36829O16947
2827C4065959N91907O72764N41478M33439L28529J06118R89229J023006J063261
2818C9815690N70994R59107J029137J129872J237408J108342R40883J604577J185824
2809D9581834J192903J345293J164719J171009J544648J787586J653841J560643
2801F1002476J790721J569368J370464J408249J866004J849600J966366J952089
2793G4775337K381576K628773K468147J863807J283624J938240K493652K416276
2785I2249432J760052K299879K215415K424872K696186K668255K387111K692993
$$ y = [29201356, 28988145, 29298282, 30126129, 29916671, 29971673, 30002869, 30115062, 30532774, 30120712, 30240175, 30315554, 30545149, 31076870, 31394604, 31623426, 32322697, 32717293, 32812183, 33449012, 34065959, 34657866, 35330630, 35872108, 36305547, 36634076, 36740194, 37729423, 38752429, 39815690, 40386684, 41345791, 42374928, 43504800, 44742208, 45850550, 46791433, 48396010, 49581834, 50774737, 52120030, 53284749, 54455758, 56000406, 57787992, 59441833, 61002476, 62793197, 64362565, 65733029, 67141278, 69007282, 70856882, 72823248, 74775337, 77156913, 79785686, 82253833, 84117640, 85401264, 87339504, 89833156, 92249432, 94009484, 96309363, 98524778, 100949650, 103645836, 106314091, 108701202, 111394195]
2777A11394195K138016K476650K957122K819649K829160L915003M541140M438362
2769A37509297M776217M873409M975302N662929N774110N717396N866731O192151
2761A81347542P432601P901078Q377760R221122R045412J0004505Q895927R536020
2753B51761967Q806492R370875J0025164J0303679J1957647J2583469J2527041
2746C27336334J1089833R278241M859688j782691o466470p866713o449845l403192
2738C26595185n6268L204389M856792M843901K986814L52921m095279p546611
2730C31141844q761596p761997o641409n162110l304087k018652N67086L142225
2722C01201304N453010P862494R933678J1306675J1281218J0905937P963044J537149
$$ y = [111394195, 113532211, 116008861, 118965983, 121785632, 124614792, 128529795, 133070935, 137509297, 142285514, 147158923, 152134225, 157797154, 163571264, 169288660, 175155391, 181347542, 188780143, 196681221, 205058981, 214280103, 223325515, 233330020, 242225947, 251761967, 260568459, 269939334, 279964498, 290268177, 302225824, 314809293, 327336334, 338426167, 347704408, 352564096, 350781405, 344314935, 336448222, 329998377, 326595185, 326538917, 329743306, 334600098, 339443999, 342430813, 342783734, 338688455, 331141844, 322380248, 314618251, 307976842, 302814732, 299510645, 297491993, 298059079, 301201304, 306654314, 314516808, 324450486, 335757161, 347038379, 357944316, 365907360, 367444509]
2714C67444509p583664j9293073k6194484k7142264k5321212k1511961j7021224
2707B23376627j4254735j2149545j0512763r221628p668631o448637n730937m661676
2699A52728075l669005l461018l624195l699236l450067m745264m762161m259916
2691A21057213l657834l464722l228973k598968k765943l113392l245886k865756
2683I6115739l063921l355524l047155k812755k196075k365855k177509j896612
2675G5200333j675856j871580j576419j376730j870564j486115j711521j786764
2667F1844784j957789j928948j589067j634598j474557j234092r81228j429488
2659D9615017j601644j246795p84083q53940n61718j212566m87409r71304j198418
$$ y = [367444509, 359860845, 340567772, 314373288, 287231024, 261909812, 240397851, 223376627, 209121892, 196972347, 186459584, 177237956, 169569325, 163120688, 157389751, 152728075, 149059070, 145598052, 141973857, 138274621, 134824554, 130079290, 125317129, 121057213, 117399379, 113934657, 110705684, 108106716, 105340773, 102227381, 98981495, 96115739, 93051818, 89696294, 86649139, 83836384, 81640309, 79274454, 77096945, 75200333, 73524477, 71652897, 70076478, 68699748, 66829184, 65343069, 63631548, 61844784, 59886995, 57958047, 56368980, 54734382, 53259825, 52025733, 51044505, 49615017, 48013373, 46766578, 45982495, 45128555, 44566837, 43354271, 42866862, 41895558, 40697140]
2650D0697140o40088j074044q73254p92716p04309m56132m42512j026091N5645
2641C4743639l65182m83653n39418j252424r12764n50157n96123o21978o34034
2632B8787906q48964l05014l19898q97737j267764k86909M89176k00078j020332
2623B4130386m94453q3804p02542k95118n42893n0935l41409j157951l04666l61405
2613A9795210j93248j86445l53997q82400k76223j35732R3751l84253m12554k90750
2603A6773359l59091q1972m16400m48103k0034q3219k93467J37689k84506l55972
2593A4568284p76846j63731o6293K30641l58604m94680J36152j39369k72435j88147
2583A2474972o89551M0938K52895k66737n05275L31911L46539j18700j002826
$$ y = [40697140, 40057052, 38983008, 38109754, 37317038, 36612729, 36156597, 35714085, 34687994, 34743639, 34378457, 33894804, 33355386, 32102962, 31190198, 30640041, 30043918, 29421940, 28787906, 27938942, 27633928, 27314030, 26416293, 25148529, 24861620, 25350796, 25150718, 24130386, 23635933, 23552129, 22849587, 22554469, 22011576, 21960641, 21619232, 20461281, 20156615, 19795210, 19601962, 19415517, 19061520, 18179120, 17902897, 17767165, 17860916, 17476663, 17064109, 16773359, 16414268, 16332296, 15915896, 15467793, 15447759, 15364540, 15071073, 15208762, 14924256, 14568284, 13791438, 13627707, 13561414, 13792055, 13433451, 12938771, 13074923, 12935554, 12663119, 12474972, 11785421, 11826359, 12079254, 11812517, 11307242, 11639153, 11985692, 11866992, 10864166]
2574A0864166M61540L4186n57559K04800l31316L9802M05046k50887n76866n7484
2564A0235428j37514q4388j72123k9061O1304m47875J19748j14263l21814M30063
2554I539505k73937l54767k23771M17197p20266L0700K58018R7399J3548o76958
2544H106668J64801p6192l70495J01028l1941q098K46742n5377l08014k70647
2534G498475j60858j92970J27944l42751n98883O43989K96867j69180k9975r286
2524G063372q3489n61155m69478K42385J52317M19532N7292M4283j29896L235
2514F738398j06062j18806K05216K48197j31263j63771q0018K46601P433R5667
2504F941592J77099Q5568l97082n41295J996K82968m52785J05668K6633J3228
$$ y = [10864166, 11325706, 11359892, 10802333, 11007133, 10675817, 10715619, 11120665, 10869778, 10292912, 10235428, 10097914, 10013526, 9841403, 9812342, 9873646, 9425771, 9545519, 9431256, 9109442, 9539505, 9265568, 8910801, 8687030, 9104227, 8383961, 8414661, 8672679, 8770078, 8783626, 8106668, 8271469, 8195277, 7824782, 7925810, 7893869, 7885771, 8132513, 8077136, 7769122, 7498475, 7337617, 7144647, 7272591, 6929840, 6330957, 6974946, 7271813, 7102633, 7072658, 7063372, 6979883, 6418728, 5949250, 6191635, 6343952, 6763484, 6820776, 6865059, 6735163, 6738398, 6632336, 6513530, 6718746, 6966943, 6835680, 6671909, 6591891, 6838492, 6845925, 6941592, 7118691, 7204259, 6807177, 6265882, 6267878, 6550846, 6098061, 6203729, 6230362, 6243590]
2494F243590L60243J26054o5403J22454P4562k45439J15392j63207L42620o56949
2484F253917J16567J85018M90688k08413j22984m12883k36528l8896O7394N00410
2474F594290L21369l51740k20856o49875L44772K20803l62531o7141L23105J52614
2464F304810n2271M07493m12862P4549n94872M22275j8896k46219K50580k73664
2454E860923L86828k84967o52852q4294m1512m92333k93687l15617J24216J14653
2444D321358J016549J6890l79949l22662P2689R0643l49455l9636L54282j17454
2434D663255m41466J92912q82952R4483P13465K30165o14419L76915J63473m51584
2424D044247j72375l6675o2207k84673k52512N37720J3276n7654m0719N2941k63195
$$ y = [6243590, 6603833, 6729887, 6664484, 6786938, 6861500, 6616061, 6731453, 6568246, 6910866, 6253917, 6370484, 6555502, 7046190, 6837777, 6714793, 6301910, 6065382, 6026486, 6093880, 6594290, 6915659, 6563919, 6343063, 5693188, 6037960, 6258763, 5896232, 5829091, 6152196, 6304810, 6252539, 6660032, 6247170, 6321719, 5726847, 6149122, 6130226, 5884007, 6134587, 5860923, 6247751, 5962784, 5309932, 5225638, 5184126, 4691793, 4398106, 4082489, 4206705, 4321358, 5337907, 5354797, 4974848, 4652186, 4724875, 4815518, 4466063, 4426427, 4780709, 4663255, 4221789, 4414701, 3531749, 3626232, 4339697, 4569862, 3955443, 4332358, 4495831, 4044247, 3871872, 3835197, 3772990, 3488317, 3235805, 3773525, 3786801, 3729147, 3688428, 3741369, 3478174]
2413C478174M3661O810K2375J86671n4390K01698O5157m56601l40050O87281j36960
2402C703826k68618k3699R351l75188j49648N15996R1816J93123m88203j68502
2392C040254j92815k14679N25542n7607K57746L45598k4161j13449J64437l63795
2382C367071k19262j20880o12546O22157J18795J52423m41319L7737m75849l40080
2372B088247K62584k51140K11228Q8356M7418J9093k5748L80848j76091n58356
2362B086439N57795J22591l54285K4545j04054J97886M49073N4496o557m01431
2352B626498l49166J26974J1970J3314J45685M2620K24325k37058j88186l89167
2342B027809M43709K58645K91346q4666j75927j60178K04682m73486j13785N48540
$$ y = [3478174, 3521835, 3528645, 3551020, 3737691, 3683301, 3884999, 3950156, 3493555, 3153505, 3840786, 3703826, 3435208, 3411509, 3420860, 3045672, 2896024, 3412020, 3503836, 3696959, 3208756, 3040254, 2847439, 2632760, 3158302, 3100695, 3358441, 3704039, 3679878, 3566429, 3730866, 3367071, 3147809, 3026929, 2414383, 3036540, 3155335, 3307758, 2866439, 2904176, 2428327, 2088247, 2350831, 2099691, 2310919, 2399275, 2446693, 2465786, 2440038, 2820886, 2644795, 2086439, 2644234, 2766825, 2412540, 2437085, 2333031, 2530917, 2979990, 3034486, 3027929, 2626498, 2277332, 2404306, 2416276, 2429590, 2575275, 2617895, 2842220, 2605162, 2416976, 2027809, 2471518, 2730163, 3021509, 2936843, 2760916, 2600738, 2805420, 2331934, 2218149, 2766689]
2332B766689M95967m24482m36302K89549j50486l04869L44715o216j93044m34430
2322A947091m13628L45938M60732m09879j12345P66927J38545l62137l51909O59656
2312B668991K07256k25406J82234m35087k32718P25523M82396K17322n40471k84216
2302B765824k72688J03912m18229k78574J99893L90280m12807R6477L3696n4491
2292B153293j49788K73750Q3506j48474k39484j23890J92278p3950K64290L27
2282B231858j44877R6942Q3548k52470k16279J60813N83202j27984j1246M5373
2272B448880k67786m64525P4895J05207J75126K25064k05002j36905J9561K27484
2262B201999L96523j20333J21567k27697R4959j44262m74494j37186K88178K42081
$$ y = [2766689, 3262656, 2838174, 2401872, 2691421, 2540935, 2236066, 2580781, 2574565, 2381521, 1947091, 1533463, 1879401, 2340133, 1930254, 1817909, 2584836, 2723381, 2361244, 2009335, 2668991, 2876247, 2650841, 2833075, 2397988, 2165270, 2890793, 3373189, 3590511, 3050040, 2765824, 2493136, 2597048, 2178819, 1900245, 2100138, 2490418, 2077611, 2174088, 2207784, 2153293, 2003505, 2277255, 2360761, 2212287, 1972803, 1848913, 2041191, 1967241, 2231531, 2231858, 2086981, 2183923, 2267471, 2015001, 1798722, 1959535, 2542737, 2414753, 2403507, 2448880, 2181094, 1716569, 1791464, 1896671, 2071797, 2296861, 2091859, 1954954, 1974515, 2201999, 2598522, 2478189, 2599756, 2372059, 2467018, 2322756, 1848262, 1711076, 1999254, 2241335]
2252B241335K93257n2974K392k74678l10286L30249K54172J77164k76301J0489
2242B394819l02016M34669j78036n94535J5423L18578L24986j272m50930M47815
2232B409501q4942l76574J85419J78771O4326l26204k0286O3898L07526k50897
2222B150538j01585K77376K30032l0926k3581m95789k70650K93765K6033J72673
2212B227886L73345j72220n30769J89501K7045k01497o9000q8403L45413J24141
2202B225442J60825J66839n33512M2976j55123J08141j17176j86879M40950J49997
2192B302480N8091o45399j5155R9940K42297R6464R4216M58634l97460l33945
2182A960163O30227R7766j48132m02309o5368L87382R3793K10930M6669l94176
$$ y = [2241335, 2534592, 2481618, 2484010, 2209332, 1899046, 2229295, 2483467, 2660631, 2384330, 2394819, 2092803, 2527472, 2349436, 1754901, 1770324, 2088902, 2413888, 2412616, 1961686, 2409501, 2324559, 1947985, 2133404, 2312175, 2376501, 2050297, 2030011, 2093909, 2401435, 2150538, 2048953, 2326329, 2556361, 2525435, 2501854, 2006065, 1735415, 2029180, 2055213, 2227886, 2601231, 2429011, 1898242, 2087743, 2114788, 1913291, 1844291, 1755888, 2101301, 2225442, 2386267, 2553106, 2019594, 2062570, 1907447, 2015588, 1898412, 1711533, 2152483, 2302480, 2360571, 1715172, 1700017, 1799957, 2042254, 2138718, 2232934, 2691568, 2294108, 1960163, 2590390, 2688156, 2540024, 2137715, 2072347, 2459729, 2553522, 2764452, 2811121, 2416945]
2172B416945j10283J50169j49795J05828K66900k52524j9246L22196J71041J30764
2162C031995j63370k89439j46823q9197J00365K21616q6265k7719m06491j76883
2152A967789J46835J74417R295M17032m7747R1663l57571l6007K24704l19378
2142B271032M04467k0671k09253O3515l1023O25120M80369k45147r8822k35923
2132C003664P09829Q9775K87451k07472m7152m00301L9144N75850K02499L97632
2122D650919j81574J62621k5616M17016J66226k65299J62941k4815P3021Q3033
2112E218473m0667M54535K73098l66922M03013M89255L12661K58857K0916M72528
2102G495747N00445M96890j62416M51600O53036j8418q0010J11158P72146L96957
$$ y = [2416945, 2306662, 2456831, 2307036, 2412864, 2679764, 2427240, 2407994, 2730190, 2901231, 3031995, 2868625, 2579186, 2432363, 2343166, 2443531, 2665147, 2578882, 2551163, 2144672, 1967789, 2114624, 2289041, 2298336, 2715368, 2667621, 2759284, 2401713, 2365706, 2590410, 2271032, 2675499, 2654828, 2445575, 2509090, 2478067, 3103187, 3583556, 3338409, 3239587, 3003664, 3713493, 3803268, 4090719, 3883247, 3836095, 3435794, 3474938, 4050788, 4253287, 4650919, 4469345, 4631966, 4606350, 5023366, 5189592, 4924293, 5087234, 5062419, 5135440, 5218473, 5177806, 5632341, 5905439, 5538517, 5941530, 6430785, 6743446, 7002303, 7023219, 7495747, 7996192, 8493082, 8330666, 8782266, 9435302, 9416884, 9336874, 9448032, 10220178, 10617135]
2092A0617135K59189N52238Q37963N07143Q51642J765374P28884P06976J012543
2083A7839087J612244K133382K383695J552023K732012K814555K760389K782807
2075C6610194L092157L620328N241727N477354Q407554J1387641J5041198J7659940
2067A06538093K0497289J4913782J9800796K775070k7311628k2286365k0965116
2060I3961921j7623960j2733364q747337n914144n573971n359748l171553k978738
2052C1859106k172474j595455k323565k711725j410530j422855j161683q17976
2044A8242843j165560q07360l49206k82641p89779o49107l00772q24738r76032
2035A2097648m49017m62746r07395o25664m57555m56881l26888j19429l2431l64898
$$ y = [10617135, 10876324, 11428562, 12266525, 12773668, 13625310, 15390684, 16119568, 16826544, 17839087, 19451331, 21584713, 23968408, 25520431, 28252443, 31066998, 33827387, 36610194, 39702351, 43322679, 48564406, 54041760, 62449314, 73836955, 88878153, 106538093, 127035382, 141949164, 161749960, 164525030, 137213402, 114927037, 93961921, 76337961, 63604597, 54857260, 48943116, 43369145, 38009397, 34837844, 31859106, 29686632, 28091177, 25767612, 23055887, 21645357, 20222502, 19060819, 18242843, 17077283, 16269923, 15920717, 15638076, 14848297, 14199190, 13898418, 13073680, 12097648, 11648631, 11185885, 10278490, 9652826, 9195271, 8738390, 8411502, 8292073, 8259642, 7894744]
2025G894744o56897l40104J42553j94911o9555R7443l33688M6088m29778m38378
2015E717517J74536k80559j69017J43447m05573n22427J19737R4750l55443j09688
2005D407280N95415k57945K20923m23858m3496k13791j86483m9263K03347k67164
1995C984965p598j07084m23767L93440p9389k65573L39530l53829L26101J35395
1985C942191k89908k69223j32215r9145l3015N77175n80152o52050j2016L26803
1975B778445l65082J48652q4166l9755Q5313P42963k16222r2649l33890L3880
1965B657489J22303j39804J69962l37462L4566j95274K21524J16995j90497O7007
1955B526809k74158k13049j63442k79004R1945o3195K5266L32620j37719K5153
$$ y = [7894744, 7237847, 6897743, 7040296, 6845385, 6775830, 6873273, 6539585, 6585673, 6155895, 5717517, 5892053, 5611494, 5442477, 5585924, 5180351, 4657924, 4777661, 4872411, 4516968, 4407280, 5002695, 4744750, 4965673, 4541815, 4498319, 4284528, 4098045, 4048782, 4252129, 3984965, 3977367, 3870283, 3446516, 3839956, 3760567, 3494994, 3834524, 3480695, 3806796, 3942191, 3652283, 3383060, 3250845, 3151700, 3118685, 3695860, 3115708, 2463658, 2451642, 2778445, 2413363, 2562015, 2477849, 2438094, 2523407, 3266370, 3050148, 2957499, 2623609, 2657489, 2779792, 2639988, 2809950, 2472488, 2507054, 2311780, 2533304, 2650299, 2459802, 2526809, 2252651, 2039602, 1876160, 1597156, 1689101, 1625906, 1651172, 1983792, 1846073, 1871226]
1945A871226Q7078o5347J69574k34384j66197J71144k34649m19979p223k3001
1935A148242J63813M92591o0672m06677l84595j47494K85799j37046K29883L44443
1925A528287l14128K61908L03867l42587k28912j30062N23162m58504J74210p0179
1915A247062K26351K63017m02452r4581L470j68015J87692M08981l86492K53642
1905A538675J79527k11699m6475l84115N0341M14968J80534l57022J01238l19400
1895A146572J18374N77295r3643K1721M3226Q1843k85325j77331j84633K85839
1885A533938J47043k75415l11850O2997N4019j77133K52569L52972j97448k97302
1875A144390N729J04203o4260k35593l16551L54972L93949q5549j91076l20289
$$ y = [1871226, 1958304, 1892957, 2062531, 1828147, 1661950, 1833094, 1598445, 1178466, 1171243, 1148242, 1312055, 1804646, 1743974, 1337297, 952702, 805208, 1091007, 953961, 1183844, 1528287, 1214159, 1476067, 1779934, 1437347, 1208435, 1078373, 1601535, 1143031, 1317241, 1247062, 1473413, 1736430, 1333978, 1239397, 1242867, 1074852, 1262544, 1671525, 1285033, 1538675, 1718202, 1506503, 1460028, 1075913, 1126254, 1541222, 1721756, 1364734, 1465972, 1146572, 1264946, 1842241, 1748598, 1770319, 1813545, 1895388, 1610063, 1432732, 1248099, 1533938, 1680981, 1405566, 1093716, 1156713, 1210732, 1033599, 1286168, 1639140, 1441692, 1144390, 1150119, 1254322, 1190062, 954469, 637918, 992890, 1386839, 1301290, 1110214, 789925]
1865G89925K00974J88732L41774m17451n18252J49048L32549l67615l66707M44935
1855G77912N23351l1113q1381l03202j99135K38844q9547J94253k5582q4134l51292
1844E68974K56761O109M9341K6315l39499P62167K40749l52364K3926j66593K24011
1833A299897j41392K13175J52706K01318q2294k21606O9788M5726L33226L01677
1823B172221K27334n9813l91133k23676n04193K48284k61697j8225M15721n22311
1813A082512o772j83821K13483k53030m34738L76486J74970p3809j56767K30656
1803I69170M68598k14633l54222K28570j92997J83723k83863J84257m0694j17134
1793H30775J78920l9323j01957J38035Q9724K21480k53341n33902K76665n6972
$$ y = [789925, 990899, 1179631, 1521405, 1103954, 585702, 734750, 1067299, 699684, 332977, 777912, 1301263, 1270150, 1188769, 885567, 686432, 925276, 835729, 1029982, 1004400, 920266, 568974, 825735, 831844, 881185, 907500, 568001, 1330168, 1570917, 1218553, 1242479, 1075886, 1299897, 1158505, 1371680, 1524386, 1725704, 1643410, 1421804, 1491592, 1537318, 1870544, 2172221, 2399555, 2339742, 1948609, 1724933, 1220740, 1469024, 1207327, 1189102, 1604823, 1082512, 1075740, 891919, 1105402, 852372, 417634, 794120, 969090, 895281, 738514, 969170, 1437768, 1223135, 868913, 1097483, 904486, 1088209, 804346, 988603, 947909, 830775, 1009695, 970372, 868415, 1006450, 1096174, 1317654, 1064313, 530411, 807076, 750104]
1783G50104K39482K18224M52972m67508j77616j88247N63064n17915l52404J91078
1773G11234j42999o8392k41318k655M89254K35087j71471R8059j80158j44233
1763E82408m233J5113o9471K59287Q8646j84218J59179k10759j42824L89587Q9747
1752I72462Q1994k96336L9304K53232j26955K62550l39237m9305J47525j56342
1742G88892L0953l64196N3547M78387P2354m74769j11556M30105L8270n51067
1732C90920j13328L5461K1513J99466Q2099q97J98789j12370j57237k20408J13572
1721D37580J62124k05553j08944L19974R1695k94072J56241l41870P70121Q1822
1711A069118m34508R8814k97660P0838j8788j26630L84833L19426m50451M1920
$$ y = [750104, 989586, 1207810, 1660782, 1193274, 1015658, 827411, 1390475, 872560, 520156, 711234, 568235, 499843, 258525, 255870, 745124, 980211, 808740, 906799, 726641, 582408, 578175, 593288, 523817, 783104, 871750, 687532, 846711, 635952, 493128, 882715, 972462, 1054456, 758120, 797424, 1050656, 923701, 1186251, 847014, 797709, 945234, 788892, 819845, 455649, 509196, 987583, 1059937, 585168, 473612, 903717, 941987, 390920, 277592, 313053, 334566, 534032, 616131, 615234, 814023, 701653, 544416, 324008, 437580, 599704, 394151, 285207, 605181, 696876, 402804, 559045, 217175, 987296, 1069118, 634610, 733424, 435764, 506602, 487814, 361184, 746017, 1065443, 614992, 656912]
1701F56912J54013K38233m53516p0062q4716J08812j22368l99379M73653K04967
1691G06549l428m6438K70986Q5974q4199j61316r9114j015j25368J03538j16017
1680E30152p6831L90448J546j09618j12619j68941l83664k2507K07785L6464L55126
1669F47341J77039L32764l11818J43913m98224l3928J4584l45445K3035n01511
1659c52250O8993N57386M52185K91841O6862o76316Q4516M41086m54133l02049
1649A78121R68542J94420k55944l76138r9429J87102q8276l16554K93552k7987
1639F57409k33516J80640P0676n6060J42349M00774m93372l1039M24372j31752
1629I30481l48400l12417k49937L55036m4610m8686L33660J83520J65435j93963
$$ y = [656912, 810925, 1049158, 595642, 525580, 440864, 549676, 427308, 27929, 501582, 706549, 703121, 656683, 927669, 1013643, 929444, 768128, 669014, 667999, 542631, 646169, 530152, 453321, 843769, 845315, 735697, 623078, 454137, 70473, 47966, 255751, 292215, 647341, 824380, 1157144, 845326, 989239, 491015, 457087, 471671, 126226, 149261, -352250, -283257, 274129, 726314, 1018155, 1085017, 408701, 493217, 934303, 480170, 178121, 1146663, 1341083, 1085139, 709001, 609572, 796674, 708398, 391844, 685396, 657409, 423893, 604533, 675209, 619149, 761498, 1162272, 668900, 637861, 1062233, 930481, 582081, 269664, 19727, 374763, 330153, 281467, 615127, 798647, 964082, 770119]
1619G70119M0283j14278k16601p04330J49775N08676p7327R7312j80264k57322
1609A6043M96324K11865l10857m04229K00163J53526j37905J25230Q6631L01981
1599G38772K90600m38617n17340K76415L24181l01192l87045j4781K25318j05731
1589I0580J49032O2302N31553K37959m21767j95003L05981M89n56228N00274K48202
1578I53374l00791l42171q6771k6130J13204k42435J25075Q1726j03716R9429
1568B70794O01915M12153k10445n96806o03660J61429N64856j37731m82798O13114
1558E92821K29343o56029o1892O0432j390J47199K6399J67174L56958j75269L98817
1547A084563j50917m58148K19462n0421K64333m34820p19674M62113M65161l02541
$$ y = [770119, 810402, 696124, 479523, -224807, -75032, 433644, 356317, 453629, 273365, 16043, 512367, 724232, 413375, 9146, 209309, 362835, 224930, 350160, 436791, 738772, 1029372, 590755, 73415, 349830, 674011, 372819, -14226, -29007, 196311, 90580, 239612, 301914, 833467, 1071426, 649659, 454656, 760637, 761126, 204898, 705172, 953374, 652583, 310412, 223641, 197511, 310715, 68280, 193355, 275081, 171365, 270794, 872709, 1284862, 1074417, 477611, -126049, 35380, 600236, 462505, -20293, 592821, 822164, 166135, 104243, 164675, 163285, 310484, 336883, 504057, 861015, 685746, 1084563, 933646, 475498, 694960, 644539, 908872, 474052, -245622, 216491, 681652, 379111]
1537C79111p4031M1445J92769L3560r3950k86268q4174N41374m73670q3162J94780
1526B87784k8656m63465J54289P0687O1224M1996J30805K62877K092L61563r6966
1515G84230o00588L307O5915j62440k84574L28253K75341J4113M94348k85135
1505F32770o57555M54648L95823l58075J72208n23880J2300K40010k33460M24045
1495E58834J45464n54138J45860O6974J93063l27487k80207l3695n7953O4822
1485g8463L46146J89089j88331L62056l7563j37674l28109J13621O1912j3789
1475B88895L3956J9924J62255Q3768o97856K48662J77160k78457L07899L5964
1465C82170l13876k06065M27778j33927l20360L60131J55593k44823j30100p5274
$$ y = [379111, 305080, 346525, 539294, 572854, 478904, 192636, 108462, 649836, 176166, 93004, 287784, 259128, -204337, -50048, 20639, 81863, 123859, 254664, 517541, 519633, 881196, 784230, 183642, 186949, 252864, 90424, -194150, 134103, 409444, 423557, 917905, 632770, -24785, 429863, 825686, 467611, 639819, 115939, 128239, 368249, 134789, 558834, 704298, 150160, 296020, 362994, 556057, 228570, -51637, -85332, -143285, -78463, 267683, 456772, 268441, 630497, 592934, 455260, 127151, 240772, 302684, 288895, 322851, 342775, 505030, 588798, -109058, 139604, 316764, 38307, 346206, 382170, 68294, -137771, 290007, 156080, -164280, 195851, 351444, 106621, -23479, -98753]
1455i8753Q5931J01497J44611K4206k70434j20402O61245j00788r8047p4049J34565
1444C89582k91160L09930J5572K85828l0789j8934K50367m26063k67450J40384
1434C57267j02229M45020j98456k27999k94578K96008K79291j59035J24350l66866
1424A52773k572K49779j33927k75998M53018J98939m4672l57526M35689l38083
1414C37420n22479J44259M14908J00145Q7679m50963M2535m6601N7012k50190
1404h6275J22799N4544J87548Q9909o1746R6772j72802n46799k46255N86583J35115
1393A59393M2811K92170J9593k62925J37004k47524J92203j91924j14197J40846
1383A67450P08236j59209o08757k21047k54139O3011J03920K84532K52604j17872
$$ y = [-98753, -12822, 88675, 233286, 257492, -12942, -133344, 527901, 427113, 329066, 255017, 389582, 98422, 408352, 423924, 709752, 678963, 660029, 910396, 484333, 216883, 357267, 255038, 700058, 501602, 273603, -20975, 275033, 554324, 395289, 519639, 152773, 150201, 399980, 266053, -9945, 443073, 642012, 597340, 239814, 675503, 337420, -185059, -40800, 374108, 474253, 561932, 110969, 153504, 106903, 163915, -86275, 36524, 91068, 278616, 368525, 306779, 403551, 230749, -316050, -562305, 24278, 159393, 202204, 494374, 513967, 251042, 388046, 140522, 332725, 140801, 26604, 167450, 875686, 716477, 107720, -113327, -367466, -304455, -200535, 83997, 336601, 218729]
1373B18729J47916n1906L5902n24513J17482j14998J23461J93304j62995Q3632
1363F6014K99596K40061M181P3148k78303j26789j09613K4525K28918J40871n92079
1352b9470J25408l4956J62607J20034K42525j45936r0484j11634L95137k5945
1342F07286l79367r7549l74108j37198M12795N2314J17897k60333L49738J91457
1332D82932l88670j44423l13229L47886R2034j6692M4147K82318k34010m30742
1322b78449L17561j3721J23549K11342N53233m99503n22167K4669K31761K02507
1312C50782k10404j7403K11870l9399k50302J58695J52239k27465K50536K73159
1302F52308p5870K89859m94845K45023L77699m24524k70740O9002r622J35473
$$ y = [218729, 366645, 314739, 350641, -173872, -56390, -171388, -47927, 145377, -17618, 66014, 365610, 605671, 609852, 683000, 404697, 277908, 168295, 192820, 421738, 562609, -29470, 95938, 60982, 223589, 343623, 586148, 440212, 349728, 238094, 633231, 607286, 227919, 130370, -243738, -380936, 31859, 84173, 202070, -58263, 291475, 482932, 94262, -50161, -363390, -15504, 76530, 59838, 103985, 386303, 152293, -278449, 39112, 25391, 148940, 360282, 913515, 414012, -108155, -83486, 148275, 350782, 140378, 122975, 334845, 295446, 45144, 203839, 356078, 128613, 379149, 652308, 576438, 866297, 371452, 616475, 994174, 569650, 298910, 367912, 358290, 493763]
1292D93763O2596l10594k00905N5618q8942n0154O4711M8690P2634L90633K4520
1281E62570k57546j21949j78786l31268o1817o4053L60263L00038K46779k30008
1271B24223n3913K8425P849K91819K77070l40447m29114Q0677J00190k00403J3036
1260e88L3039j477J95782j17058J14494m0r3530j53247M56480k8403m02013l0741
1248b7302K34686j25092j51997l37528L69166L84970m18022m9712l6956J0421
1238a47366J36426J50882M4589l3389j38650L02913m21559m78095L77581K09185
1228B517M71850p9425n55898L93431K76266K3153o4883l21627m24142M04903N9383
1217A85528Q6745l1992m91526N42310P4314l6819K84732Q7545o87376J24770M38694
$$ y = [493763, 556359, 245765, 44860, 100478, 11536, -38618, 26093, 74783, 147417, 538050, 562570, 305024, 183075, 4289, -326979, -388796, -452849, -92586, 207452, 454231, 224223, 170310, 198735, 206584, 498403, 775473, 435026, 5912, 86589, 186779, -13624, -588, 32451, 30974, 226756, 109698, 224192, 224152, 130622, -22625, 433855, 405452, 3439, -27302, 207384, 82292, -69705, -407233, -38067, 346903, -71119, -120831, -157787, -147366, -10940, 139942, 184531, 151142, 12492, 315405, -106154, -584249, -206668, 2517, 474367, 394942, -160956, 232475, 508741, 531894, 467011, 145384, -278758, 126145, 185528, 272273, 240281, -251245, 291065, 365379, 328560, 613292, 700837, 13461, 138231, 576925]
1206E76925n55491K3693m8644n7514O84317m88320l41353O8989M4232M8290l91599
1195d36475J27072K03682J4359p4458P9275k89958K33985J10242M26647J39953
1185E34324l09249M1889l08183Q402J42455K20817O1393l70755l47835j81648
1175e08390L32859K43659J25213J34335p592k68835l674k09652l29981K85563
1165b06495j89839j79153K51603O76262Q6012j04478k92206M127J53797q1047
1155A18583R9261j61913M85760m35571k72009N69967l05318j57700M48787J90998
1145E80845k21919j16052l03945j53477P7012j66345L85108J24445J93978j67891
1135B31759n46308K06623L11223m92559K17174j02591N5263K57734p0681o1722
$$ y = [576925, 21434, 45127, -3517, -61031, 623286, 134966, -206387, -137398, -93166, -44876, -436475, -309403, -105721, -91362, -165820, -86545, -376503, -142518, -32276, 394371, 534324, 225075, 266964, -41219, -32817, 109638, 330455, 391848, 21093, -326742, -508390, -175531, 68128, 193341, 327676, 320084, 51249, 47575, -162077, -492058, -206495, -396334, -575487, -323884, 352378, 438390, 333912, 41706, 45833, 199630, 118583, 217844, 55931, 541691, 106120, -165889, 404078, 98760, -58940, 389847, 580845, 358926, 242874, -61071, -214548, -137536, -303881, 81227, 205672, 399650, 231759, -314549, -107926, 203297, -289262, -72088, -174679, -119416, 138318, 67637, 5915]
1125E915J60811P4192o89511K93082K43496N109L0813k39219l25523L01245M12055
1114B72465j61919k24674L48318k00781m1573M06185k64697p9134j28175j04511
1104a78496P1308o6663O24193l35797K52378o13093m20221k17368L60532P18289
1094A95062q3721J70857l98409n7694j9064k23398k55657M12161O95578L82414
1084H18129j66950m68752m84462K01719K86236j56259J77744l8055l91400R1762
1074a30288M28498l26657j79766K74275K4273K91853l24525K98340m17017n47538
1064f08552N58193L48254J30310n34937k57673K84790L14225l15807k44665J58329
1054a67533N98921J7924m09679J19066J83569Q6793k61495K2082j66129r183K52059
$$ y = [5915, 166726, 240918, -448593, -155511, 87985, 93094, 123907, -115312, -440835, -139590, 272465, 110546, -114128, 234190, 33409, -8164, 398021, 133324, 54190, -73985, -178496, -107188, -173851, 450342, 114545, 366923, -246170, -666391, -883759, -523227, 195062, 111341, 282198, -116211, -173905, -192969, -416367, -672024, -259863, 435715, 818129, 651179, 182427, -302035, -100316, 185920, 29661, 207405, 169350, -222050, -130288, 298210, -28447, -208213, 66062, 90335, 382188, 57663, 356003, -61014, -608552, -50359, 297895, 428205, -106732, -364405, -79615, 234610, -81197, -325862, -167533, 431388, 449312, 39633, 158699, 342268, 429061, 167566, 189648, 23519, 14336, 266395]
1043B66395j77506k02808J72721K48637m25193Q7831j44799j542L30536j45091
1033I181J55269J96151m59978k69847L70234L70958j99376j18780K93047l1550
1023C15309m14517m52284K39460K17972m74754Q65045M8654Q7933l83854P2404
1013A21368J10169j0331p6822j58630J75877j58933L58227j73983k36176l0235
1003g9469K2984k19831J6945O1780k34048M2830L48984n57066M54647l63554L94775
992a11023N66633j69085j0807l91648L87521R6461k23445m45642k8714J15471
982b14278J85432j6126o4015P25153j06971j41233l32150L06163j14344m54936
972b27305R029K66647j52717J53358k58559J37326j17496L17277m6089k18443
$$ y = [266395, 88889, -113919, 58802, 307439, -117754, -29923, -174722, -176264, 154272, 9181, 164450, 360601, -99377, -369224, 1010, 371968, 172592, 53812, 346859, 315309, -99208, -551492, -312032, -94060, -568814, 296231, 344885, 432818, 48964, 121368, 231537, 221206, 144384, -14246, 161631, 2698, 360925, 186942, -49234, -79469, -56485, -276316, -259371, -197591, -431639, -388809, -39825, -596891, -142244, -505798, -111023, 455610, 286525, 275718, -115930, 271591, 368052, 144607, -301035, -329749, -214278, -28846, -44972, -108987, 616166, 509195, 367962, 35812, 341975, 227631, -227305, -218276, 48371, -104346, 49012, -209547, -72221, -189717, 127560, 81471, -136972]
962a36972l25209K69428K11914L58727k82471m7224L4436j70113M10831n8438
952B64909k9171n01968L41171J54547M439j3552L53042n58105j98549n7008K5441
941b14804J89281Q871n3333r1643L5367q8352j51353J96770L47438k84268k58864
930c64890K08471O5491O57532L306r56327J6402J4825L63815o0994j38187K08507
919A7951j40241o11378L56732L28166p5275O82414j14693k04310j19003j78683
909e8320J90324N17666n81483o3473l97074k02010N26747m8570p3461N6644K21108
898H8098J35541l39502j53481K2897j06814K14059n7511K6377K41239l664p2464
887e225P120Q1838l43211N49714j48252k1877J55056l23137j1442J70579K34029
$$ y = [-136972, -462181, -192753, 19161, 377888, 95417, 48193, 82629, -87484, 323347, 264909, 235738, -266230, 74941, 229488, 233927, 220375, 573417, 15312, -183237, -240245, -214804, -25523, -16652, -69985, -161628, -126261, -214613, -365966, -169196, 178242, -106026, -364890, -156419, -90928, 566604, 569910, -386417, -370015, -355190, 8625, -52369, -190556, 17951, -122290, -733668, -376936, -48770, -124045, 558369, 443676, 239366, 120363, -58320, 132004, 649670, 68187, 4714, -392360, -594370, -67623, -116193, -189654, -133010, 88098, 223639, -115863, -269344, -246447, -353261, -139202, -196713, -170336, 70903, 67239, -5225, 1895, 83733, -259478, 290236, 141984, 120107, 275163, -47974, -59416, 111163, 345192]
876C45192j09349m02180N10015k98190l91140M95501J43205K04907O1363m18128
866A41196L6706K43833J94510M5220o8153r3726n06248k9874M45060o22154L8680
855a74950j41663m93833N66074r4228k119K29834k4753n1908k38376M35950K2176
844C2204k47497j29314M87249o6920L37367k14552j8513m41115j55730M23699
834F878j77362J26858m3753J19887k7719N32369n69275l6494L2567J22611Q5938
823A72505P791k01530r3258N00870N7427m68407K98693k97275J01412l36626j2782
812b71180L83424K66216L29853j07340j6634l44612K8131J86972q04481k10820
802e60471L90922j56127L75574k07743M0265Q7162l60050L48825K57338K08981
$$ y = [345192, 235843, -166337, 343678, 45488, -345652, 149849, 293054, 497961, 559324, 141196, 177902, 421735, 616245, 661465, 593312, 499586, -6662, -36536, 408524, -213630, -174950, -316613, -810446, -244372, -338600, -340719, -110885, -135638, -187546, -425922, 10028, 32204, -215293, -344607, 142642, 75722, 413089, 198537, 180024, -261091, -416821, 6878, -170484, -43626, -87379, 32508, 4789, 537158, -32117, -68611, -36044, 86567, 172505, 180296, -21234, -114492, 386378, 443805, -24602, 274091, -23184, 78228, -258398, -271180, 112244, 378460, 708313, 600973, 584339, 239727, 267858, 454830, -349651, -560471, -169549, -325676, 49898, -157845, -117580, -30418, -390468, -41643, 215695, 424676]
792D24676m93416Q5675J64341K40829k59603j76323K87355j82987j06015L18179
782C02711l39767l70289J86633r1484k26824L26318K93631J59647R983j76028
772G4531J07377k0269p29649j74092k3386K29479M31164m6735J51844l37687j22814
761d60237m9426K49369J00743j13321j09086j93469j42641L84232K34504K97998
751A98666n1957J62091k63436j98629L0574K43565k92791l88020j26371p1644
741g57952K96583L28620K62490j01508j45948j48677K50886j68934K38615l39971
731b85796J91164J09066m31078K72885L91858m53296K0683K2515O7122K40216
721A45339o3591J82140k62265j56401l69445j56542L25293J13643j61624L63911
$$ y = [424676, -68740, 16935, 181276, 422105, 162502, -13821, 273534, 90547, -15468, 302711, -37056, -407345, -220712, -312196, -539020, -212702, 80929, 240576, 250559, 74531, 181908, 161639, -568010, -742102, -765488, -536009, -104845, -151580, 264, -337423, -460237, -509663, -260294, -159551, -272872, -381958, -575427, -718068, -333836, -99332, 198666, 146709, 308800, 45364, -153265, -122691, 120874, -171917, -559937, -686308, -757952, -461369, -132749, 129741, 28233, -117715, -266392, -15506, -184440, 54175, -285796, -94632, 14434, -416644, -143759, 248099, -205197, -184514, -161999, -94877, 145339, 81748, 263888, 1623, -154778, -524223, -680765, -355472, -241829, -403453, -39542]
711c9542J34928o6086k2754O419L9719n20897n8378J38675j29489J07766K10273
700a99366J22119O6175n39009l52918M38793j80986K9640R2057J61766K40719
690a21010J41179K91448k66239o5832J54311J14649L9604l42894J74986m60387
680c40185J31698J11745m03452N94116l7837k23218k76052J13894j12917L10489
670a31719j76362j52737O0428j17067k85119K23593n605j87072M15000M67074
660A10414M32403m64106m57641j16802K33971j3143K92313J39646r8906j37472
650g9323l41354j6046K50926j71134m1615n2593L06856m98931N53466k20204q4342
639c94294K22765R1261l90400l40781K11367P84068l88610l08918K84955j39068
$$ y = [-39542, 95386, 29300, 6546, 12965, 52684, -468213, -526591, -387916, -517405, -409639, -199366, -77247, -11072, -550081, -902999, -464206, -645192, -615552, -523495, -361729, -121010, 20169, 311617, 45378, -20454, 133857, 248506, 288110, -54784, 120202, -340185, -208487, -96742, -500194, 93922, 56085, -167133, -443185, -329291, -442208, -131719, -308081, -460818, -400390, -517457, -802576, -578983, -584588, -771660, -356660, 110414, 542817, 78711, -378930, -495732, -261761, -274904, 17409, 157055, 58149, -79323, -420677, -436723, -185797, -356931, -398546, -451139, -144283, -643214, -89748, -309952, -394294, -171529, -80268, -470668, -811449, -600082, 183986, -204624, -513542, -228587, -367655]
629c67655M53893j60159L00234m14517j89120L52957p9715k31903K86003k78969
619c28951m0088J22231L0702n1883m23789J2598M3758L51072j28255j82219K16381
608c78443m8895J94874k13712J38626L67648m8818J45056l25447J02973J28700
598F2562j89032l33961k16174M4812J59479P9984J54702o3894L18985j61792j022
587a45351n1484M29585J47144l64899l80533K91756L73412O1750m92377l1623
577a62620O0891k24582K15289J86888K85733m08235o213J63332K54176l43627
567B1032p8700k2403L13629m70716L87649K91664l89359n85661K27036J39332
557a66497R4224P9923l54078M95674j64144m85426M32057K18816j52319m87511
$$ y = [-367655, 86238, -73921, 226313, -188204, -377324, -24367, -104082, -335985, -49982, -328951, -369039, -246808, -216106, -267989, -691778, -679180, -635422, -284350, -412605, -594824, -378443, -427338, -232464, -446176, -307550, 60098, 11280, 156336, -169111, -66138, 62562, -126470, -460431, -676605, -631793, -472314, -392330, -237628, -301522, 17463, -144329, -145351, -196835, 232750, 379894, 14995, -365538, -73782, 299630, 361380, -130997, -162620, -101729, -326311, -111022, 75866, 361599, -46636, -52849, 110483, 364659, 21032, -57668, -80071, 233558, -237158, 150491, 442155, 52796, -532865, -305829, -166497, -72273, 7650, -346428, 149246, -14898, -500324, -68267, 150549, -1770, -489281]
547d89281L84754k48025J25876j48424l06860L3761J93708m10303N20840j29384
537d73338M1979M62152j22889K4429K3156p5965o9974k00979M6519J90535j89885
526c44260j31318j88828K28273L69371m71547J01951K8415Q7610P49443k0359
516D08751j02337m32465R239l00023p2744M4370k79127J04424O48588m27595k3474
505d22393K04043N5287L4970l88333l76768M26546K44745J17126K87719L5439
495B18381l54142K27468O70338k9029m38941M00461m13559o0439j06701n19094
485d05257M6389Q3926J59408k30323P5698J81889k91745n1435K30504k46789L57171
474i0564L3694l98321Q9017M12994j7190m33331l17283Q03888M4312m34997P7664
$$ y = [-489281, -104527, -352552, -226676, -375100, -681960, -648199, -454491, -864794, -343954, -473338, -431359, 30793, -92096, -67667, -44511, -120476, -190450, -391429, -344910, -154375, -344260, -475578, -664406, -436133, -66762, -538309, -436358, -407943, -320333, 429110, 408751, 306414, -126051, -116812, -416835, -489579, -445209, -724336, -619912, 28676, -398919, -422393, -218350, -163063, -128093, -516426, -893194, -466648, -221903, -104777, 182942, 218381, -135761, 91707, 762045, 733016, 294075, 694536, 280977, 220538, 113837, -405257, -358868, -274942, -115534, -345857, -270159, -88270, -380015, -431450, -200946, -447735, -90564, -56870, -455191, -366174, 46820, 29630, -403701, -720984, 82904, 127216, -307781, -230117]
463b30117J93797J98581j68924n92434J13729l2212J57157K59464q7139K48666
453F0568l10079m25092j79872J52721L72863K97934L5483J43083K57407m48915
443d3899j6822p9459n16818L46513j11696l38015k56021J10739N81081K79462
433d4935m77350l04420O59923K35988m48993M9186k74475K89907M15285K88384
423C88500l22955J39327k95102m745j27885J22322k52468L91031K80941J37363
413D56329J43661l34028o37502p222L95320j20539n97075K10420J87679J42410
403a60547N9969M7084J53318j48857l10623N36031k42465o40951K27738J34549
393c44754J85348j78175n97428L54463R7709j60419M24590n03801M94409l22545
$$ y = [-230117, -36320, 162261, -6663, -599097, -485368, -517580, -360423, -100959, -188098, 60568, -249511, -674603, -854475, -701754, -328891, -30957, 4526, 147609, 405016, -43899, -60721, -140180, -656998, -310485, -422181, -760196, -1016217, -905478, -324397, -44935, -522285, -826705, -166782, 69206, -379787, -330601, -605076, -315169, 100116, 388500, 65545, 204872, -90230, -94975, -222860, -100538, -353006, 38025, 318966, 456329, 599990, 265962, -371540, -378762, 16558, -103981, -701056, -490636, -302957, -160547, -100578, -53494, 99824, -49033, -359656, 176375, -66090, -707041, -479303, -344754, -159406, -337581, -935009, -580546, -482837, -643256, -218666, -722467, -228058, -550603]
383e50603m6792M37910j82306j56041N34496j77357j91015j83789k73163J42238
373f46422M02712J64896K0792M03316k4353k19520P3514K9632k43415q0291J47699
362B8560L2862J85944P6283k72492n71024N7127J53974J51041K08359m96760j98930
351f45056L19557J32739J57674P0077L7798r11398L63339M37400K29128L17149
341E08407l76225n34895K35808l12621n18600L28478K52324Q9906J96672m85592
331f16338K37565K7839J69158J52300j99619O0109J6344j14287O7958n0011L38714
320H9732m15403p1779J13002j48730j70396J03953J0008J82119l41945l01912
310i51351K48354J80436p4890O5363K65755J97664j36101j63184K73511Q8397
$$ y = [-550603, -597395, -159485, -341791, -497832, 36664, -140693, -331708, -515497, -788660, -646422, -243710, -78814, -58022, 345294, 320941, 101421, 174935, 204567, -38848, -119139, 28560, 61422, 247366, 323649, 51157, -519867, -462740, -308766, -157725, 50634, -446126, -645056, -325499, -192760, -35086, 34991, 72789, -838609, -475270, -37870, 191258, 508407, 132182, -402713, -166905, -479526, -998126, -669648, -417324, -327418, -130746, -616338, -378773, -350934, -181776, -29476, -229095, -168986, -152642, -266929, -198971, -248982, 89732, -325671, -397450, -284448, -433178, -603574, -499621, -489613, -307494, -649439, -951351, -702997, -522561, -597451, -532088, -266333, -68669, -204770, -367954, -94443, -6046]
300f046o73500q7385N45588k93791J35569O80627J14515p17755K983k3802N0324
289b72673J8543K0037r8510J27690j29769o7777L08941N90980j33025o96552l60139
278f92254J51037l98321M83878P1309j120Q9561n2427O5441n45955J16398J15490
267e96963L59101J72205k2681J32413L6064j21611l70798L03895j48531J22695
257a34211j33423j72149k4764L26068j27285R8791q3419l94036J94725J8226J0053
246d21424J7912k15129o488M14L82180j40771K00746K01781k2423J54970k71394
235a19626j93108R7579l9237K53496J93217j24001L9531N0825o95401j21535K46620
224d11640N36072o8403k47157K0271j60978j09064k24726q9869m7978M81185J61538
$$ y = [-6046, -679546, -766931, -221343, -515134, -379565, 301062, 415577, -302178, -299195, -322997, -272673, -254130, -234093, -332603, -204913, -334682, -402459, -93518, 497462, 364437, -332115, -692254, -541217, -939538, -455660, -384351, -385471, -295910, -348337, -282896, -828851, -712453, -596963, -237862, -65657, -88338, 44075, 80139, -41472, -412270, -108375, -256906, -134211, -267634, -439783, -464547, -138479, -265764, -166973, -250392, -644428, -449703, -431477, -421424, -403512, -618641, -625129, -624715, -242535, -383306, -182560, 19221, -3202, 151768, -119626, -312734, -215155, -254392, -896, 192321, 68320, 107851, 158676, -536725, -658260, -411640, 124432, 56029, -191128, -170857, -331835, -440899, -665625, -755494, -803472, -322287, -160749]
213a60749p4702l70630q3125K33511k27736p9470O06807K43856K1005k72741o4115
202b28089l35075Q366J33268J47425K20781O5858L73952m95314k80318k18128
192f07274K24333O59845l72382k2408L32319N142k83128j47414l58105P1252K52729
181b45091L84888l38956l1833l54079j37205L36433j76599J67629J77950k4121
171b40984j59493q5777R6797n7027n7688L44074k25386J66404Q7021j119l66457
160d99635m62M41781N8685k50739K95038J07445k77197k80178m01423M24024K02226
149a80435m0101l89623N7629k58456Q9712J5840l10532J15556N35521j5748J40781
138b39856k04569j55401K72209M1954J92755j26376J20383j24744j09891L8153
$$ y = [-160749, -235451, -606081, -689206, -455695, -683431, -762901, -156094, 87762, 108767, -163974, -228089, -563164, -554798, -421530, -274105, -53324, 12534, 386486, -108828, -389146, -607274, -382941, 276904, -95478, -117886, 214433, 219575, -63553, -210967, -569072, -497820, -245091, 139797, -199159, -230992, -585071, -722276, -385843, -562442, -394813, -216863, -240984, -400477, -486254, -389457, -446484, -504172, -160098, -385484, -219080, -132059, -133178, -499635, -500097, -58316, 369, -250370, 44668, 152113, -125084, -405262, -806685, -382661, -180435, -220536, -610159, -552530, -810986, -721274, -705434, -1015966, -900410, -364889, -380637, -239856, -444425, -599826, -327617, -285663, -92908, -219284, -98901, -223645, -333536, -295383]
128b95383j54260M2043L8806L43864P9420m77264k12660K02342J00291k55463
118e88264L58872k19777r0849l8927J27049o902J14209j27431J50146J41624R3441
107h6809J66573n74831K62806L94932j82152j70833K5277Q4284l03596K0675n8420
96d22094j14274m900J01698K90888k49983J03428o8748L4169j81360L34671j71355
85c47860l8447J00420j03034j16345R1826M3274K60234q5187Q0745j41055o6420
74c21849k50667K6803J96648l9254O4137j80422p7923K46130J84570O2596q6328
63a75559m56596L33615J82044J37384O8625l32387j64267M11247q4238l17195
53c97327l6189k21044j9571O1300K45668J35395k2072k94613K3799j14028M17601
$$ y = [-295383, -449643, -407600, -368794, -24930, 54490, -422774, -635434, -433092, -332801, -588264, -229392, -449169, -540018, -578945, -451896, -458798, -344589, -472020, -321874, -180250, -86809, 79764, -495067, -232261, 162671, -19481, -190314, -165037, -80753, -384349, -363674, -422094, -536368, -541268, -439570, -148682, -398665, -295237, -363985, -329816, -511176, -176505, -347860, -386307, -285887, -388921, -505266, -413440, -370166, -109932, -195119, -114374, -255429, -321849, -572516, -545713, -349065, -388319, -324182, -504604, -582527, -336397, -151827, -89231, -175559, -632155, -298540, -116496, 20888, 89513, -242874, -407141, 4106, -80132, -397327, -433516, -654560, -674131, -612831, -367163, -231768, -253840, -548453, -524654, -638682, -221081]
42b21081J03323j95467j5017k69758J58717J99138O9788o13525K09128M86371
32h8383M3924j57668J26037k00371k55870N1242J11028N677K0516k60337K21962
21c82243P3595j96498r3763K3971J28305p3825M5797J69140j3351L9871j54613
10d33614K26660K48730m7236j96447j07795K3274j90403J18532j739k16177
0e76215
$$ y = [-221081, -117758, -313225, -328242, -598000, -439283, -240145, -170357, -783882, -574754, -88383, -44459, -202127, -76090, -276461, -532331, -481089, -370061, -364384, -343868, -604205, -382243, -308648, -505146, -598909, -574938, -446633, -520458, -474661, -305521, -318872, -279001, -433614, -206954, 41776, -5460, -201907, -309702, -286428, -476831, -358299, -360038, -576215]
$$ Imaginary data points
##PAGE= N=2
##DATA TABLE= (X++(I..I)), XYDATA
16383f358372K12326p2062J20641K31290j02969K37555L9285j740K45081p2612
16373e521577j44122K09441j7215K99477J56148j67622K15958K2320J9572K06165
16363d721455P8305J13429J84021L72014r1375n0731K44746K14990M149j19802
16353c771709k84607J05277J32569N04471j89717J05727K79658j78588L1121J20321
16343c145477J30928r542J30948J93575o5706j85188M89190K5150M390j30258
16333b561990q6737L40072r0336L47548j65050L67796O9045q167R9797l1975k8158
16322a748155M07154P2861q9458Q080L28742p8012l42539K07635K08678j09900
16312a134914L17167q0190J59251M88061Q421m50429M15323j03837k03229O7334
$$ y = [-6358372, -6146046, -6218108, -6097467, -5866177, -5969146, -5731591, -5692306, -5694046, -5448965, -5521577, -5665699, -5456258, -5473473, -5173996, -5017848, -5185470, -4969512, -4947192, -4927620, -4721455, -4643150, -4529721, -4345700, -3973686, -4065061, -4115792, -3871046, -3656056, -3651907, -3771709, -4056316, -3951039, -3818470, -3313999, -3503716, -3397989, -3118331, -3296919, -3265798, -3145477, -3014549, -3024091, -2893143, -2699568, -2765274, -2950462, -2461272, -2436122, -2431732, -2561990, -2648727, -2308655, -2398991, -2051443, -2216493, -1848697, -1779652, -1787819, -1688022, -1719997, -1748155, -1341001, -1268140, -1357598, -1349518, -1020776, -1098788, -1441327, -1233692, -1025014, -1134914, -817747, -897937, -738686, -250625, -242204, -692633, -277310, -381147, -584376, -517042]
16302e17042l9605K57037n8568J90104L31065j27387J83164q779k35493L76758
16292C51254j81731P642K57466J59059J9288K07003L1653K07497l00652J8955
16282G77434L39610k68865J05407J25159K57721j60494L64124O6813m18163p5367
16272A113379P7642k0430J61897Q47395n98043K12238R9307l21587O055L75355
16262A953208L651J47548J78246J47852J82268K77792K4706q0443l92249q9026
16252B353553J92332J12720K65160k68237L5069J49568l00092k20212K33132O68591
16242C221584k13482m6274K8923l38857M22880K38155m15370Q513M12719j07349
16232C211442M2241J01368j44041J80546J67698j71623O2621M67913o0583L96750
$$ y = [-517042, -556647, -299610, -358178, -168074, 162991, 35604, 218768, 209989, -25504, 351254, 169523, 177165, 434631, 593690, 612978, 819981, 851634, 1059131, 758479, 777434, 1117044, 848179, 953586, 1078745, 1336466, 1175972, 1540096, 1606909, 1188746, 1113379, 1191021, 1170591, 1332488, 2179883, 1581840, 1794078, 1893385, 1571798, 1577853, 1953208, 1956859, 2104407, 2282653, 2430505, 2612773, 2890565, 2915271, 2834828, 2442579, 2353553, 2545885, 2658605, 2923765, 2655528, 2690597, 2840165, 2540073, 2319861, 2552993, 3221584, 3008102, 2961828, 2990751, 2651894, 3074774, 3312929, 2897559, 2906072, 3318791, 3211442, 3253683, 3355051, 3211010, 3391556, 3559254, 3387631, 3450252, 3918165, 3857582, 4254332]
16222D254332j75437j28063l68370r353L26293l26105K09509J66389k43954L60444
16212D065685M692J99348L3090m86810K99148m0703j35724Q658K33419O6182K5785
$$ y = [4254332, 4078895, 3950832, 3582462, 3573109, 3899402, 3573297, 3782806, 3949195, 3705241, 4065685, 4070377, 4269725, 4302815, 3816005, 4115153, 4074450, 3938726, 3947384, 4180803, 4246985, 4272770]
$$ [...]
##END NTUPLES=NMR SPECTRUM
##END=
