##TITLE=1H_CG-1147-B
 CDCl3, 8 sc, 
 14.05.2021
##JCAMPDX= 6.0         $$ Bruker NMR JCAMP-DX V2.0
##DATA TYPE= NMR SPECTRUM
##DATA CLASS= NTUPLES
##ORIGIN= UXNMR, Bruker Analytische Messtechnik GmbH
##OWNER= root
$$ XWIN-NMR		Version 3.5
$$ Fri May 14 11:31:32 2021 Russian Standard Time (UT+4h)  she@DPX200
##.OBSERVE FREQUENCY= 200.131506
##.OBSERVE NUCLEUS= ^1H
##.ACQUISITION MODE= SIMULTANEOUS
##.ACQUISITION SCHEME= undefined
##.AVERAGES= 8
##.DIGITISER RES= 18
##SPECTROMETER/DATA SYSTEM= spect
##.PULSE SEQUENCE= zg30
##.SOLVENT NAME= CDCl3
##.SHIFT REFERENCE= (INTERNAL, CDCl3, 0, 15.9792)
##AUDIT TRAIL= $$ (NUMBER, WHEN, WHO, WHERE, WHAT)
$$ ##TITLE= Audit trail, XWIN-NMR		Version 3.5
$$ ##JCAMPDX= 5.01
$$ ##ORIGIN= Bruker BioSpin GmbH
$$ ##OWNER= she
$$ F:/spectra/data/she/nmr/H-F/1/pdata/1/auditp.txt
$$ ##AUDIT TRAIL=  $$ (NUMBER, WHEN, WHO, WHERE, WHAT)
(   1,<2021-05-14 11:30:18.54 +0400>,<she>,<DPX200>,
      <created by zg, POWCHK disabled, PULCHK disabled
       configuration hash MD5:
       00 E9 B6 7A A2 85 ED C7 34 08 36 98 17 FE 4E 26
       data hash MD5: 16K
       2E 51 C1 AD B6 6E C6 73 B6 5E FE A6 07 57 45 9A>)
(   2,<2021-05-14 11:30:20.76 +0400>,<she>,<DPX200>,
      <Start of raw data processing
       efp BC_mod = 2 LB = 0.24 FT_mod = 6 PKNL = 1 PHC0 = -11137.36 PHC1 = 21.201 SI = 16K 
       data hash MD5: 16K
       CD 46 88 C9 CC 35 84 C7 D6 94 21 A5 9B 14 14 B4>)
(   3,<2021-05-14 11:30:42.75 +0400>,<she>,<DPX200>,
      <pk PHC0 = -4.977424 PHC1 = 7.2 
       data hash MD5: 16K
       2D F9 32 3D D0 D8 D6 2C D8 14 F3 30 B6 35 70 94>)
(   4,<2021-05-14 11:30:46.28 +0400>,<she>,<DPX200>,
      <abs ABSG = 5 
       data hash MD5: 16K
       83 57 D1 47 C9 AF 26 64 47 F9 5E 15 8A 63 33 73>)
$$ ##END=
$$ 
$$ hash MD5
$$ 6C 08 00 1C C5 1A DC 0B 15 4D 0F CA 19 9A 19 90
##$RELAX= 
##$RELAX= 
##$RELAX= 
##$RELAX= 
##$RELAX= 
##$RELAX= 
$$ Bruker specific parameters
$$ --------------------------
##$DU= <F:/spectra>
##$EXPNO= 1
##$NAME= <H-F>
##$PROCNO= 1
##$TYPE= <nmr>
##$USER= <she>
##$AMP= (0..31)
100 100 100 100 100 100 100 100 100 100 100 100 100 100 100 100 100 100 
100 100 100 100 100 100 100 100 100 100 100 100 100 100 
##$AQSEQ= 0
##$AQ_mod= 1
##$AUNM= <au_zg>
##$AUTOPOS= <>
##$BF1= 200.13
##$BF2= 200.13
##$BF3= 200.13
##$BF4= 200.13
##$BF5= 200.13
##$BF6= 200.13
##$BF7= 200.13
##$BF8= 200.13
##$BYTORDA= 1
##$CFDGTYP= 0
##$CFRGTYP= 5
##$CHEMSTR= <none>
##$CNST= (0..31)
1 1 145 1 1 1 1 1 1 1 1 1 1 1 1 1 1 1 1 1 1 1 1 1 1 1 1 1 1 1 1 1 
##$CPDPRG= <>
##$CPDPRG1= <>
##$CPDPRG2= <>
##$CPDPRG3= <>
##$CPDPRG4= <mlev>
##$CPDPRG5= <mlev>
##$CPDPRG6= <mlev>
##$CPDPRG7= <mlev>
##$CPDPRG8= <mlev>
##$CPDPRGB= <>
##$CPDPRGT= <>
##$D= (0..31)
0 1.2 0 0 0 0 0 0 0 0.06 0 0.03 0 0 0 0 0.0002 0 0 0 0 0 0 0 0 0 0 0 0 
0 0 0 
##$DATE= 1620977418
##$DBL= (0..7)
120 120 120 120 120 120 120 120 
##$DBP= (0..7)
150 150 150 150 150 150 150 150 
##$DBP07= 0
##$DBPNAM0= <>
##$DBPNAM1= <>
##$DBPNAM2= <>
##$DBPNAM3= <>
##$DBPNAM4= <>
$$ [...]
##$SUBNAM3= <"">
##$SUBNAM4= <"">
##$SUBNAM5= <"">
##$SUBNAM6= <"">
##$SUBNAM7= <"">
##$SUBNAM8= <"">
##$SUBNAM9= <"">
##$SW= 16.9725357007746
##$SWIBOX= (0..15)
0 0 2 0 0 0 0 0 0 0 0 0 0 0 0 0 
##$SW_h= 3396.73913043478
##$TD= 16384
##$TD0= 1
##$TE= 0
##$TE2= 300
##$TE3= 300
##$TEG= 300
##$TL= (0..7)
0 120 120 120 120 120 120 120 
##$TP= (0..7)
150 150 150 150 150 150 150 150 
##$TP07= 0
##$TPNAME0= <>
##$TPNAME1= <>
##$TPNAME2= <>
##$TPNAME3= <>
##$TPNAME4= <>
##$TPNAME5= <>
##$TPNAME6= <>
##$TPNAME7= <>
##$TPOAL= (0..7)
0.5 0.5 0.5 0.5 0.5 0.5 0.5 0.5 
##$TPOFFS= (0..7)
0 0 0 0 0 0 0 0 
##$TUNHIN= 0
##$TUNHOUT= 0
##$TUNXOUT= 0
##$USERA1= <user>
##$USERA2= <user>
##$USERA3= <user>
##$USERA4= <user>
##$USERA5= <user>
##$V9= 5
##$VALIST= <valist>
##$VCLIST= <CCCCCCCCCCCCCCC>
##$VD= 0
##$VDLIST= <DDDDDDDDDDDDDDD>
##$VPLIST= <PPPPPPPPPPPPPPP>
##$VTLIST= <TTTTTTTTTTTTTTT>
##$WBST= 1024
##$WBSW= 4
##$XGAIN= (0..3)
0 0 0 0 
##$XL= 0
##$YL= 0
##$YMAX_a= 80385
##$YMIN_a= -97007
##$ZGOPTNS= <>
##$ZL1= 120
##$ZL2= 120
##$ZL3= 120
##$ZL4= 120
##$ABSF1= 15.98335
##$ABSF2= -0.9893141
##$ABSG= 5
##$ABSL= 3
##$ALPHA= 0
##$AQORDER= 0
##$ASSFAC= 0
##$ASSFACI= 0
##$ASSFACX= 0
##$ASSWID= 0
##$AUNMP= <proc_1d>
##$AZFE= 0.1
##$AZFW= 0.1
##$BCFW= 0
##$BC_mod= 2
##$BYTORDP= 0
##$COROFFS= 0
##$CY= -3
##$DATMOD= 1
##$DC= 0
##$DFILT= <>
##$DTYPP= 0
##$F1P= 0
##$F2P= 0
##$FCOR= 1
##$FTSIZE= 16384
##$FT_mod= 6
##$GAMMA= 0
##$GB= 0
##$INTBC= 1
##$INTSCL= 1.334414e-10
##$ISEN= 128
##$LB= 0.24
##$LEV0= 0
##$LPBIN= 0
##$MAXI= 10000
##$MC2= 0
##$MEAN= 0
##$ME_mod= 0
##$MI= 1.114404
##$NCOEF= 0
##$NC_proc= -10
##$NLEV= 6
##$NOISF1= 3.799351
##$NOISF2= 2.8
##$NSP= 0
##$NTH_PI= 0
##$NZP= 0
##$OFFSET= 15.97921
##$PC= 1
##$PHC0= -11142.34
##$PHC1= 28.401
##$PH_mod= 1
##$PKNL= yes
##$PPARMOD= 0
##$PSCAL= 0
##$PSIGN= 0
##$REVERSE= no
##$SF= 200.130006450904
##$SI= 16384
##$SIGF1= 3
##$SIGF2= 2
##$SINO= 5.538805
##$SIOLD= 16384
##$SREGLST= <1H.CDCl3>
##$SSB= 0
##$STSI= 16384
##$STSR= 0
##$SW_p= 3396.73913043479
##$SYMM= 0
##$S_DEV= 0
##$TDeff= 16384
##$TDoff= 0
##$TI= <>
##$TILT= no
##$TM1= 0
##$TM2= 0
##$TOPLEV= 0
##$USERP1= <user>
##$USERP2= <user>
##$USERP3= <user>
##$USERP4= <user>
##$USERP5= <user>
##$WDW= 1
##$XDIM= 16384
##$YMAX_p= 507248674
##$YMIN_p= -3738026
$$ End of Bruker specific parameters
$$ ---------------------------------
##NTUPLES= NMR SPECTRUM
##VAR_NAME=  FREQUENCY,     SPECTRUM/REAL,   SPECTRUM/IMAG
##SYMBOL=    X,             R,               I
##VAR_TYPE=  INDEPENDENT,   DEPENDENT,       DEPENDENT
##VAR_FORM=  AFFN,          ASDF,            ASDF
##VAR_DIM=   16384,         16384,           16384
##UNITS=     HZ,            ARBITRARY UNITS, ARBITRARY UNITS
##FACTOR=    0.207333158178282, 1,           1
##FIRST=     3197.91938034781, 0,            0
##LAST=      -198.819750086985, 0,           0
##MIN=       -198.819750086985, -3738026,    0
##MAX=       3197.91938034781, 507248674,    0
$$ Real data points
##PAGE= N=1
##DATA TABLE= (X++(R..R)), XYDATA
$$ [...]
3521D5419560k27719n36658l24366m12333K28421k39851j353932l98120K320652
$$ 45419560 45191841 44655183 44330817 43918484 44146905 43907054 42553122 42155002 44475654
3512D4475654l09296P42090K76851L86297N4001O45487K44025K665444j14901
$$ 44475654 44166358 44908448 45185299 45571596 45625597 46271084 46515109 49180553 49065652
3503D9065652l50586K008008J431352k57242j395790P25179J638259J846066O44848
$$ 49065652 48715066 50723074 52154426 51897184 50501394 51226573 52864832 54710898 55355746
3494E5355746J632514J283705L37311J752641J716501R63561K687186J646292
$$ 55355746 56988260 58271965 58609276 60361917 62078418 63041979 65729165 67375457
3486F7375457J711136K619658J356265J875722K717541M469972M252186J701766
$$ 67375457 69086593 71706251 73062516 74938238 77655779 82125751 86377937 88079703
3478H8079703L478773M740956N876824N642736N973450N785870M192299L245166
$$ 88079703 91558476 96299432 102176256 107818992 113792442 119578312 123770611 127015777
3470A27015777K602238N14778l461705l570364m581590o898960n519425n066251
$$ 127015777 129618015 130132793 126671088 123100724 118519134 111620174 106100749 101034498
3462A01034498m836405k860837l133612l912258k267544j478473j457573k102378
$$ 101034498 96198093 93337256 90203644 86291386 84023842 82545369 81087796 78985418
3454G8985418j309957l355157q21934r48641j376170j040763q85958j221174j929720
$$ 78985418 77675461 74320304 73498370 72549729 71173559 70132796 69246838 68025664 66095944
3445F6095944j797139j05887L02646n39942n09823K62411J370243n31652J444527
$$ 66095944 64298805 64192918 64495564 63955622 63445799 63708210 65078453 64546801 65991328
3436F5991328M23937o27367Q09393J390099J63873K028601N96589J381331J609432
$$ 65991328 66415265 65787898 66597291 67987390 68151263 70179864 70776453 72157784 73767216
3427G3767216J724290J667079n17076J318731R55597O84096Q31038O49415n83116
$$ 73767216 75491506 77158585 76641509 77960240 78915837 79599933 80430971 81080386 80497270
3418H0497270p05306J053632j519202r95404K11991j354645r04838l72262j109152
$$ 80497270 79791964 80845596 79326394 78330990 78542981 77188336 76283498 75911236 74802084
3409G4802084j934448k290752L82374J483462j446815j222874N1003M53776m30493
$$ 74802084 72867636 70576884 70959258 72442720 70995905 69773031 69824034 70277810 69847317
3400F9847317l05633j480690j01559R48935J051971J185127p07454P07079L65884
$$ 69847317 69541684 68060994 67959435 68908370 69960341 71145468 70438014 71145093 71510977
3391G1510977k06751J89588k07545K312K233244N68723O75404l09672n9987N45233
$$ 71510977 71304226 71493814 71286269 71288581 73521825 74090548 74765952 74456280 74396293 74941526
3381G4941526Q97230Q06879N37379M82475J046432J88055J148607P89106l85823
$$ 74941526 75838756 76645635 77183014 77665489 78711921 78899976 80048583 80837689 80451866
3372H0451866p4820j203940J323405J361357k24890J412203K15663O83552J200356
$$ 80451866 80377046 79173106 80496511 81857868 81632978 83045181 83260844 83944396 85144752
3363H5144752N55832q94400M24421M66415Q00585J076786P51866L5403R51621
$$ 85144752 85700584 84806184 85230605 85697020 86497605 87574391 88326257 88361660 89313281
3354H9313281K026815J063453K086887J054537Q51715O87600J041075K547497
$$ 89313281 91340096 92403549 94490436 95544973 96396688 97084288 98125363 100672860
3346A00672860J557752L770994L104079K102245L329161K767804L322492K132938
$$ 100672860 102230612 106001606 109105685 111207930 114537091 117304895 120627387 122760325
3338A22760325K144994L613022K987040J762902K151274K958478L387920L879447
$$ 122760325 124905319 128518341 131505381 133268283 135419557 138378035 141765955 145645402
3330A45645402N519947N063728M938874M344023L525341M228593L145111J684981
$$ 145645402 151165349 156229077 161167951 165511974 169037315 173265908 176411019 178096000
3322A78096000J755649q0146Q39374K72261n67243N30956J070537P37205J368013
$$ 178096000 179851649 179771503 180610877 180883138 180315895 180846851 181917388 182654593 184022606
3313A84022606K158789L278999L102344N781537N754334O045224M997528M336156
$$ 184022606 186181395 189460394 192562738 198344275 204098609 210143833 215141361 219477517
3305B19477517J987593J059424j832721m503450o505468p152238o085231o252274
$$ 219477517 221465110 222524534 220691813 216188363 209682895 202530657 196445426 190193152
3297A90193152o673608o130662o808913l439298m782881m797727l275719k325786
$$ 190193152 183519544 177388882 170579969 167140671 162357790 157560063 154284344 151958558
3289A51958558j921313l685185k403016j380192j26748J02463q8050J017658L359500
$$ 151958558 150037245 146352060 143949044 142568852 142442104 142544567 142456517 143474175 146833675
3280A46833675K699541L984213L644463L886786M905108N832553M495848J215392
$$ 146833675 149533216 153517429 157161892 161048678 165953786 171786339 176282187 177497579
3272A77497579k19164r10153k448204m462013p162370o939847p600012p495084
$$ 177497579 177278415 176368262 173920058 169458045 162295675 155355828 147755816 140260732
3264A40260732p895320m745890m242416m152210l506362l458660k481704j069953
$$ 140260732 132365412 127619522 123377106 119224896 115718534 112259874 109778170 108708217
3256A08708217k328350k336073j950949j084557n73025j413806J004468m43032
$$ 108708217 106379867 104043794 102092845 101008288 100435263 99021457 100025925 99582893
3248I9582893m40815O90264j746336k190896r93948r67638l15229j926286L07497
$$ 99582893 99142078 99832342 98086006 95895110 94901162 93933524 93618295 91692009 91999506
3239I1999506q83955j615448K25347N87343J025201p60948j216435j000027n74875
$$ 91999506 91115551 89500103 89725450 90312793 91337994 90577046 89360611 88360584 87785709
3230H7785709P70750K60853q77111k0377Q13053Q31895K24883Q5962l89407o30926
$$ 87785709 88556459 88817312 87940201 87919824 88732877 89564772 89789655 89875617 89486210 88855284
3220H8855284L97486J701778J085261k75151J913453R45087o95280L63041n14404
$$ 88855284 89252770 90954548 92039809 91764658 93678111 94623198 93927918 94290959 93776555
3211I3776555N66841P92242J094290K643559Q20084J486854R09904J119260M038682
$$ 93776555 94343396 95135638 96229928 98873487 99693571 101180425 102090329 103209589 107248271
3202A07248271K526209J920958k10902j221510j754347r79308j339586j423243
$$ 107248271 109774480 111695438 111484536 110263026 108508679 107529371 106189785 104766542
3194A04766542j093035k477064k390814N30741P28134m28669j216434p26541n17059
$$ 104766542 103673507 101196443 98805629 99336370 100064504 99635835 98419401 97692860 97175801
3185I7175801l87627k68675l64529Q50383q16387J56040j063695j707275J406029
$$ 97175801 96788174 96519499 96154970 97005353 96188966 96345006 95281311 93574036 94980065
3176I4980065O64721k09014r32896M18632R01633j005555J23139P6471L19737
$$ 94980065 95644786 95435772 94502876 94921508 95823141 94817586 94940725 95017196 95336933
3167I5336933O55012J412093P14898M98118R49610N78907n10233J060482K429649
$$ 95336933 95991945 97404038 98118936 98617054 99566664 100145571 99635338 100695820 103125469
3158A03125469L50853k02670Q2891K969631J552481k4070q82005J470784J769496
$$ 103125469 103476322 103273652 103356543 106326174 107878655 107854585 106972580 108443364 110212860
3149A10212860q81502j789541m99543J202667o00965J432803p16888O93154J621130
$$ 110212860 109331358 107541817 107042274 108244941 107643976 109076779 108359891 109053045 110674175
3140A10674175o99090j126439J535617K49012N06666j935697k373260M17481j178347
$$ 110674175 109975085 108848646 110384263 110633275 111139941 109204244 106830984 107248465 106070118
3131A06070118q00020n96453M87300L3783p6358o92533j288293L10141R59281
$$ 106070118 105270098 104673645 105160945 105194728 105118370 104425837 103137544 103447685 104406966
3122A04406966j736355L66471J779205J027251l3709P41972O62168J615521J705042
$$ 104406966 102670611 103037082 104816287 105843538 105809829 106551801 107213969 108829490 110534532
3113A10534532J801610N16334p78403k508632m200620l621753j659871p10379
$$ 110534532 112336142 112852476 112074073 109565441 105364821 101743068 100083197 99372818
3105I9372818o18379j354093j142756J647727k65421p63314J12358r0592L99824
$$ 99372818 98754439 97400346 96257590 97905317 97639896 96876582 96988940 96898348 97298172
3096I7298172J537304K718566J794816J761802J707009K948850J553194M770986
$$ 97298172 98835476 101554042 103348858 105110660 106817669 109766519 111319713 116090699
3088A16090699M846902O407658M619051K968302K198767n74708l631872o095630
$$ 116090699 120937601 127345259 131964310 134932612 137131379 136556671 132924799 126829169
3080A26829169o606351n398918n272090m707475l934815l114428k616394k138675
$$ 126829169 120222818 114823900 109551810 104844335 100909520 97795092 95178698 93040023
3072I3040023j585883j708155q33034j565418k10526j765144q9549k390741L37106
$$ 93040023 91454140 89745985 88912951 87347533 87137007 85371863 85282314 82891573 83228679
3063H3228679R28681L0321j465144n17560j217062q20721j345341k21564M48658
$$ 83228679 84157360 84187681 82722537 82204977 80987915 80167194 78821853 78600289 79048947
3054G9048947n81021o6193j144132q98709L56664p65787L86808m65147l42333
$$ 79048947 78467926 78401733 77257601 76358892 76715556 75949769 76336577 75871430 75529097
3045G5529097j271052k04979J061795J185669p27579k88155p19710r64451J72665
$$ 75529097 74258045 74053066 75114861 76300530 75572951 75284796 74565086 73600635 73773300
3036G3773300l21895R94443k67031q07978J497033N59166q882J48963l67832J6697
$$ 73773300 73451405 74445848 74178817 73370839 74867872 75427038 75418156 75567119 75199287 75215984
3026G5215984L04536p7651O95036M61471j82652J98540R40624J223683Q37334
$$ 75215984 75520520 75442869 76137905 76599376 76416724 76615264 77555888 78779571 79616905
3017G9616905J745651q520M63058m21837J255777j090495l81092R05355l29546
$$ 79616905 81362556 81354036 81817094 81395257 82651034 81560539 81179447 82084802 81755256
3008H1755256P56712J73114N22473j9830j93732o76689j177277r76653m34116
$$ 81755256 82511968 82685082 83207555 83187725 82993993 82317304 81140027 80163374 79729258
2999G9729258k414078k347445j378017j519459k604094j405768Q24196p68780
$$ 79729258 77315180 74967735 73589718 72070259 69466165 68060397 68884593 68115813
2991F8115813j955791j914291K37380q49666q85010o38974k02509j295412J004410
$$ 68115813 66160022 64245731 64483111 63633445 62748435 62109461 61906952 60611540 61615950
2982F1615950j335074n00241R40639N59739k251476j219673l2703P08460J25005
$$ 61615950 60280876 59780635 60721274 61281013 59029537 57809864 57777161 58485621 58610626
2973E8610626j537488p58856j505003r61626J285255p45087k241939P54661j31481
$$ 58610626 57073138 56314282 54809279 53847653 55132908 54387821 52145882 52900543 52769062
2964E2769062l70049J83186J90169j013214j336395j098607K87194O8277O55536
$$ 52769062 52399013 52582199 52772368 51759154 50422759 49324152 49611346 49679623 50335159
2955E0335159M48686j941984K62373L75014j445314k139913o78478O72117M66527
$$ 50335159 50783845 48841861 49104234 49479248 48033934 45894021 45215543 45887660 46354187
2946D6354187m83038L03116m96178L48024j695543n02631K59527k49372l54974
$$ 46354187 45871149 46174265 45678087 46026111 44330568 43827937 44087464 43838092 43483118
2937D3483118K85991J17239j860348k06131n25040j73838n79416L06145r94075
$$ 43483118 43769109 43886348 42026000 41819869 41294829 41120991 40541575 40847720 39853645
2928C9853645R48535j184169J36699J570841P5344q10404o31905J45689O87763
$$ 39853645 40802180 39618011 39754710 41325551 41400895 40590491 39958586 40104275 40792038
2919D0792038o54375O71834r93492j87235R23449j128931r56122j027464K402020
$$ 40792038 40137663 40809497 39816005 39628770 40552219 39423288 38467166 37439702 39841722
2910C9841722J501672k505407q52101M67938L16147L62097m12903P94958p02142
$$ 39841722 41343394 38837987 37985886 38453824 38769971 39132068 38719165 39514123 38811981
2901C8811981j112712N42671j93692j90406n73938l48036n39727Q50832J099011
$$ 38811981 37699269 38241940 38048248 37857842 37283904 36935868 36396141 37246973 38345984
2892C8345984J96811j427508P28601n45939J262448Q99861j023448J62795k30282
$$ 38345984 38542795 37115287 37843888 37297949 38560397 39460258 38436810 38599605 38369323
2883C8369323J685145N24442K30537j352717J725299K448247m53250j001877L52525
$$ 38369323 40054468 40578910 40809447 39456730 41182029 43630276 43177026 42175149 42527674
2874D2527674J96290L69818j577720j09073K38852K264757Q44676R5953M87080
$$ 42527674 42723964 43093782 41516062 41406989 41645841 43910598 44755274 44851227 45338307
2865D5338307k76022k39537p59697Q85390N45738q47832J345067J980304m50799
$$ 45338307 45062285 44822748 44063051 44948441 45494179 44646347 45991414 47971718 47520919
2856D7520919J023594O35837J74627J530284J156798j208651P69073P86672P95747
$$ 47520919 48544513 49180350 49354977 50885261 52042059 50833408 51602481 52389153 53184900
2847E3184900K573073N15534j647799o85901K719101K931620J319126J08379M95648
$$ 53184900 55757973 56273507 54625708 53939807 56658908 59590528 60909654 61018033 61513681
2838F1513681K020683J427885O3395J129013J161414k48522j085784M06555J219859
$$ 61513681 63534364 64962249 65025644 66154657 67316071 67067549 65981765 66388320 67608179
2829F7608179O83719K96373q24578M95919j32353Q13462k77336J304864n70509
$$ 67608179 68291898 68588271 67763693 68259612 68127259 68940721 68663385 69968249 69397740
2820F9397740l12330k60456J98948L70755j257559o34732q5135J305475L99790
$$ 69397740 69085410 68824954 69023902 69394657 68137098 67502366 67417231 68722706 69122496
2811F9122496R94337p62520l16484o08430j198863j048482j87885n9545Q21583
$$ 69122496 70116833 69354313 69037829 68429399 67230536 66182054 65994169 65934624 66756207
2802F6756207m05562L31645L53166K76679J237564n53396r75088Q38279N42576
$$ 66756207 66350645 66682290 67035456 67312135 68549699 67996303 67021215 67859494 68402070
2793F8402070j316920K187937J282003M13913n03477J22567J916096J284667K44340
$$ 68402070 67085150 69273087 70555090 70969003 70465526 70588093 72504189 73788856 74033196
2784G4033196J86551J024720j459283L31594O55546j8414J242073J04045P79546
$$ 74033196 74219747 75244467 73785184 74116778 74772324 74753910 75995983 76100028 76879574
2775G6879574l12472m78902j020525J295585m02181j534109l19289m28375J481154
$$ 76879574 76567102 76088200 75067675 76363260 75961079 74426970 74107681 73679306 75160460
2766G5160460j35509k07539J033629J350608P29776K0411p1888L15025p89856
$$ 75160460 75024951 74817412 75851041 77201649 77931425 77951836 77879948 78194973 77405117
2757G7405117Q12181J083654J028250J142706R41843J180112J157780J235990
$$ 77405117 78217298 79300952 80329202 81471908 82413751 83593863 84751643 85987633
2749H5987633J534434L71767K8648P81734O08392J389532m33357k54904J725879
$$ 85987633 87522067 87893834 87922482 88704216 89312608 90702140 90268783 90013879 91739758
2740I1739758J799738j71607j312573J348821k55748J282408p47658r11811m91829
$$ 91739758 93539496 93367889 92055316 93404137 93148389 94430797 93683139 92771328 92279499
2731I2279499P48161M10467l30389N98j241834P21266j962810j200148p17132
$$ 92279499 93027660 93438127 93107738 93108336 91866502 92587768 90624958 89424810 88707678
2722H8707678j498970r14320j280301j855922m11800J15163j071738k144786j320482
$$ 88707678 87208708 86294388 85014087 83158165 82746365 82861528 81789790 79645004 78324522
2713G8324522n7115J4652j725441N03876M50892j245963q10027q0013p26191o76946
$$ 78324522 78267407 78282059 76556618 77060494 77511386 76265423 75455396 75375383 74649192 73972246
2703G3972246J15662j20739l96809Q45413J270430K98630q13331L54136J743973
$$ 73972246 74087908 73967169 73570360 74415773 75686203 75984833 75171502 75525638 77269611
2694G7269611Q9120K05636J85800o51689q7031J480582J427907P70369j302295
$$ 77269611 77358731 77564367 77750167 77098478 77011447 78492029 79919936 80690305 79388010
2685G9388010l4196J085628K65745l14425M96194N51162R73274Q32099J399800
$$ 79388010 79353814 80439442 80705187 80390762 80886956 81438118 82411392 83243491 84643291
2676H4643291J134136N79296J965298K300614J573334K98543J178131J73423J723072
$$ 84643291 85777427 86356723 88322021 90622635 92195969 92494512 93672643 93846066 95569138
2667I5569138R15115J632255R62042J168809R38108M58591k02780l72357J522728
$$ 95569138 96484253 98116508 99078550 100247359 101185467 101644058 101441278 101068921 102591649
2658A02591649J028303J158396M48518K18495p84479L22086Q14872J095607M46889
$$ 102591649 103619952 104778348 105226866 105445361 104660882 104982968 105797840 106893447 107340336
2649A07340336l74533q91545J126249J111073J243793K85402r46965n520J395346
$$ 107340336 106965803 106074258 107200507 108311580 109555373 109840775 108893810 108888290 110283636
2640A10283636K477990m97094P03559N86897J388471j3774J015234J530364J08959
$$ 110283636 112761626 112264532 112968091 113554988 114943459 114929685 115944919 117475283 117584242
2631A17584242o95102m59754J077176j582115Q59084J826444O08102l77217j326012
$$ 117584242 116889140 116429386 117506562 115924447 116783531 118609975 119218077 118840860 117514848
2622A17514848j463930j25492l5301K26797J199708R06409R4379L19820J219039
$$ 117514848 116050918 115925426 115890125 116116922 117316630 118223039 118317418 118637238 119856277
2613A19856277M21903L60550J136664l50811r8896J05398l74327K459165K48889
$$ 119856277 120278180 120638730 121775394 121424583 121325687 121431085 121056758 123515923 123764812
2604A23764812K52373L371134J397909Q08164l10917o25716j527695m99644k57884
$$ 123764812 124017185 127388319 128786228 129594392 129283475 128657759 127130064 126630420 126372536
2595A26372536M95033L04144R40780K7498Q58464J765497N73323J548777J460917
$$ 126372536 126867569 127171713 128112493 128139991 128998455 130763952 131337275 132886052 134346969
2586A34346969j58192J98007R82176K04052p68868Q25613J989913K114228J971186
$$ 134346969 134188777 134386784 135368960 135573012 134804144 135629757 137619670 139733898 141705084
2577A41705084L231565L107837K232225J998828J468679L31219r85304j242481
$$ 141705084 144936649 148044486 150276711 152275539 153744218 154075437 153090133 151847652
2569A51847652k030190j29063o69214j641003m14363o90418J332230K068511r6247
$$ 151847652 149817462 149688399 149019185 147378182 146963819 146273401 147605631 149674142 149577895
2560A49577895J051346j38690K491447P57423N77421j6648J269155J174586j42711
$$ 149577895 150629241 150490551 152981998 153739421 154316842 154300194 155569349 156743935 156601224
2551A56601224L01197L24809O52582R44053K546514N74465j382919j69580o2329
$$ 156601224 156902421 157227230 157879812 158823865 161370379 161944844 160561925 160392345 160330016
2542A60330016j993336j213867j544614j911950j240555r36647k427476k761786
$$ 160330016 158336680 157122813 155578199 153666249 152425694 151489047 149061571 146299785
2534A46299785k69169R9218j136443j705080j259598j153768j483416k731790
$$ 146299785 146030616 146129834 144993391 143288311 142028713 140874945 139391529 136659739
2526A36659739r42824r79978k348772o6206p80125j876552m67863k147148j661796
$$ 136659739 135716915 134736937 132388165 132321959 131541834 129665282 129197419 127050271 125388475
2517A25388475k736557j276513j267955l92693j423476j817174o30169j19569
$$ 125388475 122651918 121375405 120107450 119714757 118291281 116474107 115843938 115724369
2509A15724369j572078j049850q48311k366876O4668r59261o51373j322135n89215
$$ 115724369 114152291 113102441 112254130 109887254 109951922 108992661 108341288 107019153 106429938
2500A06429938r80894j803221m64272j027578j516331l66422j443402j224081
$$ 106429938 105449044 103645823 103181551 102153973 100637642 100271220 98827818 97603737
2492I7603737q18639r85046P58291Q57888R34470m63737j918724q66505R84502
$$ 97603737 96785098 95800052 96558343 97416231 98350701 97886964 95968240 95101735 96086237
2483I6086237Q03504q42281J000786L00445J430565P61838j21219M52913J532411
$$ 96086237 96889741 96047460 97048246 97348691 98779256 99541094 99419875 99872788 101405199
2474A01405199J665861M66654O12386N85504M97306J175611N84330J324748R15734
$$ 101405199 103071060 103537714 104150100 104735604 105232910 106408521 106992851 108317599 109233333
2465A09233333M50876J203872K415611K428295P08901M37111P10263K41299p5478
$$ 109233333 109684209 110888081 113303692 115731987 116440888 116877999 117588262 117829561 117754083
2456A17754083j112105m60904R3444l7535o36421l13776L71578r50183r59362
$$ 117754083 116641978 116181074 116274518 116236983 115600562 115286786 115658364 114708181 113748819
2447A13748819j45806R04739l36768j40463n09269j565652L42422k194853j796186
$$ 113748819 113603013 114507752 114170984 114030521 113521252 111955600 112298022 110103169 108306983
2438A08306983M37591j41122j240687j626288j48180j017148k041595j152644
$$ 108306983 108744574 108603452 107362765 105736477 105588297 104571149 102529554 101376910
2430A01376910j873970p21734j173296l005177j532776n93608m38837k061406
$$ 101376910 99502940 98781206 97607910 94602733 93069957 92476349 92037512 89976106
2422H9976106j849802j230206r97445N60610j310816q85882o8011j033450q2205
$$ 89976106 88126304 86896098 85898653 86459263 85148447 84262565 84194554 83161104 83078899
2413H3078899m68332j023093p55780n69878k90644Q2550j27740p84417M56171
$$ 83078899 82610567 81587474 80831694 80261816 79971172 80053722 79925982 79141565 79597736
2404G9597736J042993J076655l90127j176147L71642M52964n4631l67234P50890
$$ 79597736 80640729 81717384 81327257 80151110 80522752 80975716 80921085 80553851 81304741
2395H1304741J623204l95239L55459J750300Q34443k184747M78293K893483l15007
$$ 81304741 82927945 82532706 82888165 84638465 85472908 83288161 83766454 86659937 86344930
2386H6344930L48667N64208J641064J697739J450305Q38319J337380M32509J8001
$$ 86344930 86693597 87257805 88898869 90596608 92046913 92885232 94222612 94655121 94673122
2377I4673122J204219J756927M69991j855554j401871O8873q59211j420331r67206
$$ 94673122 95877341 97634268 98104259 96248705 94846834 94915707 94056496 92636165 91668959
2368I1668959j242577q46563j16215j101932j516838k2322k22085p50422N36197
$$ 91668959 90426382 89579819 89463604 88361672 86844834 86822512 86600427 85850005 86386202
2359H6386202L92781j95439L57566J818839L12969p23997K72904J131183J106186
$$ 86386202 86778983 86583544 86941110 88759949 89072918 88348921 88621825 89753008 90859194
2350I0859194J915689M43892r17531L68883Q62307K51556J113021N11849j38380
$$ 90859194 92774883 93218775 92301244 92670127 93532434 93783990 94897011 95408860 95270480
2341I5270480j05106N55887J404114O03558l54211O52512J784938P76996R50662
$$ 95270480 95165374 95721261 97125375 97728933 97374722 98027234 99812172 100589168 101539830
2332A01539830L004042K959224o43156Q7156K045906m21843j261851J56998J066088
$$ 101539830 104543872 107503096 106859940 106947096 108993002 108571159 107309308 107466306 108532394
2323A08532394Q75251L16605K90774J611982J959434J304270K51225P7210K197665
$$ 108532394 109407645 109724250 110015024 111627006 113586440 114890710 115141935 115219145 117416810
2314A17416810j350616K71193k29384m23308K856452J178670j25112J567849L58799
$$ 117416810 116066194 116337387 116108003 115684695 118541147 119719817 119594705 121162554 121521353
2305A21521353J40972J141981J414149K490891J289804J379071Q42806L020431
$$ 121521353 121662325 122804306 124218455 126709346 127999150 129378221 130221027 133241458
2297A33241458J998710R56462Q19821J880588K766843J646673K438673K954776
$$ 133241458 135240168 136196630 137016451 138897039 141663882 143310555 145749228 148704004
2289A48704004L063461J034886J338680J536198K974618K596828L009450K255974
$$ 148704004 151767465 152802351 154141031 155677229 158651847 161248675 164258125 166514099
2281A66514099J773549Q52076J277362J932851J690517J460225O08548J870587
$$ 166514099 168287648 169139724 170417086 172349937 174040454 175500679 176109227 177979814
2273A77979814r3265J999684J628456L99552K84944K23111k93473J662388J685544
$$ 177979814 177886549 179886233 181514689 181914241 182199185 182422296 182128823 183791211 185476755
2264A85476755J136073N32814p3543O49786N93791M99018M26252M13528J191488
$$ 185476755 186612828 187145642 187072099 187721885 188315676 188814694 189240946 189654474 190845962
2255A90845962J20930O81358J205724m14920M54606J488470r13366O58814J576583
$$ 190845962 190966892 191648250 192853974 192439054 192893660 194382130 193468764 194127578 195704161
2246A95704161J344760M36770N12290P11612J414599J71397K279493K606000J74747
$$ 195704161 197048921 197485691 197997981 198709593 200124192 200295589 202575082 205181082 205355829
2237B05355829J602590m5504J700955N12010N15768K55976J742849J484966J377435
$$ 205355829 206958419 206912915 208613870 209125880 209641648 209897624 211640473 213125439 214502874
2228B14502874r67012n94071R20761N3903K92986o54402K74973o96531l86926
$$ 214502874 213535862 212941791 213862552 213916455 214209441 213555039 213830012 213133481 212746555
2219B12746555L85411j58773j25141Q19089k18055j692053m77361m68292l68612
$$ 212746555 213131966 212973193 212848052 213667141 213449086 211757033 211279672 210811380 210442768
2210B10442768n87111j126013j005089Q77436j12449r43025L3276J175545n32112
$$ 210442768 209855657 208729644 207724555 208601991 208489542 207546517 207579793 208755338 208223226
2201B08223226J735688M67109j34834J81021J013814K973976J538139K280150
$$ 208223226 209958914 210426023 210291189 210472210 211486024 214460000 215998139 218278289
2193B18278289J828412K639023K655245j35616l431253m765204n886457l964519
$$ 218278289 220106701 222745724 225400969 225265353 221834100 217068896 211182439 207217920
2185B07217920l641458l122776k658055j153799j99002p74671j358929j837152
$$ 207217920 203576462 200453686 197795631 196641832 196442830 195668159 194309230 192472078
2177A92472078k936q7859L52567j191686j029901k441396k093038j401748j208317
$$ 192472078 192469142 192381283 192733850 191542164 190512263 188070867 185977829 184576081 183367764
2168A83367764l203467l276384j281709L49219q63333R80438J749403J787978
$$ 183367764 180164297 176887913 175606204 175955423 175092090 176072528 177821931 179609909
2160A79609909L995036M675962M265290K686794j327141n508464j0049432j0926145
$$ 179609909 183604945 188280907 192546197 195232991 193905850 188397386 178347954 167421809
2152A67421809n647356n253738k942587k700633k280007j301459j326626l08775
$$ 167421809 161774453 156520715 153578128 150877495 148597488 147296029 145969403 145660628
2144A45660628J331998K979669L140481K180634K231011P48319k375632l309087
$$ 145660628 146992626 149972295 153112776 155293410 157524421 158272740 155897108 152588021
2136A52588021m776038n247908k733735j997672j295668j800074m17945P47406
$$ 152588021 147811983 142564075 139830340 137832668 136537000 134736926 134318981 135066387
2128A35066387J882612K280533L528553J705167Q63442K500052M85729j717147
$$ 135066387 136948999 139229532 142758085 144463252 145326694 147826746 148312475 146595328
2120A46595328m791969l130114k672506j367346j358986j490965J48604O08282
$$ 146595328 141803359 138673245 136000739 134633393 133274407 131783442 131932046 132540328
2112A32540328J136415J606796Q13014k18239l31032q4186Q44487k03747r01462
$$ 132540328 133676743 135283539 136096553 135878314 135547282 135463096 136307583 136103836 135202374
2103A35202374J682037L30350m15360R89686j44644J979751o12658P85283j79074
$$ 135202374 136884411 137214761 136799401 137789087 137644443 139624194 139011536 139796819 139617745
2094A39617745J393457J566858J615064j72411J029239R4535l25170n61729r37207
$$ 139617745 141011202 142578060 144193124 144020713 145049952 145144487 144819317 144257588 143320381
2085A43320381n47491q29941M9137N03899m30128j377897j255842j023673l99851
$$ 143320381 142772890 141942949 141992086 142495985 142065857 140687960 139432118 138408445 138008594
2076A38008594j527035j676274j815714k162037j424779J43839j914596r76569
$$ 138008594 136481559 134805285 132989571 130827534 129402755 129546594 127631998 126655429
2068A26655429j145937j555903k872284j971114J278341j042920j389238p37223
$$ 126655429 125509492 123953589 121081305 119110191 120388532 119345612 117956374 117219151
2060A17219151J95840p55482Q46720l97225P0137J884537n66005J148359J944782
$$ 117219151 117414991 116659509 117506229 117109004 117179141 119063678 118497673 119646032 121590814
2051A21590814Q52158l58577K212210L14707J41415M43931N2688j87253p94745
$$ 121590814 122442972 122084395 124296605 124611312 124752727 125196658 125249346 125062093 124267348
2042A24267348m95101j340064j916941j283280n64065j559242j220206k593176
$$ 124267348 123772247 122432183 120515242 119231962 118667897 117108655 115888449 113295273
2034A13295273k781118j463190o48396j851178k966117j733887j501275n42719
$$ 113295273 110514155 109050965 108402569 106551391 103585274 101851387 100350112 99807393
2026I9807393j05514j036535j168670j361152j336467n30817j760072k051638
$$ 99807393 99701879 98665344 97496674 96135522 94799055 94268238 92508166 90456528
2018I0456528j246902n87711j008658j161264k100004j216940p53629k021475
$$ 90456528 89209626 88621915 87613257 86451993 84351989 83135049 82381420 80359945
2010H0359945k608075j41804r17594j092798j560003j393875j343400p14773O0256
$$ 80359945 77751870 77610066 76692472 75599674 74039671 72645796 71302396 70587623 70647879
2001G0647879K96549k256059n98511l51756r10693j274765j858446n05740j475222
$$ 70647879 70944428 68688369 68089858 67738102 66827409 65552644 63694198 63188458 61713236
1992F1713236j199008M83260j586436k00305j185312j801496j507246p41455j570053
$$ 61713236 60514228 60997488 59411052 59210747 58025435 56223939 54716693 53975238 52405185
1983E2405185k177304R3998q24289k135369P92716O38342o60120o37115j276728
$$ 52405185 50227881 50321879 49497590 47362221 48154937 48793279 48133159 47496044 46219316
1974D6219316n01861j072688o14602k91211p95580J7978q15190j023599J113909
$$ 46219316 45717455 44644767 44030165 43738954 42943374 42961352 42146162 41122563 42236472
1965D2236472P27044K74195j088869j50555j091421r1506j415474N28067r45742
$$ 42236472 42963516 43237711 42148842 41998287 40906866 40815360 39399886 39927953 38982211
1956C8982211P7506p17149o6649J096390R02237k74482j371515j82507L83115
$$ 38982211 39059717 38342568 38275919 39372309 40274546 40000064 38628549 38446042 38829157
1947C8829157K15030r12732j58021L60429o05048J0368J5510q46680J15991p59290
$$ 38829157 39044187 38131455 37973434 38333863 37728815 37739183 37754693 36908013 37024004 36264714
1937C6264714P47113J122271R84119m88369R67876j990542j165743J559221j72850
$$ 36264714 37011827 38134098 39118217 38629848 39597724 37607182 36441439 38000660 37827810
1928C7827810m57119P21189O1612J52257Q41767m88882J083429L13099P70866
$$ 37827810 37370691 38091880 38153492 38305749 39147516 38658634 39742063 40055162 40826028
1919D0826028r81779j34791J230820J626884J402225M46132M23231K38816j047477
$$ 40826028 39844249 39709458 40940278 42567162 43969387 44415519 44838750 45077566 44030089
1910D4030089r40779q1226k99322O56748Q37919Q59220l3337R94923M46351j50961
$$ 44030089 43089310 43008084 42708762 43365510 44203429 45062649 45029312 46024235 46470586 46319625
1900D6319625R76970J460855K62466R31496O18158J323069l39111n60668n57102
$$ 46319625 47296595 48757450 49019916 49951412 50569570 51892639 51553528 50992860 50435758
1891E0435758j03182J250137J337686J390594O31936R65243L03989R30490P40669
$$ 50435758 50332576 51582713 52920399 54310993 54942929 55908172 56212161 57142651 57883320
1882E7883320J659784N8377J758636R11732k27912P99358K309323J776209L83631
$$ 57883320 59543104 59601481 61360117 62271849 62043937 62843295 65152618 66928827 67312458
1873F7312458J342364K41714J793168J731466J017288K939947J440425K375690
$$ 67312458 68654822 68896536 70689704 72421170 73438458 76378405 77818830 80194520
1865H0194520K012250J863153K282394K447373J851317L928173L298243J071418
$$ 80194520 82206770 84069923 86352317 88799690 90651007 94579180 97877423 98948841
1857I8948841J102051K072941L106268N247722L845961J664328K087289K275504
$$ 98948841 100050892 102123833 105230101 110477823 114323784 115988112 118075401 120350905
1849A20350905K665522R61438K045566K534905O02072K703779L48481J671105
$$ 120350905 123016427 123977865 126023431 128558336 129160408 131864187 132212668 133883773
1841A33883773K901908J619642J236587K703718L127993K204723K469869K880940
$$ 133883773 136785681 138405323 139641910 142345628 145473621 147678344 150148213 153029153
1833A53029153M208231K921999L576523L217858N225026N419564M729826N071273
$$ 153029153 157237384 160159383 163735906 166953764 172178790 177598354 182328180 187399453
1825A87399453N455579N330032P484110Q867084P115553Q113499R651550J1523201
$$ 187399453 192855032 198185064 205669174 214536258 221651811 229765310 239416860 250940061
1817B50940061Q465269Q403324R259807Q082570P435212L290976J57939k306872
$$ 250940061 259405330 267808654 277068461 285151031 292586243 295877219 296035158 293728286
1809B93728286k896273l071098k522722l221339k754287k523578r71693o05168
$$ 293728286 290832013 287760915 285238193 282016854 279262567 276738989 275767296 275162128
1801B75162128J406104L327145L220390K534587M213119M695930P626016O051924
$$ 275162128 276568232 279895377 283115767 285650354 289863473 294559403 302185419 308237343
1793C08237343P648211Q617045J0282720R234313J1463090J2668173R267094J1044912
$$ 308237343 315885554 324502599 334785319 344019632 355482722 368150895 377417989 388462901
1785C88462901Q132851N962857M193381J619503k556157n111133o137322p172898
$$ 388462901 396595752 402558609 406751990 408371493 405815336 400704203 394566881 387393983
1777C87393983r658023n674184o621168q151287q910672q994949p751985n822805
$$ 387393983 377735960 372061776 365440608 357289321 348378649 339383700 331631715 325808910
1769C25808910k595525m454138k619128j893106j716181J777633L039867J810068
$$ 325808910 323213385 318759247 316140119 314247013 312530832 314308465 317348332 319158400
1761C19158400L227202L360184P162999O388483O929221N802371M979733K169865
$$ 319158400 322385602 325745786 332908785 339297268 346226489 352028860 357008593 359178458
1753C59178458j146191n571867p929080q442642q989035j0568138r625440p501731
$$ 359178458 358032267 352460400 344531320 336088678 327099643 316531505 306906065 299404334
1745B99404334o396839l137841m721957m462797k439326n114813o826886q589456
$$ 299404334 293007495 289869654 285147697 280684900 278245574 273130761 266303875 257714419
1737B57714419j0949830r038287q624932q616746n154257n793086o356362l399253
$$ 257714419 246764589 237726302 229101370 220484624 215330367 209537281 203180919 199781666
1729A99781666j967863p42521j399564j760693l074526l643725o202908o998060
$$ 199781666 197813803 197071282 195671718 193911025 190836499 187192774 180989866 173991806
1721A73991806r266090o705959p717969o494779m688027m307001n297407m443504
$$ 173991806 164725716 158019757 150301788 143807009 139118982 134811981 129514574 125071070
1713A25071070l517886m285679l485479k382374l367707k777268k778448j543134
$$ 125071070 121553184 117267505 113782026 111399652 108031945 105254677 102476229 100933095
1705A00933095p94665l954520l638194j532403j790749k603068k390323j274669
$$ 100933095 100138430 96183910 92545716 91013313 89222564 86619496 84229173 82954504
1697H2954504j140811r04081L98714k379940k787572j879170j029544q10972k502430
$$ 82954504 81813693 80909612 81308326 78928386 76140814 74261644 73232100 72421128 69918698
1688F9918698k596928n75506j525328q01468j305186j822052k150699m09616J64870
$$ 69918698 67321770 66746264 65220936 64419468 63114282 61292230 59141531 58731915 58896785
1679E8896785j369714j878349j933308l46577N79671k423848j604475k94352q82845
$$ 58896785 57527071 55648722 53715414 53368837 53948508 51524660 49920185 49625833 48742988
1670D8742988j635638J26975Q37197n79494j07224j596775P1732j083151m98806
$$ 48742988 47107350 47234325 48071522 47492028 47384804 45788029 45859761 44776610 44277804
1661D4277804j010560O1268j120444j349850j384483L60044j375760J64412l94507
$$ 44277804 43267244 43328512 42208068 40858218 39473735 39833779 38458019 38622431 38227924
1652C8227924k177643r72809k77508J142266l86937J31353k4008r51325j194749
$$ 38227924 36050281 35077472 34799964 35942230 35555293 35686646 35662638 34711313 33516564
1643C3516564j233766j128506P91237M66722k436796j59051J013330P24457k208658
$$ 33516564 32282798 31154292 31945529 32412251 29975455 29816404 30829734 31554191 29345533
1634B9345533j196708o90350L62154P67737q26916j22983j00471J75951N95706
$$ 29345533 28148825 27458475 27820629 28588366 27761450 27638467 27537996 27713947 28309653
1625B8309653r15069k35618j086050o25215O66525j658205j178626j32892O67652
$$ 28309653 27394584 27158966 26072916 25447701 26114226 24456021 23277395 23144503 23812155
1616B3812155K43133L96873o75771r86912m16146j09481m54300K47600r92763
$$ 23812155 24055288 24452161 23776390 22789478 22373332 22263851 21809551 22057151 21064388
1607B1064388J31953L87805P01650k000589j78087j72244R06421j644553j829435
$$ 21064388 21196341 21584146 22285796 20285207 20107120 19934876 20841297 19196744 17367309
1598A7367309K21418O60713J248896p13107J190556M88034j758483j482166N14439
$$ 17367309 17588727 18249440 19498336 18785229 19975785 20463819 18705336 17223170 17737609
1589A7737609M25593q00119M79335n45118j359354m91496L32341k98570L6407
$$ 17737609 18163202 17363083 17842418 17297300 15937946 15446450 15778791 15480221 15516628
1580A5516628n09418j29105P95000j019190r95047J515660L79798p17956O38647
$$ 15516628 15007210 14878105 15673105 14653915 13658868 15174528 15554326 14836370 15475017
1571A5475017l87684Q3807p09825N88340N63345o77853K69848L54685j027784
$$ 15475017 15087333 15171140 14461315 15049655 15613000 14935147 15204995 15559680 14531896
1562A4531896N8984j246272K02768M54584k292662J708059m55760r09690P51707
$$ 14531896 14590880 13344608 13547376 14001960 11709298 13417357 12961597 12051907 12803614
1553A2803614l96767P08333O6895j088042j03000R99602k39494J12186j17270
$$ 12803614 12406847 13115180 13182075 12094033 11991033 12990635 12751141 12863327 12746057
1544A2746057j655983P81255P22776k81074j689052J12749J24254J247763J44299
$$ 12746057 11090074 11871329 12594105 12313031 10623979 10736728 10860982 12108745 12253044
1535A2253044l66082j335074M9489J017550J094242l76932j003319n48492M95893
$$ 12253044 11886962 10551888 10601377 11618927 12713169 12336237 11332918 10784426 11280319
1526A1280319j53358P23127K84343p30796Q73425L67652j70695m32409m71197
$$ 11280319 11126961 11850088 12134431 11403635 12277060 12644712 12474017 12041608 11570411
1517A1570411p44782R34396j33621j92471J07778J239399L57856j128933j418440
$$ 11570411 10825629 11760025 11626404 11433933 11541711 12781110 13138966 12010033 10591593
1508A0591593q18169l67978O82868m86437m51927O17767J783400N8021j092142
$$ 10591593 9773424 9405446 10088314 9601877 9149950 9767717 11551117 11609138 10516996
1499A0516996N0265O85770k117117m43837k60971M66363P22077J88116q21108
$$ 10516996 10567261 11253031 9135914 8692077 8431106 8897469 9619546 9807662 8986554
1490H986554L44317n81657R58655j59316j97841J560144l59546p72799r05519
$$ 8986554 9330871 8749214 9707869 9548553 9350712 10910856 10551310 9778511 8872992
1481H872992M78716j75763k88231k49449N08597N65654r39293k24539L58231R39078
$$ 8872992 9351708 9175945 8887714 8638265 9146862 9712516 8773223 8548684 8906915 9845993
1471I845993j712093p42740J248924R46810q22112k68737J66484p1245N42139
$$ 9845993 8133900 7391160 8640084 9586894 8764782 8496045 8662529 8591284 9133423
1462I133423J39134j57636j395497n18295k45944J090425P6550j076226j69191
$$ 9133423 9272557 9114921 7719424 7201129 6955185 8045610 8122160 7045934 6876743
1453F876743J505130J059265o3033j962114l81021P25293M65304j2556P58286
$$ 6876743 8381873 9441138 9378105 7415991 7034970 7760263 8225567 8213011 8971297
1444H971297r58175l21469n97787j300026R17249J339728K75802n18381m26620
$$ 8971297 8013122 7691653 7093866 5793840 6711089 8050817 8326619 7808238 7381618
1435G381618l81538m64488J746l44031J89529J002534l10886j516403M77125Q96955
$$ 7381618 7000080 6535592 6537338 6193307 6382836 7385370 7074484 5558081 6035206 6932161
1425F932161r8667j461343Q1343j61024L6336R85074K97607j047655j140093J120801
$$ 6932161 6833494 5372151 5453494 5292470 5328806 6313880 6611487 5563832 4423739 5544540
1415E544540j936J137167j242724o60726M01461J15675K72920L1507Q32656J007544
$$ 5544540 5542604 6679771 5437047 4776321 5177782 5293457 5566377 5597884 6430540 7438084
1405G438084j142557p13175j538709L72909j0076O50024R04548L65390P02549
$$ 7438084 6295527 5582352 4043643 4416552 4406476 5056500 5961048 6326438 7028987
1396G028987j6027m53177j55192R43050r16803k322990P86218K221877n14475
$$ 7028987 7012960 6559783 6404591 7347641 6430838 4107848 4894066 7115943 6601468
1387F601468q98868n81635R311N08894P90367r11145l88201J007473j48932L09837
$$ 6601468 5702600 5120965 5130276 5639170 6429537 5518392 5130191 6137664 5988732 6298569
1377F298569L04602j509404k88714n41004J119481r71047l76592J163256m72363
$$ 6298569 6603171 5093767 4805053 4264049 5383530 4412483 4035891 5199147 4726784
1368D726784K82767l36874K026443m60665k00845q86096l74980m04630o91595
$$ 4726784 5009551 4672677 6699120 6238455 6037610 5151514 4776534 4371904 3680309
1359C680309o42667M84663j42872l33630K245373j336030R225J011271l14272
$$ 3680309 3037642 3522305 3379433 3045803 5291176 3955146 3964371 4975642 4661370
1350D661370j28106L66044K8490J107045j088321q38941R31020M39149p01914
$$ 4661370 4533264 4899308 4927798 6034843 4946522 4107581 5038601 5477750 4775836
1341D775836j162212K15652M0165r78246N06979j474846j86640K13831J20301
$$ 4775836 3613624 3829276 3869441 2891195 3398174 1923328 1736688 1950519 2070820
1332B070820K245550o8033j553193K50070m43746O31989k50216o01537J566256
$$ 2070820 4316370 4248337 2695144 2945214 2501468 3133457 2883241 2281704 3847960
1323C847960R99j64241k88781k04544L60943O87556o53728m08303m94073k53141
$$ 3847960 3848959 3684718 3395937 3191393 3552336 4239892 3586164 3177861 2683788 2430647
1313B430647J463870J343394K06099k091302k79436K03766p20454J570452l6980
$$ 2430647 3894517 5237911 5444010 3352708 3073272 3277038 2556584 4127036 4090056
1304D090056j887973J927434K64550j159916Q50411n4161m95577n31009P77980
$$ 4090056 2202083 4129517 4394067 3234151 4084562 4030401 3534824 3003815 3781795
1295C781795O8891j346158R07943P30180j335210j77629K99203Q24725J72852
$$ 3781795 3850686 2504528 3412471 4142651 2807441 2629812 2929015 3753740 3926592
1286C926592j585067P32181J27980o99547j148249M29856m5394L72412J121452
$$ 3926592 2341525 3073706 3201686 2502139 1353890 1783746 1738352 2110764 3232216
1277C232216J119015k31288p62268k95057K09432L66127N195q95947K33319J332731
$$ 3232216 4351231 4119943 3357675 3062618 3272050 3638177 3643372 2747425 2980744 4313475
1267D313475j91209j20817J265844N81895J48134j164599j92984n91778O71266
$$ 4313475 4122266 4001449 5267293 5849188 5997322 4832723 4639739 4047961 4719227
1258D719227P51268n35856O01166k68344J95022r2337J24159K0129j567461j348623
$$ 4719227 5470495 4934639 5535805 5267461 5462483 5370146 5494305 5514434 3946973 2598350
1248B598350P16921J52375J288290J47376K05470J32963m42621k53170j336927
$$ 2598350 3315271 3467646 4755936 4903312 5108782 5241745 4799124 4545954 3209027
1239C209027r57509O08946M74817J350265q98732n14303q1368L98573m24417J490775
$$ 3209027 2251518 2860464 3335281 4685546 3786814 3272511 3191143 3589716 3165299 4656074
1229D656074k054470o63901J159223O49043j15780k230039o46657J750956J004450
$$ 4656074 2601604 1937703 3096926 3745969 3630189 1400150 753493 2504449 3508899
1220C508899K00202m29238Q89072n10650M10890o06607k45358p00140J84153l64211
$$ 3508899 3709101 3279863 4168935 3658285 4069175 3462568 3217210 2517070 2701223 2337012
1210B337012J7389J1298j353496L35191L55661K8968L17258J462531L3947j702531
$$ 2337012 2354401 2365699 1012203 1347394 1703055 1732023 2049281 3511812 3545759 1843228
1200A843228l06970J573926m79831Q71274j376682J359661q11211O6465R76153
$$ 1843228 1536258 3110184 2630353 3501627 2124945 3484606 2673395 2739860 3716013
1191C716013o50851K84389j67097o6628p40383m36192Q82887J977134J60461o40680
$$ 3716013 3065162 3349551 3182454 3115826 2375443 1939251 2822138 4799272 4959733 4319053
1181D319053p21040j246513k51922O72973q62009J80296p81965J149901Q01952
$$ 4319053 3598013 2351500 2099578 2772551 1910542 2090838 1308873 2458774 3260726
1172C260726n60679m63412J100653Q19093l10695p02316k90944l201k590072J296754
$$ 3260726 2700047 2236635 3337288 4156381 3845686 3143370 2852426 2849225 259153 1555907
1162A555907r62622Q38233R37935j094503J581182q1812o35055J033434n22550
$$ 1555907 593285 1431518 2369453 1274950 2856132 2774320 2139265 3172699 2650149
1153B650149p08939k8294l10412N56925j88779N28077K11310l91984q2506J72335
$$ 2650149 1941210 1912916 1602504 2159429 1970650 2498727 2710037 2318053 2235547 2407882
1143B407882m44677J22224L38315k41800K753M68014Q92956N29256K65645r74934
$$ 2407882 1963205 2085429 2423744 2181944 2184697 2652711 3545667 4074923 4340568 3365634
1133C365634o97085j3643J478872n33461o69901M1947n57635N59534j064282j600730
$$ 3365634 2668549 2654906 4133778 3600317 2930416 2972363 2414728 2974262 1909980 309250
1123C09250J321799P87340o34884P13936K154602k92972m041J13664O02124r0076
$$ 309250 1631049 2418389 1783505 2497441 4652043 4359071 4355030 4468694 5070818 4980742
1113D980742L88623k56115J173063K14519j287221J883613J003248r06512n75135
$$ 4980742 5369365 5113250 6286313 6500832 5213611 7097224 8100472 7193960 6618825
1104F618825J428633Q8479j703451R33591o21517j990466l39701O19363P8519
$$ 6618825 8047458 8135937 6432486 7366077 6744560 4754094 4414393 5033756 5112275
1095E112275J329536j93630J40159O48888k365j453740j498838J914009N85497
$$ 5112275 6441811 6248181 6388340 7037228 7034863 5581123 4082285 5996294 6581791
1086F581791j484077J114944O56172k18240o80158r59784l7217k75155q42387
$$ 6581791 5097714 6212658 6868830 6650590 5970432 5010648 4973431 4698276 3855889
1077C855889o653k4013p58520J020532P85832o13379J495435p75216k19067N12904
$$ 3855889 3849236 3825223 3066703 4087235 4873067 4259688 5755123 4979907 4760840 5273744
1067E273744n01868J584078k07055N7602O65604q40044L82953J182855k8849j2279
$$ 5273744 4771876 6355954 6148899 6206501 6872105 6032061 6415014 7597869 7569020 7556741
1057G556741p68747p98358J433285m93287L37849R20829l99371M08559R24564
$$ 7556741 6787994 5989636 7422921 6929634 7267483 8188312 7788941 8197500 9122064
1048I122064Q85614j799371K62691O08363J00883m07937J279377r59068J398816
$$ 9122064 10007678 8208307 8470998 9079361 9180244 8772307 10051684 9092616 10491432
1039A0491432J84263j037234k28014r00412k14394Q8905m83271K046924q18556
$$ 10491432 10675695 9638461 9410447 8510035 8295641 8384546 7901275 9948199 9129643
1030I129643m99552J722022q12317L45315K86929M00823Q9500K16617P47614J13481
$$ 9129643 8630091 10352113 9539796 9885111 10172040 10572863 10662363 10878980 11626594 11740075
1020A1740075k09268J250490r2328m29268Q15517r31561J335187L73773R31230
$$ 11740075 11530807 12781297 12688969 12259701 13075218 12143657 13478844 13852617 14783847
1011A4783847p85733j025751Q79689K29880l05225J274418Q60819J15296J110365
$$ 14783847 13998114 12972363 13852052 14081932 13776707 15051125 15911944 16027240 17137605
1002A7137605K217628J075185l31008L965K574291J851365J972670n09820J398342
$$ 17137605 19355233 20430418 20099410 20103375 22677666 24529031 26501701 25991881 27390223
993B7390223O63133Q9881K830729J688348K312810K222570L181593K854634K546343
$$ 27390223 28053356 28143237 30973966 32662314 34975124 37197694 40379287 43233921 45780264
984D5780264K89842J693911K935098K840591M817506M336123N767126O575192
$$ 45780264 46070106 47764017 50699115 53539706 58357212 62693335 68460461 75035653
976G5035653R345254N693088M904950L697571P918400P774566J2236183J5702820
$$ 75035653 84380907 90073995 94978945 98676516 106594916 114369482 126605665 142308485
968A42308485J9337454K6859971L3822005M5960723M7441831N2139837N3753840
$$ 142308485 161645939 188505910 222327915 268288638 315730469 367870306 421624146
961D21624146M7858777L7765751l2354382j10038063q3530679n0837842l5419822
$$ 421624146 469482923 507248674 474894292 364856229 281325550 230487708 195067886
954A95067886k4752351k0316248j7494801j4058749j0708900q108256p407257
$$ 195067886 170315535 149999287 132504486 118445737 107736837 99628581 92221324
947I2221324o489013o054885m436292k565589n347571n820112m747553n972132
$$ 92221324 85732311 79677426 75241134 72675545 67327974 61507862 56760309 50788177
939E0788177l074161k533488l971320k129206k276787k31496j176687m48309j91440
$$ 50788177 47714016 45180528 41209208 39080002 36803215 36571719 35395032 34946723 34755283
930C4755283k287521l18217l82254j277419j725749j110173k310605k20771m90263
$$ 34755283 32467762 32149545 31767291 30489872 28764123 27653950 25343345 25122574 24632311
921B4632311J98574o88281Q34780j941671n3873L88778j708398j046022l69954
$$ 24632311 24830885 24142604 24977384 23035713 22981840 23370618 21662220 20616198 20246244
912B0246244m78968n18737m83895j192022o87794j179770J315468j154749J87045
$$ 20246244 19767276 19248539 18764644 17572622 16884828 15705058 17020526 15865777 16052822
903A6052822J11359N80966j388081J44932K90573j519640J78499j927943Q00772
$$ 16052822 16164181 16745147 15357066 15501998 15792571 14272931 14451430 12523487 13324259
894A3324259n6802k37254N11646n57562q12747j090584K0107q60391K66438M22851
$$ 13324259 13267457 13030203 13541849 12984287 12171540 11080956 11101063 10240672 10507110 10929961
884A0929961K82947r25886M25614L14612j188636j57219n5408j263345O98689
$$ 10929961 11212908 10287022 10712636 11027248 9838612 9681393 9625985 8362640 9061329
875I061329l71402J16308J064650j313318j012496M12218k94256L6379M3630p27880
$$ 9061329 8689927 8806235 9870885 8557567 7545071 7957289 7663033 7699412 7743042 7015162
865G015162j876488R13974J132823m70133j548209R5836k10628J075408k45696
$$ 7015162 5138674 6052648 7185471 6715338 5167129 5262965 5052337 6127745 5882049
856E882049P4926j50946l68470J121861n74056j154951M57034K75625p82909N54107
$$ 5882049 5956975 5806029 5437559 6559420 5985364 4830413 5287447 5563072 4780163 5334270
846E334270l82435M73471j72586m41208j48893j331369J148707P59586k60809
$$ 5334270 4951835 5425306 5252720 4811512 4662619 3331250 4479957 5239543 4978734
837D978734j277346j55348J83330N32973m62051N69828J82975j20722N84897n67333
$$ 4978734 3701388 3546040 3729370 4262343 3800292 4370120 4553095 4432373 5017270 4449937
827D449937o42899n80349J123266n3215k35126l73733K37870j271674k75370K91960
$$ 4449937 3807038 3226689 4349955 4296740 4061614 3687881 3925751 2654077 2378707 2670667
817B670667m65114O5295q04705M79099M494l45619O67140J25097k832L18851o91189
$$ 2670667 2205553 2270848 1466143 1945242 1949736 1604117 2271257 2396354 2393522 2712373 2021184
806B021184J5486Q38809Q49237R06541k10807o62034q15548K82801O68102q48492
$$ 2021184 2036670 2875479 3724716 4631257 4420450 3758416 2942868 3225669 3893771 3045279
796C045279j41929r03509M53636R6124k514188O80927K144172K48588j0474m42621
$$ 3045279 2903350 1999841 2453477 2549601 35413 716340 2860512 3109100 3098626 2656005
786B656005j293825K42799P17269J037403k88604L66220o56355K02588j74265
$$ 2656005 1362180 1604979 2322248 3359651 3071047 3437267 2780912 2983500 2809235
777B809235L35501p06293K47393j183664n97913l79548Q50346P25499L18824N0120
$$ 2809235 3144736 2438443 2685836 1502172 904259 524711 1375057 2100556 2419380 2469500
767B469500j011740l53291M60038l29241L39178Q46395n14874q52870m91451Q77440
$$ 2469500 1457760 1104469 1564507 1235266 1574444 2420839 1905965 1053095 561644 1439084
757A439084J497909o33264J27485k31831p11666K008564P1185j312235N03698
$$ 1439084 2936993 2303729 2431214 2199383 1487717 3496281 3567466 2255231 2758929
748B758929N54105j687000Q10229k7904n35418j36548j35767r36655K41353o88069
$$ 2758929 3313034 1626034 2436263 2408359 1872941 1736393 1600626 663971 905324 217255
738B17255k01573J198863K31973K35596J160960j028560o96360k15077M09178
$$ 217255 15682 1214545 1446518 1682114 2843074 1814514 1118154 903077 1312255
729A312255L92565K58934o01577K38196l19847j79741O35338P11164k159207N26047
$$ 1312255 1704820 1963754 1362177 1600373 1280526 1100785 1736123 2447287 288080 814127
719H14127M03232j198385O80342K10888k37569Q32545J31011p78345K49551L08734
$$ 814127 1217359 18974 699316 910204 672635 1505180 1636191 857846 1107397 1416131
709A416131l15521n75288O32252L39638O91423j231845n49082J331151M54480
$$ 1416131 1100610 525322 1157574 1497212 2188635 956790 407708 1738859 2193339
700B193339q42551j586000M04777J725412n863l23603J115189L45379j870041
$$ 2193339 1350788 -235212 169565 1894977 1889114 1565511 2680700 3026079 1156038
691A156038j007412K24729Q96449J22580J89980j93771N12722j822756J284093
$$ 1156038 148626 373355 1269804 1392384 1582364 1388593 1901315 78559 1362652
682A362652J021002k57864Q8194J61967n650O5390M99370O01309k36506j273249
$$ 1362652 2383654 2125790 2213984 2375951 2370301 2435691 2935061 3536370 3299864 2026615
672B026615n57696L34186J019241k49640q97036J27869J056780n6214j295920
$$ 2026615 1468919 1803105 2822346 2572706 1675670 1803539 2860319 2804105 1508185
663A508185j90238n55583M63383L58814j768037l34057J329659J0110p80561r57322
$$ 1508185 1317947 762364 1225747 1584561 -183476 -517533 812126 822236 41675 -915647
653i15647P59781K382089o48534k051445R00190j03123q49o27545o99810n6352
$$ -915647 -155866 2226223 1577689 -473756 426434 323311 322462 -305083 -1004893 -1061245
643a061245M07122K24662k62477P41042k43173K55515Q4968j99563o89414n04279
$$ -1061245 -654123 -429461 -691938 49104 -194069 61446 146414 -53149 -742563 -1246842
633a246842k44934O62599J848468j36847j615607K85953n86602P73286O84468
$$ -1246842 -1491776 -829177 1019291 882444 -733163 -447210 -1033812 -260526 423942
624D23942r38227K7333R12262O73254J3771K7583r4030p24468j039410K33861
$$ 423942 -514285 -486952 425310 1098564 1112335 1139918 1045888 321420 -717990 -484129
614d84129J651469p1703m09749j67317M78556k048004M23470m0926P86886M46092
$$ -484129 1167340 1095637 685888 518571 997127 -1050877 -627407 -668333 118553 564645
604E64645p4621J563363j72860j610224o91768J491535n82574m15367m77270L21454
$$ 564645 490024 2053387 1880527 270303 -421465 1070070 487496 72129 -405141 -83687
594h3687o8871N29536q0354o43865l1128l32600J32769Q5698M29141m77904m8894
$$ -83687 -152558 376978 296624 -347241 -378369 -710969 -578200 -492502 -63361 -541265 -590159
583e90159n16947r9936J228372M48502m61092p4560N30960j008170O29080J92636
$$ -590159 -1107106 -1207042 21330 469832 8740 -65820 465140 -543030 86050 278686
573B78686j50422m1741K8766k16023K47150Q285L5348J588166o29847j264553
$$ 278686 128264 86523 115289 -100734 146416 154701 190049 1778215 1148368 -116185
563a16185q83979o01996J109608P92338j069414Q49335j69430j61909L80257j230138
$$ -116185 -1000164 -1602160 -492552 299786 -769628 79707 -89723 -251632 128625 -1101513
553a101513N36547l84230q46443r2504P21695L28061O96J100125k44393R31615
$$ -1101513 -564966 -949196 -1795639 -1888143 -1166448 -838387 -837691 262434 18041 949656
543I49656n33250j725680J000561J031029o10458o75598p18730N66323J472523
$$ 949656 416406 -1309274 -308713 722316 111858 -563740 -1282470 -716147 756376
534G56376o04301R779k62688O35054J79441o01827L67133r70834j123033P86747
$$ 756376 152075 161854 -100834 534220 713661 111834 478967 -491867 -1614900 -828153
524h28153J796801o46829p56318j064174J010772l94528l09362k93087M5646M09927
$$ -828153 968648 321819 -434499 -1498673 -487901 -882429 -1191791 -1484878 -1439232 -1029305
514a029305O84468l84038j341374K62577J52108J427496J52914P35802o39190
$$ -1029305 -344837 -728875 -2070249 -1807672 -1655564 -228068 -75154 660648 21458
505B1458k67875l89549j165548J05053p8091p3774K20287o46248K67898M19870
$$ 21458 -246417 -635966 -1801514 -1696461 -1774552 -1848326 -1628039 -2274287 -2006389 -1586519
495a586519M29275J562439p85597M51638m90771k842719J480904R11073K5584
$$ -1586519 -1157244 405195 -380402 71236 -419535 -3262254 -1781350 -870277 -844693
486h44693l48359p62225J75216j6375o33227j105413J885366K16765N7546l39704
$$ -844693 -1193052 -1955277 -1780061 -1796436 -2429663 -3535076 -1649710 -1432945 -1375399 -1715103
476a715103M1571p517N43754J012357q58762Q34808n89446m75716J88473p61678
$$ -1715103 -1673532 -1681049 -1137295 -124938 -983700 -148892 -738338 -1214054 -1025581 -1787259
466a787259J05956L52635j39114q56268J77319L80813q03166L58388p82048O53088
$$ -1787259 -1681303 -1328668 -1467782 -2324050 -2146731 -1765918 -2569084 -2210696 -2992744 -2339656
456b339656J076402J559822j84130m70637q45175m771L94886R33408p86297o90150
$$ -2339656 -1263254 296568 112438 -358199 -1203374 -1208145 -813259 120149 -666148 -1356298
446a356298j034944J114270N68195L29743o83812p10071p1535N18194M87460N91327
$$ -1356298 -2391242 -1276972 -708777 -379034 -1062846 -1772917 -1844452 -1326258 -838798 -247471
436b47471j319463r80819J710863j68575O68559k42571j405554O09652j1457J34743
$$ -247471 -1566934 -2547753 -836890 -1005465 -336906 -579477 -1985031 -1375379 -1386836 -1252093
426a252093N30185j469388O84228j34407K31120n1887j040460R32537J48344j396762
$$ -1252093 -721908 -2191296 -1507068 -1641475 -1410355 -1462242 -2502702 -1570165 -1421821 -2818583
416b818583M48320J555111J049430j363051o47996L80062M64695K3165k14109
$$ -2818583 -2370263 -815152 234278 -1128773 -1776769 -1396707 -932012 -908847 -1122956
407a122956j46713L9638j062574J105227N51204l73898n37671j88213j458603
$$ -1122956 -1269669 -1230031 -2292605 -1187378 -636174 -1010072 -1547743 -1735956 -3194559
398c194559K362555O02137o66377M183m47955N94394m90249j166429j300265R84507
$$ -3194559 -832004 -229867 -896244 -892061 -1340016 -745622 -1235871 -2402300 -3702565 -2718058
388b718058J547914Q85149k260298K33373O45001L25918J784318j425244k00625
$$ -2718058 -1170144 -284995 -2545293 -2311920 -1666919 -1341001 443317 -981927 -1182552
379a182552j03369m3232J047423m68741n86272R62097o94645J495877m27375l18534
$$ -1182552 -1285921 -1329153 -281730 -750471 -1336743 -374646 -1069291 426586 -789 -319323
369c19323l18052q78147R9191k06677K01642r67778q12735K248009M41304N89357
$$ -319323 -637375 -1515522 -1416331 -1623008 -1421366 -2389144 -3201879 -953870 -512566 76791
359G6791m08882q28253p4572m69186Q08446n47787M66670J5428j340641p09606
$$ 76791 -332091 -1160344 -1234916 -1704102 -895656 -1443443 -976773 -961345 -2301986 -3011592
349c011592J91468P10130J142293l99183J24978N40929L73050k58560j414603
$$ -3011592 -2820124 -2109994 -967701 -1366884 -1241906 -700977 -327927 -586487 -2001090
340b001090O9717Q41140k166992p53568J052787J10194p41959J412079K79840
$$ -2001090 -1931373 -1090233 -3257225 -4010793 -2958006 -2847812 -3589771 -2177692 -1897852
331a897852Q29355m67148n58635R38681j164432p50930N35953M04841n32560R76196
$$ -1897852 -1068497 -1535645 -2094280 -1155599 -2320031 -3070961 -2535008 -2130167 -2662727 -1686531
321a686531q10052L0055O61850P189j94757n15921J992r9188Q50664J20105J178855
$$ -1686531 -2496583 -2466528 -1804678 -1797489 -1992246 -2508167 -2506175 -2605363 -1754699 -1634594 -455739
310d55739j215228O56064J27091P88040m15208k48959r89337k48040J23155M28524
$$ -455739 -1670967 -1014903 -887812 -99772 -514980 -763939 -1753276 -2001316 -1878161 -1449637
300a449637K68511p484l01936l67448n0582j4330j256451k41073J422869Q30383
$$ -1449637 -1181126 -1188610 -1490546 -1857994 -1908576 -1922906 -3179357 -3420430 -1997561 -1167178
290a167178P39705o76815m08915l93533O25986r29926n03902k81049N50444J68212
$$ -1167178 -427473 -1104288 -1513203 -1906736 -1280750 -2210676 -2714578 -2995627 -2445183 -2276971
280b276971P60545J571648j220751l64659r52087M98812J746331K6352j640689
$$ -2276971 -1516426 55222 -1165529 -1530188 -2482275 -1983463 -237132 -210780 -1851469
271a851469n48257R50308L66863L1650J17922m08040j275321M10749o73135r52705
$$ -1851469 -2399726 -1449418 -1082555 -1050905 -932983 -1341023 -2616344 -2205595 -2878730 -3831435
261c831435J379718J397840j43798K00066o57932q07017j77492j44565k76100
$$ -3831435 -2451717 -1053877 -1197675 -997609 -1655541 -2462558 -2640050 -2784615 -3060715
252c060715j19147j04900R42629P92239N41564r91324M70772l25916m0878P90108
$$ -3060715 -3179862 -3284762 -2342133 -1549894 -1008330 -1999654 -1528882 -1854798 -1895676 -1105568
242a105568n02820o25908n43812J66215M87814j033613P1773O21585n66137N34315
$$ -1105568 -1608388 -2234296 -2778108 -2611893 -2124079 -3157692 -3085919 -2464334 -3030471 -2496156
232b496156j06404J249326q4165p50906j51421N39472N13645q35911M70877n18863
$$ -2496156 -2602560 -1353234 -1437399 -2188305 -2339726 -1800254 -1286609 -2122520 -1651643 -2170506
222b170506J328392r03691q52095p82264N4161Q42745P01850J53101l38329r89254
$$ -2170506 -842114 -1745805 -2597900 -3380164 -3326003 -2483258 -1781408 -1628307 -1966636 -2955890
212b955890J132566j335783p23348K97861k86770R97623P83468M43908n75128
$$ -2955890 -1823324 -3159107 -3882455 -3584594 -3871364 -2873741 -2090273 -1646365 -2221493
203b221493O13742J77949j058798M6092M00591P66950Q0764p18415o99244m41775
$$ -2221493 -1607751 -1429802 -2488600 -2442508 -2041917 -1274967 -1194203 -1912618 -2611862 -3053637
193c053637Q70829q76697K60021R9286N01855l94610M52432Q1955K52477j077088
$$ -3053637 -2182808 -3059505 -2799484 -2700198 -2198343 -2592953 -2140521 -2058566 -1806089 -2883177
183b883177r86469p48435J354154j42228J20971P54083k59724m03846L16257O84539
$$ -2883177 -3869646 -4618081 -3263927 -3406155 -3285184 -2531101 -2790825 -3194671 -2878414 -2193875
173b193875n907j163257q25428J790088J424793L7122L73091r20430j094036j04513
$$ -2193875 -2199782 -3363039 -4188467 -2398379 -973586 -936464 -563373 -1483803 -2577839 -2682352
163b682352o06240K61606j22891l31372l4657P41878P42336N31300k08011n73330
$$ -2682352 -3288592 -3026986 -3149877 -3481249 -3515906 -2774028 -2031692 -1500392 -1708403 -2281733
153b281733k2460q06220o97949R77567k90442M25968n6605n61391K51092P07415
$$ -2281733 -2304193 -3110413 -3808362 -2830795 -3121237 -2695269 -2751874 -3313265 -3062173 -2354758
143b354758p40520l45766J68015J046025k76815N60525K86340p31799k58679K67217
$$ -2354758 -3095278 -3441044 -3273029 -2227004 -2503819 -1943294 -1656954 -2388753 -2647432 -2380215
133b380215N21269k2841m05698o3821Q03510n27442N14547j425756R6796l42235
$$ -2380215 -1858946 -1881787 -2287485 -2351306 -1547796 -2075238 -1560691 -2986447 -2889651 -3231886
123c231886l75156N65909R55634r61147O76017R2157j181941J101208n7542m33626
$$ -3231886 -3607042 -3041133 -2085499 -3046646 -2370629 -2278472 -3460413 -2359205 -2416747 -2850373
113b850373k89239J037373j132960p25082J166616k52222J90549l98543k35584
$$ -2850373 -3139612 -2102239 -3235199 -3960281 -2793665 -3045887 -2855338 -3253881 -3489465
104c489465P73363k63016n03586P12771J09614Q11086o6031l57613j024042l77374
$$ -3489465 -2716102 -2979118 -3482704 -2769933 -2660319 -1849233 -1915264 -2272877 -3296919 -3674293
94c674293R3874J80600N39022K91739l62913J56496M74678j289389N90047L89442
$$ -3674293 -3580419 -3399819 -2860797 -2569058 -2931971 -2775475 -2300797 -3590186 -3000139 -2610697
84b610697q00101O65196L17794J059369o6547j619013J72411q41334K59407m91127
$$ -2610697 -3410798 -2745602 -2427808 -1368439 -1434986 -3053999 -2881588 -3722922 -3463515 -3954642
74c954642o87114J191952J173146p36460o50231R70963k59935L65582o57215j301889
$$ -3954642 -4641756 -3449804 -2276658 -3013118 -3663349 -2692386 -2952321 -2586739 -3243954 -4545843
64d545843j85220K24096J406408j35021j44845l41537j13399J10011N5189N86090
$$ -4545843 -4731063 -4506967 -3100559 -3235580 -3380425 -3721962 -3835361 -3725350 -3670161 -3084071
54c084071l06988M15094R9786p56212O6808m56768N42691K29977j86898l12497
$$ -3084071 -3391059 -2975965 -2876179 -3632391 -3565583 -4022351 -3479660 -3249683 -3436581 -3749078
44c749078j05937J041349Q14653q05855o27763m77077L7141N66161O05395m34172
$$ -3749078 -3855015 -2813666 -1999013 -2804868 -3432631 -3909708 -3872567 -3306406 -2701011 -3135183
34c135183O83602k57472n11241R92166j09657N66338l80880j347912K04833Q80895
$$ -3135183 -2451581 -2709053 -3220294 -2228128 -2337785 -1771447 -2152327 -3500239 -3295406 -2414511
24b414511j035932p83874K59876J32433N32645J42245P2500j232999r8633J62874
$$ -2414511 -3450443 -4234317 -3974441 -3842008 -3309363 -3167118 -3094618 -4327617 -4426250 -4263376
14d263376r6821N38294O04537k20742j50949O05294L06196o09738n10166R22308
$$ -4263376 -4360197 -3821903 -3217366 -3438108 -3589057 -2983763 -2677567 -3287305 -3797471 -2875163
4b875163k8012l71603k96070m94196
$$ -2875163 -2903175 -3274778 -3570848 -4065044
0d065044
$$ -4065044
$$ Imaginary data points
##PAGE= N=2
##DATA TABLE= (X++(I..I)), XYDATA
16383a3411802m84001J084229P09106k5985j558919O27798P32211k54921P07349
$$ -13411802 -13895803 -12811574 -12102468 -12128453 -13687372 -13059574 -12327363 -12582284 -11874935
16374a1874935K6848k26135N984o26743N87266J250920K32497m08711N20645M20296
$$ -11874935 -11848087 -12074222 -12068238 -12694981 -12107715 -10856795 -10624298 -11033009 -10512364 -10092068
16364a0092068P60980o73505p18169L79549J49334o2078m79017L28479P91858
$$ -10092068 -9331088 -10004593 -10722762 -10343213 -10193879 -10255957 -10734974 -10406495 -9614637
16355i614637P22086N38676O61852l09485m80683Q0886J208722l27635o13651
$$ -9614637 -8892551 -8353875 -7692023 -8001508 -8482191 -8401305 -7192583 -7520218 -8133869
16346h133869K79172l48303L00069R45535R65576l49828n84398n20713K97707
$$ -8133869 -7854697 -8203000 -7902931 -6957396 -5991820 -6341648 -6926046 -7446759 -7149052
16337g149052l09931M3262k26862L61749P28457K94963M08622J02919k61675j17217
$$ -7149052 -7458983 -7415721 -7642583 -7280834 -6552377 -6257414 -5848792 -5745873 -6007548 -6124765
16327f124765J28539J20056N30383P44512j22941k48843N55056M7243N01021j24250
$$ -6124765 -5996226 -5876170 -5345787 -4601275 -4724216 -4973059 -4418003 -4370760 -3869739 -3993989
16317c993989J99820l77698p81868K02309O35711J094508N21754M08230j202948
$$ -3993989 -3794169 -4171867 -4953735 -4751426 -4115715 -3021207 -2499453 -2091223 -3294171
16308c294171O40623O57029m64234m19609o24646M50333J049105l191m82957m9152
$$ -3294171 -2653548 -1996519 -2460753 -2880362 -3505008 -3054675 -2005570 -2008761 -2491718 -2540870
16298b540870L98169Q50463m09883n01029K52575J87101L39984o43967l20188
$$ -2540870 -2142701 -1292238 -1702121 -2203150 -1950575 -1763474 -1423490 -2067457 -2387645
16289b387645J733548L18155j05277l26645O25712p92932O6062O21426R00053
$$ -2387645 -654097 -335942 -441219 -767864 -142152 -935084 -869022 -247596 652457
16280F52457n4971Q1837M5011j068436l89735N70027J58937M34757o84059P9278
$$ 652457 597486 679323 724334 -344102 -733837 -163810 -4873 429884 -254175 -174897
16270a74897J104040j01654M86654j362898J021337Q19162N6095k80350R52604
$$ -174897 929143 827489 1314143 -48755 972582 1791744 1847839 1567489 2520093
16261B520093k1754K0630p53813j091016l04058P4146N48901J039405k04186L1776
$$ 2520093 2498339 2518969 1765156 674140 370082 444228 993129 2032534 1828348 1860124
16251A860124o63651J280872J432709p62600O6330L37339m98266j71461J544987
$$ 1860124 1196473 2477345 3910054 3147454 3213784 3551123 3052857 2881396 4426383
16242D426383Q6695l45542r19778J03722J083000N52145n53061l04795p59565
$$ 4426383 4513078 4167536 3247758 3351480 4434480 4986625 4433564 4128769 3369204
16233C369204P01295Q4892K47586j16403N38754o50935n44983n49925Q68013k6043
$$ 3369204 4070499 4155391 4402977 4286574 4825328 4174393 3629410 3079485 3947498 3921455
16223C921455q6437R6749J089927N4699N60278j030712j78962J301292j75965
$$ 3921455 3835018 3931767 5021694 5076393 5636671 4605959 4426997 5728289 5552324
16214E552324Q7765j125530J49810M06904P09745J11652p21912J043056n81182
$$ 5552324 5640089 4514559 4664369 5071273 5781018 5892670 5170758 6213814 5632632
16205E632632J65982J221863j261412p2747J466610k07476j37827j834889j491936
$$ 5632632 5798614 7020477 5759065 5686318 7152928 6945452 6807625 4972736 3480800
16196C480800J868394J270329Q28926n53431j069411N65445n16754O95433J408422
$$ 3480800 5349194 6619523 7448449 6895018 5825607 6391052 5874298 6569731 7978153
16187G978153p12244o62910j297885l68830J224551k21833l89504O87153p1393
$$ 7978153 7265909 6602999 5305114 4936284 6160835 5939002 5549498 6236651 6165258
16178F165258J68023p21270q0687M3752J11161M36983k26827P9046J535264L75334
$$ 6165258 6333281 5612011 5531324 5575076 5686237 6123220 5896393 5975439 7510703 7886037
16168G886037n04962l49328j001471M22962J653704l73440J042641l91590J63370
$$ 7886037 7381075 7031747 6030276 6453238 8106942 7733502 8776143 8384553 8547923
16159H547923N36002q39024n98641o7847L04006P86438q17797N15299j322502
$$ 8547923 9083925 8244901 7646260 7578413 7882419 8668857 7851060 8366359 7043857
16150G043857m35015J074124j190616l95119J256063k01488L33348n92958j055279
$$ 7043857 6608842 7682966 6492350 6097231 7353294 7151806 7485154 6892196 5836917
16141E836917Q65280J502484r50974R8981L68577j240011L93927L37893r03956
$$ 5836917 6702197 8204681 7253707 7352688 7721265 6481254 6875181 7213074 6309118
16132F309118O16365J497213q57430K88499j80332N8818J130232m24525O75153
$$ 6309118 6925483 8422696 7565266 7853765 7673433 7732251 8862483 8437958 9113111
16123I113111M00870q85009p5583Q66363n95176j69213J041271q95669P29803
$$ 9113111 9513981 8628972 8553389 9419752 8824576 8655363 9696634 8800965 9530768
16114I530768m29823j760257O62482k00804P17231j07955L0487k02737o17018
$$ 9530768 9100945 7340688 8003170 7802366 8519597 8411642 8442129 8239392 7622374
16105G622374J041241J267519r67715j284213l12747k6024J260285l26919L26539
$$ 7622374 8663615 9931134 8963419 7679206 7366459 7340435 8600720 8273801 8600340
16096H600340J472465P99921j098079l62737j175703p04449J73982j2158m92287
$$ 8600340 10072805 10872726 9774647 9411910 8236207 7531758 7705740 7693582 7201295
16087G201295N01003j351287J225041J365089j038404R90996K08772m82931l51892
$$ 7201295 7702298 6351011 7576052 8941141 7902737 8893733 9102505 8619574 8267682
16078H267682m8357m23661j61893j35790J054535r2325n63321J9133J39345Q28502
$$ 8267682 8219325 7795664 7633771 7497981 8552516 8460191 7896870 7916003 8055348 8883850
16068H883850m10133P97767N97393k569615k43406Q3441J285218J177697j737435
$$ 8883850 8473717 9271484 9868877 7299262 7055856 7139297 8424515 9602212 7864777
16059G864777J182767L70052l96666J434534L32425o81342j43900j348532n11701
$$ 7864777 9047544 9417596 9020930 10455464 10787889 10106547 9962647 8614115 8102414
16050H102414Q33512J381854p60729P09593p82455n91926l54548J404312k57436
$$ 8102414 8935926 10317780 9557051 10266644 9484189 8892263 8537715 9942027 9684591
16041I684591j306362K99561N31243j315956R41883L0729j049260J223542P72951
$$ 9684591 8378229 8677790 9209033 7893077 8834960 8865689 7816429 9039971 9812922
16032I812922N70275l22329o91773o14109q30487N2079P08521R87226J59004n75755
$$ 9812922 10383197 10060868 9369095 8754986 7924499 7976578 8685099 9672325 9831329 9255574
16022I255574p81226j77492l15378k25139p2288P99664o40954R2170R10830j234030
$$ 9255574 8474348 8296856 7981478 7756339 7684051 8483715 7842761 7934931 8845761 7611731
16012G611731L45263J16117N96577P87850j46520j949652J659518N22999q05671
$$ 7611731 7956994 8073111 8669688 9457538 9311018 7361366 9020884 9543883 8738212
16003H738212q30882J002615n95352l74927P40340m6725O25373r70595r73581
$$ 8738212 7907330 8909945 8314593 7939666 8680006 8633281 9258654 8288059 7314478
15994G314478L96354j16066P23665J20143N04730o39186J99927K71776O0247k80024
$$ 7314478 7710832 7594766 8318431 8438574 8943304 8304118 8504045 8775821 8836068 8556044
15984H556044J37382J126927N73491N68344j318065o35132M74158J44909J86438
$$ 8556044 8693426 9820353 10393844 10962188 9644123 9008991 9483149 9628058 9814496
15975I814496k17546q12443J324137j30888j876753M42213O32058J023037j4396
$$ 9814496 9596950 8784507 10108644 9977756 8101003 8543216 9175274 10198311 10183915
15966A0183915n31711l98401j68614Q2407J51080j306311M18422M08323m28378
$$ 10183915 9652204 9253803 9085189 9167596 9318676 8012365 8430787 8839110 8410732
15957H410732K39398k56630N70470l07169j177404R43421J139844j5623K32345
$$ 8410732 8650130 8393500 8963970 8656801 7479397 8422818 9562662 9547039 9779384
15948I779384j080744l80950J3757P08462J09722m46232j385341L36482J280029
$$ 9779384 8698640 8317690 8331447 9039909 9149631 8703399 7318058 7654540 8934569
15939H934569P04828p32316N67623O97253j006334M31946j81255p97052J248938
$$ 8934569 9639397 8907081 9474704 10171957 9165623 9597569 9416314 8619262 9868200
15930I868200j857253M6783J869394k80000L42297q39875J129742m86013k91899
$$ 9868200 8010947 8057730 9927124 9647124 9989421 9149546 10279288 9793275 9501376
15921I501376k60657k39916R54K81433P47481N4593l30754o52716m63446m5955
$$ 9501376 9240719 9000803 9001757 9283190 10030671 10085264 9754510 9101794 8638348 8592393
15911H592393j585811R96339J299045k19811j820411j57641J90718N01906J694865
$$ 8592393 7006582 8002921 9301966 9082155 7261744 7104103 7294821 7796727 9491592
15902I491592J751034j510032o07639J61323l39727P52264L0122J194814j191362
$$ 9491592 11242626 9732594 9124955 9286278 8946551 9698815 9728937 10923751 9732389
15893I732389j041757n13659k20265O78166J008326l96970K68535o51241p51212
$$ 9732389 8690632 8176973 7956708 8634874 9643200 9246230 9514765 8863524 8112312
15884H112312j7174l39139J112388P83427m03660M63910L61750P70426j487107
$$ 8112312 8095138 7755999 8868387 9651814 9248154 9712064 10073814 10844240 9357133
15875I357133j480103P69491n08704J66380N38814q41104L90406J446217o01659
$$ 9357133 7877030 8646521 8137817 8304197 8843011 8001907 8392313 9838530 9236871
15866I236871k26923O4240o25455k45649m10388K46780R34948J47690J05022R03300
$$ 9236871 9009948 9074188 8448733 8203084 7792696 8039476 8974424 9122114 9227136 10130436
15856A0130436J41694p60677j643258K102097J03206o44669l93819o3036q27642
$$ 10130436 10272130 9511453 7868195 9970292 10073498 9428829 9035010 8971974 8144332
15847H144332k48k44766L3325n31432l52860j15310J529447o28563m7494R23816
$$ 8144332 8144084 7899318 7932643 7401211 7048351 6933041 8462488 7833925 7786431 8710247
15837H710247K18068O98736n69815p10590j162107K81475o96087l58383Q89053
$$ 8710247 8928315 9627051 9057236 8346646 7184539 7466014 6769927 6411544 7300597
15828G300597J48423Q52779N362P28938r7615m20102o20477k26191Q20440k15643
$$ 7300597 7449020 8301799 8307161 9036099 8938484 8518382 7897905 7671714 8492154 8276511
15818H276511M75876J09548N14323P8283j056025l5619J005683O00464L74700
$$ 8276511 8752387 8861935 9376258 9454541 8398516 8362897 9368580 9969044 10343744
15809A0343744j015277Q39493n54184k22737L62542j084982j002337R02035J312268
$$ 10343744 9328467 10167960 9613776 9391039 9753581 8668599 7666262 8568297 9880565
15800I880565M95763k40152k000653j230910P80700J170974J012014j082775l72459
$$ 9880565 10376328 10136176 8135523 6904613 7685313 8856287 9868301 8785526 8413067
15791H413067K67382J275023k43104n53966o61854o5067n71021J582013J027264
$$ 8413067 8680449 9955472 9712368 9158402 8496548 8431481 7860460 9442473 10469737
15782A0469737o79055n11775N57441j366573J663543j17142o83458J8955j301059
$$ 10469737 9790682 9278907 9836348 8469775 10133318 10016176 9332718 9351673 8050614
15773H050614J971220j135624m14201m43297K49798J37684N63817l8809l60344
$$ 8050614 10021834 8886210 8472009 8028712 8278510 8416194 8980011 8941202 8580858
15764H580858o76146n26717J720655J200681k020253r2975J437250j4517J092925
$$ 8580858 7904712 7377995 9098650 10299331 8279078 8186103 9623353 9608836 10701761
15755A0701761J3885j443432n50496m32089P86081J097466l09877L90259q54647
$$ 10701761 10715646 9272214 8721718 8289629 9075710 10173176 9863299 10253558 9398911
15746I398911N17905P75816j626793m70076Q37211k32419k74267k96190K88386
$$ 9398911 9916816 10692632 9065839 8595763 9432974 9200555 8926288 8630098 8918484
15737H918484O36180m58583j59874L36396p70291L61839K52099q89112k117p24348
$$ 8918484 9554664 9096081 8936207 9272603 8502312 8864151 9116250 8227138 8225021 7500673
15727G500673k08600J009010J016779J003651o26272j503979P25105J516967K70713
$$ 7500673 7292073 8301083 9317862 10321513 9695241 8191262 8916367 10433334 10704047
15718A0704047j173885n77920R72600q9965J114473M85468r95463j034697o51820
$$ 10704047 9530162 8952242 9924842 9834877 10949350 11434818 10439355 9404658 8752838
15709H752838J181250P7718j816291M90760J776233n7774J267174j274728j055500
$$ 8752838 9934088 10011806 8195515 8686275 10462508 10404734 11671908 10397180 9341680
15700I341680J99564n90397j013004P19395m96438o50896J481385K12473K20431
$$ 9341680 9541244 8950847 7937843 8657238 8160800 7509904 8991289 9203762 9424193
15691I424193j03662J36988n47042N31965k41143o82892o38375m21218P21563
$$ 9424193 9320531 9457519 8910477 9442442 9201299 8518407 7880032 7458814 8180377
15682H180377J342409o48318k48484Q06642j194794k62479Q77626k1177j386758
$$ 8180377 9522786 8874468 8625984 9432626 8237832 7975353 8852979 8831802 7445044
15673G445044J738900Q91489p39173k7666j758578M23069K605590j067071j320822
$$ 7445044 9183944 10075433 9336260 9308594 7550016 7973085 10578675 9511604 8190782
15664H190782J247854L0868n64116J093669K30518j61323j796823Q2280J322050
$$ 8190782 9438636 9469504 8905388 9999057 10229575 10068252 8271429 8353709 9675759
15655I675759m53296O20713k81652m21127R51076j678657K72104j379377Q54670
$$ 9675759 9222463 9843176 9561524 9140397 10091473 8412816 8684920 7305543 8160213
15646H160213J779181o32688j057527j88789J699550l45394l07135K70142r97185
$$ 8160213 9939394 9306706 8249179 8060390 9759940 9414546 9107411 9377553 8380368
15637H380368J058235R87487q25385j283023m7431N59562L84499k87101k84971
$$ 8380368 9438603 10426090 9600705 8317682 8270251 8829813 9214312 8927211 8642240
15628H642240L37773k016425J655845J681229q71892m11914n13347r28430P66508
$$ 8642240 8980013 6963588 8619433 10300662 9428770 9016856 8503509 7575079 8341587
15619H341587P15098j14878M7793n34707p20356L09263J414862j103100L31050
$$ 8341587 9056685 8941807 8989600 8454893 7734537 8043800 9458662 8355562 8686612
15610H686612J622940l64530n8682m49470n37255n18076R13759L54514k21704
$$ 8686612 10309552 9945022 9886340 9436870 8899615 8381539 9295298 9649812 9428108
15601I428108K8544n99428q27035R81875K18147r05582k51142n06178q2685J102728
$$ 9428108 9456652 8857224 8030189 9012064 9230211 8324629 8073487 7567309 7484624 8587352
15591H587352J186717k14994p02780K58122J62125p69898m1975m66552j817484
$$ 8587352 9774069 9559075 8856295 9114417 9276542 8506644 8464669 7998117 6180633
15582F180633J280218J259577N47785j25987L9794R6629L89533k88343j04313
$$ 6180633 7460851 8720428 9268213 9142226 9182020 9278649 9668182 9379839 9275526
15573I275526j64305J022291L60371o06037m83447j940777O03913K114437o30311
$$ 9275526 9111221 10133512 10493883 9887846 9404399 7463622 8067535 10181972 9551661
15564I551661N39374j461658Q39202O27735j481645n34921J32570N53040p60482
$$ 9551661 10091035 8629377 9468579 10096314 8614669 8079748 8212318 8765358 8004876
15555H004876j72668l29712P03139R89901k58067N88874Q67646j46120j288288
$$ 8004876 7832208 7502496 8205635 9195536 8937469 9526343 10393989 10247869 8959581
15546H959581k37787L40937M52803J528302j876314l04718R53105n04390r29223
$$ 8959581 8721794 9062731 9515534 11043836 9167522 8862804 9815909 9311519 8382296
15537H382296j359182J30597K758055q95055j212101L90525J23943N03141j068940
$$ 8382296 7023114 7153711 9911766 9016711 7804610 8195135 8319078 8822219 7753279
15528G753279k29747l02397O91137O36955p8108N72844k12948n65334J330880
$$ 7753279 7523532 7221135 7912272 8549227 8471119 9043963 8831015 8265681 9596561
15519I596561o79091J055076J215669k042095P26229j122714Q34312j1776j69742
$$ 9596561 8917470 9972546 11188215 9146120 9872349 8749635 9583947 9572171 9402429
15510I402429q56413R43901m61956l89271R86299N12848l13856l93466K46288
$$ 9402429 8546016 9489917 9027961 8638690 9624989 10137837 9823981 9430515 9676803
15501I676803r49972J30175M49538p49421J140921J264146j179528m97194n76311
$$ 9676803 8726831 8857006 9306544 8557123 9698044 10962190 9782662 9285468 8709157
15492H709157m67502l6826r67486L07311O19403M91890O60043m04979j038774
$$ 8709157 8241655 8204829 7237343 7544654 8164057 8655947 9315990 8911011 7872237
15483G872237J026497r1978l40810j00958m5648R22589J253559L55423j264453
$$ 7872237 8898734 8806756 8465946 8364988 8319340 9241929 10495488 10850911 9586458
15474I586458K68431m78891n99877l70148j80637Q71327k06071l54177K03049
$$ 9586458 9854889 9375998 8776121 8405973 8225336 9096663 8890592 8536415 8739464
15465H739464k10593N41341K04282J0480Q46602J014334j930742L47502j75407
$$ 8739464 8528871 9070212 9274494 9284974 10131576 11145910 9215168 9562670 9387263
15456I387263O3034m54064j008082k44251m92623K60871J458857n90828k61233
$$ 9387263 9450297 8996233 7988151 7743900 7251277 7512148 8971005 8380177 8118944
15447H118944J854495O06070J6907l67149N1089j514172j68675J097873L60492
$$ 8118944 9973439 10579509 10596416 10229267 10280356 8766184 8597509 9695382 10055874
15438A0055874j463046Q1944N16541O96390Q72064j950713p86487k60268J294647
$$ 10055874 8592828 8674772 9191313 9887703 10759767 8809054 8022567 7762299 9056946
15429I056946J08977m31535r7003J301272K27818M69128k56114j51693r13141
$$ 9056946 9165923 8734388 8637385 9938657 10166475 10635603 10379489 10227796 9314655
15420I314655o43610k5355L117L1295n96261m64389J052569K037933k50106n38225
$$ 9314655 8671045 8645690 8648807 8680102 8083841 7619452 8672021 10709954 10459848 9921623
15410I921623p68008J461229k259340l73756O15512J68328J415527j34070r19693
$$ 9921623 9153615 10614844 8355504 7981748 8597260 8765588 10181115 10047045 9127352
15401I127352L0511K37043O52053k89643J018181O03249r28427j729271k25703
$$ 9127352 9157863 9394906 10046959 9757316 10775497 11378746 10450319 8721048 8495345
15392H495345R14489M7721m56078q3236Q28465N44993o4314K15095J093814j277265
$$ 8495345 9409834 9457555 9001477 8918241 9746706 10291699 10227385 10442480 11536294 10259029
15382A0259029l81225J386874J89854l47902o62551m99250q98761L47342M63945
$$ 10259029 9877804 11264678 11454532 11106630 10444079 9944829 9046068 9393410 9857355
15373I857355p81688L79526o07524L59655j048623j50703P6224K51441M72772
$$ 9857355 9075667 9455193 8847669 9207324 8158701 8007998 8084222 8335663 8808435
15364H808435R96358j315770q2999Q46894J02042j78077j348083K66771J299827
$$ 8808435 9804793 8489023 8406024 9252918 9354960 9176883 7828800 8095571 9395398
15355I395398J132749l13841j94413o0818j118015J412372J735733j516401k14761
$$ 9395398 10528147 10214306 10019893 9959075 8841060 10253432 11989165 10472764 10258003
15346A0258003L01177n11654J155050j583386M62680J304082n35595M36701q31890
$$ 10258003 10559180 10047526 11202576 9619190 10081870 11385952 10850357 11287058 10455168
15337A0455168n67107n3001j073664k88976J97291j96149N87412r26854K61714
$$ 10455168 9888061 9835060 8761396 8472420 8669711 8473562 9060974 8134120 8395834
15328H395834Q05892L55479m91940P29496K21583J013709k087628l49226Q7414
$$ 8395834 9201726 9557205 9065265 9794761 10016344 11030053 8942425 8593199 8680613
15319H680613j409929J784943p27273m42468O50006L24693K80182O9243j61840
$$ 8680613 7270684 9055627 8328354 7885886 8535892 8860585 9140767 9210010 9048170
15310I048170L669L16854L86279L79027Q21168m55526m27791O96957L33014j429888
$$ 9048170 9051839 9368693 9754972 10133999 10955167 10499641 10071850 10768807 11101821 9671933
15300I671933Q10098n13881j322823J077951o89145l77905R32424O22578j0011
$$ 9671933 10482031 9968150 8645327 9723278 9034133 8656228 9588652 10211230 10201219
15291A0201219r86452m83438j17632j563574J367023J180272J51203O2570k14093
$$ 10201219 9214767 8731329 8613697 7050123 8417146 9597418 9748621 9811191 9597098
15282I597098L96582Q41209L5144R5879j662240j114321J453741P12652m7146
$$ 9597098 9993680 10834889 10870033 10965912 9303672 8189351 9643092 10355744 10308598
15273A0308598J185J22521j66839q50516R45035r74617Q46683K75790j365292
$$ 10308598 10309783 10432304 10265465 9414949 10359984 9385367 10232050 10507840 9142548
15264I142548L85320J098831n92758m21389J050286j123145j170631P79940k47152
$$ 9142548 9527868 10626699 10033941 9612552 10662838 9539693 8369062 9149002 8901850
15255H901850J164571K10583m80748J006649K39713M40305j552146K33819k092230
$$ 8901850 10066421 10277004 9796256 10802905 11042618 11482923 9930777 10164596 8072366
15246H072366J4409R29612L7391O14267j402024J037481K189355m7521m18891
$$ 8072366 8086775 9016387 9053778 9668045 8266021 9303502 11492857 11445336 11026445
15237A1026445k158547n56156J715699j182733m69945J269601l06501J14373J131705
$$ 11026445 8867898 8311742 10027441 8844708 8374763 9644364 9337863 9452236 10583941
15228A0583941N2940K74303j679506L8460O75866k00914J247752n05059Q73307
$$ 10583941 10636881 10911184 9231678 9270138 9946004 9745090 10992842 10487783 11361090
15219A1361090j046533P4660R54207j662733P96226N15076k693125Q48125J316235
$$ 11361090 10314557 10389217 11343424 9680691 10476917 10991993 8298868 9146993 10463228
15210A0463228m41855Q6250j224867O21713M04943o93212j23063R71797O06295
$$ 10463228 10021373 10107623 8882756 9504469 9909412 9216200 9093137 10064934 10671229
15201A0671229j301741N23975j270481o221K042634q42165j052718J112792p31030
$$ 10671229 9369488 9893463 8622982 8616761 10659395 9817230 8764512 9877304 9146274
15192I146274N25806N37270N02636Q5018o85776j195791l03356Q47231O70310
$$ 9146274 9672080 10209350 10711986 10797004 10111228 8915437 8612081 9459312 10129622
15183A0129622m08531j085632J402587m7455K37350O53603k348937N27144J007123
$$ 10129622 9721091 8635459 10038046 9990591 10227941 10881544 8532607 9059751 10066874
15174A0066874J96954P23495j793381P36363K51903r05756J099833l00338r83553
$$ 10066874 10263828 10987323 9193942 9930305 10182208 9276452 10376285 10075947 9092394
15165I092394L09782M77031p9994j932890P34706Q26072k91560L0532R38799r82087
$$ 9092394 9402176 9879207 9799213 7866323 8601029 9427101 9135541 9166073 10104872 9122785
15155I122785J573954K99245l5580l27445p57241L00925P09197j105630r15576
$$ 9122785 10696739 10995984 10960404 10632959 9875718 10176643 10885840 9780210 8864634
15146H864634J60897k40811P93136k46904J21744q54567M94306O74028Q01021
$$ 8864634 9025531 8784720 9577856 9330952 9452696 8598129 9092435 9766463 10567484
15137A0567484Q61473j505224o13569J128371o88137R21262j008635l71163n32585
$$ 10567484 11428957 9923733 9310164 10438535 9750398 10671660 9663025 9291862 8759277
15128H759277j52829J108002M31092M016M59467n32920j83891q17933j261795
$$ 8759277 8606448 9714450 10145542 10149558 10609025 10076105 9892214 9074281 7812486
15119G812486M59415k56625P12055l07545m35954l75460O99529P58296P50024
$$ 7812486 8271901 8015276 8727331 8419786 7983832 7608372 8307901 9066197 9816221
15110I816221Q28804j289091K07590l15455R91579r00810P09631M67533j355211
$$ 9816221 10645025 9355934 9563524 9248069 10239648 9338838 10048469 10516002 9160791
15101I160791K93251Q45781l08700j181584j237670P22996N97406m74302j9557
$$ 9160791 9454042 10299823 9991123 8809539 7571869 8294865 8892271 8417969 8398412
15092H398412j90063J523088J751773M4751m58452j66835k46822n56332J48104
$$ 8398412 8208349 9731437 11483210 11527961 11069509 10902674 10655852 10099520 10247624
15083A0247624M36928j577617J13551r39041J538830o60876J36556M09685P38885
$$ 10247624 10684552 9106935 9220486 8281445 9820275 9159399 9295955 9705640 10444525
15074A0444525r42560L03144m3802q05416J12971J83248p77459K03311O80716
$$ 10444525 9501965 9805109 9761307 8955891 9068862 9252110 8474651 8677962 9358678
15065I358678L08167L59404M4820M88265p46341j3359m77663M12465k2014j166138
$$ 9358678 9666845 10026249 10071069 10559334 9812993 9799634 9321971 9734436 9712422 8546284
15055H546284M61830J235196N7229O89417L08981k380064J101119K58650r58343
$$ 8546284 9008114 10243310 10300539 10989956 11298937 8918873 10019992 10278642 9320299
15046I320299M71831j149280J48943n74953K96939Q04036r52425J217651J054350
$$ 9320299 9792130 8642850 8791793 8216840 8513779 9317815 8365390 9583041 10637391
15037A0637391n91386M02993J67137j754030P1998L34281J126067l39261j874967
$$ 10637391 10046005 10448998 10616135 8862105 8934103 9268384 10394451 10055190 8180223
15028H180223J69636N58871M1374J37725P63588L71032q16260n01501P10790n63390
$$ 8180223 8349859 8908730 8950104 9087829 9851417 10222449 9406189 8904688 9615478 9052088
15018I052088Q13456P00421j179723j471017J213381J589662J12422p69613q7649
$$ 9052088 9865544 10565965 9386242 7915225 9128606 10718268 10830690 10061077 9973428
15009I973428j036641J54571M84283O26013k218099R22176k73525p62215J98268
$$ 9973428 8936787 9091358 9575641 10201654 7983555 8905731 8632206 7869991 8068259
15000H068259j68831m45075N19755J905838J19358M30731J088863j471176J4456
$$ 8068259 7899428 7454353 7974108 9879946 9999304 10430035 11518898 10047722 10062178
14991A0062178N92059k32864L39601M08017J236898o71214j025288J866134j525649
$$ 10062178 10654237 10421373 10760974 11168991 12405889 11734675 10709387 12575521 11049872
14982A1049872j100216J06331r66268P05655J5257J95735P71538j030024m99509
$$ 11049872 9949656 10055987 9089719 9795374 9810631 10006366 10777904 9747880 9248371
14973I248371J474876r91911n43470J109057M50162p37772k11305q18875R54475
$$ 9248371 10723247 9731336 9187866 10296923 10747085 10009313 9798008 8979133 9933608
14964I933608J353932j602073j520868J460743J14052P7775P64214K96809j320318
$$ 9933608 11287540 9685467 8164599 9625342 9739394 9817169 10581383 10878192 9557874
14955I557874n85508J63789J006687j259407l90090J25867q29285J165991P49301
$$ 9557874 8972366 9136155 10142842 8883435 8493345 8619212 7789927 8955918 9705219
14946I705219k94861j0968k8847J23081m67618r96011Q07576j04067O61749k59173
$$ 9705219 9410358 9399390 9370543 9493624 9026006 8029995 8837571 8733504 9395253 9136080
14936I136080k19483N32467l99687m89787J326191N72916M64754o74918k181422
$$ 9136080 8916597 9449064 9049377 8559590 9885781 10458697 10923451 10248533 8067111
14927H067111K327174P81956j78232M63203p89913M48452L19280n15248m96199
$$ 8067111 10394285 11176241 10998009 11461212 10671299 11119751 11439031 10923783 10427584
14918A0427584P19118R993j008689J46784q92506j533145K089766P98222j871597
$$ 10427584 11146702 11156695 10148006 10294790 9402284 7869139 9958905 10757127 8885530
14909H885530m276J086749R58406j091588J18249P54393p19034P21369n40857
$$ 8885530 8881254 9968003 10926409 9834821 9953070 10707463 9988429 10709798 10168941
14900A0168941k53710J45363q73165J378437P4427l93055Q18713n62767p52220
$$ 10168941 9915231 10060594 9187429 10565866 10640293 10247238 11065951 10503184 9750964
14891I750964J3650m27297L25273o276L11546j12159N9747M7172j105805L39017
$$ 9750964 9764614 9337317 9662590 9656314 9967860 9855701 9915448 9962620 8856815 9195832
14881I195832J45876J9947l12511J83450j56097N123j64766m15456J787489n75499
$$ 9195832 9341708 9361655 9049144 9232594 9076497 9081620 8916854 8501398 10288887 9713388
14871I713388j17569R53444O07479j99159j214899j836852K102457M79856l97652
$$ 9713388 9595819 10549263 11156742 10957583 9742684 7905832 10008289 10488145 10090493
14862A0090493K56092j7776r99758P7373O25179j159209k6129Q39044L41335J20623
$$ 10090493 10346585 10328809 9329051 9406424 10031603 8872394 8846265 9685309 10026644 10147267
14852A0147267J36725j141916J89538j008862L12869J539004l36909j607868j119503
$$ 10147267 10283992 9142076 9331614 8322752 8635621 10174625 9837716 8229848 7110345
14843G110345j40917J071591L61554J95496K31666L14490N24236l66655l86427
$$ 7110345 6969428 8041019 8402573 8598069 8829735 9144225 9668461 9301806 8915379
14834H915379N00245P53670j76113P25131j642330L33975m48453P4110J280036
$$ 8915379 9415624 10169294 9993181 10718312 9075982 9409957 8961504 9035614 10315650
14825A0315650n39540O79049l56319o20553N9384J128578q78800n89339J69796
$$ 10315650 9776110 10455159 10098840 9478287 9537671 10666249 9787449 9198110 9367906
14816I367906N84844n61373p43572N59695O71499M38366p4505m18707L81511j81933
$$ 9367906 9952750 9391377 8647805 9207500 9878999 10317365 10242860 9824153 10205664 10023731
14806A0023731J051032q17569p51151n85032R5827J205131N88298o47955L98368
$$ 10023731 11074763 10257194 9506043 8921011 9016838 10221969 10810267 10162312 10560680
14797A0560680j504210l97169J899155n24273L28213j074231R16520Q07310o24766
$$ 10560680 9056470 8659301 10558456 10034183 10362396 9288165 10204685 11011995 10387229
14788A0387229l18364j378962l62070P63102K76381K56885K273575k185680o01013
$$ 10387229 10068865 8689903 8327833 9090935 9367316 9624201 11897776 9712096 9111083
14779I111083J81304k50597r1823L68107L2373j115104K75836J027378R3787p15460
$$ 9111083 9292387 9041790 8949967 9318074 9350447 8235343 8511179 9538557 9632344 8916884
14769H916884J05115R39792N8222p34076j012994R82180J714454M06162l36932
$$ 8916884 9021999 9961791 10020013 9285937 8272943 9255123 10969577 11375739 11038807
14760A1038807j607202o95402J449337J760795m18270j283283j315208Q52067
$$ 11038807 9431605 8736203 10185540 11946335 11528065 10244782 8929574 9781641
14752I781641j338812Q32944O02403Q87900J156186l72398j107497o53954P75141
$$ 9781641 8442829 9275773 9878176 10766076 11922262 11549864 10442367 9788413 10563554
14743A0563554j371884R7998m063O55495k34035r49002J385114J295245P27715
$$ 10563554 9191670 9289668 9285605 9941100 9707065 8758063 10143177 11438422 12166137
14734A2166137k840279J7180K522292m14399m35192q12461J9096q43260R9405
$$ 12166137 9325858 9343038 11865330 11450931 11015739 10203278 10222374 9379114 9478519
14725I478519J259354j009368M56446l19343j64587R8339J080332o79688N60718
$$ 9478519 10737873 9728505 10184951 9865608 9701021 9799360 10879692 10200004 10760722
14716A0760722j278359O08166r7874j082774O39818r10099P23456J90622N03271
$$ 10760722 9482363 10090529 9992655 8909881 9549699 8639600 9363056 9553678 10056949
14707A0056949L29967L5803j87642K92941r9242J85121k45680J000469O3045j933269
$$ 10056949 10386916 10422719 10235077 10528018 10428776 10613897 10368217 11368686 11431731 9498462
14697I498462k64579j70281k75427J685472J161918R8196J529534j370946j818269
$$ 9498462 9233883 9063602 8788175 10473647 11635565 11733761 13263295 11892349 10074080
14688A0074080r94841J207003k58220j588503m85215K797942R9000n77436n77396
$$ 10074080 9079239 10286242 10028022 8439519 7954304 10752246 10851246 10273810 9696414
14679I696414j5219P80293p03438O91566o20330K88376L77415l39853N32061j20437
$$ 9696414 9681195 10461488 9758050 10449616 9829286 10117662 10495077 10155224 10687285 10566848
14669A0566848j617328M96078J36448k4345R69985L02515L93012q38160r82985
$$ 10566848 8949520 9445598 9582046 9557701 10527686 10830201 11223213 10385053 9402068
$$ [...]
##END NTUPLES=NMR SPECTRUM
##END=
