##TITLE=1H_CG-1147-3
 CDCl3, 8 sc, 
 30.04.2021
##JCAMPDX= 6.0         $$ Bruker NMR JCAMP-DX V2.0
##DATA TYPE= NMR SPECTRUM
##DATA CLASS= NTUPLES
##ORIGIN= UXNMR, Bruker Analytische Messtechnik GmbH
##OWNER= root
$$ XWIN-NMR		Version 3.5
$$ Fri Apr 30 14:27:41 2021 Russian Standard Time (UT+4h)  she@DPX200
##.OBSERVE FREQUENCY= 200.131506
##.OBSERVE NUCLEUS= ^1H
##.ACQUISITION MODE= SIMULTANEOUS
##.ACQUISITION SCHEME= undefined
##.AVERAGES= 8
##.DIGITISER RES= 18
##SPECTROMETER/DATA SYSTEM= spect
##.PULSE SEQUENCE= zg30
##.SOLVENT NAME= D2O
##.SHIFT REFERENCE= (INTERNAL, D2O, 0, 16.0248)
##AUDIT TRAIL= $$ (NUMBER, WHEN, WHO, WHERE, WHAT)
$$ ##TITLE= Audit trail, XWIN-NMR		Version 3.5
$$ ##JCAMPDX= 5.01
$$ ##ORIGIN= Bruker BioSpin GmbH
$$ ##OWNER= she
$$ F:/spectra/data/she/nmr/H-F/1/pdata/1/auditp.txt
$$ ##AUDIT TRAIL=  $$ (NUMBER, WHEN, WHO, WHERE, WHAT)
(   1,<2021-04-30 14:26:45.60 +0400>,<she>,<DPX200>,
      <created by zg, POWCHK disabled, PULCHK disabled
       configuration hash MD5:
       00 E9 B6 7A A2 85 ED C7 34 08 36 98 17 FE 4E 26
       data hash MD5: 16K
       8D 45 96 69 98 E2 DB 87 14 4D 9E C2 52 84 54 14>)
(   2,<2021-04-30 14:26:47.75 +0400>,<she>,<DPX200>,
      <Start of raw data processing
       efp BC_mod = 2 LB = 0.24 FT_mod = 6 PKNL = 1 PHC0 = -11122.52 PHC1 = 14.60103 SI = 16K 
       data hash MD5: 16K
       39 71 74 23 2D C2 88 0A 0A 7F 84 80 86 B4 DD 35>)
(   3,<2021-04-30 14:27:01.67 +0400>,<she>,<DPX200>,
      <pk PHC0 = -4.972955 PHC1 = 4.2 
       data hash MD5: 16K
       1A 4A 18 1A C3 2E 3C 6B AB 12 80 11 F0 64 CF 39>)
(   4,<2021-04-30 14:27:04.45 +0400>,<she>,<DPX200>,
      <abs ABSG = 5 
       data hash MD5: 16K
       9A 67 0B 49 DC 31 47 46 F5 C8 15 38 DD 92 53 F0>)
$$ ##END=
$$ 
$$ hash MD5
$$ 36 62 D9 95 ED 67 E4 AB 0C 70 36 0A 68 63 3E FB
##$RELAX= 
##$RELAX= 
##$RELAX= 
##$RELAX= 
##$RELAX= 
##$RELAX= 
$$ Bruker specific parameters
$$ --------------------------
##$DU= <F:/spectra>
##$EXPNO= 1
##$NAME= <H-F>
##$PROCNO= 1
##$TYPE= <nmr>
##$USER= <she>
##$AMP= (0..31)
100 100 100 100 100 100 100 100 100 100 100 100 100 100 100 100 100 100 
100 100 100 100 100 100 100 100 100 100 100 100 100 100 
##$AQSEQ= 0
##$AQ_mod= 1
##$AUNM= <au_zg>
##$AUTOPOS= <>
##$BF1= 200.13
##$BF2= 200.13
##$BF3= 200.13
##$BF4= 200.13
##$BF5= 200.13
##$BF6= 200.13
##$BF7= 200.13
##$BF8= 200.13
##$BYTORDA= 1
##$CFDGTYP= 0
##$CFRGTYP= 5
##$CHEMSTR= <none>
##$CNST= (0..31)
1 1 145 1 1 1 1 1 1 1 1 1 1 1 1 1 1 1 1 1 1 1 1 1 1 1 1 1 1 1 1 1 
##$CPDPRG= <>
##$CPDPRG1= <>
##$CPDPRG2= <>
##$CPDPRG3= <>
##$CPDPRG4= <mlev>
##$CPDPRG5= <mlev>
##$CPDPRG6= <mlev>
##$CPDPRG7= <mlev>
##$CPDPRG8= <mlev>
##$CPDPRGB= <>
##$CPDPRGT= <>
##$D= (0..31)
0 1.2 0 0 0 0 0 0 0 0.06 0 0.03 0 0 0 0 0.0002 0 0 0 0 0 0 0 0 0 0 0 0 
0 0 0 
##$DATE= 1619778405
##$DBL= (0..7)
120 120 120 120 120 120 120 120 
##$DBP= (0..7)
150 150 150 150 150 150 150 150 
##$DBP07= 0
##$DBPNAM0= <>
##$DBPNAM1= <>
##$DBPNAM2= <>
##$DBPNAM3= <>
##$DBPNAM4= <>
$$ [...]
##$SUBNAM3= <"">
##$SUBNAM4= <"">
##$SUBNAM5= <"">
##$SUBNAM6= <"">
##$SUBNAM7= <"">
##$SUBNAM8= <"">
##$SUBNAM9= <"">
##$SW= 16.9725357007746
##$SWIBOX= (0..15)
0 0 2 0 0 0 0 0 0 0 0 0 0 0 0 0 
##$SW_h= 3396.73913043478
##$TD= 16384
##$TD0= 1
##$TE= 0
##$TE2= 300
##$TE3= 300
##$TEG= 300
##$TL= (0..7)
0 120 120 120 120 120 120 120 
##$TP= (0..7)
150 150 150 150 150 150 150 150 
##$TP07= 0
##$TPNAME0= <>
##$TPNAME1= <>
##$TPNAME2= <>
##$TPNAME3= <>
##$TPNAME4= <>
##$TPNAME5= <>
##$TPNAME6= <>
##$TPNAME7= <>
##$TPOAL= (0..7)
0.5 0.5 0.5 0.5 0.5 0.5 0.5 0.5 
##$TPOFFS= (0..7)
0 0 0 0 0 0 0 0 
##$TUNHIN= 0
##$TUNHOUT= 0
##$TUNXOUT= 0
##$USERA1= <user>
##$USERA2= <user>
##$USERA3= <user>
##$USERA4= <user>
##$USERA5= <user>
##$V9= 5
##$VALIST= <valist>
##$VCLIST= <CCCCCCCCCCCCCCC>
##$VD= 0
##$VDLIST= <DDDDDDDDDDDDDDD>
##$VPLIST= <PPPPPPPPPPPPPPP>
##$VTLIST= <TTTTTTTTTTTTTTT>
##$WBST= 1024
##$WBSW= 4
##$XGAIN= (0..3)
0 0 0 0 
##$XL= 0
##$YL= 0
##$YMAX_a= 418282
##$YMIN_a= -553430
##$ZGOPTNS= <>
##$ZL1= 120
##$ZL2= 120
##$ZL3= 120
##$ZL4= 120
##$ABSF1= 15.9875
##$ABSF2= -0.9851637
##$ABSG= 5
##$ABSL= 3
##$ALPHA= 0
##$AQORDER= 0
##$ASSFAC= 0
##$ASSFACI= 0
##$ASSFACX= 0
##$ASSWID= 0
##$AUNMP= <proc_1d>
##$AZFE= 0.1
##$AZFW= 0.1
##$BCFW= 0
##$BC_mod= 2
##$BYTORDP= 0
##$COROFFS= 0
##$CY= -3
##$DATMOD= 1
##$DC= 0
##$DFILT= <>
##$DTYPP= 0
##$F1P= 0
##$F2P= 0
##$FCOR= 1
##$FTSIZE= 16384
##$FT_mod= 6
##$GAMMA= 0
##$GB= 0
##$INTBC= 1
##$INTSCL= 1.334414e-10
##$ISEN= 128
##$LB= 0.24
##$LEV0= 0
##$LPBIN= 0
##$MAXI= 10000
##$MC2= 0
##$MEAN= 0
##$ME_mod= 0
##$MI= 1.114404
##$NCOEF= 0
##$NC_proc= -6
##$NLEV= 6
##$NOISF1= 3.799351
##$NOISF2= 2.8
##$NSP= 0
##$NTH_PI= 0
##$NZP= 0
##$OFFSET= 16.02479
##$PC= 1
##$PHC0= -11127.49
##$PHC1= 18.80103
##$PH_mod= 1
##$PKNL= yes
##$PPARMOD= 0
##$PSCAL= 0
##$PSIGN= 0
##$REVERSE= no
##$SF= 200.129997328994
##$SI= 16384
##$SIGF1= 3
##$SIGF2= 2
##$SINO= 5.538805
##$SIOLD= 16384
##$SREGLST= <1H.CDCl3>
##$SSB= 0
##$STSI= 16384
##$STSR= 0
##$SW_p= 3396.73913043479
##$SYMM= 0
##$S_DEV= 0
##$TDeff= 16384
##$TDoff= 0
##$TI= <>
##$TILT= no
##$TM1= 0
##$TM2= 0
##$TOPLEV= 0
##$USERP1= <user>
##$USERP2= <user>
##$USERP3= <user>
##$USERP4= <user>
##$USERP5= <user>
##$WDW= 1
##$XDIM= 16384
##$YMAX_p= 523145588
##$YMIN_p= -267378
$$ End of Bruker specific parameters
$$ ---------------------------------
##NTUPLES= NMR SPECTRUM
##VAR_NAME=  FREQUENCY,     SPECTRUM/REAL,   SPECTRUM/IMAG
##SYMBOL=    X,             R,               I
##VAR_TYPE=  INDEPENDENT,   DEPENDENT,       DEPENDENT
##VAR_FORM=  AFFN,          ASDF,            ASDF
##VAR_DIM=   16384,         16384,           16384
##UNITS=     HZ,            ARBITRARY UNITS, ARBITRARY UNITS
##FACTOR=    0.207333158178282, 1,           1
##FIRST=     3207.04114190915, 0,            0
##LAST=      -189.697988525643, 0,           0
##MIN=       -189.697988525643, -267378,     0
##MAX=       3207.04114190915, 523145588,    0
$$ Real data points
##PAGE= N=1
##DATA TABLE= (X++(R..R)), XYDATA
$$ [...]
7273 3071998 3279863 3431557 3481303 3324047 3233791 3090019 3058711 3079434 3158472 3088416 2783813
7262 2783813 2655131 2461359 2184589 2004868 1965056 1872759 1716464 1604765 1501630 1306088
7252 1306088 1154316 1099191 1078670 969864 910872 890354 729073 677566 721844 715396 594859
7241 594859 562402 579566 623451 617778 558491 550468 588009 637980 629060 611274 598564 592635
7229 592635 608536 544705 554925 647571 676822 624323 654228 687166 665848 647428 567769 537530
7217 537530 681341 507212 432161 421913 418224 455040 406720 425664 512958 431205 443099
7206 443099 389299 276606 245675 330487 422704 315405 223400 195429 341702 386532 354871
7195 354871 324493 395135 444520 376737 341570 349011 294716 266938 342122 354192 312544 313620
7183 313620 222437 264291 264515 255143 290055 304953 247459 306708 324850 292365 279159 237246
7171 237246 308590 279461 223996 254088 207103 223672 266902 134357 177742 265386 189669
7160 189669 233763 234621 250677 217604 231816 191507 215225 352804 259300 176783 181298 222847
7148 222847 164768 142961 215208 170040 160002 101485 150110 161465 174742 210358 224224 153805
7136 153805 129382 152106 122273 103993 34787 22828 -9589 -25492 62684 -18494 -6401 69331
7124 69331 157472 62949 35364 -17444 52461 114391 69989 103422 234643 285222 177576
7113 177576 211133 176257 164074 123332 68052 -1669 48813 44462 15901 -2841 -36204 -60208
7101 -60208 -9758 -14283 40707 96518 104466 130004 23212 42566 50990 136038 193590 107275
7089 107275 149638 171815 245800 293582 181082 75730 141342 113567 91522 148931 174060
7078 174060 131086 174427 187990 181880 149816 125897 110368 97126 98011 76729 143937 120455
7066 120455 52406 55362 72527 55168 -25052 -25359 5691 129115 219958 158643 49866 53824
7054 53824 68772 13343 18400 85886 141151 147027 146682 171484 133846 115595 131285 231602
7042 231602 246746 237764 162566 274303 318408 314255 309915 272318 253660 306753 358701 289378
7030 289378 244642 207375 268931 332936 240712 235763 235392 217673 173765 132120 187431 142123
7018 142123 143468 149441 -10884 -32152 89215 26671 9087 -14230 54006 77436 77243 72831
7006 72831 139626 140181 110184 54562 59605 -420 -29061 27842 -28832 -42069 -8380 15319
6994 15319 -34550 30865 -4980 -2472 46508 -24414 -42060 39994 36996 -16050 50746 31981
6982 31981 56663 55019 16251 -4472 37267 71422 221421 156365 18075 44468 2101 -148324
6970 -148324 -129044 -83655 8205 103323 28278 -54423 -34043 -33239 -127997 -147232 -10735 -6459
6958 -6459 -66414 -129085 -191174 -167199 -145524 -96184 -157791 -55668 -1312 -89469 -157915 -124165
6946 -124165 -137299 -141882 -152403 -64742 -57075 -10010 -11145 -86366 -27889 5168 19349 -26791
6934 -26791 -23398 -67935 -109272 -39125 11916 47198 25440 -48092 38951 -10309 -107188 -126770
6922 -126770 -41826 1052 64186 154171 65227 -22346 -62131 -84905 -28246 -19593 27506 -15413
6910 -15413 590 -53165 17567 32522 -22016 24612 20316 -26285 -98023 -35439 -9567 76429
6898 76429 30201 55383 41051 16208 46799 49103 30287 83544 21713 -129092 7399 -11702
6886 -11702 -1684 -20253 -13111 19406 -59899 -20530 -412 -57263 -42992 -17784 -6890 -6443
6874 -6443 -37289 62260 29868 20668 -11847 18826 105672 137605 38486 3725 -48848 -60744
6862 -60744 -53852 -74890 -86379 -74713 -117820 -128032 -86148 -73283 -27833 -42998 3330 -18934
6850 -18934 -124294 -88857 4490 -46196 -67564 -59458 -125006 6709 71954 15087 -75531 -124805
6838 -124805 -58284 -54768 -58938 -19243 -7342 3993 11213 5838 -93372 -22290 37452 45858 75585
6825 75585 125463 142860 94225 2249 -52844 -37204 64045 126323 88907 93512 -2166 95258
6813 95258 125218 185229 244187 252854 193781 182971 278794 292990 324960 282161 249486 280698
6801 280698 225092 210434 292121 330081 403868 352103 236445 371210 419922 387217 331421
6790 331421 361747 325486 271095 226788 283342 263807 253733 279408 285919 287504 242929 191157
6778 191157 126932 75531 45225 3101 26286 22739 15176 45703 5228 92673 73254 90393
6766 90393 150849 82368 -13648 -28352 30596 -8659 -356 2841 -123459 -103488 -103720 -32542
6754 -32542 -20782 -35560 2211 17557 30186 24761 29934 72188 39183 -4825 12760 -58543
6742 -58543 81200 23786 -2956 -34453 -38516 19974 -13585 8777 -41194 26157 46109 25243
6730 25243 -48449 -9707 -13257 -11596 113584 200035 131124 88653 89022 32030 27910 43410 72514
6717 72514 43694 -101069 -121894 -55887 65695 -7134 24173 15941 5210 -78044 -87056 -25328
6705 -25328 -13778 65341 -26009 84193 85751 131940 69512 40033 -34084 28187 24676 -22319
6693 -22319 32634 3737 28678 -102794 -161477 -107120 -2414 53695 -6142 58364 54987 303
6681 303 99215 37176 68760 125802 90947 80083 9057 -21884 76075 153154 140389 62473
6669 62473 21274 96967 115846 141432 74197 93611 111391 56056 77736 14512 116809 148073
6657 148073 27437 -23881 -28877 -2704 31675 -6054 26630 42695 80288 134598 48604 42647
6645 42647 38440 19162 -24576 12533 -11500 50570 134444 32467 35421 180991 116790 43611
6633 43611 11432 -64654 61348 49473 -8109 13239 22687 36437 -47631 -53828 -29776 -48557
6621 -48557 -93874 -39719 80369 24487 82134 130960 111214 107139 -17587 -61761 -5039 100381
6609 100381 167877 195313 107549 109543 117299 57905 63439 111683 66137 -98680 -54104 58503
6597 58503 96973 170808 165241 185250 86051 -28750 97297 96619 97590 49331 -27927 -20665 143827
6584 143827 138341 173691 122574 110175 67723 111914 135432 117116 160770 238109 315985 145985
6572 145985 147009 143312 172902 171329 182997 141483 195326 280474 175418 172862 113957 179996
6560 179996 126546 183866 269895 224243 279316 245253 183115 188213 327808 332650 282755 232141
6548 232141 298434 254246 273295 288074 265286 360665 344912 359409 460451 426344 428112 504489
6536 504489 447177 452139 498909 590767 570152 514005 608562 652641 609423 529025 535594 503978
6524 503978 535734 559125 496388 415403 493039 393117 347642 469444 370945 252386 333108
6513 333108 436464 415238 477090 447830 347831 317460 378771 381907 338887 384162 392089 299697
6501 299697 350704 395448 302347 334132 373978 411256 441401 505034 451292 496048 602104
6490 602104 525793 536107 531760 412950 433970 485043 537647 658391 541400 589606 605368
6479 605368 562781 581570 574348 504252 533679 684580 653885 658363 611661 599894 540445 538601
6467 538601 577184 520250 540637 595677 667853 808503 805375 678221 680305 676259 737946 746315
6455 746315 777780 755883 756529 681872 674868 791449 717271 674668 739498 849248 893918 913610
6443 913610 913188 980962 1077794 1115702 1160525 1244430 1278355 1221012 1302760 1357733 1428609 1546478
6431 1546478 1663670 1784128 1974015 2211237 2318618 2337473 2470307 2677304 2802026 2942229
6421 2942229 3287932 3648732 3959721 4270246 4546754 4887932 4998258 5112858 5376575 5646438
6411 5646438 6085676 6381840 6619057 6707630 6587303 6581282 6479087 6332140 6231135 6205158
6401 6205158 6206090 5964392 5592115 5276355 4769356 4429131 4227761 3991038 3806287 3512113
6391 3512113 3132817 2832444 2631873 2331964 2093680 2020417 1804972 1757941 1567551 1294337
6381 1294337 1247748 1179689 1130588 1072519 1042559 1000914 941316 888077 898779 854405 831452
6370 831452 869434 773989 747209 740595 716139 646451 609071 624054 522599 493803 581906 617674
6358 617674 693716 682493 563946 596773 624545 693722 677356 664589 654243 619036 571866
6347 571866 656144 754607 849062 793598 715714 907824 947338 853652 821904 814982 784092 795868
6335 795868 914973 1056827 998981 1043367 1157248 1243807 1331823 1365223 1485639 1542226 1673414
6324 1673414 1818002 1870650 1932744 1971451 2049183 2200899 2281102 2281857 2230614 2175198 2239724
6313 2239724 2226971 2288538 2254756 2233929 2155690 2058630 1944821 1874555 1703799 1659091 1670042
6302 1670042 1673218 1710432 1643569 1532181 1462745 1439481 1307373 1273456 1150028 1115337 1086157
6291 1086157 1087582 964984 884815 778827 863597 835078 741407 696939 612308 615057 534263
6280 534263 458649 428753 388692 349678 407920 363753 371177 357180 252141 389762 348870
6269 348870 379040 399028 309497 326264 292957 156572 199061 310505 366699 347316 191175
6258 191175 250991 284874 164584 177300 176842 233544 309236 202049 101706 103263 78621 120825
6246 120825 117368 83848 102059 108631 127331 121886 178197 99678 120872 72937 35721 10979
6234 10979 143347 129033 99374 137862 117587 130784 97255 131240 153758 79306 -4898 -65107
6222 -65107 -31353 -971 16189 89074 12788 -66112 8075 30712 105136 128555 23967 74026
6210 74026 70228 64534 246742 257325 198278 126077 99489 84562 30850 141528 282864 343267
6198 343267 343969 232996 245029 348875 265026 381095 483670 374643 360646 336821 281575
6187 281575 279581 326133 407800 512181 478805 525517 561727 619392 591478 562959 642210 646225
6175 646225 708450 746122 853561 927019 912248 827658 737696 859658 830463 859531 863363
6164 863363 794670 780991 680914 623153 602776 543584 452415 489764 479149 540915 497858
6153 497858 420658 313617 238257 280291 308765 274711 315004 369043 394728 326899 204249
6142 204249 130399 164326 201950 164003 197317 235345 197294 167966 188671 251278 252771 126421
6130 126421 104169 68479 73810 102421 158433 224841 106782 134736 66374 99088 98307 101616
6118 101616 104992 60304 127297 144838 124962 193198 221383 130916 58845 78890 29418 107580
6106 107580 161259 84164 85717 74035 101418 89577 76765 78029 75257 50662 184927 244463
6094 244463 212082 173015 194904 231280 176218 130159 86240 151551 160507 162228 153398 51589
6082 51589 98144 127457 187471 149230 204786 211479 152563 211606 185055 191235 137670 177802
6070 177802 140799 136514 113393 162385 100761 59206 128677 110668 177580 215550 145615 199804
6058 199804 209116 137078 151198 185620 193407 61087 48531 76974 156590 146350 141739 187322
6046 187322 129872 57053 159057 188220 213888 83231 144495 327724 384395 371313 350023
6035 350023 392681 292498 326127 370133 321107 227627 196286 225873 267899 332021 408315
6024 408315 420355 429813 367528 371133 459123 587821 517405 408056 523160 500288 582719
6013 582719 550502 631383 655711 729213 742125 731092 839329 976303 1079414 991229 1029364
6002 1029364 991363 930505 886407 912842 1037011 983640 1025887 918155 812049 849178 824003
5991 824003 727087 639561 572154 566286 525339 563089 530779 466683 436210 366088 364697 386795
5979 386795 399602 360922 322628 369008 389288 403099 399098 355185 318812 195795 197211 108177
5967 108177 133637 102599 174304 196145 201084 164246 202843 123816 230336 285983 193182 102003
5955 102003 50827 63167 3292 75819 17845 92434 118841 157519 133614 93863 85468 54914
5943 54914 78602 -2825 -79674 -126205 -3786 68557 45902 60162 92144 151059 120141 154254
5931 154254 167647 128640 177886 118148 54690 22935 8679 85033 120298 114018 72548 -38855
5919 -38855 31085 76055 -41088 113815 141714 125631 117293 100501 218796 145673 76363
5908 76363 -47301 24435 112960 177460 136455 77187 77509 123873 19858 -48701 57469 102807
5896 102807 133963 68302 -75861 -6879 29771 62161 126618 84715 24877 -15115 -1793
5885 -1793 -7545 17984 67426 67651 78255 71437 -32005 75079 13847 -18703 -2260 -31158
5873 -31158 99804 34539 -22073 -968 33941 35228 28775 52303 99800 132559 19569 70305
5861 70305 -16425 -43496 1278 -14966 -10094 25111 -44613 19651 19290 93833 141541 172750
5849 172750 64597 59310 119395 80566 111439 70602 65382 64523 156645 157774 94565 111110
5837 111110 63690 61827 158298 204958 138345 93443 160077 86083 147120 217185 178496 196244
5825 196244 92471 84324 79900 -13409 108911 196609 89591 97025 126025 202738 156622 170777
5813 170777 164112 127967 142816 86282 190755 282814 235090 230339 219344 149388 172740 286407
5801 286407 253788 243248 236309 232716 296936 260259 230005 182372 196621 167718 262847 223736
5789 223736 212187 315427 338179 385850 441609 405777 400581 395731 461192 412321 432358 516764
5777 516764 596525 481637 556592 686198 592459 590988 570106 578350 657425 551958 555792 602143
5765 602143 493607 529540 485931 528341 520457 484180 423933 355768 336148 319449 308693 313106
5753 313106 285762 308396 357845 224761 224106 213733 156046 144880 123417 192865 194736 180865
5741 180865 265591 270500 269648 218649 190277 212691 164329 141132 223939 258742 170200 117108
5729 117108 136121 43300 154848 222289 106616 146557 94587 88532 183544 223115 175116
5718 175116 216402 153811 118300 39125 9528 1198 80617 206234 220554 230038 259155 205985
5706 205985 178305 126754 111533 100844 136665 149125 70446 127727 143311 61626 134872 149136
5694 149136 151199 172649 147357 131249 52063 56318 -29523 -40435 26570 127281 225583 181869
5682 181869 53845 29019 74610 113534 159015 168319 34696 17455 40314 -5643 34580
5671 34580 7771 -17660 37330 50903 95245 39411 91645 136782 160366 162630 25224 -6562
5659 -6562 58297 -4206 -13680 124175 79262 111573 197082 48663 119696 144941 103828 152352
5647 152352 189433 217693 187418 204333 189860 80001 135096 109246 110061 109776 151543 195252
5635 195252 164461 164920 89024 143331 140748 123179 15685 77647 26588 126359 140384 142011
5623 142011 153990 169426 216146 139939 117539 130963 127817 179312 187961 106436 140525 203860
5611 203860 149916 102662 114382 175579 165723 132176 205465 151823 163701 141124 155420 192165
5599 192165 198961 216986 173868 93856 88322 142896 99580 144988 167225 207008 160467 264934
5587 264934 252142 165815 207296 225972 117180 15353 68534 116409 201936 130451 83304
5576 83304 80536 185788 130853 64171 117286 125661 160458 182025 165267 49406 105422 85157
5564 85157 69945 11240 -13767 55305 30369 193989 198744 141258 90430 182559 113674 146540
5552 146540 123348 179526 214742 113385 166087 158340 185316 165840 87015 170459 191208 176171
5540 176171 134382 61825 83442 122492 181433 177253 167814 231211 177069 90135 116981 90468
5528 90468 87956 94209 137858 228682 219062 215162 239974 268194 292185 265813 247338 342103 300146
5515 300146 179049 188777 247991 197040 271542 274331 209622 211774 156727 243638 210573 278698
5503 278698 329655 243497 248237 216644 143193 194333 168864 211860 271466 315755 339401 356345
5491 356345 267995 207124 206411 289882 372844 310425 255086 308846 273285 220518 136443 207580
5479 207580 277126 278064 265814 213497 253177 218687 218311 250122 276683 333427 353661 299490
5467 299490 344301 377425 279756 262720 234883 269386 309345 338210 266610 267264 325375 299283
5455 299283 287460 213318 188695 253416 284744 257013 288955 281624 317091 359569 289500 268514
5443 268514 237776 263611 252368 162662 237880 280155 299039 276412 255678 286175 278210 295435
5431 295435 336674 386412 374778 373253 341740 334594 374569 373828 414159 370909 314893 263154
5419 263154 322512 316320 250082 320071 372075 346672 411331 246239 227804 310067 289991 285974
5407 285974 329651 368618 276854 252600 321556 267471 336636 358299 273742 263138 231271 240173
5395 240173 180928 176482 298447 293543 227042 307747 339912 234134 261574 345148 317332 364170
5383 364170 377519 377665 396072 357897 393817 461645 430989 286408 350443 403211 380871 407367
5371 407367 452603 302034 297620 376849 377526 341502 329603 417960 412260 386747 341596 294518
5359 294518 275554 395483 329473 289508 397607 397243 397037 427108 410487 441487 424404 407776
5347 407776 390290 393736 345898 341576 387015 423601 381817 443342 465252 464595 366942 309333
5335 309333 320732 303844 346416 322612 394111 501046 473593 452961 381425 400780 348281
5324 348281 367570 362538 426145 435701 338136 356311 284903 385338 354577 281008 349093 385469
5312 385469 357049 401013 331068 277555 337197 316033 354947 404080 406530 344156 364695 414297
5300 414297 395609 443234 419934 423494 433457 481476 535096 512363 499568 468055 425428 340132
5288 340132 472208 570642 538503 628982 620632 605937 664979 564833 448174 456025 412277
5277 412277 438101 467123 544065 577643 507747 540169 561530 484911 438710 477239 437302 494925
5265 494925 523014 456676 512556 464602 512023 587028 501533 498379 600734 526405 486353 485309
5253 485309 489445 565007 529979 577012 533934 535951 540577 598643 612894 586162 663955 709414
5241 709414 729527 697823 650438 655340 636341 636423 574308 652820 702135 634768 646960 677385
5229 677385 625479 677305 697439 661406 691153 636112 640246 636078 707084 685186 664280 706476
5217 706476 758725 702945 706295 667704 737316 733445 745438 739758 815413 860365 792030 693906
5205 693906 612682 619524 675667 686741 641303 693954 742732 724923 748184 802078 820137 898837
5193 898837 880066 890545 859265 806621 863709 954990 971848 898410 933793 878179 832987 813173
5181 813173 866574 876328 874927 886480 891544 946244 929989 955165 961539 937669 964843 920939
5169 920939 1005175 999543 1050345 1105797 997200 982380 972644 1048282 1093927 1090324 1117525 1055024
5157 1055024 1044904 1149054 1198543 1205053 1233448 1213471 1248087 1310645 1358860 1435649 1445030 1489845
5145 1489845 1569237 1501468 1441066 1551482 1508311 1568580 1643198 1793301 1860112 1861756 1808154
5134 1808154 1821418 1828056 1902344 1923061 1923293 1859562 1800182 1859072 1920762 1758067 1729371 1794510
5122 1794510 1755893 1765239 1847053 1854636 1849960 1906757 1961549 2016134 2105779 2137416 2090231 2103031
5110 2103031 2125406 2160976 2172314 2185121 2267191 2269986 2308328 2336824 2395355 2504498 2465527
5099 2465527 2418781 2395330 2342182 2297327 2251495 2241218 2225365 2123853 2025180 1926851 1984247
5088 1984247 1944031 1947755 1978122 1961136 1902061 1899703 1940060 1914628 1857995 1875254 1944064 1937992
5076 1937992 1959869 1967706 1927168 1879435 1826258 1835763 1828443 1712941 1715075 1727846 1709152 1810933
5064 1810933 1703543 1625513 1662511 1620330 1593250 1555362 1422500 1430070 1434577 1388220 1369619
5053 1369619 1442190 1494389 1439374 1388185 1412100 1385720 1249188 1246636 1210026 1200034 1250290 1267655
5041 1267655 1225941 1200022 1162991 1204187 1338102 1265304 1235375 1262828 1219966 1182001 1110514
5030 1110514 1188665 1336615 1301246 1282773 1172300 1068859 1146481 1289324 1292552 1258069 1238105
5019 1238105 1179717 1212526 1300601 1291462 1266362 1270785 1242199 1200575 1212831 1314563 1392756 1383149
5007 1383149 1380457 1379617 1357630 1394342 1396077 1381562 1338147 1299038 1341651 1438269 1340180 1331010
4995 1331010 1342214 1346665 1416064 1491935 1496032 1404217 1436808 1432823 1485117 1414223 1385806 1471615
4983 1471615 1451713 1413575 1444151 1525162 1614528 1565677 1546231 1559750 1565720 1561743 1505475 1519601
4971 1519601 1560520 1574358 1578949 1621638 1717286 1675453 1698243 1723824 1766330 1834065 1804925 1829311
4959 1829311 1756865 1768182 1840793 1940050 2027388 2018641 2074073 2025459 2052457 2129231 2198852 2191020
4947 2191020 2235399 2277094 2277301 2236248 2234690 2257698 2195527 2135485 2146216 2200302 2226509 2126479
4935 2126479 2104541 2237555 2197961 2202327 2182073 2242447 2332865 2400366 2349900 2409666 2450873
4924 2450873 2575640 2681757 2717119 2838060 2783048 2775535 2893330 2987855 2966729 2926141 2944534
4913 2944534 2881131 2808876 2813846 2913571 2886419 2853185 2838522 2743971 2585504 2642908 2636878 2625211
4901 2625211 2593094 2552462 2481834 2475315 2510502 2554049 2517638 2452325 2540020 2530597 2617462 2587258
4889 2587258 2491680 2639224 2796791 2858122 2901928 2863618 2977072 3044114 3003384 3098195 3092321
4878 3092321 3157763 3179299 3131244 3125583 3163809 3240494 3175991 2994922 2982600 2984904 2990903 3056736
4866 3056736 3074249 2972101 2984993 3051932 3053924 3136483 3159119 3186732 3297052 3388143 3333189
4855 3333189 3313939 3315891 3336255 3228042 3321304 3440175 3399121 3503338 3500642 3576691 3533039
4844 3533039 3540525 3551126 3588675 3624836 3564710 3607683 3610063 3601515 3571208 3623094 3543175 3536202
4832 3536202 3538743 3513614 3625826 3748270 3847840 3951410 3931310 4022529 3942302 3858427 3739599
4821 3739599 3740421 3758237 3713801 3695945 3680177 3540133 3412177 3459734 3426088 3420144 3378328 3333560
4809 3333560 3273111 3259247 3361723 3277861 3226278 3191336 3221365 3223012 3153786 3146271 3139747 3170128
4797 3170128 3169681 3113240 2981327 3059647 3164091 3109730 3118637 3029162 3055164 3081610 3026812 2926271
4785 2926271 2953736 2903728 2879211 2855431 2843018 2846955 2768492 2770901 2756662 2675580 2753241 2806945
4773 2806945 2733364 2788197 2835638 2802322 2739745 2730603 2703714 2731427 2737206 2746961 2626773 2609250
4761 2609250 2710548 2561078 2534362 2673249 2640465 2675333 2698586 2718733 2722631 2612119 2587454
4750 2587454 2602146 2645476 2545538 2528775 2659849 2646624 2543598 2492754 2633317 2698615 2814962
4739 2814962 2739391 2662244 2653652 2735828 2742703 2821653 2788159 2773141 2811083 2721556 2694322 2818593
4727 2818593 2802887 2773672 2701150 2708577 2771150 2737661 2709286 2707279 2711976 2718752 2757924 2771970
4715 2771970 2827403 2722956 2616811 2630618 2627761 2622847 2657915 2697973 2673671 2552888 2664863
4704 2664863 2744009 2690616 2649965 2649342 2751493 2722002 2718561 2741936 2674696 2742409 2831609 2825664
4692 2825664 2755068 2730809 2744083 2747356 2813645 2767107 2904682 2847805 2742252 2848785 2824897
4681 2824897 2858995 2874653 2858514 2817723 2829728 2837625 2932155 2895069 2896544 2942064 2940624 2868881
4669 2868881 2824976 2843518 2853756 2879601 2945428 3007081 2929834 2927676 2953500 2964176 2929164 2947873
4657 2947873 2985738 2977918 3017110 3039062 3018625 3005887 2969419 2918188 2949774 2971140 2946905 2926028
4645 2926028 3003245 3023137 3026897 3057293 3133324 3092983 2929787 3000196 3122739 3142163 3081737
4634 3081737 3101620 3090529 3149711 3146390 3105976 3173721 3204207 3192073 3184985 3216349 3158647 3091407
4622 3091407 3071071 3123870 3148214 3150681 3222196 3193588 3163074 3234370 3173938 3127368 3080394 3244336
4610 3244336 3243582 3207299 3215049 3189934 3139231 3118290 3183181 3264217 3297000 3204183 3166796 3231655
4598 3231655 3231972 3187602 3176253 3178236 3333788 3275276 3321788 3366627 3325722 3356484 3201887 3184246
4586 3184246 3190220 3239818 3273491 3225469 3242613 3273745 3235923 3313656 3376737 3377266 3470339 3425213
4574 3425213 3348881 3371015 3436858 3405998 3440239 3438919 3391741 3403812 3320927 3313025 3403434 3293576
4562 3293576 3325211 3337237 3301254 3280779 3335302 3415526 3394829 3498284 3419443 3378995 3310433
4551 3310433 3362734 3386389 3370301 3474499 3482973 3445718 3410244 3428125 3514714 3460885 3463312 3547692
4539 3547692 3542738 3622573 3550660 3548543 3613780 3639071 3660285 3680888 3621347 3614180 3580591 3492953
4527 3492953 3432865 3521871 3592814 3625693 3633363 3624537 3619674 3562909 3574217 3566466 3652882 3648690
4515 3648690 3726376 3745652 3691345 3704613 3644551 3561534 3599038 3619864 3688694 3787065 3798396
4504 3798396 3895749 3979829 4012651 4033044 3935176 3851805 3874385 3855961 3871144 3766935 3745081
4493 3745081 3719313 3657740 3613227 3606118 3571964 3579287 3558417 3640102 3614609 3554085 3656099 3669826
4481 3669826 3692671 3691853 3686328 3620138 3694738 3703615 3725887 3838647 3895257 3999883 4039230 4168086
4469 4168086 4239662 4208361 4220907 4195387 4215557 4123929 4042583 4054681 4033654 4033768 3996580 3940998
4457 3940998 4032738 4024253 4022268 4125232 4200527 4248385 4207638 4292302 4430571 4463522 4582420
4446 4582420 4668299 4723523 4737096 4781251 4926802 4947715 5045207 5229057 5233042 5367069 5481714
4435 5481714 5563856 5617909 5666291 5731801 5540665 5460553 5273567 5155424 5045875 5013128 4904451
4424 4904451 4745000 4612110 4456415 4269316 4253638 4229015 4158529 4131430 4084167 4053130 3972561
4413 3972561 3878179 3690135 3664593 3614051 3662706 3581157 3588602 3602918 3482230 3420529 3438911
4402 3438911 3543976 3464793 3433668 3393657 3383874 3336783 3455101 3456589 3436032 3449100 3365538
4391 3365538 3409115 3393848 3309461 3354268 3424631 3473432 3502510 3419894 3450046 3409497 3428500
4380 3428500 3525266 3528383 3500513 3477325 3475968 3602472 3525126 3511978 3472621 3514426 3448206 3441704
4368 3441704 3464934 3447550 3474293 3511555 3695642 3702441 3647948 3548610 3507774 3553723 3584391
4357 3584391 3718023 3732137 3740716 3744827 3619243 3634321 3614167 3680879 3643332 3609364 3619205 3562746
4345 3562746 3580255 3521956 3516585 3564488 3575136 3507784 3524136 3466690 3388257 3374466 3353701 3387415
4333 3387415 3409907 3434207 3475658 3475079 3424930 3348171 3234403 3259862 3221921 3103522 3059958
4322 3059958 2990923 2959910 2942882 2997603 2990228 2953767 2972435 2827459 2800008 2827636 2752637
4311 2752637 2792117 2838828 2841499 2763704 2717007 2729913 2762686 2732274 2607290 2544511 2595025
4300 2595025 2690375 2744251 2684522 2753488 2728877 2724678 2717180 2673236 2598408 2513892 2492932 2566355
4288 2566355 2678230 2647517 2639532 2684547 2584241 2479885 2521979 2511770 2475886 2514169 2581051
4277 2581051 2642980 2626809 2599574 2560002 2491422 2420247 2398117 2475598 2449627 2460292 2542694
4266 2542694 2585935 2564411 2568599 2520718 2534269 2536023 2586048 2561914 2461604 2439866 2490059 2554605
4254 2554605 2700697 2644287 2767505 2766507 2646496 2673963 2673157 2779010 2938510 2937508 3062373
4243 3062373 3197114 3423576 3682629 3880075 4087620 4242781 4141937 3954356 3761611 3487203
4233 3487203 3112079 2902971 2905864 2839060 2711779 2717796 2731662 2616410 2557182 2552875 2520213
4222 2520213 2504827 2513789 2453151 2492838 2610562 2542949 2527857 2517885 2536175 2519000 2457149 2512854
4210 2512854 2492091 2565754 2570368 2510367 2421343 2417501 2446700 2561472 2554358 2489386 2416218 2444267
4198 2444267 2537803 2527980 2591869 2582053 2508424 2521222 2536941 2521716 2546366 2630542 2676586 2704099
4186 2704099 2654123 2587393 2599828 2554198 2570058 2635059 2571405 2551580 2403535 2368633 2360983
4175 2360983 2444493 2394845 2380314 2386336 2385663 2336534 2297271 2251277 2267591 2264944 2272047 2275794 2300814
4162 2300814 2345704 2232428 2257986 2151216 2128831 2233321 2244236 2206910 2235891 2246759 2247491
4151 2247491 2248374 2285312 2321390 2254805 2189160 2199058 2302591 2297347 2239548 2256176 2321399 2250341
4139 2250341 2222422 2136772 2120007 2249874 2238240 2219126 2194146 2208045 2255551 2218897 2126905
4128 2126905 2110163 2132414 2131276 2156928 2202500 2191037 2200617 2286735 2270384 2217652 2219344 2291608
4116 2291608 2198965 2277107 2341722 2265803 2266312 2313801 2350533 2331769 2416408 2370075 2280253 2296345
4104 2296345 2284524 2300094 2356809 2353199 2271165 2264111 2283911 2259802 2297950 2196935 2211010 2184493
4092 2184493 2159269 2267590 2345520 2258658 2216455 2250193 2199119 2251792 2234718 2167833 2216642
4081 2216642 2210265 2215943 2160006 2246432 2291455 2332973 2408681 2442269 2346372 2258213 2301725 2382028
4069 2382028 2357590 2316439 2330820 2317977 2288648 2281561 2219749 2257211 2290471 2326484 2364291 2353798
4057 2353798 2462220 2511529 2564515 2475114 2298285 2386983 2465643 2465593 2524305 2614361 2590496 2501365
4045 2501365 2501512 2572628 2535910 2451535 2432273 2459952 2464534 2457306 2524793 2527762 2518583 2486674 2454950
4032 2454950 2428393 2463116 2505060 2523433 2490003 2439842 2495322 2569841 2505516 2586812 2641039
4021 2641039 2636644 2699939 2665746 2598348 2568992 2577402 2629988 2607004 2669776 2617189 2538987 2578465
4009 2578465 2610091 2584000 2606869 2697873 2679738 2685186 2737225 2756037 2766143 2692708 2610167 2590903
3997 2590903 2499339 2536418 2623315 2651952 2699301 2863500 2796348 2849288 2887330 2832918 2784464
3986 2784464 2824430 2851692 2877996 2883191 2910003 2884832 2848034 2849956 2875373 2866898 2873612 2953521
3974 2953521 2879995 2900226 2975563 2970300 2926231 2956581 2959494 3020955 2994730 2989680 2941601 2993742
3962 2993742 3026270 2939884 2927218 2864533 2922229 2966364 2891619 2883064 2805215 2826762 2849999 2868202
3950 2868202 2948547 2914959 2939866 2962872 2941959 2972747 2957387 2946505 2858261 2917102 2889248
3939 2889248 2901695 2897749 2867810 2835843 2816551 2794647 2780782 2747730 2690725 2722634 2651371 2659109
3927 2659109 2807433 2783501 2755959 2820748 2884266 2891087 2813341 2791257 2850457 2897289 2835580
3916 2835580 2866725 2931363 2916290 2882520 2818031 2776287 2797741 2763652 2734278 2696706 2702563 2756217
3904 2756217 2727897 2726674 2745398 2756660 2792766 2772871 2745883 2734369 2717596 2778276 2750619 2719895
3892 2719895 2703521 2730379 2691560 2647916 2742946 2720174 2659537 2667536 2708890 2709487 2736086 2710993
3880 2710993 2687421 2690558 2682969 2666723 2652622 2737442 2700157 2597073 2677974 2684743 2639772 2718313
3868 2718313 2701127 2713038 2713267 2669847 2641578 2638411 2658609 2736361 2787939 2818349 2776037 2781522
3856 2781522 2872130 2805772 2834600 2748252 2773653 2804310 2738967 2855777 2882385 2824931 2849155
3845 2849155 2823639 2883197 2946732 2894833 2828812 2862330 2986529 3002866 2971485 3057829 3028913
3834 3028913 3069834 3031089 3046765 3123933 3168999 3148204 3128717 3105930 3246050 3296903 3218024
3823 3218024 3262311 3262339 3284124 3309638 3382149 3405245 3449823 3525693 3579435 3670788 3801549 3874276
3811 3874276 3883652 3906583 3895131 3981506 4116825 4034523 4113609 4212982 4230300 4357242 4422641
3800 4422641 4416293 4395824 4422569 4386554 4305188 4309838 4333645 4335744 4334998 4451320 4531365 4530606 4473717
3787 4473717 4513256 4585734 4600695 4686636 4731840 4658840 4703260 4805519 4783562 4882511 5038634
3776 5038634 4956235 4995564 5112875 5032535 5025731 5021021 4986460 4971849 5009239 5027677 4985241 5034076
3764 5034076 5255841 5330389 5385640 5420562 5457596 5453422 5457020 5439125 5364643 5237599 5273435
3753 5273435 5304603 5270873 5229479 5125396 5062281 4999368 4999386 5095632 5215836 5211923 5232141 5190200
3741 5190200 5206362 5225134 5250581 5404548 5465041 5366701 5378577 5412901 5417626 5346677 5318549
3730 5318549 5347780 5423683 5460109 5441724 5473423 5480076 5517564 5589517 5550765 5567121 5680115
3719 5680115 5739390 5758371 5846931 5926302 5895806 5874099 5879719 5867657 5999332 5966886 5913351
3708 5913351 5935916 5937039 5852721 5836719 5782856 5755142 5789146 5915611 6024539 6024351 6083988 6097272
3696 6097272 6103491 6102277 6104525 6165171 6282008 6303261 6272108 6354477 6435408 6428667 6517223 6587895
3684 6587895 6694758 6764383 6865084 7025486 7209450 7376146 7493079 7528482 7626357 7788649
3674 7788649 7785596 7854266 7935514 8048189 8094609 8220417 8278078 8335930 8360246 8341990 8489594
3663 8489594 8536954 8549422 8497208 8434567 8397296 8234588 8126448 8010034 7807205 7655273
3653 7655273 7638492 7458012 7380287 7278781 7187852 7028874 6826041 6685405 6502244 6423411
3643 6423411 6294875 6175910 6159211 6037230 5948854 5844078 5774807 5835773 5712110 5573006
3633 5573006 5527899 5537481 5407273 5423574 5299542 5274149 5353479 5342564 5318350 5334787 5286036
3622 5286036 5231345 5276507 5268311 5253623 5284788 5147699 5139473 5194425 5172390 5256201 5172682 5112055
3610 5112055 5159024 5243729 5191146 5107243 5195041 5219349 5210178 5072249 5213435 5182419 5165671
3599 5165671 5217923 5198609 5158159 5299744 5345337 5325196 5294089 5323039 5393653 5522635 5536850
3588 5536850 5475904 5520667 5576805 5573088 5550337 5553204 5628825 5730836 5768417 5814252 5777946 5874014
3576 5874014 5996707 6060748 6068183 6129937 6174426 6247502 6315312 6349743 6310825 6370690 6456831
3565 6456831 6553106 6599724 6680711 6772687 6734809 6853644 6949277 6883544 6913791 6975629 6992795
3554 6992795 6976050 7048431 7131868 7125601 7163001 7318316 7323991 7372004 7545497 7733285 7779005
3543 7779005 7775813 7929169 8040615 8099214 8186399 8276111 8420532 8471525 8564388 8634794 8736561
3532 8736561 8833398 8883786 8931663 9017762 9019151 9110475 9177486 9090343 9182887 9293275 9302436 9373565
3520 9373565 9506754 9724943 9837802 9795034 9954931 10224827 10423395 10589720 10685281 10864072
3510 10864072 11193584 11561128 11900750 12209129 12557572 12947522 13312062 13750335 14261176
3501 14261176 14644350 15048418 15485321 15840623 16222071 16610413 16955995 17254189 17558557
3492 17558557 17885084 18194616 18511165 18787751 19300879 19904326 20419169 21045865 21812387
3483 21812387 22654237 23744909 24850194 26219046 27750741 29469835 31545150 33810544
3475 33810544 36438949 39405261 42854382 46923821 51773477 57519166 64432715 72552111
3467 72552111 81911547 92261247 102732328 112397050 120313791 125124451 126029173 122726361
3459 122726361 115673833 105617709 93872212 81818984 70506839 60565368 52471700
3452 52471700 46037666 40979675 36939131 33757430 31229898 29052746 27274191 25682692
3444 25682692 24431820 23327409 22276831 21437164 20637221 19958698 19415496 18916016 18317183
3435 18317183 17904902 17552333 17178436 16857399 16533926 16261149 16025993 15775876 15504092
3426 15504092 15188119 15044831 14902049 14785837 14570852 14493459 14404005 14235633 14137000 14035573
3416 14035573 13950447 13816476 13662973 13522259 13364726 13242137 13244195 13119801 13111751 12998443
3406 12998443 13037784 12977882 13000505 13038030 13130599 13051520 13112286 13266940 13398762 13538064 13673095
3395 13673095 13915004 14234873 14533965 14814241 15202737 15745548 16349865 17081232 17893582
3386 17893582 18820855 19841828 21137737 22350755 23413082 24202409 24809518 24982113 24568229
3377 24568229 23896951 22965622 21828946 20627368 19400200 18316342 17252301 16213318
3369 16213318 15390852 14645870 13926016 13481913 13030415 12710864 12563698 12398145 12245177
3360 12245177 12108902 11909744 11767150 11714282 11725631 11608301 11499010 11567421 11425678 11397266
3350 11397266 11356922 11305309 11289210 11262819 11182815 11158492 11119606 11076875 11096457 11214889 11304080
3339 11304080 11529036 11647982 11919777 12275413 12448126 12650770 12837844 13028618 13326590
3330 13326590 13382596 13468798 13600035 13557551 13522823 13449843 13404778 13385388 13372404 13382323 13345689
3319 13345689 13232525 13181796 13077684 12860771 12726562 12615990 12414889 12183030 11992404 11866808
3309 11866808 11838154 11792647 11822528 11832386 11932605 11976493 12153906 12247258 12356384 12561552 12806489
3298 12806489 13078610 13312260 13601862 13952901 14310437 14642499 14979067 15417033 15935551
3289 15935551 16312275 16723521 17110162 17560360 17910029 18174082 18575327 19005114 19438343
3280 19438343 19692148 19943505 20282283 20684381 21228845 21900382 22643242 23513104 24385821
3271 24385821 25279021 26261295 27070583 27678045 28113650 28262508 28298086 28207353 27899056 27238808
3261 27238808 26405690 25613734 24646061 23585209 22545941 21511447 20444366 19429255 18408451
3252 18408451 17569607 16745298 16044410 15532282 15033677 14608794 14184677 13916693 13635032
3243 13635032 13396667 13141228 13074742 12935662 12773967 12648176 12483383 12374931 12241606 12176284
3233 12176284 12093637 11905498 11857336 11877102 11870264 11880528 11794744 11751883 11746156 11787550 11855010
3222 11855010 11914504 11945735 12054734 12093336 12097273 12268705 12345826 12414773 12628523 12830389 13054217
3211 13054217 13285561 13548451 13831504 14136068 14330721 14430797 14527313 14687310 14865017 15033624
3201 15033624 15000996 15254570 15507190 15830372 16374255 16778616 17325426 18026265 18838927 19811795
3191 19811795 20939903 22011376 23141986 24108514 24735744 25021576 24811473 24270302 23414961
3182 23414961 22579043 21924309 21470817 21108330 20925452 20945340 21112013 21388256 21760764 22187982
3172 22187982 22564136 22874956 23027837 23033549 22781439 22341033 21778524 21371819 21156107 21020270
3162 21020270 21028380 21222707 21555667 21899990 22493660 23070701 23753813 24589450 25496100 26390567
3152 26390567 27169904 27567285 27704333 27588307 26994198 26105001 25278504 24560829 24049300
3143 24049300 23683776 23472351 23369324 23264167 23259484 23270934 23370129 23521353 23712450 23985472
3133 23985472 24464184 25067518 25651186 26273576 26964910 27955887 29058417 30308627 31584856
3124 31584856 33034019 34631045 36282052 38141975 40475787 43291276 46625266 50657409
3116 50657409 55536694 61324053 67919216 74560417 80179020 83963376 84879659 82374360
3108 82374360 77669898 71326627 64339894 58511423 54288640 51202693 48817120 46783441
3100 46783441 44998636 43454834 42289102 41369567 40579528 39965748 39341049 38570065 37699109
3091 37699109 36863024 35960023 35266677 34962479 35043084 35431248 36211642 37077291 37975783 38777388
3081 38777388 39492350 39906391 40539328 41283550 42312117 44068853 46494928 49609354 53030327
3072 53030327 56144309 58644218 59847267 59269792 57242732 54408038 50773333 47227676
3064 47227676 44283685 42087293 40258463 38834354 37840993 37090763 36510132 36183206 36190431
3055 36190431 36308539 36459812 36720761 37107717 37584702 38151269 39016494 39917415 41142604
3046 41142604 42427615 43952155 45512433 47300120 49026679 50965037 52955102 55294286
3038 55294286 57894538 61042475 64256345 68317189 73185037 79321383 86524080 95714651
3030 95714651 106775172 121110670 137371004 155704716 174849761 191503860 200808797
3023 200808797 207137076 201404858 185975267 171411152 146691988 126511967 109499251
3016 109499251 94802205 84297083 76554179 70074871 64223022 59616731 55035934 51243664
3008 51243664 48355549 45987211 44156640 42705166 41414529 40272482 39111362 38108090
3000 38108090 37186599 36645890 36332632 36115426 36202097 36743190 37628154 38694357 40053796
2991 40053796 41801592 43247534 44000567 44436501 43637244 41672800 39715798 36817954 34178551
2982 34178551 31903436 29953619 28486348 27300804 26290743 25569393 24945521 24416013 23942913
2973 23942913 23514928 22955936 22574858 22373773 22083509 21854911 21709299 21560206 21374612
2964 21374612 21002128 20749334 20487953 20194371 19861946 19460144 19098083 18782234 18386132
2955 18386132 18055415 17709932 17431346 17262814 17170746 16989487 16819758 16711320 16568207 16429287
2945 16429287 16338514 16344699 16352211 16324856 16313999 16271646 16257005 16174982 16070139 15940886 15906938
2934 15906938 15838241 15842478 15865978 15845877 15916746 16027756 16100765 16209229 16385442 16429913 16530820
2923 16530820 16573328 16607022 16669386 16670574 16605425 16552668 16341274 16219729 16121287 15823174 15550247
2912 15550247 15312045 15181376 15104901 15016385 14982189 15076963 15102849 15125463 15076809 15204007 15337710
2901 15337710 15355360 15409769 15455063 15460752 15564642 15636559 15640188 15666434 15618004 15610535 15606723 15669392
2889 15669392 15725346 15819541 15817058 15994192 16147018 16228360 16362219 16449450 16617402 16862892
2879 16862892 17102161 17333810 17544555 17798341 18043346 18335257 18694501 19004755 19494553
2870 19494553 20009174 20495372 21088885 21772293 22366078 23057018 23647803 24269269 25000171
2861 25000171 25641500 26150162 26824110 27491311 27959680 28414501 28810508 29315036 29819560
2852 29819560 30329826 30952499 31664530 32464104 33312660 34325210 35505141 36815991 38202058
2843 38202058 39715514 41352692 43133827 45245157 47723442 50317418 53336730 57041540
2835 57041540 61529874 66844935 72330984 77047989 80914141 82663784 81933264 80030249
2827 80030249 77284817 74286844 72539633 72088908 72821133 74265324 76679007 79815768
2819 79815768 83816186 89171261 96123478 105084150 115638702 126706736 136581420 143001941
2811 143001941 144728640 140366502 130521220 117453593 102252979 88125271 76316377
2804 76316377 67535690 60978778 55838829 51643709 48008098 44830822 42194145 40081478
2796 40081478 38312120 36904031 35708877 34706920 33779552 33006671 32395977 31870817 31476448
2787 31476448 31051415 30929953 30760404 30742163 30913962 31236969 31724737 32492206 33307380 34120979
2777 34120979 34768932 35129172 35149415 34986879 34702975 34344405 34141215 33958331 33761581 33119038
2767 33119038 32087586 30898032 29585709 28230176 27152858 26344296 25688170 25271965 25022881
2758 25022881 24960047 24742035 24707598 24717974 24758741 24918496 25093991 25276991 25460076 25871388
2748 25871388 26416290 26934955 27572264 28310743 29260434 30428248 31843785 33415866 35101021
2739 35101021 37117958 39401805 42086162 45319957 49057286 53541198 59080814 65316686
2731 65316686 72185106 79082764 85280183 89874448 92136878 91547361 88019933 82008176
2723 82008176 74205670 65895814 58033112 51174872 45708777 41532884 38388890 35971843
2715 35971843 34078055 32488601 31243682 30138173 29359236 28695652 28194723 27846057 27766751
2706 27766751 27779558 27967720 28454857 29171693 30003013 31013118 32122682 33094150 33823054
2697 33823054 34529988 35133549 35475534 35929725 36547115 37429142 38503998 39774111 41157665
2688 41157665 42632008 44116323 45344255 46374756 47050611 47369295 47424632 46887425 45897749
2679 45897749 44754806 43254058 41512412 39368428 36932091 34592104 32262226 29949890
2671 29949890 27821800 25895024 24254368 22559169 21230099 20057675 19152578 18381739
2663 18381739 17582824 16935193 16347909 15842274 15316843 14869317 14481486 14209162 13919695
2654 13919695 13706716 13540221 13400778 13275838 13234568 13103964 13097929 13018010 12999033 13088682
2644 13088682 13143267 13076594 13104579 13096995 13106314 13148421 13230812 13410367 13542003 13635101 13753227
2633 13753227 13996038 14111280 14177925 14210954 14223962 14320249 14407288 14400893 14354000 14274129 14117023
2622 14117023 13909273 13648467 13340963 12981296 12610733 12218196 11886068 11597189 11301019
2613 11301019 11123462 10951579 10832790 10684373 10491250 10349018 10140615 10064723 10016906 10007451
2603 10007451 9985622 10071397 10023450 9894385 9971603 9899753 9910063 9982554 10002541 10024223 10018469
2592 10018469 9977133 9837352 9765813 9640341 9647662 9559019 9523888 9454171 9371884 9378527 9313147
2581 9313147 9318134 9293951 9386483 9412184 9333976 9383523 9532746 9604676 9633176 9694040 9734728
2570 9734728 9817835 9925593 10065171 10242077 10300975 10410717 10563865 10724906 10776798 10836799
2560 10836799 10913553 11024717 11268878 11372889 11536970 11654376 11753529 11916788 12036736 12058297
2550 12058297 12081689 12046295 11992469 12008474 11962380 12002919 12049411 12194519 12334221 12475655 12609118
2539 12609118 12802320 13082310 13402534 13689747 13977462 14363879 14867730 15260795 15566685
2530 15566685 15870570 16095900 16320746 16457327 16588557 16735389 16790184 16594661 16336988 16136921
2520 16136921 15943485 15814381 15605957 15397667 15162926 14919733 14683326 14398714 14255226
2511 14255226 14021208 13829598 13736043 13585664 13538707 13450045 13393460 13298604 13168714 12988030
2501 12988030 12719760 12445527 12216162 12180937 12062690 11849019 11929004 12019142 11977434 12071664
2491 12071664 12103016 12081243 11995732 12013812 11926031 11801626 11840627 11741149 11626961 11543274 11571659
2480 11571659 11446814 11421617 11479652 11515904 11475138 11369684 11423170 11459344 11480221 11475406 11470531
2469 11470531 11452659 11424211 11383430 11293745 11201489 11184692 11035614 10882960 10845089 10759953 10790314
2458 10790314 10821644 10675858 10619161 10586087 10553608 10586289 10556967 10560886 10640458 10694080 10693412 10735393
2446 10735393 10890943 10930593 10937503 11058830 11267074 11414955 11596765 11776097 11969396 12306455
2436 12306455 12607303 12926740 13216889 13531855 13715978 13933493 14179485 14333706 14373477 14452415
2426 14452415 14554493 14678564 14850508 14986856 15102259 15313727 15427367 15340589 15225775 15094472
2416 15094472 14871493 14632529 14415446 14312737 14353140 14250446 14246027 14321026 14395102 14359514
2406 14359514 14473004 14511891 14611568 14620424 14551813 14657735 14738481 14790537 14817004 14763990 14773293
2395 14773293 14843019 14816985 14818666 14851572 14827106 14779686 14834285 14829100 14974414 15176707 15340666
2384 15340666 15499185 15604305 15788828 15962452 16163787 16412959 16644163 16881882 17099557
2375 17099557 17413051 17741190 18084251 18401776 18612850 18883780 19139158 19324042 19451885
2366 19451885 19697666 19851871 20142431 20256737 20371114 20675608 20851027 21038590 21127318 21364361
2356 21364361 21652041 21833168 21951794 22202362 22425493 22597083 22770625 22881443 23077755
2347 23077755 23196925 23357050 23556511 23638012 23911510 24109623 24252635 24440729 24732786 24942591
2337 24942591 25267365 25576854 25926479 26350405 26635569 26947465 27320078 27543780 27816010
2328 27816010 28030190 28228721 28469856 28731045 28980713 29342416 29662076 29991773 30162292
2319 30162292 30249712 30012496 29713605 29342777 28879342 28565566 28386789 28383561 28460984 28622616
2309 28622616 28592564 28695565 28802399 29070339 29343380 29671116 30077325 30365582 30671593 31021066
2299 31021066 31473707 31898942 32321413 32773719 33064941 33438920 33921066 34436477 35084551
2290 35084551 35787880 36677663 37740664 38873932 39868740 40770523 41872056 42891785 43918856
2281 43918856 44901779 46074630 47209958 48442523 49704022 51272744 52806763 54653021
2273 54653021 56862869 59431310 62470697 66011533 69816602 73953037 78047064 82390298
2265 82390298 86673562 91118614 96201741 101612686 107709011 115243613 124248733 134377728
2257 134377728 145248591 157279849 169893733 184029683 201222547 222139587 245587026
2250 245587026 267005276 282408983 289786662 280700609 260080073 235350194 201962855
2243 201962855 171424781 149541716 134037638 123047740 115507577 110072416 106190900
2236 106190900 103708425 102515924 102402499 102445081 102100991 101043554 97953925 93198629 88012298
2227 88012298 81605838 75540437 70957195 67436999 64806611 62491466 60662269 59147765
2219 59147765 57782604 56557703 55429097 54516374 53733037 53017278 52520583 52195115 51906032
2210 51906032 51699197 51454675 51238740 51118935 51060804 51109918 51286578 51484499 51850223 52053380
2200 52053380 52325046 52556647 52730480 52586691 52455715 52331600 52053125 51885705 51967146 52121025
2190 52121025 52397374 52734605 53069812 53329351 53646136 54233009 54800703 55323894 56003050
2181 56003050 56773395 57866979 58938991 60105049 61371263 62710397 64200402 65726904
2173 65726904 67426966 69444938 71646927 73944592 76314957 78642303 80996935 83435203
2165 83435203 85666054 87911383 90034406 92156913 94235662 96123995 98199134 100556137
2157 100556137 103130491 105911028 108929270 111996036 115320550 118911271 122579516 126326332
2149 126326332 130131670 134203592 138765996 144257157 150732284 158142754 166380427 175480040
2141 175480040 186032628 198435742 213020803 230441807 251924414 278661862 312318633
2134 312318633 354161602 402593840 450911413 491986315 518405935 523145588 504512597
2127 504512597 470442891 425066645 377271822 339144144 315058534 302933248 300841224
2120 300841224 305932204 312477687 316634622 315804532 304700072 284444383 261087051 232832135
2112 232832135 206005522 186040433 171899625 161945259 154961498 149598814 144831520 139930938
2104 139930938 134452301 128060401 121246499 114272287 107571427 101767566 96989058 93094115
2096 93094115 89758361 86884933 84635825 82582277 80763329 79136963 77736315 76633810
2088 76633810 75631799 74800781 74390614 74220987 74205949 74571927 74872030 75260530 75862754
2079 75862754 76639498 77901574 79480652 81557728 84287436 87640460 91822811 95969129
2071 95969129 99495034 101839838 102130976 99989886 96208916 91356464 85859444 80915351
2063 80915351 77179131 74416282 72108840 70209930 68554126 67081685 66075789 65765551
2055 65765551 65835805 66489141 67582691 69254219 71662997 74499427 78025458 82197342 86673583
2046 86673583 91082996 95443732 99184301 102495318 106669382 111554222 118003244 125128958
2038 125128958 131050152 135212183 134966773 128824744 120940017 110446770 98728934 89926718
2030 89926718 83715297 79585361 76596635 74286965 72286417 70757573 69490572 68586792
2022 68586792 68058502 68038742 68432312 69357190 70562474 72228036 74052263 76208689 78738401
2013 78738401 81681401 85207206 89316813 93902976 99195651 105326236 112685435 121380613
2005 121380613 131997665 145078811 160933151 179933608 202176339 227170829 251904263
1998 251904263 272134546 284694974 286106164 274008088 251969669 223818957 192068001
1991 192068001 163156260 140845735 124556410 112429433 103119926 95692101 89266836
1984 89266836 83604893 78428925 73752258 69622348 65883479 62641626 59770097 57191924
1976 57191924 54887033 52738563 50814899 49037965 47354454 45684989 43974280 42339530
1968 42339530 40907203 39606897 38308148 37124909 35936043 34846544 33729299 32675648
1960 32675648 31783215 30922531 30048053 29238355 28403210 27464680 26588157 25996414 25424191
1951 25424191 24695470 24142252 23677200 23252197 22903901 22617062 22408632 22161467 21931104
1942 21931104 21754885 21502807 21156904 20860594 20579661 20212846 19671478 19219527 18961346
1933 18961346 18611038 18219356 18012002 17955397 17848882 17773775 17526452 17406429 17141979 16762587
1923 16762587 16317139 15902245 15510645 15164505 14791971 14509305 14109688 13851933 13655271
1914 13655271 13436426 13181043 12884592 12657068 12439059 12276328 12111582 11783624 11613814
1905 11613814 11478153 11247043 11171860 10847676 10717272 10626801 10446220 10271539 10062802 9938991
1895 9938991 9748965 9564290 9382387 9240929 9147324 9016071 8885381 8668207 8582311 8506420
1885 8506420 8391728 8311769 8194953 8121707 8136210 8090046 7939928 7862544 7932032 7930715 7779659
1874 7779659 7755216 7816151 7790505 7783373 7829248 7833559 7875490 7741062 7655722 7650084 7588127 7492028
1862 7492028 7466921 7385747 7329579 7386097 7317681 7283723 7224415 7201093 7046037 7018478 7007221
1851 7007221 6875998 6985476 7032897 7046687 7095991 7087399 7097686 7069665 7042679 7078239 7161180
1840 7161180 7295764 7357026 7301073 7311779 7395290 7468586 7562104 7722674 7819913 7939537 8169815
1829 8169815 8428543 8528668 8659892 8815828 8921526 8941680 8873913 8762576 8702684 8508197
1819 8508197 8284609 8178635 8094175 8139182 8063047 8135974 8145310 8104459 8103499 8138120 8025125
1808 8025125 8024130 7916704 7924246 7931761 7834886 7751965 7764090 7851021 8017362 8009730 8046360 8129278
1796 8129278 8094682 8155133 8329992 8320046 8286789 8338791 8454744 8537291 8725840 8773284 8844898
1785 8844898 9155367 9271845 9319877 9415170 9601845 9730379 9939967 10071825 10300227 10510049
1775 10510049 10702577 10893885 11205509 11370980 11679961 11960634 12230948 12612753 12952387
1766 12952387 13291731 13789101 14129372 14559277 15094336 15752674 16451499 17259717 18062278
1757 18062278 19003384 20120103 21089862 22089241 23118996 23927117 24889685 25802713 26861776
1748 26861776 27938178 29012738 29964368 30587087 30831096 30402128 29612732 28745753 27710016
1739 27710016 26795323 26215582 25866959 25712729 25872446 26241761 26709030 27335547 28030217
1730 28030217 28918878 29750358 30541923 31373741 31955433 32443008 33069537 33725455 34300433
1721 34300433 34746555 35067898 35320440 35381145 35261034 35154017 35084120 35319273 35523227 35630677
1711 35630677 35573048 35142427 34298853 32957976 31376310 29623419 27774639 25941764 24303403
1702 24303403 22946496 21766629 20859369 20268813 19870734 19720985 19618470 19424929 19147491
1693 19147491 18840961 18412344 17749687 16837458 15847614 14817495 13785882 12989977 12350769
1684 12350769 11720152 11035495 10596316 10192719 9762922 9356665 8889783 8531387 8278758
1675 8278758 8013826 7732250 7397667 7108987 6907012 6804408 6566617 6339453 6103744 6041992
1665 6041992 5921830 5798470 5606475 5437800 5233654 5162626 5148722 4975379 4736079 4734223
1655 4734223 4688316 4566128 4445988 4390101 4307871 4239172 4196519 4096893 4091416 4010702 3835613
1644 3835613 3763621 3717778 3685287 3570177 3611299 3620321 3517216 3477280 3429497 3494259 3437626
1633 3437626 3271663 3263916 3209121 3122442 3042754 3030647 3003432 2945544 2868947 2773573 2757137
1622 2757137 2749238 2710189 2654585 2654506 2636231 2596734 2446470 2376949 2377899 2425360 2416411 2340312 2335979
1609 2335979 2311678 2222823 2246406 2254723 2181446 2121915 2101449 2098559 2081687 2085709 2107992 2073196
1597 2073196 2031154 1977916 1976407 2020633 1954130 1957624 1860656 1763862 1765701 1802712 1819605 1784060
1585 1784060 1798191 1779102 1636106 1623431 1692698 1675745 1627013 1577238 1723331 1622153 1570654
1574 1570654 1631037 1582379 1537241 1564571 1527318 1520026 1521500 1523777 1500371 1500491 1330418 1241281
1562 1241281 1331744 1353012 1325817 1337777 1243101 1279135 1276339 1289961 1175273 1113560 1108325 1076574
1550 1076574 1078154 1094552 1182495 1197632 1111576 1153653 1113991 1136992 1180075 1160717 1048577
1539 1048577 1049934 1041462 1053505 1042324 1110465 1066234 985081 991883 971259 949473 1000787 959360
1527 959360 943887 1041261 1031114 989840 1044800 1037329 1007263 952472 954012 955214 940185 942078
1515 942078 882444 954402 1018025 944253 877001 877751 835961 857328 829753 883868 877731 961071
1503 961071 944819 838088 840212 851869 834578 878509 785912 841969 866691 843900 798095 832891
1491 832891 810624 803038 832113 830641 701435 617681 682671 777999 741135 815334 765748 724862
1479 724862 776230 817624 807685 818118 775938 690881 678990 669374 576494 622434 635331 634564
1467 634564 692083 687118 734237 777077 646703 658754 630677 617742 589108 597825 631297 651048
1455 651048 771242 690588 674529 655366 645022 710640 695142 765274 750917 700333 748872
1444 748872 779034 756442 720018 699391 738531 767066 687314 622221 616411 712271 691851 627274
1432 627274 704685 751589 804797 787374 707416 651775 626027 620253 667712 732051 740869 697330
1420 697330 728223 680119 669539 763492 802190 801639 727881 777104 726793 641345 701913 687562
1408 687562 613087 653684 634168 723063 688315 611502 611829 637691 638347 701879 623524 488973
1396 488973 509363 517464 476307 428495 442052 473996 472729 500187 503508 442768 431594 501790
1384 501790 512256 547131 560107 565239 497000 589446 535581 430634 398497 504347 614159
1373 614159 606383 551937 486559 503160 547190 416828 344237 327036 321836 436426 410336 426197
1361 426197 430755 517756 402783 381264 492455 566910 414316 353817 372651 384724 450646
1350 450646 405657 456035 469416 434861 427369 439984 383496 444742 380664 343719 406061 452787
1338 452787 372619 388162 512210 537292 426218 439537 430174 415831 461752 489824 516810
1327 516810 495919 408822 387719 365600 301986 222928 291025 298943 372571 357106 276549 270580
1315 270580 295367 292774 230398 237200 226799 335409 350423 243242 294538 333438 342479 363827
1303 363827 213107 242321 379856 418842 314758 262657 236839 274290 299342 326743 328325
1292 328325 363557 331706 278775 276167 293384 326599 309269 372239 423896 370118 371400 341651
1280 341651 340290 402465 397802 381822 375859 352970 407213 391205 423186 364641 303828 363600
1268 363600 374871 314792 388860 374356 335826 352229 367332 412226 415352 360263 321173 293833
1256 293833 317967 361921 282821 277409 324763 327810 256731 212265 283639 265587 268063 317073
1244 317073 304612 228003 276001 305974 293333 302826 262079 239502 286247 301536 225497 226380
1232 226380 301635 287611 332998 301786 416236 492664 447934 431299 283415 237194 291891
1221 291891 328505 346596 308375 284384 363055 379006 297925 278168 402206 486972 368877
1210 368877 265790 264186 308130 277191 339411 343664 226109 225822 349178 392019 352878 453492
1198 453492 481643 497209 492039 445518 474379 496881 386939 282319 222990 212693 307629
1187 307629 352210 331599 350619 256047 295353 313979 293537 327956 383352 409454 282493
1176 282493 287377 283533 258472 274539 211387 217459 222155 320258 373857 340749 283675 412055
1164 412055 415060 376218 348137 380912 330092 233488 226592 263288 240099 206542 292942 268946
1152 268946 380387 383544 301516 328012 319798 318667 382513 344151 247474 304700 319064 335567
1140 335567 349099 333581 274664 309362 321011 314200 299577 255546 317486 384079 428290 342627
1128 342627 149801 266591 307755 317455 258178 217568 359570 378837 352540 314812 330386
1117 330386 296105 304961 281188 225005 254129 267789 248860 337751 411959 373046 307025 298643
1105 298643 346641 311873 298668 310709 303210 340179 378330 420921 429791 409635 323703 238754
1093 238754 319247 316615 293233 264788 337910 282152 227244 192947 180949 269122 248543 346403
1081 346403 303930 288383 315882 357468 331472 367810 350013 339447 364780 330676 388260 410424
1069 410424 430768 447845 431321 340735 383321 426033 442698 522809 522936 517219 466120 504387
1057 504387 484050 517404 469167 466093 589095 623935 640974 597270 582124 622943 736829
1046 736829 780850 689784 655415 791923 801823 671108 609368 588975 592309 580281 641340 688300
1034 688300 671387 534290 573581 607486 585774 557882 519720 594645 526804 527410 624294 600588
1022 600588 618546 646049 664197 667316 676322 653118 716128 679360 668426 638772 678183 701970
1010 701970 745718 748091 700100 752212 665505 685673 652492 679592 768283 768449 848160 799987
998 799987 666948 613887 634103 732582 780378 735571 735350 710743 785904 858707 815449 739020
986 739020 806020 766617 808102 823417 808959 718061 737419 846313 882561 817703 844952 892761
974 892761 908020 951073 991911 1013194 984315 880337 885112 1021672 1006773 1092889 1108805 1123616
962 1123616 1112456 1184106 1238171 1312381 1354732 1455271 1501683 1557060 1632145 1618334 1661339
951 1661339 1817344 1885615 1995597 2100831 2194837 2255588 2400707 2495131 2507662 2559217 2671931
940 2671931 2797716 2900240 3150757 3363527 3654960 3951017 4192546 4440111 4748762 5167210
930 5167210 5536330 5984442 6323606 6838081 7402999 8176479 9121060 10234424 11803254
921 11803254 13847017 16213560 19532233 22889135 25659793 27463372 28559619 25830950
913 25830950 23357552 20231372 15377004 12376134 10191462 8771875 7578898 6897097
905 6897097 6219414 5794952 5262868 4905431 4539318 4304377 4110352 3888864 3566788 3416633
895 3416633 3044562 2884640 2781788 2697184 2502174 2389204 2328034 2172494 1989249 1901307
885 1901307 1851405 1900239 1892420 1678325 1594630 1612542 1551432 1571712 1460591 1350213 1169567
874 1169567 1136614 1128056 1108332 1113789 1130070 1062669 990791 868767 901342 936938 947958 947027
862 947027 985438 985606 975076 923512 862358 809006 803267 805103 751959 737301 750743 633750
850 633750 570664 602804 587181 593894 624973 598984 574471 513756 557663 535161 505534 588217
838 588217 542273 531677 513118 474608 497569 550944 557954 520040 473302 524293 495141 539934
826 539934 423789 406253 538683 505367 461619 329664 358387 471026 519650 569890 537577
815 537577 477726 408806 407442 412457 381431 262828 233296 195571 292465 339409 375264 417789
803 417789 309549 234622 277386 290063 294966 269375 334676 335659 239388 218365 308418 304416
791 304416 326760 289378 275343 383251 381366 291254 234052 239021 299775 295223 224695 261499
779 261499 178667 104376 156546 104698 204418 211543 109124 97334 140748 266019 294421 174972
767 174972 125119 146654 223344 162337 112994 122031 133230 124371 87178 36836 177432 184028
755 184028 208435 200841 98960 133067 88474 101828 38580 -47704 27015 68011 137359 189726
743 189726 179057 218454 178602 224217 237971 143015 176281 129502 34503 20128 74742 96868
731 96868 57178 84388 81822 138455 88007 46816 80791 12619 -16555 50060 73950 101703
719 101703 141552 185366 107357 171573 191397 132381 109306 91868 131564 225152 194773 103006
707 103006 73696 59388 25273 98885 91845 76610 56221 58933 35902 113369 135949 166205
695 166205 73745 47000 38805 -35064 42481 92301 102314 47228 31040 92682 141106 188808
683 188808 131840 16378 -37486 -15508 14524 -11 -16829 -60950 -1140 61377 102654 184972
671 184972 120444 12501 61296 49939 64282 11496 -66627 16857 -20485 95433 20152
660 20152 12212 113140 49724 69900 28503 32479 -40964 -43449 29780 111492 44532 46475 93105
647 93105 137666 107830 112597 52705 156396 122978 111272 6257 87825 112276 101874 75781
635 75781 93863 158673 203683 123859 55751 112553 86397 97247 40894 84864 90141 6224
623 6224 92684 91297 124402 186866 112880 126534 60289 49827 61178 48622 -13127 -29512
611 -29512 32942 80949 58928 60512 -29615 -4238 -91657 -45 52581 84022 25073 72792
599 72792 77574 2914 -65065 -5855 62235 -73786 -52805 25990 21133 21709 -41738 -8616 12704
586 12704 -60364 -43878 -80319 29338 104427 64650 106908 84433 35064 85915 88699 62695
574 62695 12420 -28465 16622 46530 60046 8213 -57306 54955 60231 33694 -19560 -39119
562 -39119 34800 24867 28774 20457 -6291 22898 -59004 -63898 43175 83552 146256 85169 36109
549 36109 -6763 -41961 -64510 -95264 -122848 -124716 -123485 -14485 16563 -6853 -28100 -35112
537 -35112 -23870 -5724 -59746 -212420 -154088 -9648 2964 32333 -42277 -77533 -51452 -49233
525 -49233 17524 88955 8184 -61941 -72983 -57969 -57262 -110446 -15449 -15335 -40990 -30232 18247
512 18247 124266 95667 -24872 -56371 49215 23699 -62300 -49221 -73553 -48783 -43901 -78826
500 -78826 -79619 -92548 -81306 87723 -19922 48844 -6288 -39231 -75432 -92462 -83209 16122
488 16122 29237 -47935 -60567 4168 12688 23047 -6270 -16719 13197 -78970 12837 77324
476 77324 51420 -47015 -65362 -63470 -83211 -78377 3906 15018 -2051 85528 69071 35860
464 35860 -32254 -136755 -109681 -47073 -63874 -17364 14740 81870 -55694 -72240 -53192 -170626
452 -170626 -147511 -134779 -113867 -145161 -186330 -92474 -66029 -119905 -79515 11112 33829 -60998
440 -60998 -127266 -161689 -143498 -65861 71364 21157 59171 116428 72324 54162 13671 -111368
428 -111368 -69192 -125755 -64532 -34700 762 -29512 -64879 -21300 -92155 -121254 -60516 -63139
416 -63139 -80169 -155203 -214795 -190094 -113899 -76068 -26344 -111207 -20473 -40752 -108513 -72781
404 -72781 -66115 -51884 -71778 -61911 -30411 -78259 -109434 -41326 -20964 -79654 -178216 -156750
392 -156750 -145313 -72154 -8593 -29487 -118326 -150966 -28955 -147616 -115541 -78837 -82212 -113628
380 -113628 -220673 -216523 -178958 -77972 -70416 -148738 -179264 -20871 12545 -7279 -83563 -151016
368 -151016 -165649 -69634 -27688 -136827 -151103 -68361 -70735 -72870 -201499 -193997 -128866 -172537
356 -172537 -125242 -49401 -42035 -16135 -57426 -63148 -78772 17455 -51819 -35193 33462 -73605
344 -73605 -133315 -185199 -183209 -167391 -213964 -144978 -3215 -76636 -106633 -30840 -91628 -71980
332 -71980 -69285 -121421 -117999 -29224 -70257 -53042 10971 4746 -134234 -214980 -141847 -138010 -86422
319 -86422 -79626 -101266 -123554 -98867 -176536 -220099 -54174 -28947 -103527 -32196 -39169 -5538
307 -5538 -68852 -153795 -76892 -70520 -89888 -123893 -167811 -165994 -129240 -133706 -141896 -260181 -169968
294 -169968 -173800 -202253 -158373 -167919 -74743 -89840 -61054 -82696 -86474 -77312 -61186 -70846 -88166
281 -88166 -179103 -136815 -56808 -105000 -238277 -270760 -233387 -113818 -41797 -82482 -60522 -79559
269 -79559 -146317 -138808 -155327 -175148 -58234 -51681 -84048 -125629 -140802 -117929 -141028 -97034
257 -97034 -72393 -63924 -54051 -44252 -34821 -48403 -117165 -130640 -57289 18530 -63678 -131348 -105154
244 -105154 -56573 -101568 -140187 -145170 -156510 -209041 -117041 -132573 -139266 -145763 -238087 -175946
232 -175946 -124046 -180416 -223455 -221197 -149926 -110830 -211632 -130270 -102341 -159394 -183621 -200875
220 -200875 -186504 -158273 -152341 -68954 -81440 -20419 -157071 -131787 -44809 -184042 -196600 -193093
208 -193093 -162238 -136315 -163272 -210836 -184273 -162206 -205547 -210437 -138463 -96603 -110772 -95540
196 -95540 -129269 -175284 -93854 -112583 -111935 -70251 -105619 -148446 -166006 -153525 -70559 -59857
184 -59857 -75285 -65654 -118592 -197225 -123129 -80786 -190712 -169708 -109952 -107706 -117475 -83538
172 -83538 -159799 -168746 -205924 -203954 -185609 -176792 -162430 -219974 -189131 -199267 -138902 -88053 -49751
159 -49751 -120016 -218216 -231180 -180255 -218458 -218414 -206311 -90868 -98311 -114358 -171158 -185473 -151326
146 -151326 -204478 -121636 -166620 -189517 -190287 -182050 -174799 -161487 -75831 -81729 -98800 -113984 -245042
133 -245042 -221404 -170048 -122533 -190712 -203046 -143724 -170031 -147590 -136970 -119801 -81875 -33440
121 -33440 -129296 -147518 -148947 -98023 -14705 -62125 -69303 -121688 -114780 -127129 -142978 -170769 -132976
108 -132976 -125476 -131954 -165188 -142528 -185968 -149579 -188006 -147588 -145933 -115758 -125839 -137361
96 -137361 -93810 -102327 -171284 -222281 -210047 -229657 -185848 -172265 -178759 -190878 -64998 -66140
84 -66140 -187666 -152098 -149652 -222189 -240506 -250658 -231301 -196574 -196705 -196346 -200756 -157063 -153971
71 -153971 -267823 -195895 -82756 -106302 -177714 -175416 -145482 -78350 -57377 -128293 -163509 -175171
59 -175171 -208082 -182118 -166783 -159291 -229117 -218169 -228810 -173693 -165386 -211216 -218243 -237898 -241667
46 -241667 -224224 -230959 -178325 -208275 -210697 -148714 -178526 -210859 -138835 -70722 -100472 -178014
34 -178014 -217700 -240216 -224407 -220404 -154895 -183010 -233283 -236083 -196203 -182751 -200355 -187290
22 -187290 -158507 -140904 -117319 -185685 -187499 -174120 -144890 -191536 -196782 -170083 -231341 -209196
10 -209196 -198109 -234986 -202589 -145741 -178642 -141360 -178394 -167861 -135931 -124815
0 -124815
$$ Imaginary data points
##PAGE= N=2
##DATA TABLE= (X++(I..I)), XYDATA
16383 -4221367 -4169821 -4118033 -4061241 -4031515 -4000111 -3949828 -3951077 -3898125 -3791743 -3742733 -3728729
16372 -3728729 -3655849 -3586391 -3540578 -3512355 -3520447 -3505005 -3453758 -3382193 -3311126 -3274281 -3199243
16361 -3199243 -3180489 -3149366 -3098622 -3038205 -3038478 -3015173 -2942528 -2900236 -2944220 -2853007 -2850982 -2870791
16349 -2870791 -2785758 -2663672 -2684628 -2709368 -2613003 -2526448 -2513395 -2519148 -2357573 -2322081 -2275312
16338 -2275312 -2301396 -2257183 -2159744 -2134058 -2146697 -2103748 -2106689 -2161029 -2089093 -2013909 -1999337
16327 -1999337 -1921929 -1890651 -1856112 -1766089 -1715353 -1755794 -1699812 -1713045 -1658565 -1676282 -1574150
16316 -1574150 -1504876 -1418568 -1401228 -1336436 -1387766 -1384205 -1333366 -1300518 -1255925 -1248254 -1172079 -1189355
16304 -1189355 -1192716 -1135222 -1068159 -1046522 -1064755 -1084817 -999177 -940490 -937526 -881667 -798951 -776967
16292 -776967 -759346 -709624 -603104 -550154 -584582 -573579 -535314 -574175 -568953 -433904 -471967
16281 -471967 -495401 -368827 -360813 -313930 -274118 -334391 -310246 -196636 -145147 -162029 -125058
16270 -125058 -71462 -54317 -37763 -20954 20703 2333 13076 24025 19661 -1399 26308 172271
16258 172271 227265 186651 194210 222025 247172 217391 224317 249934 346209 399508 383926 436735
16246 436735 504722 491403 490494 549476 537170 550708 583985 612468 657021 593928 619159 585355
16234 585355 669838 838098 836614 763941 770619 800451 927252 924783 901189 977948 900156 857397
16222 857397 857937 914768 957908 958402 1073375 1048770 1036571 1030338 1094465 1193424 1218924 1203154
16210 1203154 1182312 1204577 1251153 1307787 1343102 1332781 1280206 1254413 1246082 1325068 1389918
16199 1389918 1245718 1204971 1320646 1347624 1311322 1290592 1392847 1361110 1421072 1468056 1347081
16188 1347081 1403902 1394375 1433833 1548364 1534610 1517761 1513177 1530368 1541442 1520564 1515498 1507279
16176 1507279 1593553 1601752 1587780 1594738 1592140 1651993 1565453 1556600 1613363 1592129 1597732 1721067
16164 1721067 1851302 1806189 1751637 1741311 1680192 1799936 1809043 1778613 1729245 1735250 1767837
16153 1767837 1810594 1850151 1880312 1819751 1825601 1820967 1880866 1896281 1814170 1776034 1812273 1861548
16141 1861548 1895571 1934921 1965887 1959638 1964266 2003272 1941091 1957151 1947035 1922461 1914623 1817400
16129 1817400 1917491 2011457 1947846 1919672 1968880 2020790 1974048 2056533 2055736 1964663 1937147
16118 1937147 1941028 1981001 1967164 1965337 1915656 1983160 2056930 2056646 2136407 2061148 1978688 2070311
16106 2070311 2083299 1988076 2009639 2080630 2116487 2033996 2143350 2135481 2071125 2037181 2013550
16095 2013550 2048675 2017127 2084174 2003292 2036072 2106373 2138502 2041997 2080558 1988777 1911356
16084 1911356 2070461 2169904 2180409 2174303 2150931 2136051 2223048 2154484 2199043 2203713 2212334 2142924
16072 2142924 2069375 2038459 2035446 2112425 2193283 2187610 2155633 2048254 2118079 2206102 2111852
16061 2111852 2055629 2075229 2064468 2098530 2124269 2064497 2031684 2106132 2054857 2033970 2127547
16050 2127547 2234015 2214134 2142988 2142355 2118132 2146635 2138450 2152652 2064848 2058688 2075828 2138245
16038 2138245 2103399 2029911 2142896 2082051 2077239 2133052 2218768 2220452 2190583 2142237 2144328 2154129
16026 2154129 2110418 2060481 2085336 2125647 2090500 2128722 2163833 2213327 2146114 2123868 2103640
16015 2103640 2149233 2224261 2188552 2137655 2151636 2167457 2164642 2135907 2122435 2140960 2168930
16004 2168930 2278754 2281110 2248770 2137172 2168902 2189996 2092781 2039658 2123470 2175332 2189895
15993 2189895 2241646 2181783 2158073 2194174 2223765 2243175 2256958 2252290 2174203 2073286 2123169
15982 2123169 2119840 2090754 2008176 2124197 2129140 2161826 2195271 2177767 2199829 2057703 2142533
15971 2142533 2201751 2107088 2220254 2221575 2202663 2199342 2161327 2216132 2262943 2217252 2153061
15960 2153061 2206217 2176412 2075668 2139306 2222205 2223638 2225634 2307568 2254377 2165393 2210165
15949 2210165 2112183 2111096 2145835 2252975 2260687 2229891 2180320 2176338 2269952 2191393 2185979 2194339
15937 2194339 2284963 2274937 2363222 2403398 2284352 2239480 2238004 2163875 2164925 2060309 2016045
15926 2016045 2130669 2234869 2253826 2165353 2132022 2196370 2267006 2299939 2220060 2208406 2156197
15915 2156197 2125886 2160498 2196659 2236465 2168291 2214853 2132507 2149830 2110703 2131635 2121098
15904 2121098 2160391 2311310 2247781 2187132 2204518 2198609 2122628 2176531 2149971 2144527 2211553
15893 2211553 2157829 2238891 2260691 2151901 2156869 2233882 2183298 2094255 2097841 2213665 2124061
15882 2124061 2151784 2163186 2109035 2196315 2199315 2139633 2170738 2109666 2142911 2182100 2190733 2124192
15870 2124192 2054572 2200614 2262675 2235849 2136902 2110091 2138594 2176976 2134111 2139247 2085285
15859 2085285 2120806 2148380 2151947 2146878 2132623 2168428 2177756 2231432 2216331 2276337 2225813 2187097
15847 2187097 2255594 2266732 2149538 2093978 2187506 2199786 2120586 2073978 2200009 2205579 2134209
15836 2134209 2167516 2200679 2166489 2162525 2162871 2160549 2167917 2125996 2178189 2198500 2190730 2145299
15824 2145299 2148688 2143601 2137157 2130074 2207240 2231576 2138745 2052433 2150455 2184516 2174734 2177450
15812 2177450 2180667 2202495 2171375 2177146 2196690 2232444 2241659 2164705 2140990 2161883 2164392 2128675
15800 2128675 2213395 2227755 2224066 2211515 2147629 2192233 2244240 2243627 2212845 2240686 2274717 2206958
15788 2206958 2122160 2164453 2152594 2283921 2213545 2192885 2156814 2257462 2260292 2269982 2314828
15777 2314828 2343183 2300582 2133695 2212477 2327701 2350327 2286630 2189703 2160171 2172990 2167163
15766 2167163 2169675 2122013 2101154 2101195 2181878 2190591 2209730 2332191 2225515 2107283 2159877 2214220
15754 2214220 2200495 2194202 2247153 2122614 2101857 2084273 2181789 2195032 2179984 2209949 2187212
15743 2187212 2155642 2151388 2218657 2268959 2195145 2190994 2128594 2075469 2110966 2143363 2201669 2158257
15731 2158257 2200057 2207078 2259458 2118712 2189453 2276600 2237799 2124290 2133673 2260369 2321567
15720 2321567 2261746 2291706 2253202 2211131 2146750 2169175 2170076 2287481 2348198 2267508 2182350
15709 2182350 2164766 2110276 2082948 2063364 2103617 2191929 2229103 2227717 2223038 2214116 2220290 2263180
15697 2263180 2232559 2290509 2320306 2239121 2205208 2341908 2311126 2313741 2282146 2226156 2176793
15686 2176793 2117377 2088724 2172429 2165146 2127590 2199603 2204343 2165461 2164644 2146070 2205658 2252714
15674 2252714 2255512 2202410 2189056 2239937 2322876 2310436 2202794 2293329 2197979 2116498 2151697
15663 2151697 2125578 2139121 2096523 2204309 2196751 2287835 2265865 2314021 2297883 2353125 2273116
15652 2273116 2184282 2193188 2233113 2252808 2311591 2308665 2226043 2145453 2190247 2234983 2253901 2338908
15640 2338908 2316921 2261772 2317691 2283940 2284511 2278957 2251923 2231291 2153552 2119706 2161417 2178592
15628 2178592 2200786 2238373 2289551 2314030 2214878 2103328 2198841 2201358 2208261 2186255 2172595
15617 2172595 2173928 2106441 2230100 2150950 2174852 2223332 2264338 2217366 2164903 2179548 2250684
15606 2250684 2269821 2194887 2179432 2190512 2225077 2298339 2217172 2185303 2158700 2242493 2259923
15595 2259923 2339397 2324800 2293425 2204560 2162722 2187722 2226248 2258225 2308898 2335026 2263281
15584 2263281 2219976 2278721 2292780 2215658 2164376 2185910 2225171 2260052 2307965 2218783 2235307
15573 2235307 2251959 2195518 2202161 2216373 2251827 2184673 2228779 2244837 2255152 2254500 2277216 2224796
15561 2224796 2221351 2338092 2369426 2331268 2238500 2220099 2214963 2151199 2212846 2163718 2149016
15550 2149016 2098070 2188653 2264705 2123700 2169457 2230072 2188477 2216204 2246709 2170131 2218255
15539 2218255 2266956 2283809 2197509 2269170 2233064 2237394 2230676 2209488 2142744 2155165 2197064 2127868
15527 2127868 2142750 2231769 2209340 2108790 2194075 2266033 2275096 2252070 2246993 2143113 2107905
15516 2107905 2237724 2217019 2151899 2154630 2158168 2177167 2209007 2249869 2246671 2284776 2327436 2298395
15504 2298395 2300717 2241058 2169248 2136584 2178165 2328879 2301918 2208793 2250087 2254221 2254998 2237904
15492 2237904 2203795 2184606 2145256 2255964 2232821 2280143 2298611 2244763 2205037 2186010 2202524
15481 2202524 2204093 2222287 2193582 2195799 2251285 2334075 2285193 2228258 2221544 2134037 2203726 2321150
15469 2321150 2233710 2168310 2280099 2209266 2193593 2211267 2267791 2362231 2291495 2228719 2201695
15458 2201695 2288886 2188704 2176251 2177538 2266069 2196516 2125300 2143648 2222950 2168508 2250481
15447 2250481 2282287 2253688 2254171 2292558 2241901 2203743 2178972 2173454 2238014 2248872 2334467 2267648
15435 2267648 2282691 2330785 2289457 2298398 2291331 2267314 2256072 2269143 2229818 2274265 2231777 2201629
15423 2201629 2210455 2305926 2335097 2242966 2193800 2208482 2263401 2232238 2228441 2281077 2258647 2238128
15411 2238128 2292736 2354534 2379685 2314964 2307103 2254387 2240119 2210944 2175946 2156978 2243481
15400 2243481 2200671 2265963 2366968 2332369 2296830 2222168 2266249 2277002 2142949 2172236 2219933
15389 2219933 2278673 2259387 2234650 2334588 2300825 2288669 2281678 2237491 2169517 2209429 2238995
15378 2238995 2226085 2333716 2281313 2247259 2227878 2154967 2247579 2273764 2260653 2233287 2193194
15367 2193194 2297899 2271077 2248518 2241184 2320261 2240885 2226846 2278374 2251294 2291817 2189002
15356 2189002 2308396 2390649 2332969 2322187 2314620 2266590 2191530 2182406 2150418 2312455 2312064 2326743
15344 2326743 2238379 2231010 2248220 2261475 2297417 2302335 2302129 2243489 2313718 2447667 2430529 2411333
15332 2411333 2344007 2259004 2272257 2173052 2109020 2174774 2224503 2257116 2232239 2247856 2252193
15321 2252193 2366327 2316107 2239665 2232616 2200086 2196605 2259766 2233274 2274142 2339496 2322611
15310 2322611 2421463 2336684 2224232 2196594 2258478 2272485 2264442 2306944 2334292 2284215 2202739
15299 2202739 2188667 2273206 2263258 2221589 2124904 2213275 2234152 2339658 2285404 2229867 2341109
15288 2341109 2425773 2429259 2331362 2273893 2217003 2115331 2147755 2161860 2178411 2236738 2300329
15277 2300329 2242730 2271569 2335438 2274808 2229862 2320907 2403312 2376224 2310200 2305651 2314930 2353215
15265 2353215 2306914 2243636 2264810 2272401 2260477 2233474 2216017 2229169 2232116 2174440 2244802 2289923
15253 2289923 2240283 2211829 2109174 2147689 2202949 2221778 2380914 2370713 2335084 2321787 2371483
15242 2371483 2436286 2313877 2306822 2378115 2349344 2420668 2400333 2345286 2363029 2344730 2401066
15231 2401066 2283592 2258924 2167733 2184859 2274524 2227758 2227940 2262027 2244080 2229491 2298675
15220 2298675 2344534 2372241 2342772 2330130 2293773 2215225 2217643 2201239 2228004 2337980 2267296
15209 2267296 2322311 2292090 2095624 2146758 2244880 2183686 2223396 2212318 2189044 2262109 2332774
15198 2332774 2421504 2393811 2249865 2284436 2378806 2362975 2283692 2388880 2377990 2284559 2348552
15187 2348552 2244155 2191657 2271617 2297126 2333135 2355642 2362621 2280387 2283079 2265319 2338222
15176 2338222 2384077 2360887 2365123 2326194 2261937 2221098 2267189 2286040 2348159 2464577 2403095
15165 2403095 2359641 2326480 2288538 2325544 2262691 2262744 2255784 2200272 2246717 2190047 2171653 2141103
15153 2141103 2179767 2221917 2229383 2248723 2230342 2241988 2318136 2357972 2349126 2389866 2409922 2349137
15141 2349137 2344029 2352701 2354589 2346848 2255270 2387342 2377780 2277666 2264917 2342833 2353072 2356675
15129 2356675 2336432 2314543 2366570 2314892 2237034 2265926 2255850 2358074 2337662 2301190 2351789
15118 2351789 2327312 2402753 2372075 2313116 2365644 2421484 2454042 2415635 2351482 2322864 2296615
15107 2296615 2361658 2289501 2291627 2306583 2347283 2304972 2294743 2288533 2293769 2311050 2243404 2287507
15095 2287507 2271845 2279815 2443907 2466164 2352353 2313302 2221209 2207527 2202586 2218997 2250639
15084 2250639 2229970 2306577 2384857 2323045 2271289 2291692 2385657 2347178 2240953 2200360 2196278
15073 2196278 2212891 2223402 2336107 2425582 2407287 2441695 2327617 2366389 2371822 2309365 2285637
15062 2285637 2271279 2313460 2353978 2326976 2294773 2403338 2286946 2286252 2290970 2351658 2397403
15051 2397403 2374076 2358915 2355212 2355237 2359569 2354166 2257478 2270165 2374757 2410516 2405186 2324197
15039 2324197 2326262 2357147 2336601 2299004 2374038 2371830 2364377 2339536 2345426 2427559 2478286 2384641
15027 2384641 2250845 2240045 2234110 2334038 2307875 2293889 2285833 2298484 2231351 2278493 2265810
15016 2265810 2296664 2311558 2307676 2318623 2389261 2405793 2397137 2307509 2347299 2360032 2380500 2423289
15004 2423289 2428536 2372772 2332829 2351217 2331609 2273136 2255064 2270384 2280473 2271280 2299722 2397983
14992 2397983 2357104 2338353 2305381 2317867 2427931 2383932 2264394 2316134 2460094 2473713 2406464
14981 2406464 2368097 2407744 2265377 2237410 2297874 2236601 2342793 2389257 2300785 2296901 2379330
14970 2379330 2433242 2373851 2337234 2337392 2263442 2355630 2339209 2355197 2401990 2417555 2404516 2384919
14958 2384919 2350902 2310997 2323291 2345633 2293777 2307333 2332881 2372813 2363212 2358341 2283510 2288729
14946 2288729 2333741 2284667 2243751 2245275 2220358 2260781 2260540 2304840 2452143 2440702 2391168 2456312
14934 2456312 2433668 2354692 2298039 2288300 2316430 2356845 2337757 2363138 2352937 2340892 2336293 2270534
14922 2270534 2303265 2423243 2403125 2378283 2459065 2498824 2414277 2315460 2304747 2302784 2240820
14911 2240820 2297653 2359159 2315187 2379334 2435373 2471463 2393053 2384685 2384761 2347421 2332839 2312102
14899 2312102 2319441 2368446 2361489 2362354 2463119 2409293 2372721 2356818 2338434 2273285 2268706 2315893
14887 2315893 2342777 2294336 2405639 2422820 2356135 2350566 2257909 2235599 2249387 2297322 2342891
14876 2342891 2314842 2354376 2355686 2231215 2275502 2331516 2379287 2335957 2350084 2355605 2391880
14865 2391880 2425971 2354772 2322127 2310254 2318884 2327628 2271966 2332182 2320584 2302565 2315483 2292163
14853 2292163 2311296 2339542 2371091 2274344 2235492 2329660 2413251 2364867 2411291 2436236 2309514
14842 2309514 2310010 2369356 2417165 2419823 2280075 2277488 2368551 2381615 2417528 2330056 2441457 2345900
14830 2345900 2347487 2375275 2367744 2339865 2250219 2284897 2372539 2407906 2409479 2423337 2401484 2409578
14818 2409578 2381871 2373187 2380542 2385910 2352243 2362130 2348910 2339763 2495224 2549303 2460980 2374870
14806 2374870 2323383 2343535 2363637 2317547 2377382 2377669 2379981 2405610 2364916 2343550 2338058 2376752
14794 2376752 2313288 2306322 2395807 2394732 2377917 2349342 2389604 2349409 2278195 2427152 2466835
14783 2466835 2388169 2396972 2368652 2406232 2352971 2329909 2393487 2403186 2334439 2289837 2334800 2356833
14771 2356833 2339404 2312725 2293563 2312826 2430370 2455507 2393363 2377723 2461856 2497346 2460581
14760 2460581 2410583 2358298 2333133 2348228 2442175 2483697 2522954 2490042 2409977 2411214 2345065
14749 2345065 2378608 2410134 2348278 2346579 2426281 2388392 2349049 2366675 2352137 2276521 2395554
14738 2395554 2430002 2381918 2333357 2299462 2370243 2356299 2300416 2371740 2453193 2433073 2395046
14727 2395046 2461187 2394030 2438336 2341000 2452572 2494409 2479597 2405194 2316660 2397505 2338087
14716 2338087 2372849 2354266 2416118 2446528 2449239 2531475 2482111 2550627 2590012 2477389 2396144
14705 2396144 2432374 2379005 2395450 2412349 2405164 2375266 2441507 2480838 2437192 2409356 2402556 2380911
14693 2380911 2416057 2484045 2435272 2454846 2427070 2474356 2477650 2445611 2360413 2357779 2256444
14682 2256444 2281836 2258297 2273185 2325310 2327687 2365999 2368579 2386713 2397380 2417401 2386728 2363442
14670 2363442 2309831 2361669 2396589 2340789 2362849 2329087 2389103 2416825 2399531 2408133 2284629
14659 2284629 2317207 2321978 2296823 2432881 2405039 2441794 2291797 2280935 2354546 2371863 2429276
14648 2429276 2528502 2423903 2394712 2355856 2353069 2449190 2463322 2448431 2430321 2405372 2470785
14637 2470785 2449472 2440545 2374371 2294541 2347617 2421794 2490125 2431524 2343243 2329122 2365064
14626 2365064 2340661 2353636 2338617 2422230 2382770 2386197 2346129 2290661 2469985 2443353 2364024
14615 2364024 2400346 2406531 2396315 2363543 2429986 2449893 2461812 2468811 2520483 2458969 2452515 2349378
14603 2349378 2380510 2422086 2446881 2448357 2401980 2454968 2558248 2410837 2428095 2452988 2452622
14592 2452622 2477888 2450871 2509816 2462005 2375386 2339530 2395581 2383613 2369530 2370406 2424469 2388812
14580 2388812 2372737 2363080 2322824 2274034 2303943 2328973 2464020 2437617 2467640 2414650 2409224
14569 2409224 2424771 2423068 2446765 2485660 2477695 2417912 2419386 2339805 2464546 2576796 2655171
14558 2655171 2588897 2451905 2405294 2297276 2419871 2317815 2341987 2451794 2451976 2434901 2430718
14547 2430718 2337878 2305134 2426952 2447000 2463239 2363196 2414603 2535169 2483747 2391641 2462052
14536 2462052 2468271 2481766 2411816 2519341 2525758 2437733 2523926 2576682 2512335 2429263 2300984
14525 2300984 2344747 2449314 2426679 2454820 2355707 2316161 2358328 2425447 2437448 2434145 2446171
14514 2446171 2427972 2384876 2437738 2442712 2413981 2384113 2405586 2432759 2375588 2397781 2441087
14503 2441087 2502331 2415405 2436307 2527944 2482408 2436256 2456560 2450726 2578120 2571011 2416832
14492 2416832 2354193 2378972 2330556 2425176 2354767 2357299 2384205 2450172 2467840 2375874 2403975
14481 2403975 2447265 2453554 2470289 2418221 2359044 2442575 2396517 2415790 2398670 2334788 2470112
14470 2470112 2462915 2471020 2462708 2468505 2478557 2450774 2585443 2437000 2337960 2411377 2437540 2453223
14458 2453223 2370587 2319936 2373024 2432999 2555266 2540603 2408638 2435292 2490525 2464182 2471206
14447 2471206 2441098 2495128 2471653 2470657 2472532 2379900 2413925 2397229 2403151 2447493 2420313 2475526
14435 2475526 2519183 2524346 2492491 2564602 2513029 2414732 2347154 2318864 2336661 2426651 2473256
14424 2473256 2537747 2540726 2388479 2335602 2411690 2352786 2401537 2459470 2503241 2422353 2369234
14413 2369234 2361223 2353195 2367835 2368768 2442348 2462541 2478527 2589673 2615280 2560432 2484680 2463670
14401 2463670 2445207 2469278 2514447 2484976 2529472 2517633 2418162 2412074 2359643 2364748 2397535 2433695
14389 2433695 2439809 2371194 2420844 2520666 2550776 2575652 2569522 2504781 2456600 2401367 2404729 2310830
14377 2310830 2304171 2351481 2378339 2441839 2519004 2496591 2505548 2545798 2675510 2646561 2543280
14366 2543280 2549367 2519545 2469084 2553192 2570916 2515172 2486531 2526637 2459296 2505945 2539736
14355 2539736 2540486 2560211 2441282 2530264 2520616 2480648 2489769 2394738 2527900 2478028 2483711 2419854
14343 2419854 2456149 2482564 2459048 2443993 2441248 2512642 2547056 2545345 2444786 2377313 2317838
14332 2317838 2345095 2410342 2466359 2503688 2527115 2495752 2529326 2567589 2561274 2468246 2503869
14321 2503869 2453772 2437986 2422416 2427422 2401399 2445404 2525732 2590126 2496007 2339561 2511005
14310 2511005 2492026 2491817 2461151 2390033 2361451 2290289 2366238 2436348 2508320 2505598 2545040 2481372
14298 2481372 2383077 2340992 2386004 2466530 2405818 2493199 2556190 2553462 2510373 2505272 2606829
14287 2606829 2503596 2428978 2484453 2584523 2512849 2461700 2503972 2452893 2392254 2381803 2501468
14276 2501468 2539831 2499194 2510093 2465423 2426010 2433214 2460515 2444156 2478980 2490837 2415279
14265 2415279 2456959 2544786 2550006 2487986 2453956 2540823 2568395 2490336 2486248 2452962 2493038 2521973
14253 2521973 2493170 2417380 2492125 2475389 2493534 2551491 2465377 2485024 2458964 2432308 2486517
14242 2486517 2572171 2570010 2427318 2380911 2511076 2556437 2626102 2614250 2516535 2449980 2402785
14231 2402785 2411688 2417729 2465763 2456757 2421506 2568439 2558475 2475048 2493774 2530188 2549601 2498530
14219 2498530 2466250 2513440 2587798 2533694 2469891 2595059 2559089 2580809 2607195 2570551 2487353
14208 2487353 2505557 2623310 2573167 2509414 2512460 2632832 2631907 2570557 2551679 2568542 2580686
14197 2580686 2556090 2616596 2600369 2538540 2480919 2452026 2446498 2410963 2485164 2527739 2496379
14186 2496379 2513182 2521265 2454659 2477649 2477539 2538209 2503140 2494766 2537343 2559585 2532925 2589907
14174 2589907 2485163 2565780 2516253 2465283 2485468 2484797 2511358 2480215 2551347 2509804 2473586
14163 2473586 2517401 2647966 2607563 2633211 2602762 2572996 2627655 2622651 2582435 2568501 2515419
14152 2515419 2511620 2410080 2416242 2619634 2631548 2534446 2482206 2479743 2447552 2427892 2423229 2455536
14140 2455536 2483198 2446989 2411578 2489039 2513130 2467465 2395816 2354787 2409040 2469734 2474649
14129 2474649 2486148 2464463 2415055 2470490 2504290 2497031 2464938 2444557 2441296 2428748 2472105 2486583
14117 2486583 2492121 2537706 2540629 2591245 2623044 2575507 2608377 2600559 2562176 2619269 2627743 2645740
14105 2645740 2549418 2519203 2481430 2510954 2491530 2425930 2526298 2517437 2483411 2589356 2596125
14094 2596125 2517877 2488089 2552904 2476401 2484795 2572656 2552375 2443531 2516099 2476403 2460787
14083 2460787 2526655 2571155 2491636 2489613 2524581 2573870 2570192 2538843 2602560 2498014 2496062 2561735
14071 2561735 2626836 2583010 2513704 2532396 2453109 2321113 2367759 2465452 2478936 2511204 2569124
14060 2569124 2484309 2402737 2455700 2552043 2539721 2562131 2541521 2543846 2521177 2559082 2536674
14049 2536674 2557989 2450144 2438504 2480059 2565178 2449925 2511948 2596581 2557532 2564672 2536191
14038 2536191 2506579 2443802 2527815 2498612 2535913 2495155 2516985 2528783 2588546 2570058 2548218
14027 2548218 2537308 2574981 2609797 2630366 2572824 2490298 2580474 2540527 2586621 2591182 2502273
14016 2502273 2568294 2571069 2526914 2593940 2600618 2478982 2448026 2478468 2437624 2484048 2554944
14005 2554944 2593526 2560034 2601341 2623397 2549832 2451597 2605592 2584483 2459569 2441170 2487487
13994 2487487 2477096 2524350 2542014 2562382 2525143 2525834 2627844 2686322 2648011 2556542 2511171
13983 2511171 2531349 2518231 2544001 2679526 2644592 2510580 2521601 2608916 2505204 2578560 2626776
13972 2626776 2657194 2648015 2558847 2552752 2662815 2676527 2620064 2544650 2462712 2539329 2623648
13961 2623648 2650111 2676480 2629990 2606703 2580586 2539902 2595149 2617829 2636284 2651702 2646067
13950 2646067 2642840 2554939 2604437 2594600 2617673 2610808 2480353 2472612 2544254 2530901 2504712 2452916
13938 2452916 2553024 2536349 2563116 2503925 2506666 2564421 2488600 2563166 2575721 2554975 2540758
13927 2540758 2561347 2581675 2561510 2498243 2495128 2543977 2540467 2529502 2543158 2567500 2598416 2541253
13915 2541253 2568478 2603847 2495571 2658468 2648490 2561203 2549700 2518760 2592150 2533958 2562742
13904 2562742 2611737 2645342 2646267 2552422 2480120 2615785 2646179 2557142 2596948 2588120 2536545 2573977
13892 2573977 2580370 2512678 2521625 2568003 2534476 2532826 2530271 2457756 2560043 2597473 2619267 2637239
13880 2637239 2680737 2571352 2524266 2541262 2642357 2691301 2626619 2644956 2663142 2660659 2559442
13869 2559442 2596782 2571579 2508022 2543858 2640057 2578313 2565176 2587879 2621552 2554094 2587104
13858 2587104 2567944 2670370 2631099 2648482 2605432 2535123 2633116 2732212 2572190 2485350 2611340
13847 2611340 2656749 2625081 2507639 2554180 2592367 2600668 2513801 2538127 2598447 2565535 2499625
13836 2499625 2453658 2562921 2636708 2567062 2565708 2458831 2531825 2614176 2591806 2550576 2552511
13825 2552511 2627556 2690618 2585604 2542140 2576357 2580165 2617079 2634680 2576394 2554068 2600062
13814 2600062 2571428 2547807 2594919 2653542 2640806 2594796 2558041 2573455 2591601 2619152 2630159
13803 2630159 2588673 2632060 2675255 2751915 2698524 2643003 2605609 2593981 2595672 2659026 2601635
13792 2601635 2459108 2495047 2516130 2647028 2613300 2492788 2566995 2648075 2619986 2657669 2531884
13781 2531884 2468107 2544538 2565381 2507061 2528859 2571559 2589084 2607843 2621987 2475500 2585438
13770 2585438 2580949 2562746 2543338 2596522 2670358 2633498 2743945 2763931 2701339 2568523 2525676
13759 2525676 2552949 2532433 2542233 2569948 2539997 2564110 2616484 2610662 2632552 2644003 2590255 2497211
13747 2497211 2511263 2526582 2408040 2497658 2592418 2547822 2563325 2659924 2692331 2664284 2586952
13736 2586952 2613905 2647033 2719932 2703906 2684408 2611502 2542106 2628091 2656489 2612028 2637716
13725 2637716 2572002 2513032 2548402 2588582 2623111 2676934 2665423 2641849 2608068 2645925 2677216
13714 2677216 2644828 2629119 2622135 2592968 2669038 2686996 2649821 2773812 2788324 2723220 2640272
13703 2640272 2586741 2594946 2591008 2589126 2583502 2588004 2623850 2650370 2621657 2659290 2584593 2619132
13691 2619132 2635885 2620037 2639651 2638344 2669979 2715005 2757956 2687333 2678610 2710028 2681749 2624911
13679 2624911 2579346 2583444 2538775 2552990 2628469 2648660 2608600 2613053 2641728 2604757 2589050 2577332
13667 2577332 2686797 2670782 2593625 2548170 2619276 2650023 2619752 2560257 2526202 2526104 2557239 2619376
13655 2619376 2646530 2634790 2722769 2722967 2657577 2566770 2554419 2635588 2684830 2709807 2672311 2680725
13643 2680725 2612989 2575383 2642303 2674729 2636908 2644085 2693075 2767231 2748770 2780742 2716278
13632 2716278 2728503 2629140 2588609 2646550 2742114 2679949 2575710 2602454 2632120 2573057 2541317
13621 2541317 2558961 2601801 2677234 2657736 2668297 2712904 2710651 2660313 2755240 2716027 2698105
13610 2698105 2564337 2625294 2657695 2607342 2588069 2642266 2638657 2625807 2663690 2573852 2516675
13599 2516675 2521412 2613634 2647512 2633048 2618155 2662360 2685840 2543292 2548680 2575836 2653914
13588 2653914 2705520 2666592 2635745 2633883 2625796 2588581 2537466 2647201 2685923 2674439 2760085
13577 2760085 2720585 2637645 2651575 2660094 2759918 2788196 2688369 2732281 2731135 2672294 2646040 2630849
13565 2630849 2685981 2697344 2654541 2647408 2641399 2645046 2631341 2615691 2607683 2669490 2684410 2606411
13553 2606411 2595743 2623384 2597825 2677636 2634870 2621682 2683342 2687715 2655256 2712407 2715051 2645283
13541 2645283 2692666 2704075 2652866 2678990 2691116 2674766 2677596 2618661 2677566 2696582 2728085
13530 2728085 2667244 2606808 2718993 2636771 2672134 2692700 2719421 2799872 2735742 2726597 2678253
13519 2678253 2641878 2586742 2635602 2674063 2693282 2719530 2657895 2703182 2709038 2595088 2597676
13508 2597676 2571493 2578797 2726266 2712421 2725580 2824494 2739442 2732348 2741017 2676242 2751978 2730443
13496 2730443 2591321 2630211 2676875 2699685 2699193 2663340 2738206 2735446 2724183 2588577 2562334
13485 2562334 2609189 2704685 2687441 2617836 2590635 2631606 2591632 2659765 2811707 2797959 2693374
13474 2693374 2715850 2681039 2697904 2652555 2724049 2709034 2583925 2669161 2652465 2582504 2649475
13463 2649475 2658071 2662594 2718643 2747094 2743649 2648776 2738115 2810323 2760981 2769231 2715633 2647056
13451 2647056 2635745 2566365 2597720 2647038 2662883 2674995 2631723 2728784 2737017 2653732 2676496
13440 2676496 2746407 2679137 2580626 2623227 2682647 2776448 2778080 2702885 2581641 2632114 2687235
13429 2687235 2760918 2741453 2713256 2657271 2775041 2740145 2577116 2634930 2675710 2702895 2724600
13418 2724600 2741791 2683802 2674625 2680919 2695058 2703054 2652165 2684396 2675940 2740571 2773134 2707058
13406 2707058 2724684 2716828 2664661 2679964 2638171 2690798 2709052 2704707 2757191 2857209 2786480
13395 2786480 2739684 2651284 2591778 2637105 2707026 2721515 2705605 2675328 2714614 2590421 2574520
13384 2574520 2698475 2708471 2666637 2657710 2718445 2679795 2658851 2627368 2661174 2557848 2630536
13373 2630536 2631342 2625503 2591731 2602785 2634445 2558732 2588863 2609495 2627663 2650844 2665721 2724358
13361 2724358 2694966 2690178 2703717 2634062 2646819 2648225 2660826 2680760 2657272 2695205 2758696 2770517
13349 2770517 2702223 2647816 2602536 2649745 2730597 2705288 2763023 2757277 2727909 2681799 2610081
13338 2610081 2654681 2740030 2761460 2678654 2679914 2615521 2647622 2696825 2692403 2642878 2645352 2760671
13326 2760671 2780501 2810159 2638007 2552370 2576458 2593188 2604775 2667234 2710864 2699559 2681082
13315 2681082 2728874 2676392 2624548 2745746 2739875 2729251 2697575 2699096 2724982 2643005 2637426 2735002
13303 2735002 2763878 2772129 2722240 2713194 2733013 2815443 2861498 2769208 2722147 2671251 2692909 2719135
13291 2719135 2668181 2602851 2632509 2587094 2637118 2732149 2681618 2672610 2632150 2677764 2647576
13280 2647576 2641707 2638316 2616524 2662386 2594782 2603191 2770872 2779809 2763075 2730688 2768998 2777352
13268 2777352 2796226 2753710 2847655 2773568 2724412 2789525 2807927 2714905 2669506 2705257 2729477
13257 2729477 2732421 2736339 2834296 2893910 2818183 2707776 2691826 2769833 2686510 2671895 2734355
13246 2734355 2731944 2777955 2765728 2871513 2794322 2817696 2796329 2756538 2826748 2806753 2831881
13235 2831881 2763898 2746257 2779107 2765209 2776229 2760796 2737506 2806437 2807510 2743390 2729212
$$ [...]
##END NTUPLES=NMR SPECTRUM
##END=
