##TITLE=1H_CG-1147-2
 CDcl3, 8 sc, 
 29.04.2021
##JCAMPDX= 6.0         $$ Bruker NMR JCAMP-DX V2.0
##DATA TYPE= NMR FID
##DATA CLASS= NTUPLES
##ORIGIN= UXNMR, Bruker Analytische Messtechnik GmbH
##OWNER= root
$$ XWIN-NMR		Version 3.5
$$ Thu Apr 29 13:45:36 2021 Russian Standard Time (UT+4h)  she@DPX200
##.OBSERVE FREQUENCY= 200.131506
##.OBSERVE NUCLEUS= ^1H
##.DELAY= (6, 6)
##.ACQUISITION MODE= SIMULTANEOUS
##.ACQUISITION SCHEME= undefined
##.AVERAGES= 8
##.DIGITISER RES= 18
##SPECTROMETER/DATA SYSTEM= spect
##.PULSE SEQUENCE= zg30
##.SOLVENT NAME= CDCl3
##.SHIFT REFERENCE= (INTERNAL, CDCl3, 0, 15.7039)
##AUDIT TRAIL= $$ (NUMBER, WHEN, WHO, WHERE, WHAT)
$$ ##TITLE= Audit trail, XWIN-NMR		Version 3.5
$$ ##JCAMPDX= 5.01
$$ ##ORIGIN= Bruker BioSpin GmbH
$$ ##OWNER= she
$$ F:/spectra/data/she/nmr/H-F/1/audita.txt
$$ ##AUDIT TRAIL=  $$ (NUMBER, WHEN, WHO, WHERE, WHAT)
(   1,<2021-04-29 13:44:04.25 +0400>,<she>,<DPX200>,
      <created by zg, POWCHK disabled, PULCHK disabled
       configuration hash MD5:
       00 E9 B6 7A A2 85 ED C7 34 08 36 98 17 FE 4E 26
       data hash MD5: 16K
       6E 75 D5 8B F4 E3 35 D2 EE 69 99 52 66 AF 32 F4>)
$$ ##END=
$$ 
$$ hash MD5
$$ EA 58 DD 55 48 F8 EC ED 01 B1 C4 9B 67 96 8C 85
##$RELAX= 
##$RELAX= 
##$RELAX= 
##$RELAX= 
##$RELAX= 
##$RELAX= 
$$ Bruker specific parameters
$$ --------------------------
##$DU= <F:/spectra>
##$EXPNO= 1
##$NAME= <H-F>
##$PROCNO= 1
##$TYPE= <nmr>
##$USER= <she>
##$AMP= (0..31)
100 100 100 100 100 100 100 100 100 100 100 100 100 100 100 100 100 100 
100 100 100 100 100 100 100 100 100 100 100 100 100 100 
##$AQSEQ= 0
##$AQ_mod= 1
##$AUNM= <au_zg>
##$AUTOPOS= <>
##$BF1= 200.13
##$BF2= 200.13
##$BF3= 200.13
##$BF4= 200.13
##$BF5= 200.13
##$BF6= 200.13
##$BF7= 200.13
##$BF8= 200.13
##$BYTORDA= 1
##$CFDGTYP= 0
##$CFRGTYP= 5
##$CHEMSTR= <none>
##$CNST= (0..31)
1 1 145 1 1 1 1 1 1 1 1 1 1 1 1 1 1 1 1 1 1 1 1 1 1 1 1 1 1 1 1 1 
##$CPDPRG= <>
##$CPDPRG1= <>
##$CPDPRG2= <>
##$CPDPRG3= <>
##$CPDPRG4= <mlev>
##$CPDPRG5= <mlev>
##$CPDPRG6= <mlev>
##$CPDPRG7= <mlev>
##$CPDPRG8= <mlev>
##$CPDPRGB= <>
##$CPDPRGT= <>
##$D= (0..31)
0 1.2 0 0 0 0 0 0 0 0.06 0 0.03 0 0 0 0 0.0002 0 0 0 0 0 0 0 0 0 0 0 0 
0 0 0 
##$DATE= 1619689443
##$DBL= (0..7)
120 120 120 120 120 120 120 120 
##$DBP= (0..7)
150 150 150 150 150 150 150 150 
##$DBP07= 0
##$DBPNAM0= <>
##$DBPNAM1= <>
##$DBPNAM2= <>
##$DBPNAM3= <>
##$DBPNAM4= <>
##$DBPNAM5= <>
##$DBPNAM6= <>
##$DBPNAM7= <>
##$DBPOAL= (0..7)
0.5 0.5 0.5 0.5 0.5 0.5 0.5 0.5 
##$DBPOFFS= (0..7)
0 0 0 0 0 0 0 0 
##$DE= 6
##$DECBNUC= <off>
##$DECIM= 32
##$DECNUC= <off>
##$DECSTAT= 4
##$DIGMOD= 1
##$DIGTYP= 9
##$DL= (0..7)
0 120 120 120 120 120 120 120 
##$DP= (0..7)
150 150 150 150 150 150 150 150 
##$DP07= 0
##$DPNAME0= <>
##$DPNAME1= <>
##$DPNAME2= <>
##$DPNAME3= <>
##$DPNAME4= <>
##$DPNAME5= <>
##$DPNAME6= <>
##$DPNAME7= <>
##$DPOAL= (0..7)
0.5 0.5 0.5 0.5 0.5 0.5 0.5 0.5 
##$DPOFFS= (0..7)
0 0 0 0 0 0 0 0 
##$DQDMODE= 0
##$DR= 18
##$DS= 0
##$DSLIST= <SSSSSSSSSSSSSSS>
$$ [...]
##$SUBNAM2= <"">
##$SUBNAM3= <"">
##$SUBNAM4= <"">
##$SUBNAM5= <"">
##$SUBNAM6= <"">
##$SUBNAM7= <"">
##$SUBNAM8= <"">
##$SUBNAM9= <"">
##$SW= 16.9725357007746
##$SWIBOX= (0..15)
0 0 2 0 0 0 0 0 0 0 0 0 0 0 0 0 
##$SW_h= 3396.73913043478
##$TD= 16384
##$TD0= 1
##$TE= 0
##$TE2= 300
##$TE3= 300
##$TEG= 300
##$TL= (0..7)
0 120 120 120 120 120 120 120 
##$TP= (0..7)
150 150 150 150 150 150 150 150 
##$TP07= 0
##$TPNAME0= <>
##$TPNAME1= <>
##$TPNAME2= <>
##$TPNAME3= <>
##$TPNAME4= <>
##$TPNAME5= <>
##$TPNAME6= <>
##$TPNAME7= <>
##$TPOAL= (0..7)
0.5 0.5 0.5 0.5 0.5 0.5 0.5 0.5 
##$TPOFFS= (0..7)
0 0 0 0 0 0 0 0 
##$TUNHIN= 0
##$TUNHOUT= 0
##$TUNXOUT= 0
##$USERA1= <user>
##$USERA2= <user>
##$USERA3= <user>
##$USERA4= <user>
##$USERA5= <user>
##$V9= 5
##$VALIST= <valist>
##$VCLIST= <CCCCCCCCCCCCCCC>
##$VD= 0
##$VDLIST= <DDDDDDDDDDDDDDD>
##$VPLIST= <PPPPPPPPPPPPPPP>
##$VTLIST= <TTTTTTTTTTTTTTT>
##$WBST= 1024
##$WBSW= 4
##$XGAIN= (0..3)
0 0 0 0 
##$XL= 0
##$YL= 0
##$YMAX_a= 328095
##$YMIN_a= -424238
##$ZGOPTNS= <>
##$ZL1= 120
##$ZL2= 120
##$ZL3= 120
##$ZL4= 120
##$ABSF1= 10
##$ABSF2= 0
##$ABSG= 5
##$ABSL= 3
##$ALPHA= 0
##$AQORDER= 0
##$ASSFAC= 0
##$ASSFACI= 0
##$ASSFACX= 0
##$ASSWID= 0
##$AUNMP= <proc_1d>
##$AZFE= 0.1
##$AZFW= 0.1
##$BCFW= 1
##$BC_mod= 2
##$BYTORDP= 1
##$COROFFS= 0
##$CY= 11.3945322036743
##$DATMOD= 1
##$DC= 2
##$DFILT= <>
##$DTYPP= 0
##$F1P= 15.9154993809931
##$F2P= -4.1035820241983
##$FCOR= 0.5
##$FTSIZE= 0
##$FT_mod= 4
##$GAMMA= 1
##$GB= 0.15
##$INTBC= 1
##$INTSCL= 1
##$ISEN= 128
##$LB= 0.24
##$LEV0= 0
##$LPBIN= 0
##$MAXI= 10000
##$MC2= 0
##$MEAN= 0
##$ME_mod= 0
##$MI= 1.114404
##$NCOEF= 0
##$NC_proc= 0
##$NLEV= 6
##$NOISF1= 3.799351
##$NOISF2= 2.8
##$NSP= 1
##$NTH_PI= 0
##$NZP= 0
##$OFFSET= 15.70392
##$PC= 1
##$PHC0= -11117
##$PHC1= 11.40102
##$PH_mod= 1
##$PKNL= yes
##$PPARMOD= 0
##$PSCAL= 0
##$PSIGN= 0
##$REVERSE= no
##$SF= 200.130013532006
##$SI= 16384
##$SIGF1= 3
##$SIGF2= 2
##$SINO= 400
##$SIOLD= 16384
##$SREGLST= <1H.CDCl3>
##$SSB= 0
##$STSI= 0
##$STSR= 0
##$SW_p= 3612.71676300578
##$SYMM= 0
##$S_DEV= 0
##$TDeff= 0
##$TDoff= 0
##$TI= <>
##$TILT= no
##$TM1= 0
##$TM2= 0
##$TOPLEV= 0
##$USERP1= <user>
##$USERP2= <user>
##$USERP3= <user>
##$USERP4= <user>
##$USERP5= <user>
##$WDW= 1
##$XDIM= 8192
##$YMAX_p= 0
##$YMIN_p= 0
$$ End of Bruker specific parameters
$$ ---------------------------------
##NTUPLES= NMR FID
##VAR_NAME=  TIME,          FID/REAL,        FID/IMAG
##SYMBOL=    X,             R,               I
##VAR_TYPE=  INDEPENDENT,   DEPENDENT,       DEPENDENT
##VAR_FORM=  AFFN,          ASDF,            ASDF
##VAR_DIM=   8192,          8192,            8192
##UNITS=     SECONDS,       ARBITRARY UNITS, ARBITRARY UNITS
##FACTOR=    0.0002944,     1,               1
##FIRST=     0,             0,               0
##LAST=      2.4114304,     0,               0
##MIN=       0,             -424238,         0
##MAX=       2.4114304,     328095,          0
$$ Real data points
##PAGE= N=1
##DATA TABLE= (X++(R..R)), XYDATA
$$ [...]
$$ plain form
1828 127 1369 764 -318 1387 448 -16 467 670 473 -767 1429 21 -513 836 -236 -374 -24
1845 -24 721 -566 -448 258 -237 -864 297 -281 -992 316 -856 -169 -974 -51 -205 -1319 59 -882
1863 -882 -716 -584 -531 -294 -618 -590 -262 -758 -625 195 -758 49 -464 113 -208 -832 851 -888 -40 337
1883 337 -229 174 67 482 -17 54 496 271 -325 1124 -12 350 957 121 857 -1 1013 96 207
1902 207 1289 -154 557 707 316 710 698 371 497 193 477 165 57 867 -756 714 401 -352 482
1921 482 -284 283 -662 154 102 -1006 93 -138 -939 -99 25 -1029 -101 -557 -184 -1098 -519 -3 -1671
1940 -1671 253 -494 -829 -501 -730 -224 -1107 -165 -415 -962 -227 110 -961 186 -73 -350 126 -508 664
1959 664 -754 634 433 -539 833 -214 493 416 222 511 510 257 896 153 478 820 140 1239 -14
$$ packed form
1828A27J242o05j082J705r39m64M83K03j97j240K196j408n34J349j072j38L50
1845b4P45j287J18P06m95o27J161n78p11J308j172O87q05R23j54j114J378r41
1863h82J66J32N3K37l24K8L28m96J33Q20r53Q07n13N77l21o24J683j739Q48L77
1883C37n66M03j07M15m99P1M42k25n96J449j136L62O07q36P36q58J014r17J11
1902B07J082j443P11J50l91L94j2l27J26l04K84l12j08Q10j623J470l13p53Q34
1921D82p66N67r45Q16n2j108J099k31q01Q40J24j054R28m56L73r14N79N16j668
1940a671J924p47l35L28k29N06q83R42k50n47P35L37j071J147k59k77M76o34J172
1959F64j418J388k01r72J372j047P07p7j94K89jk53O39p43L25L42o80J099j253
$$ plain form
1978 -14 765 734 89 1037 76 867 244 366 652 -257 508 356 -136 183 384 -323 339 -534 454 -244 -493
1999 -493 509 -1166 294 -287 -571 -105 -895 32 -799 -516 -34 -682 -688 -240 -905 -251 -605 -608 175 -1156
2019 -1156 411 -257 -605 110 -619 128 -827 42 98 -595 144 48 -473 -12 275 -204 97 -87 735 -628
2039 -628 295 854 -676 812 79 399 114 485 1067 -245 648 853 -83 660 1045 -25 657 396 694
2058 694 295 204 1369 -794 637 696 -335 521 -134 408 -319 131 302 -342 -124 452 -517 203 140 -629
2078 -629 107 -742 162 -544 -378 227 -1429 349 -634 -670 -229 -776 -495 -781 -459 -351 -657 -305 -43 -1092
2098 -1092 212 -525 -693 148 -810 111 -909 -95 237 -677 404 -149 -58 308 212 14 355 137 656
2117 656 -56 315 899 -216 1203 187 625 335 -6 1191 -60 829 690 218 582 384 413 369 239
$$ packed form
1978a4P79l1o45R48r61P91o23J22K86r09P65j52m92L19K01p07O62q73R88o98k49
1999d93J002j675J460n81k84M66p90R27q31K83M82o48oM48o65O54l54lP83j331
2019a156J567o68l48P15p29P47r55Q69N6o93P39r6n21M61K87m79L01j84Q22j363
2039f28R23N59j530J488p33L20k85L71N82j312Q93K05r36P43L85j070O82k61K98
2058F94l99r1J165k163J431N9j031Q56o55N42p27M50J71o44K18N76r69P20o3p69
2078f29P36q49R04p06J66O05j656J778r83l6M41n47K81k86L22J08l06L52K62j049
2098a092J304p37j68Q41r58R21j020Q14L32r14J081n53R1L66r6j98L41k18N19
2117F56p12L71N84j115J419j016M38k90l41J197j251Q89j39m72L64j98K9m4j30
$$ plain form
2136 239 595 300 -229 1079 -266 99 347 -169 514 -673 717 -469 -402 418 -358 -362 -297 -317 -633 -406
2156 -406 -298 -181 -1101 156 -685 -980 290 -1110 -310 -649 -332 -381 -960 273 -873 -486 -85 -435 -442
2175 -442 19 -393 -289 -234 -84 206 -638 761 -363 -15 381 -476 471 -48 415 171 65 414 -150 269
2195 269 530 -33 433 764 -312 933 370 281 469 123 986 -320 908 541 -202 661 114 299 215
2214 215 505 183 31 203 531 -534 312 431 -538 557 -346 367 -324 -155 322 -727 102 -249 -466
2233 -466 -130 -383 -432 -469 -461 -162 -356 -681 9 -1043 -95 -551 -330 -201 -947 40 -727 -409 -116 -493 35
2254 35 -416 -314 -279 -193 135 181 -529 417 -156 -43 396 -311 636 -51 351 276 -36 827 80 381 390 333 263
2277 263 528 329 541 634 433 669 129 1187 -240 525 485 -43 566 3 619 -164 187 448 -401 224
$$ packed form
2136B39L56k95n29J308j345L65K48n16O83j187J390j186O7Q20p76mO5k0l16K27
2156d06J08J17r20J257q41k95J270j400Q00l39L17m9n79J233j146L87M01l50p
2175d42M61m12J04N5J50K90q44J399j124L48L96q57R47n19M63k44j06L49n64M19
2195B69K61n63M66L31j076J245n63q9J88l46Q63j306J228l67p43Q63n47J85q4
2214B15K90l22j52J72L28j065Q46J19r69J095r03P13o91J69M77j049Q29l51k17
2233d66L36k53m9l7QK99j94l25O90j052R48m56K21J29p46R87p67L18K93l77N28
2254C5m51J02L5Q6L28M6p10R46n73J13M39p07R47o87M02p5l12Q63p47L01Rn7p0
2277B63K65j99K12R3k01K36n40J058j427P65m0n28O09n63O16p83L51K61q49O25
$$ plain form
2297 224 397 -307 -350 213 -361 -125 -486 105 -620 -539 351 -1068 -173 -214 -437 -475 -474 -44 -850 -336 5 -509
2319 -509 -543 219 -703 -436 -21 -350 -152 -676 425 -640 -322 346 -490 32 -22 48 -95 50 152 -95
2339 -95 12 376 162 -54 626 -99 537 137 263 366 -23 925 -165 502 353 348 533 121 466 297 254
2360 254 449 499 205 596 101 79 288 -14 452 -390 401 -28 -93 258 -312 166 -336 -57 -75 -30 -311 -125
2382 -125 -286 -187 -191 -501 157 -657 -255 -527 -525 -237 -613 -82 -711 -310 -399 -344 -418 -204 -375 -478 -284 -252 -200
2405 -200 -645 271 -414 -233 177 -448 232 -142 385 -94 -60 566 -26 197 427 690 100 612 349 349 329
2426 329 498 467 -31 668 51 288 423 298 370 133 598 104 161 334 217 159 314 60 -20 337 -172 339
2448 339 -320 263 -185 -399 98 -444 53 -354 -259 -340 -126 -261 -598 -204 -384 -292 -466 -213 -572 -477 -310
$$ packed form
2297B24J73p04m3N63n74K36l61N91p25Q1Q90j419Q95m1k23l8JM30q06N14L41n14
2319e09l4P62r22K67M15l29J98n24J101j065L18O68q36N22n4P0j43J45J02k47
2339i5J07L64k14k16O80p25O36m00J26J03l89R48j090O67j49nJ85m12L45j69m3
2360B54J95N0k94L91m95k2K09l02M66q42P91m29o5L51n70M78n02K79j8M5k81J86
2382a25j61R9ml10O58q14M02k72KK88l76N31o29M01q9N5p4K14j71j03J94L2N2
2405b00m45R16o85J81M10o25O80l74N27m79L4O26n92K23K30K63n90N12k63%k0
2426C29J69l1m98O99o17K37J35j25P2k37M65m94N7J73j17n8J55k54q0L57n09N11
2448C39o59N83m48k14M97n42M97m07R5q1K14j35l37L94j80R2j74K53l59R5J67
$$ plain form
2469 -310 -592 -309 -388 -25 -651 0 -256 -343 53 -152 -186 -380 219 -240 -19 130 -12 -9 7 166 -201 602
2491 602 -1 285 153 108 489 -242 636 252 254 362 442 413 226 520 285 377 168 507 172 238 650 186
2513 186 297 52 535 207 61 236 103 167 21 306 -172 -101 -133 62 -148 51 -50 -356 115 -273 -99
2534 -99 -331 53 -149 -689 88 -492 -330 -197 -281 -519 -269 -87 -320 -234 -401 -130 -568 -47 -331 -347 -73
2555 -73 -369 -100 -276 179 -479 29 288 -348 125 -52 24 -78 412 195 154 251 377 79 207 810 22
2576 22 573 487 350 417 343 656 135 470 432 268 409 416 110 52 319 159 206 -191 375 -56 156 223 -493
2599 -493 141 -171 -44 -312 -30 24 -331 -80 -93 -182 -480 -330 -410 -322 -449 -205 -205 -661 -93 -610 -339 -432 -343
2622 -343 -150 -461 3 -209 -336 -278 0 -367 -143 -71 -142 -279 -98 258 -357 105 161 -93 172 31 341
$$ packed form
2469c10k82K83p9L63o26O51k56q7L96k05l4j94N99m59K21J49j42LJ6J59l67Q03
2491F02o03K86j32m5L81p31Q78l84KJ08Q0k9j87K94k35R2k09L39l35O6M12m64
2513A86J11k45M83l28j46J75j33O4j46K85m78P1l2J95k10J99j01l06M71l88J74
2534i9k32L84k02n40P77n80J62J33q4k38K50J82k33Q6j67K71m38N21k84j6K74
2555g3k96K69j76M55o58N08K59o36M73j77P6j02M90k17m1R7J26k98J28O03p88
2576B2N51q6j37O7p4L13n21L35l8j64J41Pl06n8K67j60M7l97N66m31K12O7p16
2599d93O34l12J27k68K82N4l55K51j3q9k98J50q0Q8j27K44%m56N68n17K71r3Q9
2622c43J93l11M64k12j27N8K78l67K24P2p1j37J81L56o15M62N6k54K65j41L10
$$ plain form
2643 341 -63 455 154 94 418 274 423 273 671 74 486 197 233 421 233 596 15 686 116 254 202
2664 202 302 229 23 281 -107 223 126 96 2 208 38 -219 329 -278 -142 -352 -134 -241 -183 -27 -503 -217
2686 -217 -217 -150 -480 -101 -295 -640 -154 -266 -279 -624 -90 -373 -467 -62 -497 -265 -82 -148 -247 -171 -337 -332 -63
2709 -63 -34 76 -212 213 -116 15 437 233 -19 -154 445 -49 424 75 282 308 -3 433 197 392 393 237
2731 237 564 298 -138 96 473 -6 197 474 135 175 127 582 470 654 -182 114 456 132 -80 -129 122
2752 122 -413 155 -347 258 -388 -96 -317 -354 -265 -421 34 -628 -183 -390 -275 -214 -556 -3 -640 -281 -356
2773 -356 -173 -410 -177 -267 -300 -26 -209 -2 -225 322 -97 -145 119 -207 44 25 410 -141 87 501 -68
2794 -68 66 156 441 -156 463 323 291 313 488 277 166 839 192 327 439 335 151 334 649 78 357
$$ packed form
2643C41m04N18l01o0L24j44J49j50L98n97M12k89L6J88j88L63n81O71n70J38n2
2664B02J00p3k06K58l88L30r7l0r4K06j70k57N48o07J36k10K18j07N8J56m76K86
2686b17%O7l30L79j94l45M86j12j3l45N34k83r4M05m35K32J83o6r9P6j66NK69
2709f3K9J10k88M25l29J31M22k04k52j35N99m94M73l49K07K6l11M36k36J95Jj56
2731B37L27k66m36K34L77m79K03K77l39M0m8M55j12J84q36K96L42l24k12m9K51
2752A22n35N68n02O05o46K92k21l7Q9j56M55o62M45k07J15O1l42N53o37L59p5
2773c56J83k37K33r0l3K74j83K07k23N47m19m8K64l26K51j9L85n51K28M14n69
2794f8J34R0K85n97O19j40l2K2J75k11j11O73o47J35J12j04j84J83L15n71K79
$$ plain form
2815 357 433 189 141 368 215 -133 340 -41 -8 -96 189 -142 -172 149 -456 -39 -362 -115 -274 -44 -7 -280
2837 -280 -101 -322 -220 -540 -26 -476 -355 -186 -314 -252 -392 67 -478 -57 -223 -374 -152 -123 -164 -331 -59
2858 -59 -343 25 -229 -64 -44 -36 247 -56 177 -149 270 190 89 154 190 476 34 499 58 196 330 237 371
2881 371 138 515 31 507 306 427 169 257 534 -28 354 36 171 198 294 80 11 369 -53 -38 -18 106
2903 106 -101 43 170 -417 -95 -241 -163 -376 -71 -453 -542 -110 -245 -165 -320 -240 -473 -395 -144 -384 -308 -359
2925 -359 -46 -531 -73 -168 -342 -141 -245 -11 -325 141 -207 204 54 -200 131 28 295 -49 353 17
2945 17 238 134 296 240 247 348 -61 320 320 437 173 278 485 -66 537 221 190 214 328 29 120 354 29
2968 29 198 8 295 116 304 253 -48 159 -66 22 -49 25 29 -319 65 -287 -248 -369 -122 -394 -275 -173 -193
$$ packed form
2815C57P6k44m8K27j53l48M73l81L3q8K85l31l0L21o05M17l23K47j59K30L7k73
2837b80J79k21J02l20N14m50J21J69j28O2j40M59n45M21j66j51K22K9m1j67K72
2858e9k84L68k54J65K0QK83l03K33l26M19q0j01O5L6K86m42M65m41J38J34r3J34
2881C71k33L77m84M76k01J21k58Q8K77n62L82l18J35K7R6k14o9L58m22J5K0J24
2903A06k07J44J27n87L22j46P8k13L05l82q9M32j35Q0j55Q0k33P8K51k40P6n1
2925c59L13m85M58r5j74K01j04K34l14M66l48M11j50k54L31j03K67l44M02l36
2945A7K21j04J62n6PJ01m09L81%J17k64J05K07n51O03l16l1K4J14k99R1K34l25
2968B9J69j90K87j79J88n1l01K07k25Q8p1P4Ml48L84l52L9j21K47k72J19J02k0
$$ plain form
2991 -193 -214 -93 -113 -568 -3 -385 -214 -274 -324 36 -571 -280 -250 -377 -286 -124 -36 -312 -65 -228 293 -147
3013 -147 4 -83 11 169 -67 80 28 267 27 284 250 196 185 37 383 14 548 112 360 306 391 171 252
3036 252 593 -16 538 192 388 140 77 425 -24 224 185 141 157 133 45 -75 88 -159 -87 -370 199 -151
3058 -151 -109 -10 -516 -12 -267 22 -351 -53 -220 -634 -370 -303 -247 -521 -148 -429 -340 -338 -227 -84 -573 211
3080 211 -489 -1 -212 -186 -116 -214 138 -278 -39 199 92 -91 231 141 12 168 -85 340 -98 325 306 236
3102 236 491 58 450 -18 192 223 318 290 350 413 259 357 119 236 122 137 183 7 242 -108 345 -162 120
3125 120 14 70 80 -163 115 -245 -47 -197 -37 -306 -52 46 -266 43 -498 59 -431 -16 -159 -411 -50
3146 -50 -471 -119 -357 -68 -337 -231 -262 -202 -114 -141 96 -302 116 -320 -40 -48 -60 73 -196 207 -273 8 -18
$$ packed form
2991a93k1J21k0m55N65l82J71o0n0L60o07K91L0j27R1J62Q8k76K47j63N21m40
3013a47J51q7R4J58k36J47n2K39k40K57l4n4j1j48L46l69N34m36K48n4Q5k20Q1
3036B52L41o09N54l46J96k48o3L48m49K48l9m4J6k4q8j20J63k47P2k83N69l50
3058a51M2R9n06N04k55K89l73K98j67m14K64O7N6k74L73k81Q9KJ11J43m89P84
3080B11p00M88k11K6P0r8L52m16K39K38j07j83L22r0j29J56k53M25m38M23j9p0
3102B36K55m33L92m68K10L1R5k8O0O3j54R8k38J17j14J5M6j76K35l50M53n07K82
3125A20j06N6J0k43K78l60J98j50J60k69K54R8l12L09n41N57m90M15j43k52L61
3146e0m21L52k38K89k69J06l1O0Q8k7K37l98M18m36K80qj2J33k69M03m80K81k6
$$ plain form
3169 -18 74 65 -22 101 -67 142 252 234 80 319 293 65 651 57 372 146 322 291 55 497 250 190 260
3192 260 510 154 312 79 226 315 -108 71 -215 413 11 148 70 -91 93 -260 9 -248 -62 -191 -151
3213 -151 -97 -197 -131 -445 -158 -424 -323 -113 -142 -162 -534 7 -700 -70 -285 -461 -132 -143 -99 -331 149 -355
3235 -355 -195 -190 67 -243 -60 222 -150 274 -194 250 -195 70 199 -103 118 219 407 132 346 178 264
3256 264 337 327 443 118 561 -31 290 331 261 319 -32 584 108 155 168 -49 95 -10 179 -20 12 -74 88
3279 88 -193 184 -164 -342 172 -229 -76 -300 -82 -319 -275 -36 -179 -154 -257 -71 -371 -57 -326 -252 -430
3300 -430 -20 -82 -480 113 -434 -200 -115 -192 -26 -370 124 -162 -106 6 -155 -252 -108 40 -83 390 -201 123
3322 123 4 383 36 -12 464 16 324 153 478 131 187 325 164 222 188 356 260 309 186 190 252 -10 125
$$ packed form
3169a8R2rq7J23j68K09J10j8j54K39k6k28N86n94L15k26J76l1k36M42k47o0P0
3192B60K50l56J58k33J47Q9m23J79k86O28m02J37p8j61J84l53K69k57J86j29M0
3213a51N4j00O6l14K87k66J01K10k9k0l72N41p07O30k15j76L29j1M4k32M80n04
3235c55J60NK57l10J83K82l72M24m68M44m45K65J29l02K21J01J88k75K14j68Q6
3256B64P3j0J16l25M43n92L21M1p0N8l51O16m76M7J3k17J44j05J89j99L2q6J62
3279H8k81L77l48j78N14m01J53k24K18k37M4K39j43K5j03J86l00L14k69P4j78
3300d30M10o2l98N93n47K34Q5p7J66l44M94k86N6J12j61r7J44J48j23M73n91L24
3322A23j19L79l47m8M76m48L08j71L25l47N6J38j61N8l4J68r6M9j23MO2k62J35
$$ plain form
3345 125 -30 401 36 34 207 -31 247 -5 193 -163 126 -82 -23 -22 72 -19 -149 47 -190 -67 -282 -226 -261
3368 -261 -439 19 -345 -269 -260 -177 -167 -237 -401 -348 -190 -416 -101 -273 -56 -224 -193 -273 -85 50 -361 60 -29
3391 -29 -71 65 108 189 21 30 235 -31 184 117 193 -48 318 124 420 20 330 137 296 396 39 418 52
3414 52 304 162 199 257 266 194 -63 191 52 190 -240 18 103 10 75 -73 226 -57 148 -83 -37 80 -233
3437 -233 82 -108 -18 -165 -10 -228 -208 -240 -198 -180 -468 -19 -404 -339 -214 -277 -130 -193 -63 -356 -71 -245 -159
3460 -159 -139 -106 -188 -287 69 -231 197 -284 -5 -6 -145 234 -49 176 133 110 96 56 233 64 262 182 443 149
3484 149 274 205 241 325 196 417 224 546 40 290 107 84 124 147 102 125 172 -62 132 -41 -48 127 -67 139
3508 139 -234 84 -95 32 72 -211 88 -345 -133 -144 -224 -305 -266 -210 -234 -178 -416 -17 -441 -37 -360 -398 -106
$$ packed form
3345A25j55M31l65kJ73k38K78k52J98l56K89k08N9JR4r1j30J96k37J23k15N6l5
3368b61j78M58l64P6RQ3J0p0j64N3J58k26L15j72K17j68L1q0J88J35m11M21q9
3391b9m2J36M3Q1j68RK05k66K15o7P6k41L66j94K96m00L10j93J59J00l57L79l66
3414E2K52j42L7N8Rp2k57K54j39J38m30K58Q5r3O5j48K99k83K05k31M6J17l13
3437b33L15j90R0j47J55k18K0l2M2J8k88M49l85O5J25o3J47o3J30k93K85j74Q6
3460a59K0L3q2r9L56l00M28m81K79jj39L79k83K25m3k3j4m0J77j69J98q0K61k94
3484A49J25o9L6Q4j29K21j93L22n06K50j83k3M0K3m5K3M7k34J94j73pJ75j94K06
3508A39l73L18j79J27M0k83K99m33K12j1q0q1L9N6k4N6k38L99m24M04l23l8K92
$$ plain form
3531 -106 -228 -53 -184 79 -152 -240 -107 -109 -148 -263 89 -233 -37 124 113 -112 217 299 -170 279 112 217
3553 217 22 268 195 5 348 186 183 236 153 215 319 328 217 196 114 488 -94 484 210 150 0 152 307 -47
3577 -47 217 -40 64 44 -124 76 11 24 -96 -44 -211 -140 -171 -144 21 -166 -79 -299 -101 -177 -98 -210 -345 46
3601 46 -355 -192 -291 -328 -79 -138 -199 -169 -99 -365 38 -223 22 36 -136 -37 -100 197 -65 211 36 104 141 124
3625 124 17 308 240 -54 368 85 415 233 121 357 -41 343 180 169 282 330 240 68 161 366 196 -65
3647 -65 397 50 163 210 -37 45 -180 292 -112 -1 127 -21 221 -298 69 -182 13 -141 -121 -36 1 -259
3669 -259 -305 87 -235 59 -432 -123 -201 -216 -215 -213 -101 -129 -183 -166 -157 -221 -165 -4 -360 -11 -244 63 46 -97 -43
3694 -43 -173 76 -14 119 -49 82 102 190 273 10 220 160 148 70 120 233 112 331 98 234 71 420 117
$$ packed form
3531a06j22J75j31K63k31q8J33kl9j15L52l22J96J61j1k25L29Q2m69M49j67J05
3553B17j95K46p3j90L43j62lN3q3O2J04Rj11k1q2L74n82N78k74o0j50J52J55l54
3577d7K64k57J04k0j68K00o5J3j20N2j67P1l1K7J65j87Q7k20J98p6P9j12j35L91
3601D6m01J63r9l7K49n9o1L0P0k66M03k61K45J4j72R9o3K97k62K76j75O8L7j7
3625A24j07K91o8k94M22k83L30j82j12K36l98L84j63j1J13M8r0j72R3K05j70k61
3647f5M62l47J13M7k47Q2k25M72m04J11J28j48K42n19L67k51J95j54K0Q5L7k60
3669b59m6L92l22K94m91L09p8j5JKJ12k8n4J7Ro4N6J61l56L49k33L07j7j43N4
3694d3j30K49r0J33j68J31K0Q8Q3k63K10o0j2p8N0J13j21K19k33J36j63L49l03
$$ plain form
3717 117 105 358 158 272 -10 219 91 175 153 -127 31 203 193 -151 157 -171 -93 72 52 45 -205 215 -217
3740 -217 -165 -148 -8 -234 -206 -81 -295 -114 -375 -39 -410 -147 -335 -368 -100 -312 -54 -438 -136 -164 -155 -198 -236
3763 -236 10 -467 8 -151 -19 -54 -107 -109 -3 232 59 228 -37 -1 74 182 249 31 461 156 443 166
3785 166 326 240 217 143 41 252 70 477 19 117 262 33 261 -3 175 -129 143 37 46 107 44 -119 -168
3808 -168 20 -219 16 43 1 -78 -177 130 -340 -12 -141 -260 -132 -168 -3 -407 39 -251 -170 -378 -132 -300
3830 -300 -375 -39 -78 -160 -420 -7 -244 -2 -70 -170 52 -104 219 -18 192 -48 76 99 64 216 22 277
3852 277 14 231 259 155 163 42 329 171 337 -37 186 288 212 321 158 481 -10 296 -27 148 200 29
3874 29 173 50 225 7 -130 1 154 80 -35 46 -209 49 -274 19 -81 -7 -73 -150 86 -232 -107 -434
$$ packed form
3717A17j2K53k00J14k82K29j28Q4k2k80J58J72j0l44L08l28P8J65k0pk50M20m32
3740b17N2J7J40k26K8J25k14J81k61L36l71K63j88l3K68k12K58l84L02k8Rm3l8
3763b36K46m77M75j59J32l5n3kJ06K35j73J69k65L6P5J08O7k18M30l05K87k77
3785A66J60q6k3p4j02K11j82M07m58R8J45k29K28k64J78l04K72j06RO1o3j63m9
3808a68J88k39K35K7m2p9r9L07m70L28j29j19J28l6J65m04M46k90Q1k08K46j68
3830c00p5L36l9q2k60M13k37K42o8j00K22j56L23k37K10k40J24K3l5J52j94K55
3852B77k63K17K8j04Qj21K87j58J66l74K23J02p6J09j63L23m91L06l23J75N2j71
3874B9J44j23J75k18j37J31J53p4j15Q1k55K58l23K93j00P4o6p7K36l18J25l27
$$ plain form
3896 -434 -242 -206 -153 -96 -188 -96 -234 -77 -272 -57 -85 -372 -30 -293 -105 -275 16 -85 19 38 -185 133
3918 133 -100 -79 -198 109 -231 -28 158 -52 100 46 202 -70 244 77 111 285 48 268 196 285 177 209
3940 209 297 224 202 238 261 92 318 124 174 62 21 250 -5 443 28 139 82 19 108 -49 94 -304 145
3963 145 -282 -22 -181 -47 -52 -258 142 -243 70 -458 -142 -142 -203 -157 -384 19 -354 -140 -119 -141 -130 -304 -40
3986 -40 -202 -88 -57 -50 -74 95 37 -236 167 -100 204 -198 158 -54 6 63 134 301 58 281 -19 160 164 288
4010 288 141 95 218 137 294 219 287 64 142 123 53 219 107 307 165 170 108 -41 186 94 106 -7 265 -21
4034 -21 -38 21 -17 87 -57 -52 -182 15 -207 -54 -15 -212 -5 -315 -61 -183 -207 -111 -64 -254 -432 -48 -197
4057 -197 -30 -138 -61 -232 -296 16 -289 -112 -140 37 -180 126 1 41 168 -160 11 -128 78 35 2 212
$$ packed form
3896d34J92L6N3N7r2R2j38J57j95K15k8k87L42k63J88j70K91j01J04J9k23L18
3918A33k33K1j19L07l40K03J86k10J52n4J56k72L14j67L4J74k37K20p2Q9j08L2
3940B09Q8p3k2L6K3j69K26j94N0j12m1K29k55M48m15J11n7o3Q9j57J43l98M49
3963A45m27K60j59J34nk06M00l85L13n28L16%o1M6k27M03l73K14K1k2J1j74K64
3986d0j62J14L1Pk4J69n8k73M03k67L04m02L56k12O0N7P1J67k43K23l00J79MJ24
4010B88j47m6J23q1J57p5O8k23P8j9p0J66j12K00j42No2j49K27r2J2j13K72k86
4034b1j7N9l8J04j44Nj30J97k22J53L9j97K07l10K54j22k4R6M7j90j78L84j49
4057a97J67j08P7j71o4L12l05J77k8J77k17L06j25M0J27l28J71j39K06m3l3K10
$$ plain form
4079 212 142 116 22 228 94 166 161 -18 263 97 91 96 379 137 127 273 55 260 78 341 62 284 156 216
4103 216 88 146 176 28 195 -200 199 3 52 50 -240 106 -94 74 -375 -57 -161 -48 -35 -387 18 -298
4125 -298 113 -255 -208 -156 -206 -29 -203 -93 -337 -160 -258 -49 -15 -124 24 -333 64 -158 8 -170 24 -205
4147 -205 -107 117 -11 181 81 150 -33 -83 169 95 333 182 106 40 242 179 78 193 45 170 98 126 86
4170 86 285 185 210 120 145 390 -138 255 -96 -36 -28 156 105 -107 221 -154 37 -174 -78 -127 -83 165 -203 -47
4194 -47 -190 -50 22 -108 -53 -104 -56 -200 -94 -214 -57 -268 -211 30 -258 -161 -278 -108 -198 -89 -74 -185 -43
4217 -43 -117 16 -65 49 42 18 70 -11 194 53 189 -38 262 58 234 327 147 -2 -30 133 90 220 258 233
4241 233 222 2 211 -87 210 8 216 221 -1 178 -24 123 -124 157 71 42 129 -44 67 -10 127 -143
$$ packed form
4079B12p0k6r4K06j34P2nj79K81j66oNK83k42j0J46k18K05j82K63k79K22j28O0
4103B16j28N8L0j48J67l95L99j96M9kk90L46k00J68m49L18j04J13J3l52M05l16
4125b98M11l68M7N2n0J77j74J10k44J77r8K09L4j09J48l57L97k22J66j78J94k29
4147b05R8K24j28J92j00O9j83n0K52p4K38j51p6o6K02o3j01J15j48J25p2K8m0
4170H6J99j00K5r0K5K45n28L93l51O0QJ84n1k12L28l75J91k11R6m9M4K48l68J56
4194d7j43J40P2j30N5n1M8j44J06j20J57k11N7K41k88R7j17J70r0J09J5j11J42
4217d3p4J33q1J14pk4N2q1K05j41J36k27L00k04J76R3j80j49k8J63m3J30L8k5
4241B33j1k20K09k98K97k02K08Nk22J79k02J47k47K81q6k9Q7j73J11p7J37k70
$$ plain form
4263 -143 67 -178 50 -99 -161 -101 -215 -139 -139 -49 -202 -104 -114 -244 -86 -303 -98 -294 -101 -156 -211 -163 -245 103
4287 103 -250 112 -228 -146 -220 -21 103 -174 -81 -86 149 15 180 86 -37 329 30 112 -120 199 231 269 351
4310 351 -7 267 167 -10 -71 259 153 73 101 28 322 57 343 18 103 70 97 237 87 158 -155 197 191
4333 191 -60 48 -153 76 -221 6 -140 98 -129 6 -25 -148 29 -149 -66 -32 -236 -245 -28 -56 -291 -48
4355 -48 -255 -111 -345 -52 138 -338 -126 -210 -91 -69 -141 -87 53 30 -105 -93 -175 35 -250 213 -70 146 94
4378 94 60 86 152 229 -40 187 107 158 141 109 5 211 360 -47 72 317 16 216 7 277 -36 235 46
4401 46 71 -132 67 51 71 189 -63 206 -250 117 103 36 42 -43 23 -112 -55 -94 6 -98 -183 -169 -272 155 -187
4426 -187 -163 -202 -198 -221 -191 75 -240 -205 -286 -154 30 -47 -55 -210 -152 -227 -8 -115 -117 65 -244 4 25 253 66
$$ packed form
4263a43K10k45K28j49o2O0j14P6%R0j53R8j0j30J58k17K05j96J93n5n5M8q2L48
4287A03l53L62l40Q2p4J99J24k77R3nK35j34J65r4j23L66k99Q2k32L19L2L8Q2
4310C51l58K74j00j77o1L30j06q0K8p3K94k65K86l25Q5l3K7J40j50P1l13L52o
4333A91k51J08k01K29k97K27j46K38k27J35l1j23J77j78Q3L4k04rK17k8k35K43
4355d8k07J44k34K93J90m76K12q4J19K2p2N4J40k3j35J2q2K10k85M63k83K16n2
4378I4l4K6O6P7k69K27q0N1j7l2j04K06J49m07J19K45l01K00k09K70l13K71j89
4401D6K5k03J99j6K0J18k52K69m56L67j4o7Oq5O6j35N7l9J00j04q5J4j03M27l42
4426a87K4l9Mk3L0K66l15L5q1J32J84p7qj55N8p5K19j07kJ82l09K48K1K28j87
$$ plain form
4451 66 34 -87 -68 136 218 99 -19 154 89 300 21 223 189 219 269 76 190 114 307 169 240 228 67 266
4475 266 -23 200 7 203 44 0 8 42 157 -82 175 -24 -22 23 50 3 -107 -120 -243 92 -226 -84 -183 -112
4499 -112 -140 -267 -136 -263 -314 -284 -127 -75 -102 -227 -203 111 -251 -153 -80 12 -8 -298 -86 -106 22 -203 11 -22
4523 -22 105 90 -132 249 -55 221 -54 82 150 -8 123 97 272 79 287 187 174 109 59 119 194 288 40
4546 40 338 30 65 118 164 78 -230 198 -2 87 87 38 44 20 14 2 -43 -165 -8 -12 20 15 -202 197 -193 -19 -11 -25
4574 -25 -266 -313 105 -177 -98 -122 -136 -198 -159 -24 -168 -124 -148 137 -105 5 -142 -60 46 -185 -45 -11 108 -72
4598 -72 -8 -4 33 74 14 192 -113 133 -34 145 76 128 228 68 277 64 306 140 200 242 171 141 73 67 223
4623 223 364 174 109 314 230 264 -53 226 143 245 34 -115 -108 17 148 2 52 -95 -139 -31 -122 -114 -138 -242
$$ packed form
4451F6l2j21J9K04Q2j19j18J73o5K11k79K02l4L0N0j93J14p6J93j38P1j2j61J99
4475B66k89K23j93J96j59m4QL4J15k39K57j99KM5K7m7j10j3j23L35l18J42r9P1
4499a12k8j27J31j27n1L0J57N2k7j25K4L14l62R8P3R2k0k90K12k0J28k25K14l3
4523b2J27j5k22L81l04K76k75J36O8j58J31k6J75j93K08j00j3o5n0O0P5R4k48
4546D0K98l08L5N3M6q6l08M28k00Q9%m9Ok4oj2m5j22J57mL2nk17L99l90J74Qj4
4574b5k41m7M18k82P9k4j4o2L9J35j44M4k4K85k42J10j47Q2J06k31J40L4J19j80
4598g2O4ML7M1o0J78l05K46j67J79o9N2J00j60K09k13K42j66O0M2p1l0o8oJ56
4623B23J41j90o5K05q4L4l17K79q3J02k11j49PJ25J31j46N0j47m4J08r1Qk4j04
$$ plain form
4647 -242 -108 -68 -147 -45 -225 -235 -81 -276 19 -153 0 -365 -74 -139 -41 59 -71 -10 -284 35 -214 -51
4669 -51 -19 -150 -20 -61 240 -41 28 -64 -64 155 -28 167 22 202 51 114 68 123 71 91 127 -72 178 -115
4693 -115 229 157 158 83 167 -8 54 186 189 113 95 -6 115 95 -11 -87 139 -73 -5 133 -49 -22 -162 -74 29
4718 29 -62 -40 -89 -103 -208 22 -116 -65 -139 -156 -120 -318 -209 -207 -85 -342 14 -133 -143 -78 -251 -49 -67 -7 -143
4743 -143 -83 -160 103 -110 -12 -17 47 14 19 199 -74 -93 186 173 190 -26 132 18 56 181 177 93 61 380 -69 198
4769 198 22 209 148 133 101 33 235 17 312 121 221 160 177 85 -112 306 -2 203 -47 14 56 -50 143
4792 143 -143 102 -163 159 -16 -98 -81 -174 142 -190 -24 -209 -83 -111 -134 -134 -365 64 -165 -119 -200 -224 -153 -174
4816 -174 -10 -266 15 -168 23 -21 -25 -2 -64 37 0 150 24 126 274 118 74 93 160 -13 177 1 165
$$ packed form
4647b42J34M0p9J02j80j0J54j95K95j72J53l65K91o5R8J00j30O1k74L19k49J63
4669e1L2j31J30m1L01k81O9r2%K19j83J95j45J80j51O3m6N5n2K0L6j99K50k93
4693a15L44p2Jp5Q4j75O2J32Lp6j8j01J21k0j06p6K26k12O8J38j82K7j40Q8J03
4718B9r1K2m9j4j05K30j38N1p4j7L6j98J09KJ22k57L56j47j0O5j73K02j8O0j36
4743a43O0p7K63k13R8nO4l3NJ80k73j9K79j3J7k16J58j14L8J25mq4l2L19m49K67
4769A98j76J87o1j5l2o8K02k18K95j91J00o1J7r2j97M18l08K05k50O1M2j06J93
4792A43k86K45k65L22j75q2J7r3L16l32J66j85J26k8k3%k31M29k29M6q1k4P1k1
4816a74J64k56K81j83J91m4mK3o2J01l7J50j26J02J48j56m4J9O7j73J90j76J64
$$ plain form
4839 165 130 172 335 81 171 -18 169 155 443 132 139 234 -95 236 -108 148 22 167 32 -18 230 -1 228
4862 228 -86 278 -79 45 52 -32 143 -132 160 -327 -15 -140 -126 -159 -41 -130 -183 -76 -165 -2 -145 -179 -274
4885 -274 -264 -115 -311 33 -407 -305 15 16 119 -187 -42 -85 -14 -44 -99 -44 79 -32 -8 -112 17 11 80 5
4909 5 130 62 144 93 162 176 168 224 187 322 112 399 -37 81 134 8 -22 192 138 -24 400 157 -9 -120 227
4934 227 78 -50 112 -48 68 -152 61 -30 13 89 -127 89 -231 -25 -405 -69 -161 -90 -135 -290 -119 -159
4956 -159 -83 -332 -121 -226 -189 -78 -227 -24 -258 -233 -277 -104 -44 -94 -36 -92 171 -28 -7 -6 25 59 -76 68
4980 68 -151 266 -29 203 115 48 36 28 386 -36 87 140 165 105 25 265 9 117 -99 104 -100 252 33
5003 33 -13 41 132 134 -63 27 9 116 -136 -57 136 -28 113 -93 16 -85 -172 34 -123 66 -276 -126 -171 -74
$$ packed form
4839A65l5M2J63k54R0j89J87j4K88l11PR5l29L31l44K56j26J45j35n0K48k31K29
4862B28l14L64l57J24Pq4J75k75K92m87L12j25J4l3J18q9n3J07q9J63j43l4r5
4885b74J0J49j96L44m40J02L20JJ03l06J45m3P1l0n5N5J23j11K4j04J29oO9p5
4909EJ25o8Q2n1O9J4qN6l7J35k10K87m36J18N3j26l0K14n4j62M24k43j66j11L47
4934B27j49j28J62j60J16k20K13r1M3P6k16K16l20K06l80L36r2P1m5j55J71m0
4956a59P6k49K11j05L7J11j49K03k34K5m4J73O0n0N8n6K63j99K1JL1L4j35J44
4980F8k19M17k95K32q8o7j2qL58m22J23N3K5o0q0K40k56J08k16K03k04L52k19
5003C3m6N4R1Kj97R0j8J07k52P9J93j64J41k06J09j01q7K06j57J89l42J50m5R7
$$ plain form
5027 -74 -169 -269 -4 -13 -26 -177 -42 -268 -54 -201 -117 -163 -223 -47 -293 78 -170 -11 67 -154 -65 -119 -61 -90
5051 -90 146 -40 11 55 78 121 -172 71 -56 270 -3 250 159 107 213 15 194 56 204 38 286 240 107
5074 107 171 -59 370 216 184 169 147 265 87 -2 -186 151 -86 148 74 -121 -1 7 19 -35 12 -36 -10 -29 -20
5099 -20 68 -40 58 -329 -100 -10 -295 -15 -222 -73 -238 19 -191 -73 -32 -31 -102 -165 -178 -233 -178 -21 -281 -129
5123 -129 -62 -217 37 181 -75 52 -3 152 196 -3 183 97 115 146 143 35 264 111 143 219 134 222 164 412
5147 412 235 71 221 -91 150 72 146 95 204 -50 15 229 -33 76 -75 60 -66 38 -44 -8 113 -245
5169 -245 45 -82 -17 -232 85 -74 -186 82 -257 27 46 -205 -133 -51 12 -353 -62 -178 -56 -201 84 -240
5191 -240 -89 -108 -3 -61 -116 43 -34 -26 -4 -146 216 -13 133 -25 111 -174 97 56 -21 244 -69 113 31
$$ packed form
5027g4r5j00K65rj3j51J35k26K14j47Q4m6o0J76k46L71k48J59P8k21Q9n4N8k9
5051i0K36j86N1M4K3M3k93K43j27L26k73K53r1n2J06j98J79j38J48j66K48m6j33
5074A07O4k30M29j54l2j5k2J18j78q9j84L37k37K34p4j95J20QJ2n4M7m8K6j9R
5099b0Q8j08R8l87K29R0k85K80k07J49j65K57k10J18M1Jp1o3j3n5N5J57k60J52
5123a29O7j55K54J44k56J27n5J55M4j99J86q6J8L1lj08K29j53L2P6q5Q8n8K48
5147D12j77j64J50l12K41p8P4n1J09k54O5K14k62J09j51J35j26J04q2L6J21l58
5169b45K90j27O5k15L17j59j12K68l39K84J9k51P2Q2O3l65K91j16J22j45K85l24
5191b40J51j9J05n8n5J59p7QK2j42L62k29J46j58J36k85K71m1p7K65l13J82q2
$$ plain form
5214 31 193 -35 161 123 45 114 88 222 52 297 74 32 300 136 196 2 273 44 23 -78 86 43 130
5237 130 194 -91 190 -80 263 -44 -51 78 -115 68 -55 65 -82 -209 -110 -116 -102 -277 -65 -161 -48 -114 -201
5260 -201 -107 -254 -174 -293 -38 -341 -136 -10 33 -83 -146 -53 -106 47 -126 -126 30 -158 -117 85 178 29 194
5283 194 5 143 240 -225 273 28 221 120 144 124 255 133 125 263 41 292 -56 91 117 56 205 45
5305 45 55 15 176 -211 120 51 58 302 -75 -1 -165 68 -159 106 -45 -59 211 -115 -23 46 -76 -54 -76 -184
5329 -184 -27 -112 -124 29 -160 -45 -187 -17 -155 -153 -114 -298 45 -274 30 -189 -186 -28 -74 -51 -99 146 -17
5352 -17 -1 -43 47 104 -72 127 -61 110 100 100 95 15 -10 10 227 2 267 109 147 312 81 18 -1 127 18
5377 18 102 235 178 257 -147 218 87 93 41 140 121 163 -7 -65 87 -19 182 -133 70 120 183 43 -197 -97
$$ packed form
5214C1J62k28J96l8p8O9k6J34j70K45k23m2K68j64O0j94K71k29k1j01J64m3Q7
5237A30O4k85K81k70L43l07pJ29j93J83j23J20j47j27R9oJ4j75K12r6J13o6q7
5260b01R4j47Q0j19K55l03K05J26M3j16o3R3n3J53j73%J56j88M1K02R3j49J65
5283A94j89J38R7m65M98k45J93j01K4k0J31j22qJ38k22K51l48J47K6o1J49j60
5305D5J0m0J61l87L31o9PK44l77P4j64K33k27K65j51j4K70l26R2O9j22K2k2j08
5329a84J57q5j2J53j89J15j42J70j38KL9j84L43l19L04k19LJ58m6K3m8K45j63
5352a7J6m2R0N7j76J99j88J71j0%nq0k5K0K17k25K65j58L8J65k31o3j9J28j09
5377A8Q4J33n7P9m04L65j31On2R9j9M2j70n8J52j06K01l15K03N0O3j40k40J00
$$ plain form
5401 -97 -209 30 -143 -93 -191 -152 -55 -232 -18 -335 -49 -197 -127 -199 -227 -97 -286 -69 -278 -101 -234 -112 -156
5424 -156 -164 -67 -93 57 -85 120 -27 -47 38 59 94 29 184 -45 162 -37 66 92 7 194 27 146 264 274
5448 274 67 106 270 9 213 -218 115 276 252 41 -78 124 33 70 -34 102 61 -114 143 11 55 -116
5470 -116 98 -108 10 -32 -163 -20 -132 12 -225 196 -285 -101 10 -229 -53 -166 22 -174 -68 -139 35
5491 35 -151 -253 -102 -157 -45 -296 -129 -35 -149 77 -134 -142 -96 185 -89 78 -2 -170 -59 -216 71 137 112
5514 112 106 232 93 89 119 99 133 -46 267 135 73 89 230 175 -57 106 -148 254 175 86 135 117 120 130 104 -8
5540 -8 166 44 -45 158 -37 -24 -56 20 -265 113 -34 -260 -69 -198 30 -249 -58 -258 -51 -105 -66 -31 -210
5563 -210 -87 -313 -197 -111 16 -183 -214 -17 -170 -4 -153 -80 78 -52 -33 8 60 -216 14 -135 -9 73
$$ packed form
5401i7j12K39j73N0r8L9R7j77K14l17K86j48P0p2k8J30j89K17k09J77j33J22m4
5424a56qR7k6J50j42K05j47k0Q5K1L5o5J55k29K07j99J03K6q5J87j67J19J18J0
5448B74k07L9J64k61K04m31L33J61k4k11j19K02r1L7j04J36m1j75K57j32M4j71
5470a16K14k06J18m2j31J43j12J44k37M21m81J84J11k39J76j13J88j96J06p1J74
5491C5j86j02J51n5J12k51J67R4j14K26k11qM6K81k74J67q0j68J11j57K87O6k5
5514A12oJ26j39mL0k0L4j79L13j32o2J6J41n5k32J63k54M02p9q9M9j8LJ0k6j12
5540hJ74j22q9K03j95J3l2P6k85L78j47k26J91j29K28k79J91k00K07n4L9L5j79
5563b10J23k26J16Q6J27j99l1J97j53J66j49P3J58j30J9M1N2k76K30j49J26Q2
$$ plain form
5585 73 20 185 -103 227 -147 198 4 304 67 20 179 202 156 257 154 31 234 201 36 268 88 187
5607 187 68 106 -56 110 62 7 117 -148 95 -69 180 -24 -65 51 1 -143 -50 -61 -278 11 -232 -115
5629 -115 15 -308 97 -264 -38 -184 -25 -58 -215 -5 -137 -151 -192 -31 -198 -147 -37 52 -37 -268 89 -239
5651 -239 7 32 44 -19 -60 172 -108 -45 -109 94 184 97 115 -61 131 -49 160 -60 261 167 296 109 38 190
5675 190 66 309 108 167 274 -52 157 125 217 -69 219 138 1 103 100 163 -103 104 -65 84 -33 -122 -21
5698 -21 -52 93 -222 93 -233 -18 -53 -165 72 30 -115 -127 3 -162 -124 -131 -137 -173 -127 -26 -139 9 -206 -51
5722 -51 32 -280 12 -178 71 -66 -2 63 12 -96 -83 125 22 17 76 150 -97 187 29 41 90 -147 62 -89
5746 -89 234 111 65 -27 210 318 75 103 76 -130 146 220 198 26 265 -17 103 42 141 -15 152 2 -176
$$ packed form
5585G3n3J65k88L30l74L45j94L00k37m7J59K3m6J01j03j23K03l3j65K32j80R9
5607A87j19L8j62J66m8n5J10k65K43j64K49k04m1J16n0j44R3j1k17K89k43J17
5629a15J30l23M05l61K26j46J59l3j57K10j32j4m1J61j67N1J10Q9q9k31L57l28
5651b39K46K5J2o3m1K32k80O3o4K03R0q7J8j76J92j80K09k20L21r4J29j87p1J52
5675A90j24K43k01N9J07l26K09l2R2k86K88q1j37J02lO3k66K07j69J49j17q9J01
5698b1l1J45l15L15l26K15l5j12K37m2j45j2J30j65L8pol6M6J01j13J48k15J55
5722e1Q3l12K92j90K49j37O4O5n1j08J3K08j03nN9P4k47K84j58J2M9k37K09j51
5746h9L23j23m6r2K37J08k43K8k7k06K76P4k2j72K39k82J20o1R9j56J67j50j78
$$ plain form
5769 -176 3 -161 28 -109 56 -86 -213 -48 -326 -83 -45 -296 -210 -227 -7 -213 -176 -292 24 -211 -60
5790 -60 -152 -278 -41 -237 -106 -228 96 -214 75 -10 -136 19 -190 -128 -119 -113 45 -27 -120 94 105 -63 123 -5
5814 -5 117 32 49 134 -68 133 64 193 48 74 157 136 -11 78 218 40 110 106 117 110 9 150 58 176 -121 67
5840 67 -84 56 65 -100 80 -224 92 -92 -42 -28 -132 -90 -111 93 -251 -89 -26 63 -112 -30 -51 -192 -39 -213
5864 -213 17 -107 -72 -51 -248 -135 -202 -60 -284 -6 17 -150 50 -321 27 -238 -36 9 -10 -83 -11 71 58
5887 58 56 9 190 -79 164 -37 57 107 54 117 23 108 95 162 141 64 204 101 189 45 133 85 124 112 140 36 33
5914 33 102 -72 133 108 37 24 -31 151 -176 42 -255 86 -269 -33 -23 -146 -12 -32 -69 -116 50 -187 -45
5937 -45 69 -137 -11 -133 16 -152 -50 -193 -205 11 -399 -40 -286 -125 -50 -67 -39 62 116 -122 6 -82
$$ packed form
5769a76J79j64J89j37J65j42j27J65k78K43L8k51Q6j7K20k06L7j16L16k35J51
5790f0r2j26K37j96J31j22L24l10K89q5j26J55k09O2ROJ58p2r3K14J1j68J86j28
5814eJ22q5J7Q5k02K01o9J29j45K6Q3k1j47Q9J40j78P0mJ1pj01J41r2J18k97J88
5840F7j51J40Rj65J80l04L16j84N0J4j04M2k1K04l44J62O3Q9j75Q2k1j41J53j74
5864b13K30j24L5K1j97J13o7J42k24K78K3j67K00l71L48k65K02M5j9p3P2Q2j3
5887E8km7J81k69K43k01R4N0n3O3r4Q5j3O7k1p7J40j03Q8j44Q8m8L9j2K8j04l
5914C3O9j74K05k5p1j3n5J82l27K18k97L41l55K36J0j23J34k0l7m7J66k37J42
5937d5J14k06J26j22J49j68J02j43j2K16m10L59k46J61P5j7K8J01N4k38J28q8
$$ plain form
5959 -82 216 169 18 5 102 23 -106 -4 17 243 170 23 -13 152 24 -147 171 151 115 19 38 135 -44 269
5983 269 56 107 67 14 123 116 23 -45 39 -88 130 46 -31 179 -23 -134 -25 155 -67 -47 19 -83 -21 -148
6007 -148 51 -120 -86 -271 -115 -131 -183 -79 -120 62 -161 -29 -353 -34 12 -232 -38 -73 -59 -243 -120 2
6029 2 57 -45 -69 24 -58 30 -27 97 68 85 49 -151 124 -65 23 4 168 40 79 241 62 248 112 233 105
6054 105 48 69 -30 42 146 193 -6 156 152 175 40 -52 143 47 335 -13 60 -173 24 54 66 133 -260 -16 -240
6079 -240 -97 -215 -198 -40 -212 -89 -222 16 -249 -192 146 -234 -194 -200 -22 -150 -35 -106 -53 -162 -62 -102 -106
6102 -106 74 -281 -221 40 -113 -45 -155 -168 -11 34 -120 236 -23 -14 -107 155 74 -107 171 -19 260 113 42
6125 42 180 141 222 -86 50 61 204 136 131 156 -25 165 -26 86 54 89 37 183 133 4 13 25 71 27 -24 -35
$$ packed form
5959h2K98m7j51j3R7p9j29J02K1K26p3j47l6J65j28j71L18k0l6r6J9R7j79L13
5983B69k13N1m0n3J09pr3o8Q4j27K18q4p7K10k02j11J09J80k22K0O6j02O2j27
6007a48J99j71L4j85J56j6n2J04m1J82k23J32l24L19M6k44J94l5J4j84J23J22
6029BN5j02k4R3q2Q8n7J24k9J7l6k00K75j89Q8j9J64j28L9J62j79J86j36J21j28
6054A05n7K1r9P2J04M7j99J62mK3j35r2J95r6K88l48P3k33J97L0J2O7l93K44k24
6079b40J43j18J7J58j72J23j33K38k65N7L38l80M0oJ78j28J15p1N3j09J00m0m
6102a06J80l55O0K61j53O8j10j3J57M5j54L56k59Rr3K62q1j81K78j90K79j47p1
6125D2J38l9Q1l08J36J1J43o8nK5j81J90j91J12l2L5n2J46n0j29RJ2M6m4n1j1
$$ plain form
6151 -35 29 23 -107 95 -145 -3 -86 59 -67 -196 -202 -114 98 -116 21 -166 -162 -23 -167 -47 -382 -13 -88 -84
6175 -84 -118 -326 -55 -160 -5 -317 -101 107 183 71 -117 94 -38 235 41 2 -35 101 -13 -138 133 72
6197 72 148 58 245 -24 119 201 13 217 39 157 147 94 148 195 159 44 126 135 214 128 178 76 -62 93 50
6222 50 -12 -50 -3 -120 -87 142 -105 102 -210 143 -111 2 -3 35 -122 -327 76 -257 -27 -135 -223 -121 -262
6245 -262 -193 -211 -67 -202 -41 -226 -73 -139 -248 -62 -139 -106 93 59 -69 76 -74 -7 82 -62 -1 -66 61
6268 61 -110 85 -109 16 255 21 144 78 79 54 132 141 54 272 32 164 62 228 122 272 37 51 306
6291 306 -42 80 105 99 63 -3 142 -99 137 -229 44 -100 -52 -51 -254 -98 -189 71 -46 -78 -95 -114 -103 -136 6
6316 6 -275 93 -178 -209 12 -268 -26 -111 -148 -226 -127 -94 -42 -93 -235 17 3 -99 16 -16 -60 43 -75 -68 137
$$ packed form
6151c5O4oj30K02k40J42q3J45j26j29oQ8K12k14J37j87MJ39j44J20l35L69p5M
6175h4l4k08K71j05J55l12K16K08P6j12j88K11j32K73j94l9l7J36j14j25K71o1
6197G2P6r0J87k69J43Q2j88K04j78J18j0n3N4M7l6j15Q2RP9q6N0j02j38J55m3
6222E0o2l8M7j17L3K29k47K07l12L53k54J13nL8j57k05M03l33K30j08q8J02j41
6245b62O9j8J44j35J61j85J53o6j09J86p7L3J99l4j28J45j50O7Q9j44O1o5J27
6268F1j71J95j94J25K39k34J23o6Jk5P8Rq7K18k40J32j02J66j06J50k35J4K55
6291C06l48J22K5ol6o6J45k41K36l66K73j44M8Jk03J56r1K60j17l2j7j9J1l3J42
6316Fk81L68k71l1K21k80K42q5l7p8R9L3N2n1j42K52j4j02J15l2m4J03j18PK05
$$ plain form
6341 137 64 -2 52 82 128 40 3 11 101 33 167 -49 10 60 238 299 74 218 -80 287 95 71 96 69 259 -106
6367 -106 57 -8 131 -44 57 49 141 84 25 156 -155 67 -60 4 32 -95 -15 -160 -73 -282 80 -228 -155 -110
6391 -110 -121 -122 -22 -52 -166 75 -121 -62 -49 -222 28 -143 -44 -120 6 -20 -106 -33 -74 119 -132 -166 -28 -111 -62
6416 -62 14 -67 12 48 -23 42 66 120 104 174 254 18 136 -71 14 117 41 38 152 191 22 180 -95 95 55 95
6442 95 146 98 315 69 186 35 64 148 -24 194 16 -80 162 164 -89 11 27 -50 57 -146 -1 -99 64 -65
6466 -65 -120 -108 -179 87 -240 -38 -170 -192 -164 9 -186 -121 -211 -135 93 -117 8 -41 -45 -82 -130 75 -181 75 86
6491 86 98 -22 -209 114 -169 -9 -53 83 19 130 107 0 105 24 16 56 87 80 222 131 160 97 -4 128 107
6516 107 194 159 7 157 43 110 -14 -40 -20 -48 -38 -138 107 -130 21 -116 55 -23 -106 138 -63 -139 -222 20
$$ packed form
6341A37p3o6N4L0M6q8l7QR0o8J34k16N9N0J78O1k25J44k98L67j92k4K5k7J90l65
6367a06J63o5J39j75J01qR2n7n9J31l11K22j27O4K8j27Q0j45Q7k09L62l08P3M5
6391a10j1jJ00l0j14K41j96N9J3j73K50j71R9p6J26k6q6P3m1J93k51l4J38q3M9
6416f2P6q1P9L6p1O5K4N4j6P0Q0k36J18k07Q5J03p6lJ14L9j69J58k75J90m0M0
6442I5N1m8K17k46J17j51K9Q4j72K18j78r6K42Kk53J00J6p7J07k03J45r8J63j29
6466f5n5J2p1K66l27K02j32k2K8J73j95O5r0P6K28k10J25m9ml7m8K05k56K56J1
6491H6J2j20j87L23k83J60m4J36o4J11k3j07J05q1qM0L1pJ42r1K9o3j01J32k1
6516A07Q7l5j52J50j14O7j24k6K0k8J0j00K45k37J51j37J71p8q3K44k01p6q3K42
$$ plain form
6540 20 -207 -103 -138 -42 -29 -158 87 -241 -131 -107 -199 -275 -12 -20 17 13 -96 -101 -172 133 -39 -154 96 20 33 -39
6566 -39 109 23 83 46 -58 200 -13 -35 248 120 -128 -49 210 -81 233 104 152 154 220 73 4 166 206 140
6590 140 -5 174 39 170 66 -30 120 76 86 12 103 -35 66 -146 38 114 -6 94 -33 133 67 1 -250
6613 -250 -26 -34 -168 -47 -98 74 -45 -251 -34 -157 -113 -51 -44 -209 49 -116 -74 -184 -189 140 -36 38 -110 16
6637 16 -142 3 47 -92 175 8 11 63 207 164 98 128 92 275 99 101 74 150 43 81 100 -66 131 -80 157
6662 157 55 49 265 46 120 -57 56 26 149 119 -110 16 -5 84 114 89 -117 62 -169 58 -49 5 32 14
6686 14 -55 -69 -121 -138 -75 152 -63 -10 -274 33 -85 -50 -90 -128 11 -361 -76 -190 -69 -211 -69 -43 -43 7 -183
6711 -183 -74 -46 -74 13 0 31 -82 102 -39 -55 -8 81 -5 29 76 -26 242 5 96 13 -1 93 -37 155 20
$$ packed form
6540B0k27J04l5R6J3j29K45l28J10K4r2p6K63qL7mj09np1L05j72j15K50p6J3p2
6566c9J48q6O0l7j04K58k13k2K83j28k48P9K59k91L14j29M8KO6j47o9J62M0o6
6590A40j45J79j35J31j04r6J50m4J0p4R1j38J01k12J84P6j20J00j27J66o6o6k51
6613b50K24qj34J21n1J72j19k06K17j23M4O2Pj65K58j65M2j10nL29j76P4j48J26
6637A6j58J45M4j39K67j67LN2J44m3o6L0l6J83j76Kk7P6j07L8J9j66J97k11K37
6662A57j02oK16k19P4j77J13l0J23l0k29J26k1Q9L0k5k06J79k31K27j07N4K7j8
6686A4o9j4n2j7O3K27k15N3k64L07j18L5m0l8J39l72K85j14J21j42J42K6%N0j90
6711a83J09K8k8Q7j3L1j13J84j41j6M7Q9q6L4M7j02K68k37R1q3j4R4j30J92j35
$$ plain form
6736 20 225 8 115 -25 45 47 -63 197 -26 96 36 99 123 65 89 -108 31 -73 118 27 57 -40 -7 17 -144
6761 -144 172 -63 10 -187 -20 -26 -117 24 42 -93 -91 -108 -99 -142 88 -49 118 -125 18 -61 -27 -50 -49 -3 -268 81
6787 81 -80 186 -112 -5 -9 70 -47 58 72 -114 182 12 -40 46 -14 108 -260 216 -107 50 -73 97 59
6810 59 105 150 89 140 -35 94 49 -60 45 79 55 81 60 0 -41 156 -21 111 10 101 -152 -76 -49 49 63 -125
6836 -125 -82 -75 104 -99 -64 -60 -51 -164 -70 -19 -66 114 -281 -56 -84 -208 -190 -133 15 -152 -53 -148 49 -68 -225
6861 -225 -88 50 14 -43 141 85 -32 -119 72 61 -88 90 153 169 77 79 34 33 112 180 236 29 190 -14 135
6886 135 65 51 3 -76 276 -20 105 112 86 155 -51 -19 146 47 147 -37 58 -91 20 -105 20 -95 -107 26
6910 26 -57 113 -17 -6 -220 -38 -83 -67 -88 -93 -85 -104 -13 14 -24 -184 -197 -105 13 -8 -175 -158 -12 63 0 140 3
$$ packed form
6736B0K05k17J07j40P0Kj10K60k23J22o0O3K4n8K4j97J39j04J91r1L0r7L3K4j61
6761a44L16k35P3j97J67or1J41J8j35Kj7Rm3K30j37J67k43J43p9L4k3JM6k65L49
6787H1j61K66k98J07mP9j17J05J4j86K96j70n2Q6o0J22l68M76l23J57j23J70l8
6810E9M6M5o1N1j75J29m5j09J05L4k4K6k1o0m1J97j77J32j01R1k53P6K7R8J4j88
6836a25M3PJ79k03L5MRj13R4N1m7J80l95K25k8j24J8N7J48j67R9r5J97j17j57
6861b25J37J38l6n7J84n6j17q7J91j1j49J78O3J6r2Km5jP9O8N6k07J61k04J49
6886A35p0j4m8p9L52k96J25Pk6O9k06L2J65r9J00j84R5j49J11j25J25j15j2J33
6910B6q3J70j30J1k14J82m5J6k1nQj9R1K7l8j60j3R2J18k1j67J7J46P5o3J40j37
$$ plain form
6937 3 -122 -51 85 8 -180 128 -135 99 85 -84 126 -82 185 -27 -105 -133 50 132 44 -25 99 79 47 32
6961 32 -84 202 251 197 70 114 48 77 134 74 93 116 -25 155 -173 235 -1 122 55 -35 196 -66 47 -185
6985 -185 -161 -136 22 -136 -65 -40 -158 78 -131 88 -73 -65 -88 -68 -68 -86 -87 -162 -53 -52 -113 -34 25 -125 -283 0
7011 0 -304 -12 -125 -69 14 -80 74 -119 30 -26 64 71 -83 -2 105 -60 -33 143 78 171 250 -46 178 -82 89
7036 89 87 40 111 181 205 98 196 135 264 112 108 38 16 91 122 175 -12 128 68 -70 114 108 -60 6 68 -63 -111
7063 -111 -241 -63 99 5 91 -161 -95 -43 -111 -99 -106 -221 -222 99 -89 -47 -199 8 2 -18 -17 -38 82 -17 94 -229
7089 -229 -63 2 -66 -78 67 146 214 63 23 -25 137 96 49 10 189 23 50 -29 43 -119 113 122 -78 135 421
7114 421 260 68 66 247 73 133 18 62 47 203 81 -50 208 28 -14 -99 95 21 78 90 -15 -14 -72 88
$$ packed form
6937Cj25P1J36p7j88L08k63K34j4j69K10k08K67k12p8k8J83Q2q8o9J24k0l2j5
6961C2j16K86M9n4j27M4o6K9N7o0J9K3j41J80l28M08k36J23o7r0K31k62J13k32
6985a85K4K5J58j58P1K5j18K36k09K19j61Qk3K0%j8jp5J09Jo1P9N9j50j58K83
7011@l04K92j13N6Q3r4J54j93J49n6R0Pj54Q1J07j65K7J76o5R3P9k96K24k60J71
7036H9km7P1P0K4j07R8o1J29j52mp0k2P5L1N3j87J40o0j38J84oj68O6O2j31m8
7063a11j30J78J62r4Q6k52O6N2o8J2pj15jL21j88M2j52K07ok0Jk1J20r9J11l23
7089b29J66O5o8j2J45P9O8j51m0m8J62m1m7l9J79j66K7p9P2j62K32Rk00K13K86
7114D21j61j92kJ81j74O0j15M4j5J56j22j31K58j80m2q5J94p4N7J2j05Jn8J60
$$ plain form
7138 88 -77 -15 1 -32 -143 -39 -78 23 45 -41 -31 -64 -113 -151 -61 -10 -86 -131 -145 -19 -159 -19 -70 -137 175 -111
7164 -111 -177 -106 -27 127 -64 -26 -2 -217 -74 188 -103 89 113 98 34 64 66 -70 145 188 184 -42 58 0 -25
7189 -25 309 -51 57 47 -33 17 134 60 85 -63 33 148 56 6 66 -225 68 65 57 -109 -21 -120 -64 10 -47 28 -48
7216 -48 -37 -87 -134 -32 -132 44 23 -24 -84 -58 -39 -96 -18 -100 -133 -177 7 -265 45 -148 -42 -174 -98 -67 -43 -27
7242 -27 -6 23 -55 -4 2 -94 133 -31 12 151 62 75 106 87 -7 138 -76 19 -116 24 111 61 18 119 209 75
7268 75 128 52 90 90 -49 43 111 39 -61 218 -77 78 116 80 93 -21 28 -109 -42 39 -109 -123 -84 -69 -33 -136
7294 -136 11 43 -135 65 78 -162 51 -241 33 -238 167 -157 -201 -76 -84 -54 -208 6 -241 -102 -100 -191 -18
7317 -18 -122 41 54 117 5 -77 113 17 47 -2 197 -3 219 122 161 13 97 32 -104 241 46 118 54 -11 87
$$ packed form
7138H8j65O2J6l3j11J04l9J01K2q6J0l3m9l8R0N1p6m5j4J26j40J40n1o7L12k86
7164a11o6P1P9J54j91L8K4k15J43K62k91J92K4j5o4L0Kj36K15M3mk26J00n8k5
7189b5L34l60J08j0q0N0J17p4K5j48R6J15r2n0O0k91K93lqj66Q8r9N6P4n7P5p6
7216d8J1n0m7J02j00J76k1m7o0K6J9n7P8q2l3m4J84k72L10j93J06j32P6L1K4J6
7242b7K1K9p8N1Or6K27j64M3J39q9J3L1j9r4J45k14R5j35J40Q7n0m3J01R0j34
7268G5N3p6L8%j39R2O8p2j00K79k95J55L8l6J3j14M9j37O7Q1j48j4L9J5L6j03
7294a36J47L2j78K00J3k40K13k92K74k71M05l24m4J25qL0j54K14k47J39Kr1J73
7317a8j04J63J3O3j12q2J90r6L0m9J99k00K22r7L9j48Q4o5j36L45j95P2o4o5R8
$$ plain form
7342 87 -10 140 -42 36 86 115 -104 -113 81 -3 80 -132 -7 37 46 -103 16 -67 -178 30 -30 84 -104 -103 -68 -80
7368 -80 108 -109 79 -118 -85 -119 -96 -66 -214 69 -133 -42 -146 -126 -231 1 -19 -193 -34 -206 13 -100 -9
7391 -9 31 -55 228 55 -38 -83 101 33 -62 -33 29 166 1 118 100 136 -32 70 49 112 53 -79 148 51 99 57
7417 57 -41 146 -54 108 -2 182 13 131 37 216 122 106 130 -127 187 93 48 -32 65 -108 59 97 32 108
7441 108 99 -184 -101 -38 41 -171 -15 -121 -25 -42 -125 -79 -153 19 -52 -46 -7 -31 -24 -218 -141 -236 -32 -54 61 -55 36
7468 36 -57 84 56 -53 -28 -71 -108 0 67 131 59 122 -102 8 16 113 170 145 -83 53 218 -124 118 -110 129
7493 129 161 81 157 84 101 139 -10 6 88 -10 -99 -3 -40 48 -14 104 -160 -127 73 -27 -69 -183 179 118 -80 -66
7519 -66 -7 -49 -240 39 -10 57 -279 -135 -59 -59 11 -142 -1 -83 -31 -24 -65 -151 -183 0 -41 176 18 -98 19 -20
$$ packed form
7342H7r7J50j82P8N0K9k19rJ94q4Q3k12J25M4Rj49J19q3j11K08o0J14j88JL5j2
7368h0J88k17J88j97L3l4K3L0j48K83k02R1j04K0j05K32k0j74J59j72K19j13R1
7391iM0q6K83j73r3m5J84o8r5K9O2J37j65J17j8L6j68J02k1O3n9j32K27r7M8m2
7417E7r8J87k00J62j10J84j69J18r4J79r4j6K4k57L14r4m5q0R7j73J67L8o5P6
7441A08rk83Q3O3P9k12J56j06R6j7q3M6p4J72p1OL9k4Pj94P7r5K04k2J15j16R1
7468C6r3J41k8j09K5m3l7J08O7O4p2O3k24J10QR7N7k5k28J36J65l42K42k28K39
7493A29L2q0P6p3J7L8j49J6Q2r8q9R6l7Q8o2J18k64L3K00j00m2j14L62o1j98J4
7519f6N9m2j91K79m9O7l36J44P6%P0j53J41q2N2Pm1q6l2J83m1K17j58j16J17l9
$$ plain form
7545 -20 31 -115 185 -101 27 -176 -76 -81 112 -1 65 91 50 159 -104 105 18 115 110 95 60 68 128 83 158 11
7571 11 47 1 49 29 79 256 93 9 -48 114 30 56 229 25 117 -43 -37 99 26 83 -112 -135 -149 -45 -64 -31
7597 -31 -126 0 -17 -121 -111 -159 -3 -146 -67 -29 -115 8 -247 -66 37 -218 -88 -81 -197 -121 -1 2 -127 -137 16
7622 16 87 22 64 -51 -96 -1 91 233 135 -260 68 167 62 73 74 5 21 117 65 -54 95 114 145 -103 292 121
7648 121 108 34 186 52 -93 7 143 204 9 131 47 223 -103 -114 141 -139 -68 -67 -86 -108 -152 -119 -152 132
7672 132 -136 -33 -106 -120 75 35 -49 -98 56 -39 -220 -87 -93 34 -209 -8 -84 -82 -106 -156 -96 -117 36 -101 -50
7697 -50 3 -150 -76 -64 -21 28 -134 56 35 -47 38 85 -37 173 -29 165 105 93 54 46 68 31 227 -122 8 27
7723 27 190 -59 102 164 104 185 49 77 13 -1 -110 116 48 11 57 -64 -23 -55 -84 100 -237 -23 -194 -86
$$ packed form
7545b0N1j46L00k86J28k03J00nJ93j13O6K6m1J09k63K09q7R7nj5l5QO0m5P5j47
7571A1L6m6M8k0N0J77j63q4n7J62q4K6J73k04R2j60OJ36p3N7j95k3j4J04j9L3
7597c1r5J26j7j04J0m8J56j43P9L8q6J23k55J81J03k55J30Pj16P6J20Lj29j0J53
7622A6P1o5M2j15m5R5R2J42r8l95L28R9j05J1Jo9J6R6n2j19J49J9L1k48L95j71
7648A21j3p4J52j34j45J00J36O1j95J22q4J76l26j1K55k80P1Jj9k2m4L3l3K84
7672A32k68J03p3j4J95m0q4m9J54r5j81J33oJ27k43K01p6Kk4n0O0k1J53j37N1
7697e0N3j53P4J2M3M9j62J90k1q2Q5M7j22K10k02J94o0j2l9qK2l7J96l49J30J9
7723B7J63k49J61O2o0Q1j36K8o4j4j09K26o8l7M6j21M1l2k9J84l37K14j71J08
$$ plain form
7747 -86 -131 128 -94 94 -57 -58 -16 -35 -6 -123 -71 -49 -76 -43 -39 124 -190 -38 53 -88 151 -94 19 -56 -214
7772 -214 -139 -47 34 62 -62 25 205 -76 18 -68 31 72 -11 60 -108 144 -126 173 147 137 30 18 -25 -8 88 75
7798 75 127 115 185 -52 -25 151 175 103 44 55 56 51 90 85 157 -162 20 14 -39 1 -30 -152 -115 137 -138 145 -27 -126
7826 -126 -65 -81 -93 72 28 -89 -47 -210 -132 -8 12 4 -2 22 -115 -88 -104 -13 117 -135 34 -131 -21 109 82
7851 82 60 -83 69 0 44 103 108 46 91 107 142 64 65 3 -201 -28 -39 66 -5 -89 238 97 98 87 238 -21 58
7878 58 72 104 168 -68 148 -71 34 -32 156 181 65 14 32 -55 -198 131 -16 -84 -125 -18 -14 -102 143 -144 -167
7903 -167 -73 -193 -133 -173 -124 -87 -15 -105 -178 -23 -35 20 -30 186 -90 -121 -10 47 -41 -42 45 -29 144 -41 -98 -24 45
7930 45 -15 109 3 -21 22 229 100 114 -116 54 -25 161 121 46 36 207 69 32 52 110 78 -21 112 176 9
$$ packed form
7747h6m5K59k22J88j51jM2j9K9j17N2K2k7L3MJ63l14J52R1j41K39k45J13p5j58
7772b14P5R2Q1K8j24Q7J80k81R4q6R9M1q3P1j68K52k70K99k6j0j07j2m3J7R6j3
7798G5N2j2P0k37K7J76K4p2n9J1JnL9nP2l19J82on3M0l1j22L7K52k75K83j72r9
7826a26O1j6j2J65m4j17M2j63P8J24K0qoK4j37K7j6R1J30k52J69j65J10J30k7
7851H2k2j43J52o9M4N9No2M5J6L5p8Jo2k04J73j1J05p1q4L27j41Jj1J51k59P9
7878E8J4L2O4k36K16k19J05o6J88K5j16n1J8q7j43L29j47o8m1J07Mq8K45k87k3
7903a67R4j20O0m0M9L7P2r0p3J55j2N5n0K16k76l1J11N7q8jQ7p4J73j85n7P4O9
7930D5o0J24j06k4M3K07j29J4k30J70p9J86m0p5j0J71j38l7K0N8l2r9J33O4j67
$$ plain form
7955 9 9 39 21 105 86 -27 221 13 80 -164 -61 53 -122 -2 -125 -24 -156 70 -11 -99 39 -94 149 27
7979 27 -82 -134 -26 -73 -27 151 -30 -95 -37 -119 -114 -83 -44 -125 -7 -31 73 -3 128 15 -118 -53 -79 -43 65 -71
8005 -71 16 30 -35 174 -58 33 140 94 85 32 58 105 -16 94 111 78 59 113 159 91 122 18 198 -11 159 -47
8031 -47 79 80 -87 -3 -36 158 -20 145 10 60 -31 139 -105 -114 0 -32 -14 -62 -121 -52 103 -88 30 -20 44
8056 44 -27 -187 -25 -10 -187 -41 -133 -45 -87 20 -42 26 -28 17 35 17 -13 -89 -87 -40 -44 117 8 -169 -77 129 -75
8083 -75 -87 35 -13 56 8 213 133 49 48 212 16 -28 121 57 199 -38 98 -20 282 131 -63 36 -40 71
8107 71 -10 -9 -87 119 -44 -82 -132 -54 -38 193 6 -136 0 9 -35 62 -47 -1 -183 -7 -164 -25 -148 -121 20
8132 20 -51 28 -68 -19 -65 -19 -92 -75 -106 -234 -48 -187 -202 -177 -122 -50 -173 -44 41 198 -9 151 11 -86 1 -94
$$ packed form
7955I%L0j8Q4j9j13K48k08O7k44J03J14j75J20j23J01j32K26q1q8J38j33K43j22
7979B7j09n2J08m7M6J78j81o5N8q2NL1L9q1J18k4J04p6J31j13j33O5k6L6J08j36
8005g1Q7J4o5K09k32R1J07m6rn3K6M7j21J10J7l3j9N4M6o8L1j04J80k09J70k06
8031d7J26Jj67Q4l3J94j78J65j35N0r1J70k44rJ14l2J8m8n9O9J55j91J18n0O4
8056D4p1j60J62J5j77J46r2Q8m2J07o2O8n4M5J8j8l0p6KM7mJ61j09j77R2K06k04
8083g5j2J22m8O9m8K05q0q4jJ64j96m4J49o4J42k37J36j18L02j51j94R9p6J11
8107G1q1Jp8K06j63l8n0P8J6K31j87j42J36Rm4R7j09M6j82J76j57J39j23K7J41
8132B0p1P9r6M9m6M6p3J7l1j28J86j39j5K5N5P2j23J29Q5J57k07J60j40r7Q7r5
$$ plain form
8158 -94 113 -30 38 68 123 174 195 186 55 131 99 108 25 53 -117 -27 222 -9 62 94 111 115 79 103 125 61 -68 62
8186 62 28 -136 38 18 48
$$ packed form
8158i4K07j43O8L0N5N1K1rj31P6l2Rq3K8j70R0K49k31P1L2J7Ml6K4K2o4j29J30
8186F2l4j64J74k0L0
8191D8
$$ Imaginary data points
##PAGE= N=2
##DATA TABLE= (X++(I..I)), XYDATA
$$ plain form
0 0 0 0 0 0 0 0 0 0 -6 8 -8 8 -15 16 -22 24 -32 40 -48 63 -72 88 -105 126 -147 174 -202 235 -271 313 -359
31 -359 410 -466 529 -600 674 -761 855 -958 1069 -1192 1325 -1471 1631 -1806 1996 -2206
47 -2206 2432 -2682 2954 -3254 3583 -3946 4351 -4801 5303 -5873 6520 -7264 8132 -9154
61 -9154 10382 -11891 13796 -16287 19699 -24696 32820 -49103 154890 -377024 -7768 290880
73 290880 -253102 180487 -23872 -36025 48036 -127965 115083 -23880 -164410 157007
83 157007 -65819 -109305 39780 -10541 -55311 -3635 -5332 -80223 43418 -27100 -86834 92964
95 92964 -72007 -8709 11161 -79891 107279 -60528 -57176 92339 -101096 59310 9158
106 9158 -89574 89926 -84255 48052 30859 -148247 138707 -14264 -82841 72118 -33165
$$ packed form
0@%%%%%%%%oJ4j6J6k3L1l8M6n6P2q8J11j35J60j93K31k73L21l76M37n06N84o72
31c59P69q76R95j129J274j435J616j813K027k261K517k796L102l437L802m202
47b206M638n114N636o208O837p529Q297r152J0104j1176J2393j3784J5396j7286
61i154J9536k2273K5687l0083L5986m4395N7516q1923K03993n31914L69256K98648
73B90880n43982M33589k04359j2153Q4061j76001K43048j38963j40530L21417
83A57007k22826m3486J49085n0321m4770N1676j697p4891J23641p0518n9734J79798
95I2964j64971O3298J9870r1052J87170j67807L352J49515j93435J60406n0152
106I158r8732J79500j74181J32307j7193j79106K86954j52971o8577J54959j05283
$$ plain form
117 -33165 31722 1222 -20436 44730 -21571 38887 14973 -17428 28505 10871 55815 -51527
129 -51527 23344 75423 -81312 89395 -23242 -45554 120384 -101235 33067 51390 -97529
140 -97529 84483 -48683 -20916 76285 -115567 55593 12760 -83913 87341 -55448 -23186
151 -23186 39297 -18434 27560 -52922 17790 51330 -37264 9236 6104 7782 14771 -1472 10057
164 10057 -16584 24148 7431 -18430 23775 -38327 32892 2973 -53657 53373 -46995 9056
176 9056 14030 -73073 71569 -41774 -48440 65038 -60253 11776 -1317 -44746 58774 -63305
188 -63305 7813 40301 -79698 49724 -2252 -26657 16612 -26713 42625 -24075 -23721 41229
200 41229 -21167 5744 -1183 -4092 21216 -24693 26026 305 -19650 38069 -13947 20589
$$ packed form
117c3165O4887l0500k1658O5166o6301O0458k3914l2401M5933j7634M4944j07342
129e1527P4871N2079j56735J70707j12637k2312J65938k21619J34302J8323j48919
140i7529J82012j33166K7767R7201j91852J71160m2833r6673J71254j42789L2262
151b3186O2483n7731M5994q0482P0712L3540q8594M6500l132J678O989j6243J1529
164A0057k6641M0732j6717k5861M2205o2102P1219k9919n6630J07030j00368N6051
176I056M974q7103J44642j13343o666J13478j25291P2029j3093m3429J03520j22079
188f3305P1118L2488j19999J29422n1976k4405M3269m3325O9338o6700L54O4950
200D1229o2396K6911o927k909K5308m5909N0719k5721j9955N7719n2016L4536
$$ plain form
212 20589 -11127 1958 59086 -53518 31411 34544 -39688 54692 -7488 -8439 39646 -16695
224 -16695 27106 -4549 -5421 44322 -37937 16512 26492 -34280 13988 8774 -6973 -26010 23733
237 23733 4710 -57614 33761 622 -38399 4165 -10656 11729 -34812 -16605 44229 -64938
249 -64938 2273 36735 -62756 19644 -8181 -6340 7520 -46815 46318 -17782 -35219 46907
261 46907 -33272 -77 20542 -26108 20945 -11817 2325 19670 -29021 27608 -985 -11755
273 -11755 24770 -10842 5487 6513 11727 -7223 -2756 33883 -18283 -687 24744 -7809 7871
286 7871 -3842 12411 11738 -27909 38868 -3614 -29854 46792 -16644 -4431 11285 -6986 21066
299 21066 -22720 7441 16497 -21336 15237 -3590 -9618 15158 -10923 594 -1289 -539 2974
$$ packed form
212B0589l1716J3085N7128j12604Q4929L133p4232R4380o2180r51M8085n6341
224a6695M3801l1655q72M9743q2259N4449R980o0772M8268n214j5747j9037M9743
237B3733j9023o2324R1375l3139l9021M2564j4821K2385m6541J8207O0834j09167
249f4938O7211L4462r9491Q2400k7825J841J3860n4335R3133o4100j7437Q2126
261D6907q0179L3195K0619m6650M7053l2762J4142J7345m8691N6629k8593j0770
273a1755L6525l5612J6329J026N214j8950M467L6639n2166J7596K5431l2553J5680
286G871j1713J6253o73l9647O6777m2482k6240P6646o3436J2213J5716j8271K8052
299B1066m3786L0161R056l7833L6573j8827o028K4776k6081J1517j883P50L513
$$ plain form
312 2974 -15569 17537 -17711 -5378 23580 -30526 5276 4502 -3962 -452 -23581 28819 -6831
325 -6831 -33732 37738 -13722 -21519 27027 -15419 -1111 -4292 3189 9288 -31415 19951 3704
338 3704 -24303 12025 -4192 -7283 -679 -296 -6320 -9115 11167 -7413 -16440 15138 -6337 -8536
352 -8536 5836 -1881 1866 -9532 19734 -3740 -16919 33040 -4483 -6893 13906 7104 12116
365 12116 -9507 11825 23437 -17104 13739 18885 -13046 13513 6327 6053 -2933 -1173 23299
378 23299 -13480 -3822 12786 1192 -4385 -8030 13670 -4769 -12162 13139 -11012 -5797 12728
391 12728 -17754 1293 439 -9247 7022 -16582 1433 -695 -10290 4191 -15290 -4732 4778
404 4778 -10404 -11818 -1430 -492 -11463 -6699 3052 -12024 -4077 3469 -10723 4539 -6213 83
$$ packed form
312B974j8543L3106l5248J2333K8958n4106L5802p74q464L510k3129N2400l5650
325f831k6901P1470n1460p797M8546m2446J4308l181P481O099m0703N1366j6247
338C704k8007L6328j6217l091O604L83o024k795K0282j8580r027L1578k1475k199
352h536J4372p717L747j1398K9266k3474j3179M9959l7523k410K0799o802N012
365A2116k1623K1332J1612m0541L0843N146l1931K6559p186k74q986J760K4472
378B3299l6779R658J6608j1594n577l645K1700j8439p393K5301k4151N215J8525
391A2728l0482J9047q54r686J6269k3604J8015k128r595J4481j9481J0558R510
404D778j5182j414J0388R38j0971M764R751j5076P947P546j4192J5262j0752O296
$$ plain form
418 83 7721 -9252 8581 3476 1819 3736 2602 15221 67 -3008 18056 8263 -3045 8131
432 8131 10497 4802 -2975 15151 2236 -12136 20115 1271 -10471 3363 5490 323 -9810
445 -9810 3336 524 -7224 3675 -2907 -7961 6366 -2065 -5415 676 261 1809 -6703 6411
459 6411 -3158 -4876 12196 -8092 -3558 8585 -1118 -5764 1431 4013 -2329 -5231 2842 2418 -6698
474 -6698 847 -2047 -517 -1241 -1793 -327 -6081 3906 297 -1984 -3564 -1184 7154 -1153 -6600 567
490 567 6408 -2534 -3023 542 118 -4046 1078 2907 -10116 -2126 3138 -387 -9916 -3014 6063 -8903
506 -8903 -3765 3894 -2962 -6676 3111 2445 -3191 203 3167 2730 -830 8590 2398 -872 7967 8880
522 8880 3151 627 10442 5339 3704 6726 4292 -616 7355 10934 -8414 288 11643 -194
$$ packed form
418H3P638j6973J7833n105j657J917j134J2619j5154l075K1064r793j1308J1176
432H131K366n695p777J8126j2915j4372L2251j8844j1742J3834K127n167j0133
445i810J3146k812p748J0899o582n054J4327q431l350O091m15J548q512J3114
459F411r569j718J7072k0288M534J2143r703m646P195K582o342k902Q073m24r116
474f698P545k894J530p24n52J466n754R987l609k281j580K380Q338q307n447P167
490E67N841q942m89L565m24m164N124J829j3023P990N264l525r529O902R077j4966
506h903N138P659o856l714R787o66n636L394K964m37l560R420o192l270Q839R13
522H880n729k524R815n103j635L022k434m908P971L579j9348Q702J1355j1837
$$ plain form
536 -194 -9175 4565 6078 -11159 -420 6407 -9193 -8625 9944 -5455 -14249 4401 2239 -11156
550 -11156 -8087 9089 -8213 -11577 6645 -4030 -8620 -1163 -434 -5806 -2699 -1005 -4345 -5210
564 -5210 2145 -1774 -8438 1998 -2776 -623 394 -3109 -2627 2330 7470 -7735 51 9518 -359
579 -359 380 5700 2025 1797 6652 5319 862 -193 11747 1582 -1103 8195 541 4161 1805
594 1805 2382 1199 1416 3434 -3881 3404 2924 -5780 467 4238 -4264 -1158 271 -350 -2950 -829
610 -829 6099 -10530 692 7523 -5316 -2957 -1325 6544 -3107 -6304 6509 -2557 -4633 6501
624 6501 -4138 -5195 4067 -65 -1683 -6932 4237 605 -7262 2873 -3280 -1557 -1188 -222 -2392
639 -2392 -4616 4348 -3173 -5735 5318 -2504 -5874 5340 -2001 -1979 -1096 2082 2020 -8337 7538
$$ packed form
536a94q981J3740J513j7237J0739O827j5600N68J8569j5399q794J8650k162j3395
550a1156L069J7176j7302l364J8222j0675m590P457P29n372L107J694l340q65
564e210P355l919o664J0436m774K153J017l503M82M957N140j5205P786R467r877
579c59P39N320l675k28M855j333m457j055J1940j0165k685R298p654L620k356
594A805N77j183K17K018p315P285m80q704O247L771q502L106J429o21k600K121
610h29O928j6629J1222O831j2839K359J632P869r651l197J2813r066k076J1134
624F501j0639j057R262m132j618n249J1169l632p867J0135o153J723L69R66k170
639b392k224Q964p521k562J1053p822l370J1214p341K2Q83L178o2j0357J5875
$$ plain form
654 7538 795 -6844 4652 3018 -1494 -4287 6796 3332 -7787 5435 6639 -7243 2930 6260
668 6260 -1081 -1223 2071 8515 -5937 2221 7563 -3778 5215 441 2288 2641 -863 5419 -403
683 -403 444 4487 -2287 4079 1612 -5758 8643 -2068 -3966 4420 -1665 211 -3908 3353 -2080
698 -2080 -5803 3738 -3055 -3687 -1068 -2091 -2253 -2832 -1474 -2666 -5216 3386 -5552 -5634 5874 -9133
714 -9133 -404 1628 -4823 -920 -2701 4247 -5010 -3518 7266 -4515 -3176 6189 -1725 -1565 1596
729 1596 2603 1245 -4268 7035 -188 -1961 5570 -1746 4102 -802 1229 3979 -1545 3595 805
744 805 748 3245 -562 3652 1725 -2896 7285 -644 -722 3839 -1228 5370 -3339 1985 3325 -3172
760 -3172 4652 -2577 -248 3096 -2517 145 -287 -1457 1579 -3721 194 -296 -3773 3707 -5762 -302
$$ packed form
654G538o743p639J1496j634m512k793J1083l464j1119J3222J204j3882J0173L330
668F260p341j42L294O444j4452Q158N342j1341Q993m774J847L53l504O282n822
683d03Q47M043o774O366k467p370J4401j0711j898Q386o085J876m119P261n433
698b080l723R541o793o32K619j023j62n79J358j192k550Q602q938q2J1508j5007
714i133Q729K032o451L903j781O948r257J492J0784j1781J339R365p914J60L161
729A596J007j358n513J1303p223j773P531p316N848m904K031K750n524N140k790
744H05n7K497l807M214j927m621J0181p929p8M561n067O598q709N324J340o497
760c172P824p229K329L344n613K662m32j170L036n300L915m90l477P480r469N460
$$ plain form
776 -302 1149 -3488 1395 -5327 2051 158 -4107 784 -1622 440 -1410 -2781 3362 -3010 -2884 5383
792 5383 -5478 -1281 1715 -659 -1662 -5101 7034 -4361 -5951 6496 -3199 -3816 1169 1429 -3311
807 -3311 -2853 5286 -1491 -7234 7929 98 -5820 5989 39 100 -366 5065 10 -3455 9966
822 9966 -1575 -2177 7323 2047 -1046 2012 5222 360 -2355 8179 813 -5346 10676 -880
836 -880 -3264 5244 1549 1296 -4271 5861 1828 -5669 4302 344 -2672 1116 -352 -1427 -1323 -517
852 -517 175 -4996 689 -1104 -4341 1026 -5853 43 -2269 -4082 -937 -4975 944 -4168 -4670 1181
868 1181 -3840 -2804 -416 -2993 -11 -2957 -260 2023 -5631 4248 69 -2323 3297 -455 3508
883 3508 -1617 2786 4386 -2140 4506 2917 -329 3654 2476 1657 1539 2000 5044 -3055 3643 4484
$$ packed form
776c02J451m637M883o722P378j893m265M891k406K062j850j371O143o372J26Q267
792E383j0861M197K996k374j003l439J2135j1395j590J2447r695o17M985K60m740
807c311M58Q139o777n743J5163p831n918J1809n950O1m66N431n055l465J3421
822I966j1541o02R500n276l093L058L210m862k715J0534p366o159J6022j1556
836h80k384Q508l695k53n567J0132m033p497R971l958l016L788j468j075J04Q06
852e17O92n171N685j793l237N367o879N896k312j813L145m038N919n112n02N851
868A181n021J036K388k577K982k946K697K283p654R879m179k392N620l752L963
883C508n125M403J600o526O646j589l246L983j178q19j18M61L044q099O698Q41
$$ plain form
899 4484 -4627 5849 648 -1364 1861 2217 1696 -4526 4352 2971 -5539 2092 3110 -4454 906
914 906 1936 -1506 -3471 1759 3321 -8460 2538 2675 -6016 780 -460 55 -3965 384 1834
929 1834 -5698 1058 1507 -5243 965 718 -2889 -109 -1946 2701 -3362 -1378 3489 -5557 2550 -222
945 -222 -2536 900 -947 1769 -2810 -897 2597 -2511 -782 1654 -2090 976 -1501 1028 634 -4522
961 -4522 4790 -1308 -1442 1664 -759 3039 -2886 1732 2989 -3011 2118 3035 -809 629 2172 2952
977 2952 -1131 330 6856 -3456 1873 4651 -942 2528 -387 4450 -536 -827 5210 -2379 775
992 775 3686 -1748 -72 1660 223 166 -2508 2409 -1750 -1993 2535 -5267 1167 -938 -2096 -658
1008 -658 -4436 1942 -3065 -3470 1301 -3485 -2242 -62 -3100 -382 -3119 -923 1016 -5355 1877
$$ packed form
899D484r111J0476n201k012L225L56n21o222Q878j381q510P631J018p564N360
914I06J030l442j965N230J562j1781J0998J37q691O796j240N15m020M349J450
929A834p532O756M49o750O208k47l607K780j837M647o063J984M867r046Q107k772
945b22k314L436j847K716m579J913L494n108J729K436l744L066k477K529l94n156
961d522R312o098j34L106k423L798n925M618J257o000N129R17l844J438J543P80
977B952m083J461O526j0312N329K778n593L470k915M837m986k91O037p589L154
992G75K911n434J676J732j437n7k674M917m159k43M528p802O434k105j158J438
1008f58l778O378n007m05M771m786J243K180l038K718k737K196J939o371P232
$$ plain form
1023 1877 -1986 -1683 1077 -2824 2348 -2964 323 2615 -3217 1236 1291 -662 1668 304 930 1380
1039 1380 -207 3390 -1227 2496 2173 -1131 4706 -810 1861 1324 1480 3378 -2668 4443 1916 -2589
1055 -2589 5212 702 -2591 4267 577 -32 -515 1380 2704 -5241 4574 461 -4597 4364 -1082
1070 -1082 -1924 -617 1202 -720 -3688 2960 -765 -5338 3678 -411 -5305 2307 -352 -2215 -2834
1085 -2834 2107 -933 -6346 5181 -2431 -4752 2312 -406 -2186 -2801 2424 -798 -5474 3284 827
1100 827 -6319 2940 193 -2457 43 -559 2017 -4507 2752 1820 -4676 3476 506 -59 100 601
1116 601 2898 -1287 814 3752 -2116 2136 3198 -1446 2429 279 3502 -884 -329 5792 -3031
1131 -3031 1966 2781 -492 1402 83 2923 -99 -1460 4378 -1209 -2134 4483 -1964 -528 601
$$ packed form
1023A877l863L03K760l901N172n312L287K292n832M453N5j953K330j364O26M50
1039A380j587L597m617L723l23l304N837n516K671n37J56J898o046P111k527m505
1055b589P801m510l293O858l690o09m83J895J324p945R815m113n058Q961n446
1070a082q42J307J819j922k968O648l725m573R016m089m894P612k659j863o19
1085b834M941l040n413J1527p612k321P064k718j780o15N225l222m676Q758k457
1100H27p146R259k747k650K500o02K576o524P259r32o496Q152k970n65J59N01
1116F01K297m185K101K938n868M252J062m644L875k150L223m386N55O121q823
1131c031M997Q15l273J894j319K840l022j361N838n587r25O617o447J436J129
$$ plain form
1146 601 586 275 -3548 4059 -2293 -2172 2709 -3404 -266 -690 -1302 -651 -2440 122 -1566 -3214 1740
1163 1740 -3281 -2204 1390 -4328 465 -1865 -773 -1245 -2642 2639 -4564 38 1711 -3877 1144
1178 1144 -111 -1864 1101 -843 804 -221 -1214 3965 -2697 1347 2659 -2481 3475 -236 1325
1193 1325 557 930 3478 -2415 2783 2851 -1852 3104 1335 -644 3185 -172 2045 261 -121 4138
1209 4138 -2886 2132 1127 -727 2309 -2092 2105 -193 -825 1267 -1775 826 350 -2151 1813
1224 1813 -1874 -930 2189 -4234 1090 -532 -1614 -84 -2746 2324 -2999 -1174 1259 -3372 516
1239 516 -716 -1887 -33 -1785 461 -958 -3137 3085 -2896 -1381 2205 -3221 1461 -1523 378
1254 378 -128 -1999 2904 -2264 -423 1762 -1414 447 -37 269 1481 -2345 2448 920 -2786 4032
$$ packed form
1146F01j5l11l823P607o352J21M881o113L138m24o12O51j789K562j688j648M954
1163A740n021J077L594n718M793k330J092m72j397N281p203M602J673n588N021
1178A144j255j753K965j944J647j025r93N179o662M044J312n140N956l711J561
1193A325p68L73K548n893N198O8m703M956j769j979L829l357K217j784l82M259
1209D138p024N018j005j854L036m401M197k298o32K092l042K601m76k501L964
1224A813l687R44L119o423N324j622j082J530k662N070n323J825K433m631L888
1239E16j232j171J854j752K246j419k179O222n981J515L586n426M682k984J901
1254C78n06j871M903n168J841K185l176J861m84L06J212l826M793j528l706O818
$$ plain form
1270 4032 -1098 22 869 307 2400 -2873 3167 1685 -2010 2744 883 165 982 912 2381 -1422
1286 -1422 1356 3940 -3647 2831 2601 -1762 1883 -393 2427 -1421 287 2678 -3303 1885 1248
1301 1248 -2648 631 435 -577 -1402 -1376 2339 -3337 -1260 2251 -4869 976 -822 -2365 -772 -1886
1317 -1886 1392 -3775 -1183 1238 -3157 -534 -164 -2092 12 -1522 -59 -867 -1929 2670 -3431
1332 -3431 80 1831 -3048 2243 -873 154 726 -347 1813 -1121 1454 2167 -1362 1997 1913 -487
1348 -487 2588 367 2203 708 473 4064 -2270 2778 2302 -1377 2693 362 1408 469 232 2051
1364 2051 -1285 564 2073 -2295 1045 539 -1377 886 -2147 1661 -1808 -1339 2173 -3400 460
1379 460 -92 -1572 -250 -1248 254 -1528 -1741 1659 -1960 -1757 1310 -2038 -11 -1330 89 -162
$$ packed form
1270D032n130J120Q47n62K093n273O040j482l695M754j861p18Q17p0J469l803
1286a422K778K584p587O478k30m363L645k276K820l848J708K391n981N188o37
1301A248l896L279j96j012q25K6L715n676K077L511p120N845j798j543J593j114
1317a886L278n167K592K421m395K623L70j928K104j534J463q08j062M599o101
1332c431L511J751m879N291l116J027N72j073K160k934K575P13l529L359q4k400
1348d87L075k221J836j495k35L591o334N048m76l679M070k331J046r39k37J819
1364B051l336J849J509m368L340n06j916K263l033L808l469M69L512n573L860
1379D60n52j480J322r98J502j782k13L400l619K03L067l348K027j319J419k51
$$ plain form
1395 -162 -3193 2691 -2299 -1773 1786 -1810 -651 -718 504 -146 -2161 1409 250 -2313 2427 -1032
1411 -1032 -725 1575 -638 1457 -1940 1969 1011 -2092 3072 -301 -103 1435 -47 919 297 662
1427 662 1218 -616 1743 799 -866 2716 -847 1455 934 -484 2298 -940 1638 369 116 1871
1443 1871 -1020 1273 1171 -1232 1385 760 -998 852 -546 1051 -1299 -387 1535 -3242 1251 -294
1459 -294 -1982 92 -929 -164 -2146 -715 455 -2640 -659 214 -2820 -197 -473 -1695 -446 -1662
1475 -1662 871 -2304 -397 817 -2530 874 -676 -318 303 -624 630 -520 -94 1255 -751 548
1491 548 1099 -758 1661 -353 1140 1261 -628 2270 -396 1304 1149 32 1763 -35 1126 1423
1507 1423 -213 1339 1113 -98 1563 -149 880 477 -333 1981 -1178 1224 626 -786 1066 -756
$$ packed form
1395a62l031N884m990N26L559l596J159o7J222o50k015L570j159k563M740l459
1411a032L07K300k213K095l397L909r58l103N164l373J98J538j482R66o22L65
1427F62N56j834K359r44j665L582l563K302n21j418K782l238K578j269k53J755
1443A871k891K293j02k403K617o25j758J850j398J597k350R12J922m777M493j545
1459b94j688K074j021P65j982J431J170l095J981Q73l034K623k76j222J249j216
1475a662K533l175J907J214l347L404j550L58O21r27J254j150M26J349k006J299
1491E48N51j857K419k014J493J21j889K898k666J700j55j117J731j798J161K97
1507A423j636J552k26j211J661j712J029m03q10K314l159K402n98j412J852j822
$$ plain form
1523 -756 518 -146 -438 25 -670 -46 -346 -1158 425 -824 -1233 907 -1863 -170 -668 -877 -271 -1638
1541 -1638 879 -1900 -876 960 -1734 -692 111 -1015 -775 -56 -342 -949 -942 1424 -1670 -1084 1866
1558 1866 -1599 -254 395 396 -850 169 1760 -1536 84 1616 -461 -580 1628 334 -258 541 1271
1575 1271 -80 -396 2615 -742 248 1824 32 728 229 1640 159 176 1953 62 259 1501 253
1592 253 264 1152 108 879 -653 860 143 -913 1085 -928 193 -153 -442 159 -723 -116 -437 -649
1610 -649 -471 -353 -923 -420 -862 -346 -751 -1140 40 -1687 74 -979 -906 -332 -1383 -117 -1123 -568
1628 -568 -557 -713 -581 -344 -695 95 -486 -556 829 -900 369 -225 264 487 -449 1414 -206 470 863
1647 863 577 442 874 1174 484 677 1144 1179 -149 1885 683 119 1396 704 604 -344 1515 170
$$ packed form
1523g56J274o64k92M63o95O24l00q12J583j249m09K140k770J693m98k09O06j367
1541a638K517k779J024J836k694J042Q03j126K40P19k86o07PK366l094N86K950
1558A866l465J345O49Jj246J019J591l296J620J532k077j19K208j294n92P99P30
1575A271j351l16L011l357R90J576j792O96m99J411j481J7J777j891J97J242j248
1592B53J1Q88j044P71j532J513p17j056J998k013J121l46k89O01q82O07l21k12
1610f49J78J18n70N03m42N16m05l89J180j727J761j053P3N74j051J266j006N55
1628e68J1j56J32K37l51P90n81p0J385j729J269n94M89K23r36J863j620O76L93
1647H63k86j35M32L00o90J93M67L5j328K034j202n64J277o92j00r48J859j345
$$ plain form
1665 170 -470 1196 268 -378 518 640 -754 231 369 -68 -880 428 251 -1664 886 -399 -642 -435
1683 -435 -159 -418 -1205 288 -934 -1054 -512 -276 -1274 -525 -386 -1192 -487 -895 -254 -1030 -108 -577 -1125
1702 -1125 121 -811 -373 -424 -160 -265 138 -49 -215 627 102 301 -139 1067 -188 96 913 -78 504
1721 504 245 1051 -163 510 891 -27 298 817 528 -181 997 271 429 470 611 161 7 1388 -121
1740 -121 344 565 395 238 216 1007 -162 335 302 407 -459 327 49 -385 193 -252 83 -880 54 -259
1760 -259 -781 -102 -672 -290 -1109 -57 -423 -1117 -613 -285 -782 -958 147 -1076 -267 -707 -163 -703 -601
1779 -601 254 -1433 -161 -95 -330 -616 54 1 -592 68 138 -172 -289 895 -621 393 666 -127 713
1798 713 138 1102 53 813 1036 -14 966 903 466 586 1262 331 669 874 678 158 834 1226 -686
$$ packed form
1665A70o40J666r28o46Q96J22j394R85J38m37q12J308j77j915K550j285k43K07
1683d35K76k59p87J493j222j20N42K36r98P49J39q06P05m08O41p76R22m69n48
1702a125J246r32M38n1K64j05M03j87j66Q42n25J99m40J206j255K84Q17r91N82
1721E04k59Q06j214O73L81r18L25N19k89p09J178p26J58M1J41m50j54J381j509
1740a21M65K21j70j57k2P91j169M97l3J05q66P86k78m34N78m45L35r63R34l13
1760b59n22O79n70L82q19J052l66o94N04L28m97j76J105j223Q09m40N44n40J02
1779f01Q55j687J272O6k35k86O70n3n93O60P0l10j17J184j516J014K73p93Q40
1798G13n75R64j049P60K23j050R80o3m37J20O76r31L38K05j96n20O76L92j912
$$ plain form
1817 -686 1299 466 -370 350 368 238 -535 665 -187 -815 395 209 -1033 95 177 -1096 64 -272
1835 -272 -249 -1458 -160 75 -1706 306 -475 -1158 -526 -151 -794 -943 -7 -397 -1005 -433 143 -1252 142
1854 142 -378 -598 -279 -542 608 -975 417 273 -489 366 -113 309 3 324 326 389 -95 908 83 188
1874 188 542 182 882 -390 1300 538 -155 1174 68 368 470 759 354 163 787 342 -183 801 560
1893 560 -495 1048 -57 348 278 319 386 -869 798 -398 -294 459 -442 -65 -29 -416 -347 -197 -276 -166
1913 -166 -729 134 -808 -783 313 -1290 -138 -713 -450 -544 -680 127 -1203 -411 254 -971 -528 247 -909
1932 -909 -329 -104 -331 -251 -540 878 -1032 141 576 -738 592 78 523 -244 439 729 -163 324 834
1951 834 94 393 1176 -38 1133 269 851 471 167 1505 -236 1022 390 285 769 21 472 405 194
$$ packed form
1817f86J985q33q36P20J8j30p73J200q52o28J210j86j242J128Q2j273J160l36
1835b72K3j209J298K35j781K012p81o83O32L75o43j49R36l90o08N72N76j395J394
1854A42n20k20L19k63J150j583J392j44p62Q55m79M22l06L21KO3m84J003q25J05
1874A88L54l60P00j272J690p62o93J329j106L00J02K89m05j91O24m45n25R84k41
1893E60j055J543j105M05p0M1O7j255J667j196J04P53r01L77L6l87O9J50p9J10
1913a66n63Q63r42K5J096j603J152n75K63r4j36Q07j330P92O65j225M43P75j156
1932i09N80K25k27Q0k89J418j910J173M35j314J330n14M45p67O83K90q92M87N10
1951H34p40K99P83j214J171q64N82l80l04J338j741J258o32j05M84p48M51o7k11
$$ plain form
1970 194 451 187 -78 567 -411 322 95 -677 635 -750 183 -439 -396 52 -812 226 -871 -458 -107
1989 -107 -852 -568 -280 -738 -258 -511 -441 -45 -1188 235 -713 -480 87 -919 206 -599 -28 -123 -693
2008 -693 223 -374 -354 264 -236 -230 234 -366 724 -323 196 702 -594 1021 -8 601 227 -21 944
2027 944 -209 456 624 60 337 735 280 372 212 801 295 -234 1491 -274 647 632 -81 552 -311 1006
2047 1006 -163 39 812 -181 -190 703 -174 -148 317 -386 40 -812 408 -640 -810 627 -1117 -202 -229
2066 -229 -469 -538 -549 -92 -765 -521 -62 -632 -754 209 -845 -330 -402 -422 -69 -847 521 -835 -155 225
2086 225 -819 138 -257 -8 -39 102 319 -104 -43 617 -335 330 957 -484 1026 97 464 538 251 1170
2106 1170 -226 855 896 28 678 605 393 465 463 565 434 16 922 -236 398 439 -328 651 -320 671 -358
$$ packed form
1970A94K57k64k65O45r78P33k27p72J312j385R33o22M3M48q64J038j097M13L51
1989a07p45K84K88m58M80k53P0L96j143J423r48K33N67j006J125q05N71r5n70
2008f93R16n97K0O18n00OM64o00J090j047N19N06j296J615j029O09l74k48R65
2027I44j153O65J68n64K77L98m55R2j60N89n06n29J725j765R21j5p13O33q63J317
2047A006j169K02P73r93rQ93q77K6M65p03M26q52J220j048j70J437j744R15k7
2066b29k40o9j1M57o73K44M59n70j22R63j054N15p2k0L53p78J368j356O80L80
2086B25j044R57l95K49l1J41K17m23O1O60r52O65O27j441J510r29L67P4k87R19
2106A170j396J081M1q68O50p3k12P2kJ02j31m18R06j158O34M1p67R79r71R91j029
$$ plain form
2127 -358 -200 630 -662 -116 -52 -342 -343 -350 -253 -213 -769 -79 -558 -1081 178 -851 -166 -841 -394 -212 -1362
2148 -1362 178 -659 -726 -188 -302 -593 -260 -147 -68 -578 -27 354 -1007 471 -93 -176 330 -410 588 -446
2168 -446 688 300 -143 692 34 -38 442 307 189 652 136 868 55 667 644 -75 1096 -195 550 494
2188 494 310 631 222 743 150 276 538 104 -73 672 -126 97 539 -329 207 -386 484 -440 -217 684
2208 684 -907 118 -211 -444 -275 -218 -216 -440 -299 -142 -582 -566 369 -937 -188 -200 -658 -221 -771 332
2228 332 -797 -299 15 -717 -164 -305 -277 -196 -309 -271 14 -451 170 -223 -362 547 -501 510 -244 364
2248 364 443 -125 894 43 478 343 320 419 257 485 656 311 390 784 7 862 146 528 456 132 773
2269 773 -53 779 235 0 408 -4 73 295 75 -5 122 -146 4 -297 70 -209 -752 437 -688 -109
$$ packed form
2127c58J58Q30j292N46O4k90jpR7M0n56O90m79n23J259j029O85o75M47J82j150
2148a362J540q37o7N38j14k91L33J13P9n10N51L81j361J478n64q3N06p40R98j034
2168d46J134l88m43Q35o58p2M80j35j18M63n16P32q13O12k3p19J171j291P45n6
2188D94j84L21m09N21n93J26K62m34j77P45p98K23M42q68N36n93Q70r24K23R01
2208F84j591J025l29k33J69N7Kk24J41J57m40J6R35j306P49j2m58M37n50J103
2228C32j129M98L14p32N53j41K8Q1j13L8K85m65O21l93j39R09j048J011p54O08
2248C64P9n68J019q51M35j35k3R9j62K28J71l45P9L94p77Q55p16L82p2l24O41
2269G73q26Q32n44k35M08m12P7K22k20q0J27k68J50l01L67k79n43J189j125N79
$$ plain form
2289 -109 -393 -409 -379 -755 55 -622 -571 -232 -578 -834 -18 -533 -480 -204 -352 -219 -962 361 -586 -452 279
2310 279 -538 -23 -12 277 -418 -28 528 10 -18 647 149 -307 537 170 489 104 557 478 -212 902 -77
2331 -77 291 417 392 315 208 597 169 195 491 424 37 488 157 119 443 134 514 -82 422 -126 -207 416
2353 416 -251 321 -364 -24 -75 -201 -237 -4 -382 -126 -163 -535 84 -551 -22 -383 -335 -25 -828 -263 -522
2374 -522 -245 -304 -503 -210 -353 -334 -357 -194 -330 -2 -632 34 -291 -224 86 -339 89 -415 216 95 -95
2395 -95 274 -125 134 149 244 32 259 287 337 112 399 725 61 900 298 374 489 290 512 62 782 240
2417 240 148 545 430 451 163 363 -25 219 168 285 -155 367 44 -297 375 -364 5 -251 -94 -225 -550
2438 -550 -60 -357 -127 -284 -412 -651 -311 -410 -303 -519 -412 -196 -748 2 -496 -270 -101 -737 -175 -464
$$ packed form
2289a09k84j6L0l76Q10o77N1L39l46k56Q16n15N3K76j48J33p43J323r47J34P31
2310B79q17N15J1K89o95L90N56n18k8O65m98m56Q44l67L19l85M53p9o90J114r79
2331g7L68J26k5p7j07L89m28K6K96o7l87M51l31l8L24l09L80n96N04n48q1O23
2353D16o67N72o85L40n1j26l6K33l78K56l7l72O19o35N29l61M8L10q03N65k59
2374e22K77n9j99K93j43J9k3J63j36L28o30O66l25O7L10m25M28n04O31j21j90
2395i5L69l99K59J5R5k12K27K8N0k25K87L26o64Q39o02P6J15j99K22m50P20n42
2417B40r2L97j15K1k88K00l88K44n1J17m40N22l23l41O72p39L69k56J57j31l25
2438e50M90k97K30j57j28k39L40r9J07k16J07K16n52P50m98K26J69o36N62k89
$$ plain form
2458 -464 -130 -376 -262 -149 -111 -198 25 -27 -101 313 -158 258 152 237 56 -4 530 0 374 385 235 322 542
2481 542 470 10 644 412 395 184 525 87 332 690 71 492 46 562 -102 260 411 -184 204 71 243
2502 243 47 105 -109 -25 -21 195 -29 -412 244 -279 -110 -324 -213 -126 -682 -105 -434 -32 -444 -329 -426 -555
2524 -555 -92 -404 -249 -381 -107 -686 -68 -253 -398 -166 -455 59 -633 136 -225 -287 128 8 -110 -141 373
2545 373 -247 58 221 233 -22 201 447 -115 631 230 417 377 387 359 124 903 174 275 476 481 107 619
2567 619 402 52 708 469 481 70 362 21 -21 339 -73 145 37 197 -140 41 287 -31 -378 64 -268
2588 -268 -609 -2 -228 -500 -552 -136 -251 -730 109 -410 -598 -223 -555 -390 -459 -286 -419 -135 -413 -122 -329
2609 -329 -194 -125 -207 -33 -207 125 -251 226 139 -88 326 -84 424 -43 482 152 56 303 200 290 -6 551
$$ packed form
2458d64L34k46J14J13L8q7K23n2p4M14m71M16j06Q5j81o0N34n30L74J1j50Q7K20
2481E42p2m60O34k32j7k11L41m38K45L58o19M21m46N16o64L62J51n95L88j33J72
2502B43j96N8k14Q4MK16k24l83O56n23J69k14J11Q7n56N77l29M02m12J15r7j29
2524e55M63l12J55j32K74n79O18j85j45K32k89N14o92P69l61o2M15j20j18l1N14
2545C73o20L05J63J2k55K23K46n62P46m01J87m0J0k8k35P79p29J01K01Nl74N12
2567F19k17l50O56k39J2m11K92l41m2L60m12K18j08J60l37J81K46l18l47M42l32
2588b68l41O07k26k72n2M16j15m79Q39n19j88L75l32J65o9J73j33K84k78K91k07
2609c29J35O9q2J74j74L32l76M77q7k27M14m10N08m67N25l30r6K47j03R0k96N57
$$ plain form
2631 551 187 299 351 474 289 310 551 47 437 442 374 155 342 521 -68 461 166 204 40 265 58 -4
2653 -4 128 -127 206 -286 19 -269 95 -162 -312 46 -299 -109 -338 -116 -330 -288 -167 -486 -236 -355 39
2674 39 -647 -59 -390 -360 -180 -396 -210 -438 -122 -606 -97 64 -249 -197 -239 58 -381 87 26 34 -269 158
2696 158 272 -149 338 -27 78 128 388 200 59 722 -37 503 269 362 129 548 174 293 593 193 534
2717 534 189 431 -3 273 361 330 352 13 325 -81 35 57 -273 230 244 247 -327 -55 -176 148 -124 -33 -323
2740 -323 -515 8 -151 -232 -303 -558 307 -238 -83 -612 -172 -228 11 -378 -309 -368 -387 -31 -428 -120 -242 62
2762 62 -202 -266 -110 -233 -93 -168 194 -167 34 196 70 173 230 376 -62 508 324 162 209 275 500 -194
2784 -194 652 220 250 157 394 297 170 539 139 262 338 390 -92 179 372 -37 135 201 278 -122 354 91
$$ packed form
2631E51l64J12N2J23j85K1K41n04L90No8k19J87J79n89N29k95L8j64K25k07o2
2653dJ32k55L33m92L05k88L64k57j50L58l45J90k29K22k14M2J21l19K50j19L94
2674C9o86N88l31L0J80k16J86k28L16m84N09J61l13N2m2K97m39M68o1Ql03M27
2696A58J14m21M87l65J05N0K60j88j41O63p59N40k34R3k33M19l74J19L00m00L41
2717E34l45K42m34K76Q8l1K2l39L12m06J16K2l30N03J4Ln74K72j21L24k72R1k90
2740c23j92N23j59q1p1k55Q65n45J55n29M40n6K39l89O9n9j9L56l97L08j22L04
2762F2k64o4J56j23J40p5L62l61K01J62j26J03N7J46m38N70j84j62M7O6K25o94
2784a94Q46m32L0r3K37r7j27L69m00J23P6N2m82K71J93m09J72O6P7m00M76k63
$$ plain form
2806 91 -286 106 -60 52 -260 123 -313 -298 105 -192 -386 -218 116 -521 -247 -193 -437 -326 -169 -318 -511
2827 -511 -40 -522 -300 -213 -202 -377 -308 -43 -387 -111 -156 95 -316 49 -178 -157 333 -211 168 -114 86 -53
2849 -53 42 354 -30 386 42 353 169 392 239 158 442 146 435 271 437 400 317 261 323 403 15 416 74
2872 74 412 274 46 263 24 309 -162 144 35 123 -109 -28 190 -247 3 -262 49 -391 -110 -163 -457
2893 -457 -263 -339 -116 -448 -320 -344 -484 -178 -488 -201 -549 -127 -372 -337 -381 -413 -379 -163 60 -526 59 -192
2915 -192 -169 -241 53 252 -101 257 -223 124 -32 250 187 250 336 182 381 97 298 146 361 360 296 552 36
2938 36 565 318 444 48 223 413 26 427 149 320 169 240 -138 157 193 -43 114 2 319 -404 120
2959 120 58 -214 40 -116 -17 -230 53 -337 -160 -36 -133 -233 -423 38 -406 -257 -302 -282 -171 -319 -39 -523
$$ packed form
2806I1l77L92j66J12l12L83m36J5M03k97j94J68L34o37K74N4k44J11J57j49j93
2827e11M71m82K22Q7J1j75O9K65l44K76m5K51m11L65k27K1M90n44L79k82K00j39
2849e3R5L12l84M16l44L11j84K23j53q1K84k96K89j64J66l7q3n6O2Q0l88M01l42
2872G4L38j38k28K17k39K85m71L06j09Q8k32Q1K18m37K50k65L11m40K81n3k94
2893d57J94p6K23l32J28k4j40L06l10K87l48M22k45L5m4l2L4K16K23n86N85k51
2915a92K3p2K94J99l53L58m80L47j56K82o3O3Q6j54J99k84K01j52K15jo4K56n16
2938C6N29k47J26l96J75J90l87M01k78J71j51P1l78K95L6k36J57j12L17p23N24
2959A20o2k72K54j56R9k13K83l90J77J24r7j00j90M61m44J49m5K0J11j48K80m84
$$ plain form
2981 -523 -115 -448 -191 -121 -287 -76 -335 63 -159 -128 -192 112 -134 -150 150 -72 225 -114 301 17 319
3002 319 156 68 194 109 451 83 418 375 476 273 386 316 79 447 77 470 241 356 262 151 476 113
3024 113 459 132 363 37 165 150 -136 107 -44 112 -292 129 -141 -167 131 -201 -206 -269 -1 -289 -219 -105
3046 -105 -327 -285 -281 -122 -493 -211 -277 -375 -300 -167 -234 -715 40 -305 -123 -221 -125 -108 -293 44 -432 -34 69
3069 69 80 -163 18 111 -83 172 30 301 50 471 47 8 349 103 491 61 465 207 273 394 238 285
3091 285 311 445 11 426 158 319 338 70 309 -41 355 28 72 155 317 189 -131 107 -84 -19 -277 -90
3113 -90 -238 -12 -188 -192 63 -348 -77 -447 8 -75 -402 -181 -436 -58 -142 -95 -315 -292 -251 -180 -197 -330 -124
3136 -124 -349 52 -237 -81 -17 -269 156 -237 92 14 23 -94 -38 22 -69 324 22 174 181 347 -11 174 169 -10
$$ packed form
2981e23M08l33K57P0j66K11k59L98k22L1o4L04k46j6L00k22K97l39M15k84L02
3002C19j63q8J26q5L42l68L35m3J01k03J13p0k37L68l70L93k29J15r4j11L25l63
3024A13L46l27K31l26J28j5k86K43j51J56m04M21k70k6K98l32no3K68k88P0J14
3046a05k22M2MJ59l71K82o6r8P5J33o7m81P55l45J82r8R6J7j85L37m76L98J03
3069F9J1k43J81R3j94K55j42K71k51M21m24l9L41k46L88m30M04k58O6J21j56M7
3091B85K6J34m34M15k68J61J9k68K39l50L96l27M4Q3J62j28l20K38j91O5k58J87
3113i0j48K26j76mK55m11K71l70M55q3l27K21k55L78q4M7k20K3M1P1j7j33K06
3136a24k25M01k89J56O4k52M25l93L29p8Rj17N6O0r1L93l02J52PJ66l58J85nj79
$$ plain form
3160 -10 479 170 369 94 312 345 4 461 214 336 195 292 374 154 71 113 189 87 181 -251 402 4 13
3183 13 161 -110 304 -235 158 -8 -272 66 -117 -195 -260 -116 -426 80 -418 -133 -220 -96 -200 -622 -79
3204 -79 -402 -78 -346 -333 -109 -339 -87 -333 -133 -308 -249 -398 23 -143 -95 156 -296 119 -274 97 -57
3225 -57 97 428 -147 298 -13 268 193 340 197 273 203 184 401 11 700 21 117 298 111 384 94 471
3247 471 112 272 301 222 263 162 201 41 276 40 120 -72 110 81 -115 17 -129 124 -361 -77 -214 -416
3269 -416 -80 -179 -208 -80 -217 -379 -271 -410 -288 -276 -318 -80 -581 -52 -286 -311 -214 -248 16 -404 88 -134
3291 -134 -67 -77 0 -71 -262 211 6 -95 9 112 -164 129 205 -87 195 122 309 111 430 188 27 311
3313 311 199 84 259 219 200 540 161 269 404 238 438 -113 444 111 175 279 -13 151 -313 283 2
$$ packed form
3160a0M89l09J99k75K18L3l41M57k47J22j41R7Q2k20q3M2P6j02R4m32O53l98R
3183A3J48k71M14n39L93j66k64L38j83p8o5J44l10N06m98K85q7J24j04m22N43
3204g9l23L24k68J3K24k30K52k46K00j75N9j49M21j66M8K51m52M15l93L71j54
3225e7J54L31n75M45l11K81p5J47j43P6p0j9K17l90O89o79R6J81j87K73k90L77
3247D71l59J60K9p9M1j01L9j60K35k36Q0j92J82k9j96J32j46K53m85K84j37k02
3269d16L36r9k9J28j37j62J08j39J22J2m2K38n01N29k34k5R7l4K64m20M92k22
3291a34O7j0P7p1j91M73k05j01J04J03k76K93P6k92K82p3J87j98L19k42j61K84
3313C11j12j15J75m0j9L40l79J08J35j66K00n51N57l33O4J04k92J64m64N96k81
$$ plain form
3334 2 84 30 30 -121 -81 273 -267 194 -207 -136 -223 -139 -123 -472 -155 -588 -146 -449 -256 -69 -304 2 -121 -329
3358 -329 -384 -116 -464 17 -416 -294 -124 -223 137 -351 -91 167 -278 -137 -220 83 -15 140 27 137 128 378
3380 378 66 -135 218 160 305 80 353 254 222 505 -96 408 254 498 214 354 326 135 421 158 199 19
3402 19 316 -133 161 -43 118 277 -302 186 -68 -67 -11 44 -77 -124 6 -105 -136 -404 -97 -152 -194 -279 -207 -59
3426 -59 -516 -28 -252 -251 -130 -212 -172 -404 -128 -327 -230 -211 -24 -160 -270 -109 -39 19 -328 137 -132 65 -50
3449 -50 -276 215 -58 198 -29 111 238 129 285 291 205 153 211 17 258 66 129 216 42 356 16 478 135
3472 135 92 304 122 238 157 249 183 26 132 16 59 283 176 -99 265 -48 27 -184 -9 55 -202 148
3494 148 -296 -72 -276 -303 -380 -128 -154 -112 -73 -293 -99 -318 -103 -186 -392 -172 -366 -1 -427 -87 -158 -278
$$ packed form
3334BQ2n4%j51M0L54n40M61m01P1q7Q4J6l49L17m33M42l03J93J87k35L06j23k08
3358c29n5K68l48M81m33J22J70r9L60m88K60K58m45J41q3L03r8J55j13J10rK50
3380C78l12k01L53n8J45k25K73r9l2K83o01N04j54K44k84J40k8j91K86k63M1j80
3402A9K97m49K94k04J61J59n79M88k54JN6N5j21m7J30j11l1k68L07n5m2q5P2J48
3426e9m57M88k24JJ21q2M0k32K76j99R7J9J87j36j10J61P0N8l47M65k69J97j15
3449e0k26M91k73K56k27J40J27j09J56Oq6n2N8j94K41j92O3Q7j74L14l40M62l43
3472A35m3K12j82J16q1R2o6j57J06j16M3K24j07k75L64l13P5k11J75O4k57L50
3494A48m44K24k04k7p7K52k6M2L9k20J94k19K15q3k06K20j94L65m26L40p1j20
$$ plain form
3516 -278 19 -85 -85 -187 93 -12 -81 -45 60 -13 40 217 -204 175 -100 195 20 223 309 -145 458 170
3538 170 304 59 527 219 212 277 -37 297 196 625 -71 300 356 61 126 67 277 42 166 267 -16 149
3560 149 -8 41 19 221 -104 30 -153 11 -120 -200 157 -365 63 -323 -146 -193 -198 -128 -370 -87 -348 -227
3582 -227 -226 -90 -158 -177 -22 -287 -61 -359 -125 -198 4 -152 -302 18 -230 -49 -262 98 -47 -2 -13 58 184
3605 184 -20 161 71 398 111 168 296 6 496 -30 439 78 288 339 184 299 33 334 67 329 55
3626 55 243 157 -5 155 -57 243 -95 170 -108 52 147 97 160 -72 99 -110 -151 24 -6 -125 3 -181
3648 -181 -198 35 -307 -61 -382 21 -53 -287 -115 -444 -79 -167 -103 -176 -162 -98 -293 -186 -175 -53 -157 0 -168
3671 -168 -236 246 -235 161 -324 35 -16 65 140 13 425 -45 179 97 276 0 67 218 39 179 139 316
$$ packed form
3516b78K97j04%j02K80j05o9L6J05p3N3J77m21L79k75K95j75K03Q6m54O03k88
3538A70J34k45M68l08pO5l14L34j01M29o96L71N6k95O5n9K10k35J24J01k83J65
3560A49j57M9k2K02l25J34j83J64j31q0L57n22M28l86J77m7nP0k42K83k61J21
3582b27JJ36o8j9J55k65K26k98K34p3K02j56j50L20k48J81k13L60j45M5j1P1J26
3605A84k04J81r0L27k87N7J28k90M90n26M69l61K10N1j55J15k66L01k67K62k74
3626E5J88q6j62J60k12L00l38K65k78J60R5n0O3k32J71k09m1J75l0j19J28j84
3648a81j7K33l42K46l21M03p4k34J72l29L65q8O4p3J4O4j95J07J1J22j04J57j68
3671a68o8M82m81L96m85L59n1Q1P5j27M12m70K24q2J79k76O7J51j79J40m0J77
$$ plain form
3693 316 -85 373 367 196 318 130 304 -4 319 93 258 186 153 64 135 194 -146 325 91 215 59 9 78
3716 78 -365 64 -278 -204 -137 -59 -102 -273 94 -184 -87 -346 -54 -233 -246 -107 -300 -170 -398 -154 -326 -78
3738 -78 -372 -302 -13 -179 37 -231 13 -229 84 -60 123 37 -82 145 -169 87 -31 44 76 15 301 -70
3760 -70 257 15 153 99 110 25 219 257 195 366 53 294 34 199 270 273 100 -18 233 62 213 76 154
3783 154 163 32 344 -68 344 -95 96 64 41 -229 -68 73 -353 -100 -239 -264 -229 -175 -81 -353 -154 -193 -128
3806 -128 -329 -195 -22 -438 101 -347 -51 -241 -155 -211 -79 -83 -207 52 -351 -116 -195 163 -120 -164 -128 8
3828 8 44 -295 207 -58 59 115 81 -32 42 366 21 220 178 252 357 19 382 36 209 183 318 145 272
3851 272 223 23 427 -31 371 66 205 245 -87 -37 -74 133 -122 72 88 16 -58 -213 -30 -302 -10 -368
$$ packed form
3693C16m01M58oj71J22j88J74l08L23k26J65p2l3q9P1N9l40M71k34J24j56n0O9
3716G8m43M29l42P4O7P8m3j71L67k78R7k59K92j79j3J39j93J30k28K44j72K48
3738g8k94P0K89j66K16k68K44k42L13j44J83q6j19K27l14K56j18P5L2o1K86l71
3760g0L27k42J38n4J1q5J94L8o2J71l13K41k60J65P1Lj73j18K51j71J51j37P8
3783A54Rj31L12m12M12m39J91l2k3k70J61J41m26K53j39k5L5N4R4k72J99l9O5
3806a28k01J34J73m16N39m48K96j90Q6n6J32mj24K59m03K35p9L58k83m4L6J36
3828HL6l39N02k65J17N6l4j13P4L24l45J99m2P4J05l38L63l46J73k6J35j73J27
3851B72m9k00M04m58M02l05J39M0l32N0l7K07k55J94J6p2p4j55J83k72K92l58
$$ plain form
3873 -368 57 -246 -29 -263 -272 -126 -226 -29 -355 -61 -353 -230 -90 -243 -12 -345 81 -166 -104 -118 -162 -5
3895 -5 -238 27 -149 56 -90 68 41 44 98 -111 96 -152 320 -60 196 215 117 220 47 338 8 177 102
3918 102 109 104 246 311 78 275 -41 347 160 127 245 -1 277 1 428 44 172 -44 -31 -40 -100 272 -81
3941 -81 -28 -105 -92 -138 103 -105 -197 -26 -210 -148 -341 -171 -346 -244 51 -334 -138 -252 -76 -416 -138 -100 -352
3964 -352 1 -181 -165 -411 19 -60 -160 -64 -129 109 -129 -7 -108 60 -55 -9 3 51 111 -126 120 132 178
3987 178 17 44 163 82 449 -1 207 202 179 215 -100 343 143 388 173 255 102 273 215 92 284 -31 203
4010 203 -98 252 138 62 67 -14 121 -210 42 -53 -38 -161 -294 -37 -220 -189 -52 42 -199 -289 -67 -180 -138
4033 -138 -299 -145 -355 38 -395 -71 17 -90 146 -214 60 -141 -64 -189 -206 104 -150 266 25 206 -161
$$ packed form
3873c68M25l03K17k34rJ46j00J97l26K94k92J23J40j53K31l33M26k47O2j4m4J57
3895ek33K65j76K05j46J58k7LN4k09K07k48M72l80K56J9r8J03j73K91l30J69p5
3918A02PnJ42O5k33J97l16L88j87l3J18k46K78k76M27l84J28k16J3ro0L72l53
3941h1N3p7J3m6K41k08r2J71j84O2j93J70j75J02K95l85J96j14J76l40K78L8k52
3964c52L53j82J6k46M30p9j00R6o5K38k38J22j01J68j15M6J2M8O0k37K46J2M6
3987A78j61K7J19q1L67m50K08nk3L6l15M43k00K45k15Q2j53J71n8j23J92l15K34
4010B03l01L50j14p6Nq1J35l31K52r5J5j23j33K57j83L1J37R4k41r0K22j13M2
4033a38j61J54k10L93m33L24Q8j07K36l60K74k01P7j25j7L10k54M16k41J81l67
$$ plain form
4054 -161 -76 65 50 170 -57 291 -63 268 188 234 229 171 158 11 397 29 149 209 166 101 196 220 45 354
4078 354 30 146 84 163 87 -12 260 12 300 23 103 -54 -42 24 -60 54 -24 12 -195 -122 -111 -164 -129 -172 68
4103 68 -220 -68 -135 -136 -276 -211 -102 -278 -2 -240 82 -313 -127 -51 -253 -44 -170 12 -158 44 -152 -169
4125 -169 -34 -116 179 -141 192 -47 26 175 131 149 7 337 -97 314 54 140 176 228 457 50 151 35
4147 35 232 181 186 204 195 335 136 185 193 133 137 50 123 60 276 -133 77 -77 -5 -63 -38 -27 12 -86 -91 -48 -100 -224 -304
4176 -304 -31 -27 -254 37 -185 -51 -220 -136 -174 -184 -19 -286 -153 -112 -61 -262 -265 -122 -305 76 -246 138 -125
4199 -125 59 55 -107 -34 -25 5 -189 162 -148 -24 25 52 22 -10 295 38 387 63 155 188 135 244 173 300 165
4224 165 257 23 82 92 66 252 42 178 15 128 -55 125 -34 -7 215 -104 72 -227 129 -202 34 -4
$$ packed form
4054a61Q5J41j5J20k27L48l54L31q0M6nn8j3j47L86l68J20O0m3o5R5K4j75L09
4078C54l24J16o2P9p6r9K72k48K88k77Q0j57J2O6q4J14p8L6k07P3J1n3L5m3K40
4103F8k88J52o7jj40O5J09j76K76k38L22l95J86P6k02K09j26J82j70K02j96j7
4125a69J35q2K95l20L33k39P3J49m4J8j42L30m34M11k60Q6L6N2K29m07J01j16
4147C5J97n1NJ8rJ40j99M9Qo0Mq7P3o3K16m09K10j54P2n8K5J1L9r8nM3n2j24q0
4176c04K73Mk27K91k22J34j69Q4l8j0J65k67J33M1N1k01lJ43j83L81l22L84k63
4199a25J84mj62P3RL0j94L51l10J24M9K7l0l2L05k57L49l24R2L3n3J09p1J27j35
4224A65R2k34N9J0k6J86k10J36j63J13j83J80j59K7K22l19J76k99L56l31K36l8
$$ plain form
4246 -4 -87 -31 -152 27 -214 24 -200 -73 -58 -236 91 -199 -93 -280 57 -84 -62 -106 -336 -17 -269 -135
4268 -135 -84 -172 -110 -116 -5 -134 9 -250 -46 -87 -162 96 -72 198 6 67 -74 289 -96 12 249 143 197
4291 197 -23 301 186 111 -1 134 234 95 304 136 202 189 67 177 96 120 74 62 185 -100 -186 110 -184
4314 -184 36 84 -157 -56 -12 24 -88 -97 -68 -116 73 -238 -110 -115 -141 -250 -162 -216 -354 -55 -130 122 -70 -190
4338 -190 -181 -140 -147 -149 -32 -213 -114 -176 -4 -58 -201 -7 -189 110 -61 67 -7 40 112 -57 103 23 325 190 183
4363 183 107 6 295 188 201 -6 198 67 274 270 45 172 50 286 -27 435 -15 193 242 75 121 10
4385 10 297 -104 -38 35 135 73 -114 70 -43 -132 -236 -24 -28 -42 -204 -13 70 -205 -138 -101 62 -195 -284 -99
4409 -99 -320 -156 -199 23 -352 75 -206 -13 12 -169 -29 -27 -62 -338 111 -58 -138 -41 -36 28 -76 -75 -15 49 62
$$ packed form
4246dq3N6j21J79k41K38k24J27J5j78L27k90J06j87L37j41K2m4k30L19k52J34
4268a35N1q8O2oJ11j29J43k59K04m1p5K58j68K70j92O1j41L63l85J08K37j06N4
4291A97k20L24j15p5j12J35J00j39K09j68O6j3j22J10q1K4m6j2J23k85q6K96k94
4314a84K20M8k41J01M4L6j12rK9m8J89l11J28nk6j09Q8n4j38K99p5K52j92j20
4338a90RM1pkJ17j81R9o2J72n4j43J94j82K99j71J28p4M7P2j69J60q0L02j35p
4363A83p6j01K89j07J3k07K04j31K07mk25J27j22K36l13M62m50K08M9j67M6j11
4385A0K87m01O6P3J00o2j87J84j13q9j04K12mj4j62J91Q3k75O7L7J63k57q9J85
4409i9k21J64m3K22l75M27k81J93K5j81J40Kl5k76M49j69q0R7NO4j04JO0O4J3
$$ plain form
4434 62 127 127 79 55 -9 158 55 83 63 124 190 26 243 56 122 84 0 256 134 224 126 354 70 184 27
4459 27 27 212 6 152 -49 54 -111 110 -36 82 32 -292 -25 -320 -142 -89 -63 -176 -136 -144 -187 -89 -238 -244
4483 -244 -73 34 -194 -269 -163 -396 -90 -265 -74 -104 -128 -120 -214 303 -176 54 -161 -49 -57 -49 -72 -134 199 -82
4507 -82 16 -97 211 83 87 96 127 243 -183 145 140 186 60 12 345 39 118 47 280 135 41 104 135 189 -22 250
4533 250 82 386 9 -7 -45 14 253 -81 214 -56 67 81 -129 180 -140 -108 -124 28 -224 -65 -19 -77 0
4556 0 -162 13 -169 -81 -347 -201 -135 -137 -8 -162 22 -115 10 -108 -293 -170 -209 -1 -315 21 -20 -37 49
4579 49 52 12 64 142 70 80 -85 209 4 165 269 77 261 -22 151 45 40 180 26 216 160 232 74 208
4603 208 106 166 167 69 200 -39 167 147 93 70 47 92 5 275 -13 122 -42 -18 -124 -55 37 -199 30 -66 -78
$$ packed form
4434F2O5%m8k4o4J67j03K8k0O1O6j64K17j87O6l8q4K56j22R0r8K28k84J14j57
4459B7%J85k06J46k01J03j65K21j46J18n0l24K67k95J78N3K6j13M0qm3R8j49o
4483b44J71J07k28p5J06k33L06j75J91l0k4Qr4N17m79K30k15J12qQk3o2L33k81
4507h2R8j13L08j28MRL1J16m26L28nM6j26m8L33l06P9p1K33j45r4O3L1N4k11K72
4533B50j68L04l77j6l8N9K39l34K95k70J23J4k10L09l20L2j6J52k52J59M6n8P7
4556@j62J75j82Q8k66J46O6kJ29j54J84j37J25j18j85J23l9K08l14L36m1j7Q6
4579D9Lm0N2P8p2J0j65K94k05J61J04j92J84k83J73j06nJ40j54J90n6P2j58J34
4603B08j02O0Jr8J31k39K06k0n4k3k3M5q7K70k88J35j64K4j06O9R2k36K29r6j2
$$ plain form
4628 -78 -304 -104 -111 -213 -45 64 -17 -324 -186 -259 -142 -77 -115 -211 -183 -46 -286 -38 -153 -65 -117 -22 40 -190
4652 -190 -97 39 6 9 42 34 11 129 -114 48 131 247 180 98 140 93 363 73 216 96 217 159 176 247 7
4677 7 117 13 -18 155 165 127 141 232 128 203 -47 72 -48 13 42 -1 -15 14 57 -60 -94 -178 -64 -130 -26 86
4703 86 -48 37 -94 -283 -3 -186 51 -208 -53 -119 22 -300 -219 -52 -49 -162 -408 -49 -239 -123 -129 -103 -20
4726 -20 -175 67 -319 -64 32 141 105 119 55 -116 119 -137 149 25 135 110 37 175 -96 80 166 256 -21
4749 -21 219 28 141 202 112 167 38 197 -33 170 207 76 71 -20 116 108 89 -41 259 -40 6 77 -52 64
4773 64 -177 14 -108 -135 75 29 -67 -214 -102 -159 -136 83 -119 -147 4 -137 -261 -78 -436 -153 -145 -56 -173
4796 -173 -128 71 -175 2 -3 -130 -110 -57 39 -111 18 -126 -45 -17 -1 152 -57 136 15 159 180 197 185 155
$$ packed form
4628g8k26K00pj02J68J09q1l07J38p3J17O5l8r6K8J37k40K48j15Q8n2R5O2k30
4652a90R3J36l3LL3qk3J18k43J62Q3J16o7q2M2m7K70k90J43j20J21n8J7P1k40
4677GJ10j04l1J73J0l8J4R1j04P5k50J19j20O1K9m3j4K9M3j17l4q4J14o6J04J12
4703H6j34Q5j31j89K80j83K37k59J55o6J41l22Q1J67Lj13k46L59j90J16oK6Q3
4726b0j55K42l86K55R6J09l6J4o4j71K35k56K86j24J10k5p3J38k71J76Q6R0k77
4749b1K40j91J13O1r0N5j29J59k30K03L7j31nr1J36qj9j30L00k99M6P1j29J16
4773F4k41J91j22k7K10m6r6j47J12n7K3K19k02k8J51j41j24J83l58K83QQ9j17
4796a73M5J99k46J77nj27K0N3R6j50J29j44Q1K8J6J53k09J93j21J44K1J7j2l0
$$ plain form
4820 155 388 117 201 154 99 145 209 132 189 232 -15 94 -20 187 118 227 131 28 95 -2 128 -91 282 22
4844 22 5 -180 -70 53 -64 57 -253 -110 -1 -140 -251 -268 -95 -79 -15 -235 112 -125 -34 -37 -197 41 -135
4867 -135 45 -287 -59 -111 -78 -44 -214 35 -137 -3 -77 -30 -45 47 4 -159 216 176 -43 -106 89 112 -154 184
4891 184 -59 385 68 187 -52 95 160 -13 137 192 168 185 249 187 183 221 -44 120 149 -5 -101 68 147 -93
4915 -93 141 -63 166 -133 39 -102 -88 -43 -184 52 -58 155 -228 -123 -65 -154 -150 -237 -161 -214 -76 -380 -84
4938 -84 -106 -277 -176 -132 16 -359 -55 -34 -35 -121 -105 117 -221 3 -145 80 -135 -144 -87 -52 116 -168 -78 -16 107
4963 107 45 7 140 -23 262 10 142 92 240 83 205 100 68 126 230 169 91 158 209 75 57 173 252 -63
4987 -63 126 26 56 -9 -32 197 -13 -60 53 119 -253 45 -6 -43 -107 -258 -37 -179 -42 -225 -125 -47 -249
$$ packed form
4820A55K33k71Q4m7n5M6O4p7N7M3k47J09j14K07o9J09r6j03O7r7J30k19L73k60
4844B2j7j85J10J23j17J21l10J43J09j39j11j7J73J6O4k20L47k37R1lj60K38j76
4867a35J80l32K28n2L3L4j70K49j72J34p4M7j5R2m3j63L75m0k19o3J95K3k66L38
4891A84k43M44l17J19k39J47O5j73J50N5k4J7O4o2mL8k65J64K9j54r6J69P9k40
4915i3K34k04K29k99J72j41J4M5j41K36j10K13l83J05N8q9Mq7P6n3J38l04K96
4938h4k2j71J01M4J48l75L04K1jq6J6K22l38K24j48K25k15rN7L5J68k84R0O2J23
4963A07o2l8J33j63K85k52J32n0J48j57J22j05l2N8J04o1p8O7N1j34j8J16P9l15
4987f3J89j00L0o5k3K29k10m7J13O6l72K98n1l7o4j51K21j42J37j83J00P8k02
$$ plain form
5010 -249 -109 -312 25 -147 -98 -129 -67 -25 -258 96 -329 -67 -184 -239 22 -99 -131 -138 30 -45 35 -46 76 139
5034 139 -147 94 -263 -3 80 -84 98 161 294 -137 211 75 241 -88 273 132 189 216 -48 233 54
5055 54 318 94 232 74 118 28 -4 179 138 251 21 -110 -55 -101 128 100 207 -83 68 -97 27 -69 -38
5078 -38 188 -264 15 -328 180 -167 -67 -57 -302 92 -403 -6 -199 -60 -259 -78 -134 -202 -74 -161 18 -218
5100 -218 -140 -53 -82 -116 -132 52 -171 -81 -113 -174 0 -106 98 1 32 -130 48 120 89 187 -91 92 -10 227
5124 227 21 184 30 102 227 138 335 -42 60 -5 99 134 65 176 -157 247 -57 63 -18 112 193 -28
5146 -28 125 17 141 -92 35 -69 -82 -106 -128 -50 -308 -32 -231 -84 -296 -200 -52 -98 -116 -174 -20 -137 -25
5169 -25 -178 -93 -154 -285 127 -103 102 -168 -160 -39 -35 75 -187 -9 48 2 -93 151 -35 88 178 20 46 -79
$$ packed form
5010b49J40k03L37j72M9l1O2M2k33L54m25K62j17n5K61j21l2pJ68p5Q0q1J22O3
5034A39k86K41l57K60Q3j64J82O3J33m31L48j36J66l29L61j41N7K7k64K81j79
5055E4K64k24J38j58M4r0l2J83m1J13k30j31N5m6K29k8J07k90J51j65J24r6L1
5078c8K26m52K79l43N08l47J00J0k45L94m95L97j93J39j99J81n6o8J28q7J79k36
5100b18P8Q7k9l4j6J84k23R0l2o1J74j06K04r7L1j62J78P2l1R8k78J83j02K37
5124B27k06J63j54P2J25q9J97l77J02o5J04L5o9J11l33M04l04J20q1J30Q1k21
5146b8J53j08J24k33J27j04j3k4k2P8k58K76j99J47k12R6J48m6j8n8J54j17J12
5169b5j53Q5o1j31M12k30K05k70QJ21MJ10k62J78N7m6r5K44j86J23R0j58K6j25
$$ plain form
5193 -79 49 -11 152 288 84 225 49 294 250 192 169 383 238 90 175 13 93 34 164 145 31 131 94
5216 94 232 -71 133 -30 211 70 51 61 -119 34 -203 -112 -90 -264 -43 -147 73 -90 89 -265 -215 -348
5238 -348 -84 -106 -184 -62 -349 -3 -71 -259 -153 -178 -94 -229 -54 -169 14 -121 8 -84 -53 0 -185 -21 -20
5261 -20 128 -16 -152 -95 -111 283 76 219 102 190 20 176 340 132 215 -89 176 -1 274 193 193 57 120
5284 120 343 -33 93 114 93 65 -14 -31 199 62 -52 338 -211 72 23 -40 121 -80 51 -107 125 -167
5306 -167 -243 -70 -245 -171 -230 -1 -198 -59 -278 -129 -14 -76 -66 -105 -85 -151 -174 -312 -43 6 -320 -24 -202
5329 -202 -86 -26 -152 -71 -196 -50 -150 -5 -47 198 -115 -30 182 8 178 80 198 250 294 95 67 56 84
5352 84 248 89 443 15 152 160 -8 191 72 -42 -1 230 140 122 -173 8 65 -64 138 -111 -43 -25 92
$$ packed form
5193g9J28o0J63J36k04J41j76K45m4n8k3K14j45j48Q5j62Q0n9J30j9j14J00l7
5216I4J38l03K04j63K41j41j9J0j80J53k37R1K2j74K21j04K20j63J79l54N0j33
5238c48K64k2p8J22k87L46o8j88J06k5Q4j35J75j15J83j35J29r2L1N3j85J64J
5261b0J48j44j36N7j6L94k07J43j17Q8j70J56J64k08Q3l04K65j77K75q1%j36O3
5284A20K23l76J26K1k1k8p9j7K30j37j14L90n49K83m9o3J61k01J31j58K32k92
5306a67p6J73j75P4n9K29j97J39k19J49J15o2J0l9K0o6k3j38K69M9l26K96j78
5329b02J16O0j26Q1j25J46j00J45m2K45l13Q5K12j74J70r8J18N2M4j99k8j1K8
5352H4J64j59L54m28J37Qj68J99j19j14M1K31r0j8k95J81N7j29K02k49O8J8J17
$$ plain form
5375 92 36 -179 -81 31 108 -172 -13 -264 -119 -46 -235 -208 -285 -36 -265 -136 -80 -194 -116 -192 -173 -381 -14 -73
5399 -73 -8 -21 -157 10 -138 -174 -136 -27 -258 139 -21 -14 -70 -110 80 84 97 -88 -64 155 176 238 123 152 133 207
5425 207 21 141 228 167 166 -46 98 46 334 145 52 160 206 -11 -50 266 66 134 104 -117 156 129 37 -104
5449 -104 16 -71 95 -91 -88 -24 -212 -71 -58 -22 -139 -185 -13 -156 50 -257 36 -273 -169 -67 -113 -75 -81 -56
5473 -56 13 -91 -261 -152 -256 -65 -98 -196 -51 -97 -29 -164 -94 -45 -15 157 -153 255 -111 181 158 82 121 145
5497 145 239 26 175 48 62 -70 228 176 11 278 59 223 -48 167 123 200 210 -27 165 131 22 -34 68
5520 68 26 92 -19 -104 156 -121 37 -148 -12 22 -102 74 -17 27 -173 -12 -326 -67 -119 -66 -69 -300 -113 -48
5544 -48 24 -50 -85 -133 -183 17 -247 163 -273 -230 -38 -31 -61 -191 146 -25 146 91 185 -141 -76 16 -123 53 -75
$$ packed form
5375I2n6k15R8J12P7k80J59k51J45P3j89K7p7K49k29J29N6j14P8p6J9k08L67n9
5399g3O5j3j36J67j48l6L8J09k31L97j60Pn6m0J90MJ3j85K4K19K1O2j15K9j9P4
5425B07j86J20Q7o1jk12J44n2K88j89r3J08M6k17l9L16k00O8l0k21K73k7r2j41
5449a04J20q7J66j86LO4j88J41J3L6j17m6J72j43K06l07K93l09J04J02m6L8oK5
5473e6O9j04j70J09j04J91l3r8J45m6O8j35P0M9L0J72l10M08l66K92k3p6L9K4
5497A45R4k13J49j27J4j32K98n2j65K67k19J64k71K15m4P7J0k37J92l4j09n6J02
5520F8m2O6j11q5K60k77J58j85J36L4j24J76r1M4k00J61l14K59n2N3lk31J87O5
5544d8P2p4l5m8n0K00k64M10m36M3J92Pl0j30L37j71J71n5R4l26O5R2j39J76j28
$$ [...]
8191a37
##END NTUPLES=NMR FID
##END=
