##TITLE=1H_CG-1147-1
 CDcl3, 8 sc, 
 29.04.2021
##JCAMPDX= 6.0         $$ Bruker NMR JCAMP-DX V2.0
##DATA TYPE= NMR SPECTRUM
##DATA CLASS= NTUPLES
##ORIGIN= UXNMR, Bruker Analytische Messtechnik GmbH
##OWNER= root
$$ XWIN-NMR		Version 3.5
$$ Thu Apr 29 14:04:15 2021 Russian Standard Time (UT+4h)  she@DPX200
##.OBSERVE FREQUENCY= 200.131506
##.OBSERVE NUCLEUS= ^1H
##.ACQUISITION MODE= SIMULTANEOUS
##.ACQUISITION SCHEME= undefined
##.AVERAGES= 8
##.DIGITISER RES= 18
##SPECTROMETER/DATA SYSTEM= spect
##.PULSE SEQUENCE= zg30
##.SOLVENT NAME= CDCl3
##.SHIFT REFERENCE= (INTERNAL, CDCl3, 0, 15.9771)
##AUDIT TRAIL= $$ (NUMBER, WHEN, WHO, WHERE, WHAT)
$$ ##TITLE= Audit trail, XWIN-NMR		Version 3.5
$$ ##JCAMPDX= 5.01
$$ ##ORIGIN= Bruker BioSpin GmbH
$$ ##OWNER= she
$$ F:/spectra/data/she/nmr/H-F/1/pdata/1/auditp.txt
$$ ##AUDIT TRAIL=  $$ (NUMBER, WHEN, WHO, WHERE, WHAT)
(   1,<2021-04-29 14:03:01.31 +0400>,<she>,<DPX200>,
      <created by zg, POWCHK disabled, PULCHK disabled
       configuration hash MD5:
       00 E9 B6 7A A2 85 ED C7 34 08 36 98 17 FE 4E 26
       data hash MD5: 16K
       CD 0C 14 92 B3 2D 9D 66 A3 EF 91 9A 64 3C 3A DC>)
(   2,<2021-04-29 14:03:04.01 +0400>,<she>,<DPX200>,
      <Start of raw data processing
       efp BC_mod = 2 LB = 0.24 FT_mod = 6 PKNL = 1 PHC0 = -11128.7 PHC1 = 22.60102 SI = 16K 
       data hash MD5: 16K
       E0 8E E8 4C A5 11 44 0C 8E 30 5D 66 44 00 71 74>)
(   3,<2021-04-29 14:03:22.78 +0400>,<she>,<DPX200>,
      <pk PHC0 = 6.503775 PHC1 = -7.4 
       data hash MD5: 16K
       DD E7 18 8B 72 60 C1 22 88 F2 BA E7 2A 7F E7 22>)
(   4,<2021-04-29 14:03:26.06 +0400>,<she>,<DPX200>,
      <abs ABSG = 5 
       data hash MD5: 16K
       B0 5D C1 9B 87 FD BF E0 3E BF D2 50 EB AD 10 DD>)
$$ ##END=
$$ 
$$ hash MD5
$$ 5F 61 E5 99 C8 BC 50 76 5F 99 B7 F9 E6 3E 7F 85
##$RELAX= 
##$RELAX= 
##$RELAX= 
##$RELAX= 
##$RELAX= 
##$RELAX= 
$$ Bruker specific parameters
$$ --------------------------
##$DU= <F:/spectra>
##$EXPNO= 1
##$NAME= <H-F>
##$PROCNO= 1
##$TYPE= <nmr>
##$USER= <she>
##$AMP= (0..31)
100 100 100 100 100 100 100 100 100 100 100 100 100 100 100 100 100 100 
100 100 100 100 100 100 100 100 100 100 100 100 100 100 
##$AQSEQ= 0
##$AQ_mod= 1
##$AUNM= <au_zg>
##$AUTOPOS= <>
##$BF1= 200.13
##$BF2= 200.13
##$BF3= 200.13
##$BF4= 200.13
##$BF5= 200.13
##$BF6= 200.13
##$BF7= 200.13
##$BF8= 200.13
##$BYTORDA= 1
##$CFDGTYP= 0
##$CFRGTYP= 5
##$CHEMSTR= <none>
##$CNST= (0..31)
1 1 145 1 1 1 1 1 1 1 1 1 1 1 1 1 1 1 1 1 1 1 1 1 1 1 1 1 1 1 1 1 
##$CPDPRG= <>
##$CPDPRG1= <>
##$CPDPRG2= <>
##$CPDPRG3= <>
##$CPDPRG4= <mlev>
##$CPDPRG5= <mlev>
##$CPDPRG6= <mlev>
##$CPDPRG7= <mlev>
##$CPDPRG8= <mlev>
##$CPDPRGB= <>
##$CPDPRGT= <>
##$D= (0..31)
0 1.2 0 0 0 0 0 0 0 0.06 0 0.03 0 0 0 0 0.0002 0 0 0 0 0 0 0 0 0 0 0 0 
0 0 0 
##$DATE= 1619690580
##$DBL= (0..7)
120 120 120 120 120 120 120 120 
##$DBP= (0..7)
150 150 150 150 150 150 150 150 
##$DBP07= 0
##$DBPNAM0= <>
##$DBPNAM1= <>
##$DBPNAM2= <>
##$DBPNAM3= <>
##$DBPNAM4= <>
$$ [...]
##$SUBNAM3= <"">
##$SUBNAM4= <"">
##$SUBNAM5= <"">
##$SUBNAM6= <"">
##$SUBNAM7= <"">
##$SUBNAM8= <"">
##$SUBNAM9= <"">
##$SW= 16.9725357007746
##$SWIBOX= (0..15)
0 0 2 0 0 0 0 0 0 0 0 0 0 0 0 0 
##$SW_h= 3396.73913043478
##$TD= 16384
##$TD0= 1
##$TE= 0
##$TE2= 300
##$TE3= 300
##$TEG= 300
##$TL= (0..7)
0 120 120 120 120 120 120 120 
##$TP= (0..7)
150 150 150 150 150 150 150 150 
##$TP07= 0
##$TPNAME0= <>
##$TPNAME1= <>
##$TPNAME2= <>
##$TPNAME3= <>
##$TPNAME4= <>
##$TPNAME5= <>
##$TPNAME6= <>
##$TPNAME7= <>
##$TPOAL= (0..7)
0.5 0.5 0.5 0.5 0.5 0.5 0.5 0.5 
##$TPOFFS= (0..7)
0 0 0 0 0 0 0 0 
##$TUNHIN= 0
##$TUNHOUT= 0
##$TUNXOUT= 0
##$USERA1= <user>
##$USERA2= <user>
##$USERA3= <user>
##$USERA4= <user>
##$USERA5= <user>
##$V9= 5
##$VALIST= <valist>
##$VCLIST= <CCCCCCCCCCCCCCC>
##$VD= 0
##$VDLIST= <DDDDDDDDDDDDDDD>
##$VPLIST= <PPPPPPPPPPPPPPP>
##$VTLIST= <TTTTTTTTTTTTTTT>
##$WBST= 1024
##$WBSW= 4
##$XGAIN= (0..3)
0 0 0 0 
##$XL= 0
##$YL= 0
##$YMAX_a= 312610
##$YMIN_a= -441485
##$ZGOPTNS= <>
##$ZL1= 120
##$ZL2= 120
##$ZL3= 120
##$ZL4= 120
##$ABSF1= 15.97506
##$ABSF2= -0.9976015
##$ABSG= 5
##$ABSL= 3
##$ALPHA= 0
##$AQORDER= 0
##$ASSFAC= 0
##$ASSFACI= 0
##$ASSFACX= 0
##$ASSWID= 0
##$AUNMP= <proc_1d>
##$AZFE= 0.1
##$AZFW= 0.1
##$BCFW= 0
##$BC_mod= 2
##$BYTORDP= 0
##$COROFFS= 0
##$CY= -3
##$DATMOD= 1
##$DC= 0
##$DFILT= <>
##$DTYPP= 0
##$F1P= 0
##$F2P= 0
##$FCOR= 1
##$FTSIZE= 16384
##$FT_mod= 6
##$GAMMA= 0
##$GB= 0
##$INTBC= 1
##$INTSCL= 1.334414e-10
##$ISEN= 128
##$LB= 0.24
##$LEV0= 0
##$LPBIN= 0
##$MAXI= 10000
##$MC2= 0
##$MEAN= 0
##$ME_mod= 0
##$MI= 1.114404
##$NCOEF= 0
##$NC_proc= -7
##$NLEV= 6
##$NOISF1= 3.799351
##$NOISF2= 2.8
##$NSP= 0
##$NTH_PI= 0
##$NZP= 0
##$OFFSET= 15.97713
##$PC= 1
##$PHC0= -11122.2
##$PHC1= 15.20102
##$PH_mod= 1
##$PKNL= yes
##$PPARMOD= 0
##$PSCAL= 0
##$PSIGN= 0
##$REVERSE= no
##$SF= 200.130006865962
##$SI= 16384
##$SIGF1= 3
##$SIGF2= 2
##$SINO= 5.538805
##$SIOLD= 16384
##$SREGLST= <1H.CDCl3>
##$SSB= 0
##$STSI= 16384
##$STSR= 0
##$SW_p= 3396.73913043479
##$SYMM= 0
##$S_DEV= 0
##$TDeff= 16384
##$TDoff= 0
##$TI= <>
##$TILT= no
##$TM1= 0
##$TM2= 0
##$TOPLEV= 0
##$USERP1= <user>
##$USERP2= <user>
##$USERP3= <user>
##$USERP4= <user>
##$USERP5= <user>
##$WDW= 1
##$XDIM= 16384
##$YMAX_p= 456859354
##$YMIN_p= -557309
$$ End of Bruker specific parameters
$$ ---------------------------------
##NTUPLES= NMR SPECTRUM
##VAR_NAME=  FREQUENCY,     SPECTRUM/REAL,   SPECTRUM/IMAG
##SYMBOL=    X,             R,               I
##VAR_TYPE=  INDEPENDENT,   DEPENDENT,       DEPENDENT
##VAR_FORM=  AFFN,          ASDF,            ASDF
##VAR_DIM=   16384,         16384,           16384
##UNITS=     HZ,            ARBITRARY UNITS, ARBITRARY UNITS
##FACTOR=    0.207333158178282, 1,           1
##FIRST=     3197.50312383373, 0,            0
##LAST=      -199.236006601062, 0,           0
##MIN=       -199.236006601062, -557309,     0
##MAX=       3197.50312383373, 456859354,    0
$$ Real data points
##PAGE= N=1
##DATA TABLE= (X++(R..R)), XYDATA
$$ [...]
4381B3951198q10522m77501o20689m70838k72362n23794n53363o54539o80843
4372A8886747p77660m83672l46060o93812o68008q5747l43791n44385k72130k95723
4362A4375759l82454j96984k72700k90367m15592J48013J27241j59032o0192j71692
4352A2702000K4150j16866J81998J15660l9333n2798K32798j50731K411J28174
4342A3027463l3228k81883l31596l11378j28745l49946k24870L5331l20009l90598
4332A0690541J2223k55754k79438j17308l697k0687k92126n9003r8269j14519
4322I461963k12795j23342J0898j68863j30565K44758L5967J10985O3879j38716
4312I154169J8894j05310j86018j15106k11263J13859j29565l24278p8205m02722
$$ plain form
4381 23951198 23140676 22663175 22042486 21571648 21299286 20775492 20222129 19567590 18886747
4372 18886747 18109087 17625415 17279355 16585543 15917535 15831788 15487997 14943612 14671482 14375759
4362 14375759 13993305 13796321 13523621 13233254 12817662 12965675 13092916 12933884 12873692 12702000
4352 12702000 12726150 12609284 12791282 12906942 12867609 12814811 13047609 12896878 12899289 13027463
4342 13027463 12994235 12712352 12380756 12069378 11940633 11590687 11365817 11401148 11081139 10690541
4332 10690541 10702764 10447010 10167572 10050264 10046567 10025880 9733754 9674751 9576482 9461963
4322 9461963 9249168 9125826 9136724 8967861 8837296 9082054 9118021 9229006 9292885 9154169
4312 9154169 9173063 9067753 8881735 8766629 8555366 8669225 8539660 8215382 8137177 7734455
4302G734455j10819r4399l43893n9751q7977n5158m1736j79675k21113K4171J19582
4291F683687m1905j84194J25711l7766j77713j47774m3535j02048r4165k6453
4281E953845k20953q947J20114j45708J53179L2615j21076j42816o0517q4338
4271E475398J56999J49576k36751o7012O2081L4281j09009p0238K44304K21415
4261E861044l3881m8015m21626P8538J29381J27134J7969n1592O3741K09135J57033
4250F088861k5548r1492K16749J48865k14229k85963l26509r2505O2830p0256
4240E410803L5377m341k09435j06465k11733j15293m0091K24190J35303j27473
4230D990842o3691P4886j96403O6650M7160j80777r8033M367J168J40940K1282
$$ plain form
4302 7734455 7623636 7529237 7185344 7125593 7037616 6982458 6940722 6761047 6539934 6564105 6683687
4291 6683687 6641782 6457588 6583299 6545533 6367820 6220046 6176511 6074463 5980298 5953845
4281 5953845 5732892 5723945 5844059 5698351 5851530 5884145 5763069 5620253 5559736 5475398
4271 5475398 5632397 5781973 5545222 5478210 5540291 5574572 5465563 5395325 5639629 5861044
4261 5861044 5827163 5779148 5357522 5436060 5565441 5692575 5710544 5658952 5722693 5931828 6088861
4250 6088861 6063313 5971821 6188570 6337435 6123206 5837243 5510734 5418229 5481059 5410803
4240 5410803 5446180 5441839 5232404 5125939 4914206 4798913 4758822 4983012 5118315 4990842
4230 4990842 4927151 5002037 4805634 4872284 4919444 4738667 4640634 4645001 4646169 4787109 4808391
4219D808391L2789q5710O7770p327N619J14937o6655K08081p5161K2164o5817
4208D959081j60463K56960K1209j27220K7711m6111p1737Q05k3780K1742J89777
4197E047974l73q1820L3640P1918n8042j15518K30312m0036n8757M4814j22168
4186D951944M4228q2179N7140L7930q8092M5699o0101K15053J7085J81544K73495
4175E593746j76188k28560q4032N0816q072K18147n8060j82815j05141M4269q9406
4164D974704p3686k90249N6076r9213r3761l4751J59247M8676M1421M3752o695
4153D725521n382j94455Q3834p3795R5180n5529m1001l615K7K5039j85068J22871
4141D493627J71921r8785J641l7051l31122o9699J99258k3340j22593J37907j4829
$$ plain form
4219 4808391 4841180 4755470 4823240 4815913 4821532 4936469 4869814 5077895 5002734 5024898 4959081
4208 4959081 4798618 5055578 5076787 4949567 4977278 4931167 4859430 4860235 4836455 4858197 5047974
4197 5047974 5047601 4965781 4999421 5071339 5013297 4897779 5128091 5088055 5029298 5074112 4951944
4186 4951944 4996172 4913993 4971133 5009063 4920971 4966670 4906569 5121622 5138707 5320251 5593746
4175 5593746 5417558 5188998 5104966 5155782 5147710 5365857 5307797 5124982 5019841 5064110 4974704
4164 4974704 4901018 4610769 4666845 4567632 4473871 4439120 4598367 4647043 4688464 4732216 4725521
4153 4725521 4720139 4525684 4609518 4535723 4630903 4575374 4534373 4530758 4530785 4555824 4370756 4493627
4141 4493627 4665548 4566763 4568404 4531353 4200231 4130532 4329790 4306450 4183857 4321764 4306935
4130D306935k8924j7619k4439m1468K3372J02225j51433K5678K2589p9684l6387
4119D100845P6085J6765j90806K9462Q2671j8027j86545o2632K18469N9609m3771
4108D082125p4308M0711M6979K782K6127K3495n4881j12231n2457J92497j01238
4097D019601Q3446N7688J07457L4966k30502l317N0168K51244r679J20904j2981
4086D468995j08450j17245o3588j736J45089K5513j32950K85187r1447N7194J64277
4075D630839J07579k6990M2583j8439k77424m9755j71335J2988o2185l4872p424
4064D145565j13494l149Q0858j08944q8728P3698j82596J53131l7674J42891M4424
4053D105982N2821q5403m0177J21991j39954L17614O8319j33404J52199j85404
$$ plain form
4130 4306935 4278011 4260392 4235953 4194485 4217857 4320082 4168649 4194327 4216916 4137232 4100845
4119 4100845 4176930 4193695 4002889 4032351 4115022 4096995 3910450 3847818 4066287 4125896 4082125
4108 4082125 4007817 4048528 4095507 4098289 4124416 4147911 4093030 3980799 3928342 4120839 4019601
4097 4019601 4103047 4160735 4268192 4303158 4072656 4069339 4119507 4370751 4361072 4481976 4468995
4086 4468995 4360545 4243300 4179712 4177976 4323065 4348578 4215628 4500815 4409368 4466562 4630839
4075 4630839 4738418 4711428 4754011 4735572 4458148 4408393 4237058 4250046 4187861 4152989 4145565
4064 4145565 4032071 4028922 4109780 4000836 3912108 3985806 3803210 3956341 3918667 4061558 4105982
4053 4105982 4158803 4073400 4033223 4155214 4015260 4332874 4401193 4267789 4419988 4234584
4043D234584L4878Q8875k1174k20597Q6399K81344k44956k54251L8230J45652
4033D168984q1641j01715J56112O5988J60488p2876p4337L4667m5260p4239m5554
4022D090617p4421j17676K35855O1185j35112n800J89046p4170j94799O8985m5809
4011C997901R2852K00584j92767P8855J69434J91607J17475M7789M6360k50836
4001D499254j1590J55013o2531j10373J62519j01052j39612J140k8827J77898
3991D541839p5275k47281p3314J12623j67461j24164K01287n7194r7918J42907
3981D156049n5403p6933J18028l8601L2685J54383O5419m8323Q0531K9026j07862
3970D308999J76731r8061M1251l41362r643j3782j10994Q5986J11160P4316r9147
$$ plain form
4043 4234584 4269462 4358337 4337163 4116566 4202965 4484309 4239353 3985102 4023332 4168984
4033 4168984 4087343 3985628 4141740 4207728 4368216 4295340 4221003 4255670 4210410 4136171 4090617
4022 4090617 4016196 3898520 4134375 4195560 4060448 4054648 4243694 4169524 3974725 4043710 3997901
4011 3997901 4090753 4291337 4098570 4177425 4346859 4538466 4655941 4703730 4750090 4499254
4001 4499254 4487664 4642677 4580146 4469773 4632292 4531240 4391628 4392768 4363941 4541839
3991 4541839 4466564 4219283 4145969 4258592 4091131 3966967 4168254 4111060 4013142 4156049
3981 4156049 4100646 4023713 4141741 4103140 4135825 4290208 4355627 4307304 4387835 4416861 4308999
3970 4308999 4485730 4387669 4428920 4087558 4077915 4064133 3953139 4039125 4150285 4224601 4125454
3959D125454P2084k40209k482J50645L8318R075j95196P1318K5399m2731p1890
3948C939785M5862K05308J21178r7069P0837j31467m068J02891Q0452j70871N5808
3937D218646K04605r5506R983j49251K8000m7662J72349J21064q2894J87477j82574
3926D384237l4835O8414k7718j47223J74682n449Q0969N5964j05037J6771k56444
3915D204331K69527J24245N8264k65590J41452K23194J9765j91744J48019J11137
3905D842600K62128J4230L3256P9312l979J31971k52641J57705J3350K05342J22632
3894E605906L0978n8745p2148K13326K9507j0685n5280J2409L5106M44284j27458
3883F047200k21946J78780R4700P2313J20785J40065j4401J92210K61103J84739
$$ plain form
3959 4125454 4197538 3957329 3954847 4105492 4143810 4152885 3957689 4029007 4054406 4011675 3939785
3948 3939785 3985647 4190955 4312133 4215064 4285901 4154434 4150366 4253257 4333709 4162838 4218646
3937 4218646 4423251 4327745 4337728 4188477 4216477 4168815 4341164 4462228 4379334 4566811 4384237
3926 4384237 4349402 4417816 4390098 4242875 4417557 4412108 4493077 4549041 4444004 4460775 4204331
3915 4204331 4473858 4598103 4656367 4390777 4532229 4755423 4775188 4583444 4731463 4842600
3905 4842600 5104728 5118958 5152214 5231526 5227547 5359518 5106877 5264582 5277932 5483274 5605906
3894 5605906 5636884 5578139 5505991 5719317 5748824 5738139 5682859 5695268 5730374 6174658 6047200
3883 6047200 5825254 6004034 6098734 6171047 6291832 6431897 6417496 6609706 6870809 7055548
3873G055548Q902J93678m2423J95189L63967K59199J08371O1525K96460J45775
3863H646191O17723L11335L16851K66062N07099M20204M21359N02432L03760L77711
3853A2690727M14429K03804j02660L2440j34254j04870k21462j36238k37568j25071
3843A2279277l31180k75581J36786L277r4909r6963K10690J51466M27604J4206
3833A2424673J77610L96882L28033K88863J57748L08411K34700J98286K30058
3824A4745264M67310K48521M17871L26099L79279K17894K32689J62193J24178
3815A7321298K70784O7714J53179l5756N0220n2887k30323j88028o7115l9529
3805A7249557j04740j81516l3718l1026Q869M67099j78662p0649Q8070J01658
$$ plain form
3873 7055548 7064450 7258128 7215705 7410894 7774861 8034060 8142431 8203956 8500416 8646191
3863 8646191 9263914 9575249 9892100 10158162 10665261 11085465 11506824 12009256 12313016 12690727
3853 12690727 13105156 13308960 13206300 13238740 13104486 12999616 12778154 12641916 12404348 12279277
3843 12279277 11948097 11672516 11809302 11812579 11717670 11620707 11831397 11982863 12410467 12424673
3833 12424673 12602283 12999165 13327198 13616061 13773809 14082220 14316920 14515206 14745264
3824 14745264 15212574 15461095 15878966 16205065 16584344 16802238 17034927 17197120 17321298
3815 17321298 17592082 17659796 17812975 17777219 17827439 17774552 17544229 17356201 17289086 17249557
3805 17249557 17144817 16963301 16929583 16898557 16907426 17374525 17195863 17125214 17213284 17314942
3795A7314942n776m0805J01941j37135o6724J61754j34854J31135K85012L3056
3785A7642546Q2698J07580o6403J03167J82926L86457J98861J74932N44208O49733
3775B0006705M45307M16274M04005M39387J50265J40287J60280k78550m16637
3766B1467323m80316l23971o47905l85300j71142p6553m84117k09471p9516l82972
3756A8226060R4448P4288j72419k10969J53506l2458J92140K85147j56550J53384
3746A8606577K58632J16453K74189K68083K89022L92389K18399N10380M95213
3737B1429337P04571K01156L93822M11407K77127N20307L93159M56030M14765
3728B5201681O46550N82919N82762Q23365M76964O60467Q80352J089505P69814
$$ plain form
3795 17314942 17309166 17268361 17370302 17233167 17166443 17328197 17193343 17324478 17609490 17642546
3785 17642546 17725244 17832824 17766421 17869588 18052514 18438971 18637832 18812764 19356972 20006705
3775 20006705 20452012 20868286 21272291 21711678 21861943 22002230 22162510 21883960 21467323
3766 21467323 20987007 20663036 20015131 19629831 19458689 19382136 18898019 18688548 18609032 18226060
3756 18226060 18320508 18394796 18222377 18011408 18164914 18132456 18324596 18609743 18453193 18606577
3746 18606577 18865209 18981662 19255851 19523934 19812956 20205345 20423744 20934124 21429337
3737 21429337 22133908 22335064 22728886 23140293 23417420 23937727 24330886 24786916 25201681
3728 25201681 25848231 26431150 27013912 27837277 28314241 28974708 29855060 30944565 31714379
3719C1714379J155625J092072J141086J462859J484927J356200J437653J575183
3711D2419984J700409J789115J828848K208184K111102K663008K409754K944459
3703F0074863L206116L111842L396713L880815M253883M271405N068380N450369
3695I2714386N988145O494423O875253P410860P532007P602625P062323O533247
3687A48213269N774547M366895K902073J015570j750865l845170n340870o833674
3679A44501775q115942q759858r409020r526839q872420p923011p303754o324367
3671G8266564n608005n049142m157423l570638l294419k943251k835260k419924
3663D8388502k349053j847390j826814j617647j446223j770355j451876j009265
$$ plain form
3719 31714379 32870004 33962076 35103162 36566021 38050948 39407148 40844801 42419984
3711 42419984 44120393 45909508 47738356 49946540 52057642 54720650 57130404 60074863
3703 60074863 63280979 66392821 69789534 73670349 77924232 82195637 87264017 92714386
3695 92714386 98702531 105196954 112072207 119483067 127015074 134617699 141680022 148213269
3687 148213269 153987816 158354711 161256784 162272354 160521489 156676319 151335449 144501775
3679 144501775 136385833 127625975 118216955 108690116 99817696 91894685 84590931 78266564
3671 78266564 72658559 67609417 63451994 59881356 56586937 53643686 50808426 48388502
3663 48388502 46039449 44192059 42365245 40747598 39301375 37531020 36079144 35069879
3655C5069879j106380j086390r65192j008131q83520r48556o15509p33751o33282
3646B7089168o72465p67060o15542k07773o13351k35948k19763l76668k83133
3637B3097465l17078j16428l44456J48487l5248k92066j62827j68563j85318k2857
3627B1601111n604J13523J02728n884J65744K24667L82961n5598J24804K53060
3617B2901512J85692M02791M62084K26577K10255J95502J08567j77631l09559
3608B4205790r7228l83143k35105l5073l81528J81579J06940J6954K53137M73124
3598B4105447M3854l5029K48119K253L13266J62260J06241J82953O21940N11191
3588B6262495M28668P74005R02075Q35911J024749Q99060N96635P65390N07525
$$ plain form
3655 35069879 33963499 32877109 31911917 30903786 30020266 29071710 28456201 27722450 27089168
3646 27089168 26416703 25649643 25034101 24826328 24212977 23977029 23757266 23380598 23097465
3637 23097465 22780387 22663959 22319503 22467990 22432742 22140676 21977849 21809286 21623968 21601111
3627 21601111 21595507 21709030 21811758 21805874 21971618 22196285 22579246 22523648 22648452 22901512
3617 22901512 23087204 23489995 23952079 24178656 24388911 24584413 24692980 24515349 24205790
3608 24205790 24108562 23725419 23490314 23455241 23073713 23255292 23362232 23379186 23632323 24105447
3598 24105447 24149301 24114272 24362391 24364644 24677910 24840170 24946411 25129364 25751304 26262495
3588 26262495 26691163 27465168 28367243 29203154 30227903 31126963 31723598 32488988 32996513
3579C2996513J5547j85398l20858q06987p71572p54202j016498q60432n84946
3570B7711167p62519o29310m13645k55759k32641o8041j65918Q7750K51471O2139
3560B5584694K64142M81625L37830L91826O38803O01075M87979P25962R20357
3551C0434293Q79088P62826J049373Q61677O71665P04932N22925L61633N16802
3542C6765214M68350K57392M19831M67090Q17681O72252P97690N47983M89368
3533D1702851K83730l80902n81399o89882q86466p86387q78771j013548q37240
3524C5931986n15230j01180k75541k22182j392n8815N37684L53160M51043O36998
3514C6736531P25077P80421R89187R34273J002346J387328J682749J724454J724118
$$ plain form
3579 32996513 33012060 32826662 32505804 31698817 30927245 30173043 29156545 28296113 27711167
3570 27711167 26948648 26319338 25905693 25649934 25417293 25349252 25183334 25271084 25522555 25584694
3560 25584694 25848836 26330461 26668291 27060117 27698920 28299995 28787974 29513936 30434293
3551 30434293 31313381 32076207 33125580 33987257 34658922 35363854 35886779 36248412 36765214
3542 36765214 37233564 37490956 37910787 38377877 39195558 39867810 40665500 41213483 41702851
3533 41702851 41986581 41605679 41024280 40334398 39447932 38661545 37782774 36769226 35931986
3524 35931986 35416756 35315576 35040035 34817853 34816461 34757646 35295330 35648490 36099533 36736531
3514 36736531 37461608 38242029 39231216 40165489 41167835 42555163 44237912 45962366 47686484
3505D7686484K032908K043348K221300K375531J900484J563734J163806K53084
3497F1240679m79683j174267j752809k132655k340279k422644k325820j932965
3489D6679557j638907j548572j269961j038795q44733q37845p56612n70603m40079
3480C7733450j98407k41960Q011K47082J86947J57647M54001Q84600R44151P61519
3470D0937041R04475J257755J240771R61060P73476M92992M87615j71562o75468
3461D6208155j036057j462878j522993j425372j309812j343207r67670q55687
3453C6284479o20524o90364l70590m87379k69324J77789j84628j3094K85201M05565
3443C4517131K83136N34413L66165N78034N90204M95264J038306O41767P18964
$$ plain form
3505 47686484 49719392 51762740 53984040 56359571 58260055 59823789 60987595 61240679
3497 61240679 60760996 59586729 57833920 55701265 53360986 50938342 48612522 46679557
3489 46679557 45040650 43492078 42222117 41183322 40338589 39500744 38744132 38173529 37733450
3480 37733450 37535043 37293083 37301094 37548176 37735123 37892770 38346771 39231371 40175522 40937041
3470 40937041 41841516 43099271 44340042 45301102 46074578 46567570 47055185 46883623 46208155
3461 46208155 45172098 43709220 42186227 40760855 39451043 38107836 37140166 36284479
3453 36284479 35663955 34973591 34603001 34115622 33846298 34024087 33839459 33826365 34111566 34517131
3443 34517131 34800267 35334680 35700845 36278879 36869083 37364347 38402653 39044420 39763384
3434C9763384R83670J016977J078878J312769J568176J814831K020565K367393
3426E1926643K838185L178142L658364L910120M272195N133742N497061N755427
3418H6169879O613484P552721Q420857R259731J0001188J0689630J1382900J1519400
3410A61609790J0288397O927402J257112o519732j3270793j5813706j5288607
3403A29189863j3050062j0705471r008945p476221o222944n460740m342807l973921
3395F8948752l427765l194138k859221k300125k129521k058921j456600j579122
3387D9943339j267962r65709j159687r23262p70488m19118p52259o38416m05710
3378D2640728o64245p93512k79077l37914k18730M6752k23354l6905K04090O7533
$$ plain form
3434 39763384 40747054 41764031 42842909 44155678 45723854 47538685 49559250 51926643
3426 51926643 54764828 57942970 61601334 65511454 69783649 74917391 80414452 86169879
3418 86169879 92783363 100336084 108756941 118016672 128017860 138707490 150090390 161609790
3410 161609790 171898187 178825589 180082701 173562969 160292176 144478470 129189863
3403 129189863 116139801 105434330 96425385 88949164 82726220 77265480 72922673 68948752
3395 68948752 65520987 62326849 59467628 57167503 55037982 52979061 51522461 49943339
3387 49943339 48675377 47709668 46549981 45626719 44856231 44437113 43684854 43046438 42640728
3378 42640728 41976483 41182971 40903894 40565980 40347250 40394002 40170648 40133743 40337833 40405366
3368D0405366P8220L16856N17670N56368P70030N09463N82864P51387N35662M45791
3358D5469677M22786J60335k53661j93893r7270k64701k08726J2038K18752J95547
3348D5460884J14568K60709L93842O44289M18112O13398Q91287Q71027Q82163
3339E0550279Q22395Q91685J260052J693369J705812J562723J884652K143617
3331F2514584K384779K681670K616566L033337L257910L399167L724857M161353
3323H7774223M492540M959772N463194N862699O420070O724460P044166P316135
3315A36057259O814400N965117M305428L199178K040185R81810N76548R26122
3307A60866047J876009L292567N292899P096050Q435072R305071R537503Q263152
$$ plain form
3368 40405366 40483586 40800442 41318112 41874480 42644510 43153973 43736837 44488224 45023886 45469677
3358 45469677 45892463 46052798 45799137 45605244 45507974 45243273 45034547 45046585 45265337 45460884
3348 45460884 45575452 45836161 46230003 46874292 47292404 47905802 48797089 49668116 50550279
3339 50550279 51372674 52264359 53524411 55217780 56923592 58486315 60370967 62514584
3331 62514584 64899363 67581033 70197599 73230936 76488846 79888013 83612870 87774223
3323 87774223 92266763 97226535 102689729 108552428 114972498 121696958 128741124 136057259
3315 136057259 142871659 148836776 153142204 156341382 158381567 159363377 159939925 160866047
3307 160866047 162742056 166034623 171327522 178423572 186858644 196163715 205701218 213964370
3299B13964370M229149j363092p028521j2106600j4132395j5133770j5810367
3292A52618774j5175130j3363562j1021211q862649p137779o109733n055395m270069
3284H1623246l405139l069725k867478k535230k233411j877548k168120j625778
3276F1840817j749449j859676j920695k034672j456545j605164j471121j083019
3268D8660476j095260j015683o93721n51290n37633n01740l32572l64824k11640
3259D3356113M0626K22670o0560K39747K28622J11467K37575L17035M22799L09500
3249D5425594P36249J098848J103658J295158J349117J761450J801476K156868
3241E6728418J806835J492232J857447K205762K663752L216911L962852M562298
$$ plain form
3299 213964370 218193519 216830427 209801906 197695306 183562911 168429141 152618774
3292 152618774 137443644 124080082 113058871 104196222 97058443 90948710 85893315 81623246
3284 81623246 78218107 75148382 72280904 69745674 67512263 65634715 63466595 61840817
3276 61840817 60091368 58231692 56310997 54276325 52819780 51214616 49743495 48660476
3268 48660476 47565216 46549533 45855812 45304522 44766889 44265149 43932577 43567753 43356113
3259 43356113 43396739 43619409 43558849 43798596 44027218 44138685 44376260 44693295 45116094 45425594
3249 45425594 46161843 47260691 48364349 49659507 51008624 52770074 54571550 56728418
3241 56728418 58535253 60027485 61884932 64090694 66754446 69971357 73934209 78496507
3233G8496507N865642P081903Q237655R356393J0155688J0479283J0360326Q707026
3225A48740423N411613p32777q713668j4033418j4050353j2127923r832482p976408
3217H6685007o061095m653823l808181k627369k062594j516227r59835o24497
3209F4371386m38701k87809n61838j550193k699624l214580k727560k303901j984378
3200D8602802j936877j693684j476668j140215j039314j210843j171020p89566
3192C8144615k58382p44822q12605l08331l87525l87380m18763m73853k20315
3183C4132639k50210k92683l31159m48030k72325l32530l16450j67180n0783n3458
3173C1617831l34518j30093O070J48487l4347k02018K21113J64047J59323R7753
$$ plain form
3233 78496507 84362149 91444052 99681707 109038100 119193788 129673071 140033397 148740423
3225 148740423 154152036 153419259 144705591 130672173 116621820 104493897 94661415 86685007
3217 86685007 80623912 75970089 72161908 69534539 67471945 65955718 64995883 64371386
3209 64371386 63932685 63644876 63083038 61532845 58833221 55618641 52891081 50587180 48602802
3200 48602802 46665925 44972241 43495573 42355358 41316044 40105201 38934181 38144615
3192 38144615 37886233 37141411 36328806 36020475 35632950 35245570 34826807 34352954 34132639
3183 34132639 33882429 33589746 33258587 32810557 32538232 32205702 31889252 31722072 31671289 31617831
3173 31617831 31283313 31153220 31159290 31307777 31273430 31071412 31292525 31456572 31615895 31713648
3163C1713648J21362M94970O25509N29590N63422N41652M66809L52804N55485
3154C5965251L50923K09070L08569K50325M13963J90680N55432K30414K75061
3145C8749688N6868O9132J31238L33889M88881M34224Q77112J086729Q73796O41187
3135D3742744Q90975L94361K23530j62696o18954m75122n49536m17718m14175
3126D2613409j3390L98275M58510Q84532J201848J538919J820418J874379K147770
3117E2924670K327467J802094J593695J537401J762125J895015K630307L463946
3109F9936720M286931N044754N479106N318029N153082L811239Q21706m141305
3101I5710262q134521q058623o973476n495212m523325l469977l017104k564666
$$ plain form
3163 31713648 31835010 32329980 32955489 33485079 34048501 34590153 35056962 35409766 35965251
3154 35965251 36316174 36525244 36833813 37084138 37498101 37688781 38244213 38474627 38749688
3145 38749688 38806556 38875688 39006926 39340815 39829696 40263920 41141032 42227761 43101557 43742744
3135 43742744 44633719 45028080 45251610 45088914 44469960 43994838 43445302 43027584 42613409
3126 42613409 42600019 42998294 43456804 44341336 45543184 47082103 48902521 50776900 52924670
3117 52924670 55252137 57054231 58647926 60185327 61947452 63842467 66472774 69936720
3109 69936720 74223651 79268405 84747511 90065540 95218622 99029861 99851567 95710262
3101 95710262 87575741 79517118 72543642 67048430 62525105 59055128 56038024 53473358
3093E3473358k085668j954767j422396j309052j288303q90913p97990o13687k06637
3084D2903945j57121j57608j00299J69357M99368l909R5955l92928p99936j104778
3074D0952046j376781j116871r06732n89369m60606k01070j26896j61352J47525
3065C6159894j40922R5109K10865K71358O68575P54903R17472J055939J680032
3056D1673225J706535J736163K104797K211040K076286J615906Q33428o07014
3048E3350366j724832k154192k026310j568902j312146p60001m28865m22721k09934
3039D2742463m0968J96476P7683J75839K75738M28653M24089K60738O34388N55147
3029D5730246O70926P01576Q15118N36164P29571Q13591N76012O96923O65914
$$ plain form
3093 53473358 51387690 49432923 48010527 46701475 45413172 44522259 43724269 43110582 42903945
3084 42903945 42746824 42589216 42488917 42658274 43157642 43153733 43249688 42856760 42056824 40952046
3074 40952046 39575265 38458394 37551662 36962293 36501687 36300617 36173721 36012369 36159894
3065 36159894 36018972 36114081 36324946 36596304 37264879 38019782 38937254 39993193 41673225
3056 41673225 43379760 45115923 47220720 49431760 51508046 53123952 53957380 53350366
3048 53350366 51625534 49471342 47445032 45876130 44563984 43803983 43375118 42952397 42742463
3039 42742463 42701495 42897971 42975654 43151493 43427231 43855884 44279973 44540711 45175099 45730246
3029 45730246 46401172 47102748 47917866 48454030 49183601 49997192 50573204 51270127 51936041
3020E1936041N44092M77145O78086N72562P93771R51938O66486R18160Q78958
3011E8417239J169309J158015R23662J032021P69310O06308N16098P46976N57641
3002F5896579K02482K14383m68224l62958l73800o45586j158580r90432p69143
2993F1544721j136792j199703j231031j321495j360296j373953j392419j343203
2985E1185829r28316j091223r89677q05638p17913o44675q24207o58220j018804
2976D3507156j001399j205200j065398j147521j010488j026189r54357j075837
2968C5020767q90312o41513p11148q46064p76763l88779n41201n53615o95800
2959B8975572m27164n29187o32777m88365n65279o19592k67804k45855m07499
$$ plain form
3020 51936041 52480133 52957278 53635364 54207926 55001697 55953635 56620121 57538281 58417239
3011 58417239 59586548 60744563 61668225 62700246 63469556 64075864 64591962 65338938 65896579
3002 65896579 66099061 66313444 65845220 65482262 65108462 64462876 63304296 62313864 61544721
2993 61544721 60407929 59208226 57977195 56655700 55295404 53921451 52529032 51185829
2985 51185829 50257513 49166290 48176613 47370975 46653062 46008387 45184180 44525960 43507156
2976 43507156 42505757 41300557 40235159 39087638 38077150 37050961 36096604 35020767
2968 35020767 34130455 33488942 32777794 31931730 31154967 30766188 30224987 29671372 28975572
2959 28975572 28548408 28019221 27386444 26898079 26332800 25713208 25445404 25199549 24792050
2950B4792050k26074l40450n77011k91000j74405k25471j79675j61641j96263
2941B2420060l96151R5242j50110r4264L5642j61684J95186K18289J62719K11039
2931B2535968M77497J52617K89192N60231L96653M38386L96314N07937M92662
2922B6247457O26489M54145M24009L87239Q0911J49945J32672j43324j8125l9995
2912B8301423L1847k67498j66277L0830j87961J7347J1487j7508K31791M94813
2902B8480294M05919K85968L94366N87785P22707Q05132Q19757P27558P20537
2893C3950023P45981Q89491J281576J160795J155859J132463J062857R37891P49587
2884D3066523N70934J96945Q4571j18118n50538n92682p34959q49752n75921o79666
$$ plain form
2950 24792050 24565976 24225526 23648515 23357515 23183110 22957639 22777964 22616323 22420060
2941 22420060 22023909 22119151 21969041 21874777 21910419 21748735 21943921 22162210 22324929 22535968
2931 22535968 23013465 23166082 23455274 24015505 24412158 24850544 25246858 25754795 26247457
2922 26247457 26873946 27328091 27752100 28139339 28220250 28370195 28502867 28359543 28341418 28301423
2912 28301423 28333270 28065772 27899495 27930325 27742364 27759711 27771198 27753690 27985481 28480294
2902 28480294 28886213 29172181 29566547 30154332 30877039 31682171 32501928 33229486 33950023
2893 33950023 34696004 35585495 36867071 38027866 39183725 40316188 41379045 42316936 43066523
2884 43066523 43637457 43834402 43918973 43800855 43250317 42657635 41922676 41072924 40497003 39817337
2874C9817337r58038j022305o03935l06964l60233j02142l01633m7513J32974
2865C6247548P2692K48735M28159M45413O80542P85080O51496R40214J033154
2856D1533033J017693R37505J045892J106429R59047P20915P34959K24326n5126
2847D8224673l57577n11778j046228j181493j418538j486084j310602j168547
2839C9743826j229641j415722j188169r31780p72021p09816m34843n67488n97976
2830C1896370k49018k48363M7140J08872j32362p9931J53042K32840J55973M01963
2820C2286526L59072N72214M66205P258K60905j71000k33086k21270n24841o09421
2810C2192562j055975r38185j134904j064080r65851o96430p70813r34568p16453
$$ plain form
2874 39817337 38859299 37836994 37233059 36926095 36565862 36463720 36162087 36114574 36247548
2865 36247548 36320240 36568975 36997134 37442547 38123089 38908169 39559665 40499879 41533033
2856 41533033 42550726 43488231 44534123 45640552 46599599 47320514 48055473 48279799 48224673
2847 48224673 47867096 47355318 46309090 45127597 43709059 42222975 40912373 39743826
2839 39743826 38514185 37098463 35910294 34978514 34206493 33496677 33061834 32494346 31896370
2830 31896370 31647352 31398989 31446129 31555001 31422639 31342708 31495750 31728590 31884563 32286526
2820 32286526 32645598 33217812 33684017 33691275 33952180 33781180 33548094 33326824 32801983 32192562
2810 32192562 31136587 30198402 29063498 27999418 27033567 26337137 25566324 24631756 23915303
2801B3915303m88812n05950m30719n71720o80861m63026k47108m62370k43210
2792A9821527k64075k25789p0760j54685l37371k33144P3779j08982M4365P9373
2782A8624238k89067k4200r7380l36139l37041q6447l50695l30198k25588l72184
2772A6175299k91154k10695k09657r6658o9553l86671r8902j16209J28360j80855
2762A4643305k65785k98421q0382k4376j37125k55727p0820o1406j56401J8139
2752A3311001l12296m2629j70378j26751J65234N2195K6588j31039q3676L8851
2742A2727100J8259J50841k10642Q6659J10417j21304J14264J13434k6962l1608
2732A2930458R2247J9844O2847K83696J01943K8929r5909j92131j8235O0419r6710
$$ plain form
2801 23915303 23426491 22920541 22489822 21918102 21237241 20774215 20527107 20064737 19821527
2792 19821527 19557452 19331663 19260903 19106218 18768847 18535703 18609482 18500500 18544865 18624238
2782 18624238 18335171 18310971 18213591 17877452 17540411 17453964 17103269 16773071 16547483 16175299
2772 16175299 15884145 15673450 15463793 15367135 15297582 14910911 14812009 14695800 14824160 14643305
2762 14643305 14377520 14079099 13998717 13974341 13837216 13581489 13510669 13449263 13292862 13311001
2752 13311001 12998705 12956076 12785698 12658947 12824181 12876376 12902964 12771925 12688249 12727100
2742 12727100 12745359 12896200 12685558 12772217 12882634 12761330 12875594 12989028 12962066 12930458
2732 12930458 13022705 13042549 13105396 13389092 13491035 13519964 13424055 13231924 13213689 13274108 13177398
2721A3177398q6035R7302K7686J2273j1926j8977j88521q8711j6833p4358J07656
2710A2936954j17557j60914K57760l1453K320O1853p0111n9977N4152J2275M0649
2699A2925951K36220p9465l02293O7743m5361j59831O1623J13134j511p3666o7476
2688A2675068j73468r6115j10142k61834M0636N413k14050j53084J71503m0317
2678A1843610p8644j5250J29878L5982J1230N0302j8497J04433j27175M4762J9844
2667A2000475K47844J08927j09002R7666M5905J63512P5425J72747k0370m2440
2657A2740689J93924J77186O0656P3454J4457J83908q7388J10282K96879Q8137
2647A3852184J21920L3426J32564P2431J23274M61636L47932R3482M2018P6669
$$ plain form
2721 13177398 13091363 13188665 13216351 13228624 13216698 13197721 13009200 12920489 12903656 12829298 12936954
2710 12936954 12819397 12658483 12916243 12884790 12887110 12948963 12878852 12818875 12873027 12885302 12925951
2699 12925951 13162171 13082706 12780413 12848156 12802795 12642964 12704587 12817721 12816210 12742544 12675068
2688 12675068 12501600 12405485 12295343 12033509 12074145 12079558 11865508 11712424 11883927 11843610
2678 11843610 11764966 11749716 11879594 11915576 11926806 11977108 11958611 12063044 11935869 11980631 12000475
2667 12000475 12248319 12357246 12248244 12345910 12391815 12555327 12630752 12803499 12783129 12740689
2657 12740689 12934613 13111799 13172455 13245909 13260366 13444274 13356886 13467168 13764047 13852184
2647 13852184 13974104 14007530 14140094 14212525 14335799 14797435 15145367 15238849 15280867 15357536
2637A5357536J01647k15747M9397J15552R1251j06302k05916p2654o028J62481
2627A5271217R4916k44128j4991K9192M8885P560P2500p3977j39726R3198K22112
2616A5366758K03672R1476K7113J05669J44104J25075q0746J22326J36436n294
2606A6236589K68564J46496n6315K01436K45941J05606k29903j56561R9747P5754
2596A6937354k8296k3372J87536N0808R6605J58563R1342J22437n8601Q7415K90312
2585A7912103R4414K31075J52844J56802L8929J74669L27576K17208K40066K98735
2575A9844421K09909J81940K95989J06598K47007K09434q3264K13500R5331J62874
2565B1483739k23476P2442K79636K26750M34101R0311K78386L41703M58344M11516
$$ plain form
2637 15357536 15459183 15243436 15292833 15408385 15499636 15393334 15187418 15114764 15108736 15271217
2627 15271217 15366133 15122005 15107014 15136206 15185091 15192651 15265151 15191174 15051448 15144646 15366758
2616 15366758 15570430 15661906 15689019 15794688 15938792 16063867 15983121 16105447 16241883 16236589
2606 16236589 16505153 16651649 16595334 16796770 17042711 17148317 16918414 16761853 16861600 16937354
2596 16937354 16909058 16885686 17073222 17124030 17220635 17379198 17470540 17592977 17534376 17621791 17912103
2585 17912103 18006517 18237592 18390436 18547238 18586167 18760836 19088412 19305620 19545686 19844421
2575 19844421 20054330 20236270 20532259 20638857 20885864 21095298 21012034 21225534 21320865 21483739
2565 21483739 21260263 21332705 21612341 21839091 22273192 22363503 22641889 22983592 23441936 23853452
2555B3853452M68966M96250N62336N83801P82153P92677P85736J191028J250754
2546C0767153J273985J498907J370240J668327J785434J719945J668409J364953
2538D3117353Q35573j35823o57132o14419k35061K75376M44720J007433J242662
2529D5280682J416349J499237J359444J074341N94697N35417L95540K46986L78528
2520E2781221O30160P61427J339390J828099K353041K345193K699946K840527
2512F7579004K418185J491668M7018k038653l508631l431700k958549j958121
2504E7640221j237335q51604p36322m3591R3151p0390j07673j9748k24662n86509
2494E3855538o74572j278343j216191j165076o21707j17918R2112M97067N28349
$$ plain form
2555 23853452 24322418 24818668 25381004 25964805 26746958 27539635 28325371 29516399 30767153
2546 30767153 32041138 33540045 34910285 36578612 38364046 40083991 41752400 43117353
2538 43117353 43952926 43817103 43159971 42545552 42310491 42585867 43030587 44038020 45280682
2529 45280682 46697031 48196268 49555712 50630053 51224750 51760167 52155707 52402693 52781221
2520 52781221 53411381 54172808 55512198 57340297 59693338 62038531 64738477 67579004
2512 67579004 69997189 71488857 71535875 69497222 65988591 62556891 59598342 57640221
2504 57640221 56402886 55551282 54814960 54771369 54864520 54794130 54686457 54666709 54442047 53855538
2494 53855538 53180966 51902623 50686432 49521356 48899649 48781731 48873843 49370910 49899259
2485D9899259R34109O94503N86393k74234j065525j191559j151784r59992m99282
2476D6971888j55310j89825p564L82577N46548M38892N91822L58202O86254N99890
2466E0223374M60672M01294M31488L75421K82083M70929L83438K31633K72941
2457E3533273J87839M79184N60201L58477M23688N45499J36766J52180K53794
2448E6630901R2748P3241R0048j00936R1619J00179L24222L80466N47874P25153
2438E8955515Q92132R90288R51312J431912J324535J226591J301733J040271R38070
2429F9052359N86641O83072K41267Q9319J57638k6835M66239M01362M49327R94400
2419G3094789J321356J206847J278390J444427J261643J211476J423199J086407
$$ plain form
2485 49899259 50833368 51527871 52114264 51840030 50774505 49582946 48431162 47471170 46971888
2476 46971888 46816578 46626753 46619189 47001766 47548314 47987206 48579028 48937230 49623484 50223374
2466 50223374 50684046 51085340 51516828 51892249 52174332 52645261 53028699 53260332 53533273
2457 53533273 53721112 54200296 54760497 55118974 55542662 56088161 56224927 56377107 56630901
2448 56630901 56723649 56796890 56886938 56786002 56877621 56977800 57302022 57682488 58230362 58955515
2438 58955515 59847647 60837935 61789247 63221159 64545694 65772285 67074018 68114289 69052359
2429 69052359 69639000 70322072 70563339 70652658 70810296 70783461 71249700 71651062 72100389 73094789
2419 73094789 74416145 75622992 76901382 78345809 79607452 80818928 82242127 83328534
2411H3328534J332165J361567J256922J072581J076205Q32197N89112M72911K76467
2402I1598661o945l87937o02193r99155q62570r25839j013574q96072p00235m73270
2392H4730871n89090l95384o12349o79187r03788j278595j619214k046214k286535
2383G4320515k446081k710102k805660k996402k838189k621570k321751k055759
2375E3525001k261727k026403j625552j547317j365370j420376r80715j035156
2367D1262385j049421q79491p44052p86687o86575l82424n03128n80564k61817
2358C5388226m18826l50621j94926l97260l27731p3453m1947k71015J8959O9045
2348C3400451J82872L5430j90599K7204J49819L26369K85147L12924J39459L96377
$$ plain form
2411 83328534 84660699 86022266 87279188 88351769 89427974 90260171 90849283 91322194 91598661
2402 91598661 91591716 91203779 90601586 89602431 88739861 87814022 86800448 85904376 85204141 84730871
2392 84730871 84141781 83746397 83134048 82454861 81551073 80272478 78653264 76607050 74320515
2383 74320515 71874434 69164332 66358672 63362270 60524081 57902511 55580760 53525001
2375 53525001 51263274 49236871 47611319 46064002 44698632 43278256 42297541 41262385
2367 41262385 40212964 39333473 38589421 37802734 37116159 36733735 36230607 35650043 35388226
2358 35388226 34969400 34618779 34423853 34026593 33698862 33625409 33583462 33312447 33331406 33400451
2348 33400451 33583323 33618753 33428154 33455358 33605177 33931546 34216693 34529617 34669076 35065453
2338C5065453M73956K26959L43265J64000J77849K48239N52046L64155K69479
2329C7885401K40715l7853K72464M09333o9596K86585K52394K32727K12898L73513
2319D0058581J27037k63582O6916q094L68188L8729J53603O9888J9336M52284
2309D1082886L70777O93664L05436P18076M44991M64289P62512P45706O21543
2300D6209880Q95251R18835P82766J133361J075994J064862R91882R84351J120950
2291E5178132J263437R06933R06617J210930J159114Q99534J049046J131725R15249
2282F4620717J254735J318528J277733J143140J211320J565630J751258J846353
2274G5989414J962053K192850K124865K264263K337368K341714K436392K432093
$$ plain form
2338 35065453 35539409 35766368 36109633 36273633 36451482 36699721 37251767 37615922 37885401
2329 37885401 38126116 38088263 38360727 38770060 38700464 38987049 39239443 39472170 39685068 40058581
2319 40058581 40185618 39922036 39988952 39980858 40349046 40387775 40541378 40611266 40630602 41082886
2309 41082886 41453663 42147327 42452763 43170839 43615830 44080119 44842631 45588337 46209880
2300 46209880 47105131 48023966 48806732 49940093 51016087 52080949 53072831 54057182 55178132
2291 55178132 56441569 57348502 58255119 59466049 60625163 61524697 62573743 63705468 64620717
2282 64620717 65875452 67193980 68471713 69614853 70826173 72391803 74143061 75989414
2274 75989414 77951467 80144317 82269182 84533445 86870813 89212527 91648919 94081012
2266I4081012K338902K386456K190867K286049K213772J711693K021117J827086
2258A11056954J336515J403095J609732J340308R53355J292747J253694J020569
2250A21266969R71434R38670Q73502R78476J119717R91024J159535J413991J503040
2241A31216358J406281J915837K342077K519667K615209K817669K822496L069085
2233A50724679K889707K965807L132870L081223L197953L060351L169063L112650
2225A75334303L425766L550756L735387L770296M076110M764995N173881N065358
2217B08896852N234892N557093N994713O463940O663597O904370P422763P479810
2209B60618030Q059738Q279607Q339462Q331455Q151048Q128098Q087994P562288
$$ plain form
2266 94081012 96419914 98806370 100997237 103283286 105497058 107208751 109229868 111056954
2258 111056954 112393469 113796564 115406296 116746604 117699959 118992706 120246400 121266969
2250 121266969 122238403 123177073 124050575 125029051 126148768 127139792 128299327 129713318 131216358
2241 131216358 132622639 134538476 136880553 139400220 142015429 144833098 147655594 150724679
2233 150724679 153614386 156580193 159713063 162794286 165992239 169052590 172221653 175334303
2225 175334303 178760069 182310825 186046212 189816508 193892618 198657613 203831494 208896852
2217 208896852 214131744 219688837 225683550 232147490 238811087 245715457 253138220 260618030
2209 260618030 268677768 276957375 285296837 293628292 301779340 309907438 317995432 325557720
2201C25557720O948957O524405N893336N208768M681664L950445K869797K032049
2193C63667141Q34814l53697j328774k149991k761305l681867l937529m171560
2185C46117232m518290m523775m948193n067863n716699o252621o994885q170404
2177B99924502r236714j0265992j1124739j1739025j2108399j2256694j2099169
2170B21093770j1669997j1113722j0192060r670980q731565p890656p484328o942913
2162A47397549o236485n496470n230234m994798m696911m329157l900472l845267
2154A08667755l524324l248045l057443k823220k655778k382059k550832k068018
2146H6358036k164823k035456j706818j701448j375060j508584j287859j215501
$$ plain form
2201 325557720 332506677 339031082 344924418 350133186 354814850 358765295 361635092 363667141
2193 363667141 364501955 364148258 362819484 360669493 357908188 354226321 350288792 346117232
2185 346117232 341598942 337075167 332126974 327059111 321342412 315089791 308094906 299924502
2177 299924502 290687788 280421796 269297057 257558032 245449633 233192939 221093770
2170 221093770 209423773 198310051 188117991 178447011 169715446 161824790 154340462 147397549
2162 147397549 141161064 135664594 130434360 125439562 120742651 116413494 112513022 108667755
2154 108667755 105143431 101895386 98837943 96014723 93358945 90976886 88426054 86358036
2146 86358036 84193213 82157757 80450939 78749491 77374431 75865847 74577988 73362487
2138G3362487j078458r11865q17624o20240n06067k95635m16307k08936k97841
2129F8209514l94952l50773k63834p44325r24065r74918q87120o53602p91919
2120F2224006r32912p03190p63265r83265p89202j075024q39959p13789n27217
2111E4896183o65466q63862n32202r46424m30740k95547o67215l75262n32836
2102D9586629m93646m70424k36065k30189l37595l95523p4619j04574k15589l48779
2092D6679626j76585j60669l49306k72797K3331j50692j14172P5973K24872J45022
2082D5924603j42266J95078L0984K07273N7514J17138l0150q2424J70176O1076
2072D6509002J76855K09515J46529K88564K99104L81997K37926L03258L63899
$$ plain form
2138 73362487 72284029 71372164 70554540 69934300 69428233 69132598 68716291 68507355 68209514
2129 68209514 67814562 67463789 67199955 66455630 65531565 64556647 63669527 63015925 62224006
2120 62224006 61291094 60587904 59824639 58841374 58052172 56977148 56137189 55423400 54896183
2111 54896183 54230717 53366855 52834653 51888229 51457489 51161942 50494727 50119465 49586629
2102 49586629 49092983 48622559 48386494 48156305 47818710 47423187 47348568 47243994 47028405 46679626
2092 46679626 46503041 46342372 45993066 45720269 45743600 45592908 45478736 45554709 45779581 45924603
2082 45924603 45782337 45977415 46008399 46215672 46273186 46390324 46360174 46277750 46447926 46509002
2072 46509002 46685857 46895372 47041901 47330465 47629569 48011566 48249492 48552750 48916649
2063D8916649P76994N42702M31626P77853M76554M87955P93982P00429R28962
2054E4833706Q47579R88447J366765J117139J136135J310035J652556J690970
2046F4943332J941602J879220J965508K157339K429002K673794K547115K401941
2038H2938853K491105K525603K192590K210729K480852K066576K252062K565728
2030A01724098K602047K773265L002209L017470L389407L463689L484943L242055
2022A26699183L449265K773861K125862J894618J266121O32302l32070j060103
2014A37449039j780596k404557l443497l759658m065060m491767m866110m923109
2006A07714685m805470n356372n356230n132716m922161m461579m321968m246754
$$ plain form
2063 48916649 49693643 50236345 50667971 51445824 51922378 52410333 53204315 53904744 54833706
2054 54833706 55681285 56669732 58036497 59153636 60289771 61599806 63252362 64943332
2046 64943332 66884934 68764154 70729662 72887001 75316003 77989797 80536912 82938853
2038 82938853 85429958 87955561 90148151 92358880 94839732 96906308 99158370 101724098
2030 101724098 104326145 107099410 110101619 113119089 116508496 119972185 123457128 126699183
2022 126699183 130148448 132922309 135048171 136942789 138208910 138841212 138509142 137449039
2014 137449039 135668443 133263886 129820389 126060731 121995671 117503904 112637794 107714685
2006 107714685 102909215 97552843 92196613 87063897 82141736 77680157 73358189 69111435
1998F9111435l734585l406032l124513k582051k432151k496424k100640j951729
1990D7283310j961947j583938j483418j434537j351989j122717q76439j085184
1982C6383141j063763r80631o61564p19157q54382p34661o92125p17463p90235
1973B9169160n72426m21340o29068n39646l70915m40864l15470j18699l05235
1964B5455497m78410k23990l12855j52668j58555j370k49618j43924l0193r0784
1954B3613130j5736j87233k13491j05539j96828l30288m14460j39313l56422j17852
1944B1535968j60483l48042k56421m08266k47747q4242k33804l42682l25288l00228
1934A8828765l45085m1174k01825l23402k12275j14458r7120k24174m7421l5825
$$ plain form
1998 69111435 65376850 61970818 58846305 56264254 53832103 51335679 49235039 47283310
1990 47283310 45321363 43737425 42254007 40819470 39467481 38344764 37468325 36383141
1982 36383141 35319378 34338747 33677183 32958026 32103644 31368983 30676858 29959395 29169160
1973 29169160 28596734 28175394 27546326 27006680 26635765 26194901 25879431 25760732 25455497
1964 25455497 24977087 24753097 24440242 24287574 24129019 24127649 23878031 23734107 23703914 23613130
1954 23613130 23597394 23410161 23196670 23091131 22894303 22564015 22149555 22010242 21653820 21535968
1944 21535968 21375485 21027443 20771022 20362756 20115009 20030767 19796963 19454281 19128993 18828765
1934 18828765 18483680 18442506 18240681 17917279 17705004 17590546 17493426 17269252 17221831 17186006
1924A7186006k8142k52056j4527l28603j40963l197l81983n9299j41331m3444
1914A5792461L1580J04090m2908Q3663Q9476R1909j44761j08920R9701P5655J64729
1903A6236675N4060J27702r1974K01372R9437k7033K84491P3964N7732K92836
1893A7309262l0591L11746L32218j06940J33684L2100L19544J16546J35543K63765
1883A8816877M8320K00829K34890J19731J07828K99001j14048J11075J74447j5887
1873A9983063K85427M21599L11097J33744J29690J81419K30547M36394K63370
1864B2376350K82434M86740K29868M21347L49483J71886L74783L95156N42106
1855B5630153N25183P85974P83060N44059O28099Q66296O96008O60240Q49267
$$ plain form
1924 17186006 17157864 16905808 16891281 16562678 16421715 16418518 16036535 15977236 15835905 15792461
1914 15792461 15824041 15928131 15885223 15968886 16058362 16150271 16005510 15896590 15996291 16071946 16236675
1903 16236675 16290735 16418437 16326463 16527835 16627272 16600239 16884730 16958694 17016426 17309262
1893 17309262 17278671 17590417 17922635 17815695 17949379 17981479 18301023 18417569 18553112 18816877
1883 18816877 18865197 19066026 19300916 19420647 19528475 19827476 19713428 19824503 19998950 19983063
1873 19983063 20268490 20690089 21001186 21134930 21264620 21446039 21676586 22112980 22376350
1864 22376350 22658784 23145524 23375392 23796739 24146222 24318108 24692891 25088047 25630153
1855 25630153 26155336 26941310 27724370 28268429 28896528 29762824 30458832 31119072 31968339
1846C1968339O77150Q97732Q09423N77986N91504R46521J076342Q26076P59232
1837C9130305K96040M37540N03719M82617N28804O35725O26481Q27539P58089
1828D4226859N23710N96051P72210P40876Q73313P32698J146538J385708J423809
1819E2421772J276970J197008J618420J686214J626905J680587J798230K012967
1811F5319073J719529J955285K121408K273688K380116K589595K569039K968979
1803H3896712L117845K938429K942977K251984J565182Q17765P00248O90307J274130
1794A00195579J543079K441716K748580L044920L546463L935851M139851M597086
1786A26193125N362759O072130O442433P215824Q010209Q750956R809494J0731033
$$ plain form
1846 31968339 32645489 33543221 34352644 34930630 35522134 36468655 37544997 38371073 39130305
1837 39130305 39426345 39863885 40367604 40850221 41379025 42014750 42641231 43468770 44226859
1828 44226859 44750569 45346620 46118830 46859706 47733019 48465717 49612255 50997963 52421772
1819 52421772 53698742 54895750 56514170 58200384 59827289 61507876 63306106 65319073
1811 65319073 67038602 68993887 71115295 73388983 75769099 78358694 80927733 83896712
1803 83896712 87014557 89952986 92895963 95147947 96713129 97530894 98231142 98921449 100195579
1794 100195579 101738658 104180374 106928954 109973874 113520337 117456188 121596039 126193125
1786 126193125 131555884 137628014 144070447 151286271 159296480 168047436 177856930 188587963
1778A88587963J2315409J3231594J4604742J6113805J6596840J7103629J7809450
1771B96363432J7765482J6859723J5091008J2027644J0235576R742155J0859518
1764C88944538J2754674J4185544J3107099Q624549J184891o679319q719261m771447
1756D18631268J037351O398119R906605J0957960Q401359J526692r433039k3019272
1748D24407043l2351126l5055343l3741462k9797036k5665189k1988870j9089442
1741B26718575j6419335j4226277j2528220j1163500j0190679r110608q090873
1734A44989083p368328o520783n750670n449625n169481m721262m436109m390133
1726A01182692m489945m089812l794493l624763l464292l054908k652557k374309
$$ plain form
1778 188587963 200903372 214134966 228739708 244853513 261450353 278553982 296363432
1771 296363432 314128914 330988637 346079645 358107289 368342865 378085020 388944538
1764 388944538 401699212 415884756 428991855 437616404 438801295 432121976 423402715 418631268
1756 418631268 419668619 426066738 435973343 446931303 455332662 456859354 447426315 424407043
1748 424407043 392055917 357000574 323259112 293462076 267796887 245808017 226718575
1741 226718575 210299240 196072963 183544743 172381243 162190564 153079956 144989083
1734 144989083 137620755 131099972 125349302 119899677 114730196 110008934 105572825 101182692
1726 101182692 96692747 92602935 88808442 85183679 81719387 78664479 76011922 73637613
1718G3637613k630735k333583j849591j917647k037110j688299j733232j841945
1710E7605471j414451j277513j262645j377309j162838j244643j160170j124869
1702D7581033j191605j091094o04991p99526p41415o71198q59361p41197q99825
1693C9980821q44640r71247p85671q10087r96873q72124o78318m33942o43777
1684C2944142n69648r03112o87359n79873o92358p10304n25301o05738p13598
1675B6956851m17500n24648n50160m19296m87870n46860n02983l12326l75738
1666B2819470l69004m65862l22047m09077j26567m23373m72546k64221m55672
1657A9511101k00492l11551l77586l26919k03335n54959j69174q2669m45822k04217
$$ plain form
1718 73637613 71006878 68673295 66823704 64906057 62868947 61180648 59447416 57605471
1710 57605471 56191020 54913507 53650862 52273553 51110715 49866072 48705902 47581033
1702 47581033 46389428 45298334 44693343 43893817 43152402 42481204 41621843 40880646 39980821
1693 39980821 39136181 38164934 37379263 36569176 35572303 34700179 34021861 33587919 32944142
1684 32944142 32374494 31471382 30784023 30204150 29511792 28801488 28276187 27670449 26956851
1675 26956851 26539351 26014703 25464543 25045247 24557377 24010517 23507534 23195208 22819470
1666 22819470 22450466 21984604 21662557 21253480 21126913 20703540 20230994 19966773 19511101
1657 19511101 19310609 18999058 18621472 18294553 18091218 17536259 17367085 17284416 16838594 16634377
1647A6634377k53366j97713j92886k63773k10835j42639j44575j67880k95795
1638A4764915j16842l74490m25377R453J87670k46203l12380j60155j72575N1332
1628A3205348j03274k64785k44141m9638j48892j28298p0776k33355l50371J30
1618A1611948k15451j43513J8019N059k24919k46325K4291k70533l4764k16860
1608A0306952j32741J6670l53460J35295O8612J6034l04509p6689j27932k74416
1598I273816q3183j3770o9937k23118j90196q040o2347j75346L6338k01784k08958
1587H073475r281p6184j04503q1317n2838k00669j89880j51804j7649K75721j67131
1576G297940l0818l4076n1512J0156j09772O2752Q2410j68086j17216k17102m8006
$$ plain form
1647 16634377 16381011 16183298 15990412 15726639 15515804 15373165 15228590 15060710 14764915
1638 14764915 14648073 14273583 13848206 13857659 14045329 13799126 13486746 13326591 13154016 13205348
1628 13205348 13102074 12837289 12593148 12543510 12394618 12266320 12195544 11962189 11611818 11611948
1618 11611948 11396497 11252984 11271003 11276062 11051143 10804818 10829109 10558576 10523812 10306952
1608 10306952 10174211 10190881 9837421 9972716 10041328 10057362 9752853 9676164 9548232 9273816
1598 9273816 9190633 9176863 9106926 8883808 8693612 8685572 8623225 8447879 8484217 8282433 8073475
1587 8073475 8064194 7988010 7883507 7802190 7749352 7548683 7358803 7206999 7189350 7465071 7297940
1576 7297940 7267122 7233046 7181534 7191690 7081918 7144670 7227080 7058994 6941778 6724676 6676670
1565F676670j3111k27349p308r1092j07467O684k6410k0573j63603m4791J6425
1554E998075k0776l5786j86819j39787N3800J09433k84330j15211J49458k63311
1544E264746j6515N3867k9206N9329k9717r1134r0371Q1059p1108P070o0830L7443
1532E114633J35333J3401k37575m9214l182p2273r6394L9721j019k0453J2169
1521D835147K9178j4042j64350n0426j02982l0252J50268L5941j80960m6682k08243
1510D252597J59810O1687P0204K34500j77088k49038K4089J93265p6678k64952
1500D228396J40119P2769p3263J0608j05631J0731J24258J27375j53840k35362
1490D146160j43146J64257L1152N738j4409p67K98504k3997L8776p729j00641
$$ plain form
1565 6676670 6663559 6436210 6428902 6337810 6230343 6237027 6210617 6190044 6026441 5981650 5998075
1554 5998075 5977299 5941513 5754694 5614907 5668707 5778140 5493810 5378599 5528057 5264746
1544 5264746 5248231 5302098 5272892 5332221 5302504 5211370 5120999 5202058 5130950 5138020 5077190 5114633
1532 5114633 5249966 5263367 5025792 4976578 4973396 4901123 4804729 4844450 4843431 4822978 4835147
1521 4835147 4864325 4850283 4685933 4635507 4532525 4502273 4652541 4688482 4507522 4460840 4252597
1510 4252597 4412407 4474094 4544298 4778798 4601710 4352672 4376761 4570026 4493348 4228396
1500 4228396 4368515 4441284 4368021 4378629 4272998 4283729 4407987 4535362 4381522 4146160
1490 4146160 4003014 4167271 4198423 4204161 4189752 4188985 4487489 4463492 4502268 4494539 4393898
1479D393898j6443o310q7911J07187k8265K52J94122M0325J8855J1353k2953J35453
1467D739563j3166K41220K43276j42922R1561L21606N4250j36124J59323k19260
1457E339327j78767j73549q7410N1540R8527Q0399J56831o2819o4699j02014k02009
1446D855357j37235j82930k88460k8045j20747j97377r5435m2168p4375N5222
1436C743807N2053k07781J12849j75878l55214J14103J27079n5621l7129k7866
1426C290402O5962M3276j31135k63769N3510P0587q5371m8094k9810k9246J98113
1415C134425R323j92853M6639N5678j35579n9408N5056k40352Q280N7926j12972
1404B626163q339m8706K22532j20859n5624O7566o6920j6009O1805L2619p0538
$$ plain form
1479 4393898 4377455 4371145 4283234 4390421 4362156 4362408 4556530 4596855 4615710 4627063 4604110 4739563
1467 4739563 4726397 4967617 5210893 5067971 5159532 5481138 5535388 5399264 5558587 5339327
1457 5339327 5160560 4987011 4899601 4951141 5049668 5130067 5286898 5224079 5159380 5057366 4855357
1446 4855357 4718122 4535192 4246732 4218687 4097940 3900563 3805128 3762960 3688585 3743807
1436 3743807 3795860 3588079 3700928 3525050 3169836 3283939 3411018 3355397 3318268 3290402
1426 3290402 3356364 3399640 3268505 3004736 3058246 3128833 3043462 2995368 2965558 2936312 3134425
1415 3134425 3143748 2950895 2997534 3053212 2917633 2858225 2913281 2672929 2681209 2739135 2626163
1404 2626163 2617824 2569118 2791650 2670791 2615167 2682733 2615813 2599804 2661609 2694228 2623690
1393B623690J79809j25695J5937n0363M3344L7952m3450Q4692k35341P5475Q1383
1382B687433j35600j27636m6527j38245J60441O2770q3677N8659J50909q0497
1372B508030r0369Q1876j66955J3589p8032o3633J37096j55050j80096l7144K52906
1361B222218k6829m7840L829j46313J18756N691k49231k9880K36978p9941n0245
1350A957193m962j01772j03064j12292J77775M1088j9246J48993K6093L8911R1818
1339B140535q3385k30945J6188J22535q9247j61081J50556J77085k1185j19475
1329A901581L1542L451k7178n6135K7582j19884q8810J17622K4532J02753j24712
1318A792344j28097o571j48916K7733R5691j42867n7175J12671J10651j650j08645
$$ plain form
1393 2623690 2803499 2677804 2693741 2643378 2686722 2724674 2681224 2765916 2530575 2606050 2687433
1382 2687433 2551833 2424197 2377670 2239425 2399866 2462636 2378959 2437618 2588527 2508030
1372 2508030 2417661 2499537 2332582 2346171 2268139 2204506 2341602 2186552 2006456 1969312 2222218
1361 2222218 2195389 2147549 2151378 2005065 2123821 2129512 1880281 1850401 2087379 2007438 1957193
1350 1957193 1952231 1850459 1747395 1635103 1812878 1853966 1834720 1983713 2009806 2048717 2140535
1339 2140535 2057150 1826205 1842393 1964928 1875681 1714600 1865156 2042241 2021056 1901581
1329 1901581 1933123 1936574 1909396 1853261 1880843 1760959 1672149 1789771 1814303 1917056 1792344
1318 1792344 1664247 1657676 1508760 1536493 1632184 1489317 1432142 1544813 1655464 1653814 1545169
1307A545169o9355N8845J25449L3965j37932m9220j36424J00186K42066j34457
1297A578292o2530Q284p872J33415j2750j2328k45187K2307j9664j41003R3992
1286A334956J49657n3176R2568k7378j44824K33177P530P0930j88368M301N666
1275A485039J7430j765N7473J1876r498j14663R6761k6453n6097j95090m6165
1264A218848J53329l3610o8807l8703J72516K8814J65047l07821K0930R8014k37101
1253A171456N8618J01086J32142J71076q6158k1105J57945l5146L8106j65843
1243A522177n2171P615k16541K3123P9809k0157r7926K88601r699j74988m205
1232A345638N262r4215K45938J6647k03416p6271p5664N3231K22596k472j48318
$$ plain form
1307 1545169 1475814 1534659 1660108 1694073 1556141 1506921 1370497 1470683 1712749 1578292
1297 1578292 1515762 1524046 1516174 1649589 1636839 1624511 1379324 1401631 1381967 1240964 1334956
1286 1334956 1484613 1431437 1524005 1496627 1351803 1584980 1592510 1663440 1475072 1479373 1485039
1275 1485039 1502469 1500704 1558177 1570053 1560555 1445892 1542653 1516200 1460103 1265013 1218848
1264 1218848 1372177 1338567 1269760 1231057 1403573 1432387 1597434 1289613 1310543 1408557 1171456
1253 1171456 1230074 1331160 1463302 1634378 1548220 1527115 1685060 1649914 1688020 1522177
1243 1522177 1470006 1477621 1261080 1284203 1364012 1343855 1245929 1534530 1524831 1349843 1345638
1232 1345638 1350900 1256685 1502623 1519270 1315854 1239583 1163919 1217150 1439746 1437274 1288956
1221A288956l7073j45754J66776j7905J58075p7466k7843Q5019n4700j82529J48213
1210A303769N2442k43934j0894J79149l8785J34520P7558j56733L6267n4059j10872
1199A168428K56720o9384j58477J57856k13024J0745K84918n4204j13185j997
1189A268396m9123k0350n0889J15944J09239J9223j85514J2287m8380k48888K29731
1178A151676m9067k6229R9843L6269l4140M9890L4654j61825K16281j72267l7294
1167A107791J9913J08745P1538K9734j10125j16649J40913j75733r0449P8370
1157A064048R6425j83832J55569o9199j13552J58478P0917N7166j03922O7557
1147A199655o9438j17134Q8252O6426k3185J69339q6859p8231J55617j37183o1648
$$ plain form
1221 1288956 1251883 1106129 1272905 1255000 1413075 1335609 1307766 1392785 1338085 1155556 1303769
1210 1303769 1356211 1112277 1101383 1280532 1241747 1376267 1453825 1297092 1333359 1279300 1168428
1199 1168428 1425148 1355764 1197287 1355143 1142119 1152864 1437782 1383578 1270393 1268396
1189 1268396 1219273 1198923 1148034 1263978 1373217 1392440 1206926 1219213 1170833 921945 1151676
1178 1151676 1102609 1076380 1176223 1212492 1178352 1228242 1262896 1101071 1317352 1145085 1107791
1167 1107791 1127704 1236449 1307987 1337721 1227596 1110947 1251860 1076127 985678 1064048
1157 1064048 1160473 976641 1132210 1063011 949459 1107937 1178854 1236020 1132098 1199655
1147 1199655 1130217 1013083 1101335 1167761 1144576 1313915 1227056 1148825 1304442 1167259 1105611
1136A105611J53298N5070p5064k10129K37845J52850j16006m591j2030q6191Q3581
1125A284244R0708j46883K7690M1613q9536J69254o6139K45427J30991q3554l14790
1114A289025k73927J65382K84663M6250p7590q6837l2297L8125n9821K02327j3932
1103A481368j68689Q0293O6323L4207j40566L9415L8863k09965M6340P2982P103
1092A347674J49074K2533j20151J42536J93726k16917j08828K22570m7783J29316
1082A713750P7471n0550l0114r3459r2213R713l5976N83K39026m0398j42861j48510
1070A406462L5019k5627J33470L42709j08113J50849Q4432P019L9109j40591J17022
1059B041760n9943P6672k14885j38617J83133j30987r9468j55833J39150Q9135
$$ plain form
1136 1105611 1258909 1313979 1238915 1028786 1266631 1419481 1303475 1298884 1286854 1200663 1284244
1125 1284244 1374952 1228069 1255759 1297372 1207836 1377090 1310951 1556378 1687369 1603815 1289025
1114 1289025 1015098 1180480 1465143 1511393 1433803 1346966 1314669 1352794 1292973 1495300 1481368
1103 1481368 1312679 1392972 1459295 1493502 1352936 1392351 1431214 1221249 1267589 1340571 1347674
1092 1347674 1496748 1519281 1399130 1541666 1735392 1518475 1409647 1632217 1584434 1713750
1082 1713750 1791221 1740671 1710557 1617098 1524885 1534598 1498622 1499205 1738231 1697833 1554972 1406462
1070 1406462 1441481 1415854 1549324 1892033 1783920 1934769 2019201 2026220 2065329 1924738 2041760
1059 2041760 1981817 2058489 1843604 1704987 1888120 1757133 1657665 1501832 1640982 1730117
1049A730117R6614l4301J2618K3061m1150N0116O8236J91395l6601o4543J01347
1038B096909j92020P3242O4347Q6004J14740p6978J50455j16123j91060J57090
1028B166606j28955J31244J65111k0868r0384o4795k1009K06720n414p808K630
1017B333078P8539m0367l23544J51136K03473J31611L0850o7639K65541J70593
1007B933271R6016J12201n601J20128p9813m0676J28108K98460K82526K65880
997D110500J60602j05317J16103R2445K69631K39026K43509K32517M84298J70895
987F014209J44272K81253K00162K45428N30442N19114L78032M92237J010865P19027
977A0535041Q89910R59301P93526Q22442J115311J174920J674348K129905K736701
$$ plain form
1049 1730117 1826731 1792430 1805048 1828109 1786959 1837075 1905311 2096706 2060105 1995562 2096909
1038 2096909 1904889 1978131 2042478 2128482 2243222 2166244 2316699 2200576 2009516 2166606
1028 2166606 2037651 2168895 2334006 2313138 2222754 2157959 2136950 2343670 2338256 2330448 2333078
1017 2333078 2411617 2371250 2047706 2198842 2402315 2533926 2564776 2497137 2762678 2933271
1007 2933271 3029287 3141488 3135887 3256015 3176202 3135526 3263634 3562094 3844620 4110500
997 4110500 4271102 4165785 4281888 4374333 4643964 4882990 5126499 5359016 5843314 6014209
987 6014209 6158481 6439734 6639896 6885324 7415766 7934880 8312912 8805149 9816014 10535041
977 10535041 11424951 12384252 13177778 14000220 15115531 16290451 17964799 20094704 22831405
968B2831405L342978M882510N280784N116960O076960P803186O779943P503107
960F9617833j54305j5474809j2821837p673112n286657l776563l007009k470550
952A8952991j888498j578689r77908r67195q54609n56825m89308n45542o95206
943A0399211q11849q96645o23155m57115l71833l99617l02438k50774l08895k42901
933E733989k31510M3824k05833k41232m41412k05950q1061j54850p6349j87033
923C952583k53758k67062j65831l581N1453j53813k2437j89896r6468m9832r1151
912B710207J29324j16250m9785J49046k4427j95340r5027j14274J81285k37065
902B337694j7817n5570j02478J49326j25749p5783j91948P9383j63420p6927j50582
$$ plain form
968 22831405 26174383 31056893 36337677 41454637 47531597 55334783 62114726 69617833
960 69617833 69463528 53988719 41166882 33493770 28207113 24430550 21423541 18952991
952 18952991 17064493 15485804 14507896 13540701 12686092 12129267 11639959 11094417 10399211
943 10399211 9587362 8690717 8067562 7610447 7238614 6838997 6536559 6285785 5976890 5733989
933 5733989 5502479 5546303 5340470 5099238 4657826 4451876 4370815 4215965 4139616 3952583
923 3952583 3698825 3431763 3265932 3262351 3313804 3159991 3137554 2947658 2851190 2801358 2710207
912 2710207 2839531 2723281 2673496 2822542 2798115 2602775 2507748 2393474 2574759 2337694
902 2337694 2319877 2264307 2161829 2311155 2185406 2109623 1917675 1997058 1833638 1756711 1606129
891A606129K14808j1258j56759j15296R9258k0478j14653O2354P3145n0276j103
880A585871m375R5942m6746J45412j6614n6654j45005j26776k5733k0498K20N7265
868A442309k27696m6821R046K8690q0134o2754k9009k2144R9126K05226K0853
857A336692j03678n414J7099p1553o7407j46217j45778o0120M9460Q6843J10719
846A000646k98213K45397N619j03031R4064j09938J4497P3872P0112J04038K7205
835A124268j8164j44147l07443k2771N0469n3526Q1807J89620J19949J00147r8374
824A021835k33626L6872P6264k26271k805j49501J19685K94255j43547n1680K32963
813I74444j1219j87659o8490J06762M2646Q8756j54740l8734J1189j4753J3155
$$ plain form
891 1606129 1820937 1809679 1652920 1537624 1636882 1616404 1501751 1564105 1637250 1586974 1585871
880 1585871 1581496 1677438 1630692 1776104 1759490 1702836 1557831 1431055 1405322 1384824 1385044 1442309
868 1442309 1214613 1167792 1176838 1205528 1125394 1062640 1033631 1011487 1110613 1315839 1336692
857 1336692 1233014 1227600 1244699 1173146 1105739 959522 813744 753624 803084 889927 1000646
846 1000646 702433 947830 953449 850418 944482 834544 849041 922913 993025 1097063 1124268
835 1124268 1106104 961957 654514 631743 682212 628686 710493 900113 1020062 1120209 1021835
824 1021835 788209 825081 901345 675074 672269 522768 642453 936708 793161 741481 974444
813 974444 963225 775566 707076 813838 856484 945240 790500 751766 762955 748202 761357
802G61357n4693j44138K3167J0685j73109m6379N9773P6466J3653J07121p7973
791E55930r2827K8456M4930l1484J92720K57776k36674j67829o884N3060j35444
780D61730J00620M7398j27040p811K0l4642J24313j18889n7718K9033J67752J05676
768F90442j58511J9295j11492P5575J83522n5951J9050j18416j48827q4640P3856
757C83903j3848R5750M8781L5822R1802N8197K4469k38283j62384k1908P7179
746C79480L0449q3070O6429j70443L5794Q4069J90463m999l11258j5535J20072
735C21451J43763M0261j9235k9347l4052J66721L7178n051k4470o9196N711o2648
723D71086J64594l8231k93156J6408m889r3494O4100p6873J12901K30778r4186
$$ plain form
802 761357 706664 562526 585693 596378 423269 376890 436663 513129 526782 633903 555930
791 555930 463103 491559 536489 505005 697725 955501 718827 550998 544114 597174 461730
780 461730 562350 609748 482708 474897 474917 440275 564588 445699 387981 417014 584766 690442
768 690442 531931 551226 439734 515309 698831 642880 661930 543514 394687 310047 383903
757 383903 370055 465805 514586 550408 642210 700407 724876 486593 324209 302301 379480
746 379480 409929 326859 393288 222845 258639 342708 533171 528172 216914 201379 321451
735 321451 465214 505475 486240 456893 422841 589562 626740 621689 597219 528023 533734 471086
723 471086 635680 597449 304293 320701 315812 222318 286418 209545 322446 553224 459038
712D59038O4632k13424j58496l6743K81630L8215o7966J102K0536J21396k5784
701D84136n1011k22751q846L1652j56515M8681K98102j46898n550N8957Q168l3776
689C04349J995j24016K00038k6439o6368q0204J74861K8750o068n1903K4088J56082
677E35165J60138M1255l10197J52747J89782k95354k69354L1636J87833Q3279
667E06930N6391k43437j68129J48398j89298Q3028J09301J30757J25485j7051
657E42375J30495k72031l4574j42293q2131L6362R736q1034M6212J04914l3132
646B24899K7951o2601j29156L2174J88657k776m6703P310M191k4696K35902J43415
634E98567k01929o0521O2929r2512n0232j21049Q3655r471j17909q1246R4993
$$ plain form
712 459038 523670 310246 151750 115007 396637 434852 366886 367988 388524 509920 484136
701 484136 433125 210374 201528 233180 76665 125346 423448 276550 271000 329957 338125 304349
689 304349 306344 182328 382366 355927 289559 209355 384216 412966 406898 354995 379083 535165
677 535165 695303 736558 426361 579108 768890 473536 204182 235818 423651 506930
667 506930 563321 319884 151755 300153 110855 193883 303184 433941 559426 542375
657 542375 672870 400839 366265 223972 141841 178203 187939 106905 153117 258031 224899
646 224899 252850 190249 61093 93267 281924 279148 232445 239755 243946 219250 455152 598567
634 598567 396638 336117 399046 306534 256302 135253 218908 209437 91528 10282 105275
623A05275J90977n9347n9335j02821M3583J0577l5144J9987O3490R3269K3482
612B93993j37854J15424P4689r1966M6238l4514k89811J05519Q11j14840K29479
601A97168R4427j71066o2393J86165j24016l3050k1510K46356j72434n6438J43375
590B26584L2841q3462j32833M8235l4448Q3979J21468o496n9578n3966N1428L7100
578B30852n0485O247j57551k4606k19544p763K05356K9543K38377o6839J18383
567C01970j69514o964r3005L09176j50220j77655K67345j5919k37623k49417K07297
556a4529K0147m1869J65142N3687k19018Q760M1842K8865l9357R0804k9034p4738
544i298O3450k8080O6862j3393j91933n9722J47884k5631j60436K72794j48283
$$ plain form
623 105275 296252 236905 177570 74749 118332 128909 93765 113752 177242 270511 293993
612 293993 156139 271563 346252 254286 300524 266010 -23801 81718 82529 -32311 197168
601 197168 291595 120529 58136 244301 120285 87235 65725 312081 139647 83209 226584
590 226584 259425 175963 43130 91365 56917 140896 262364 255868 196290 142324 193752 230852
578 230852 180367 186614 29063 4457 -215087 -222850 -17494 12049 250426 183587 301970
567 301970 132456 125492 32487 341663 191443 13788 281133 265214 27591 -221826 -14529
556 -14529 5618 -36251 128891 182578 -36440 -27680 14162 43027 3670 94474 65440 -9298
544 -9298 54152 26072 92934 79541 -112392 -172114 -24230 -49861 -210297 62497 -85786
533h5786q4270Q7561P1335L857q3202O7401o377J81983j96456Q3031K21336n6473
521B03940r7749k5684j13350j58828N3023j99372J8640R0894J89599n45j76129
510b15561J45671J50375n1532K41168k01090p7395l8444J62881m7154j23329K56002
499B01592L4906J03100j85587P1761N1136K77n6769m3452p431j85273q2734k1818
487a20292K3656p4344r538O9043J14013J06993j3096n3056P4757j37000l11781
476c30645J80155J6395m3027M9961J13957K1792K26493J13397j85667r8503n6436
465G872p3029O1837J79375j57430j9988r808j1919P582J11515k15669p819L6374
453i1107r1006k6320R9767o7066j25052J00007j73836J94877J00898o8550p639
$$ plain form
533 -85786 -170056 -82495 -11160 -7303 -90505 -23104 -29481 152502 -43954 39077 260413 203940
521 203940 106191 80507 -32843 -191671 -138648 -338020 -319380 -228486 -38887 -39432 -215561
510 -215561 -69890 80485 28953 270121 69031 -8364 -46808 116073 68919 -54410 201592
499 201592 236498 339598 154011 225772 276908 277185 220416 176964 169533 -15740 -98474 -120292
487 -120292 -96636 -170980 -180518 -111475 2538 109531 96435 43379 118136 -18864 -330645
476 -330645 -150490 -134095 -177122 -127161 -13204 8588 235081 348478 162811 64308 7872
465 7872 -65157 -3320 176055 18625 -1363 -11171 -23090 -15508 96007 -119662 -127481 -91107
453 -91107 -182113 -208433 -108666 -175732 -300784 -200777 -374613 -179736 -78838 -147388 -155027
442a55027K23655O2030k60202q9000l4563J57468O6486M1122j18163j65729K54595
431a7328j77997j10390j7013K61940N4046p5805J9224j37085p0723N5841J23938
420i1352J12337J47894j76934r5888m6261l7026J01487P3106o7570k3994J23976
409A9775j9940n0665P6701J4398p2143l2014L2355P1897j60248k1959M2408P2607
397b6828o8844K0420r5440j90774j39582J24161L66797r5904j39959J8412q3459
386c11000Q980j1950L9684K74141k7263k8123l9504j0853j20745j06512K09288
375a23857n1560Q542K46507p9563j16962j4651l8280M0095J96736j85459n6150
364a74602j6716j46356K6158K62776J746J21069m1933j61210J080J45778O459
$$ plain form
442 -155027 68628 130658 -129544 -218544 -253107 -95639 -29153 11969 -106194 -271923 -17328
431 -17328 -195325 -305715 -322728 -60788 -6742 -82547 -63323 -200408 -271131 -215290 -91352
420 -91352 20985 168879 -8055 -103943 -150204 -187230 -85743 -12637 -80207 -104201 19775
409 19775 -165 -50830 25871 40269 -31874 -63888 -31533 40364 -119884 -141843 -99435 -26828
397 -26828 -95672 -75252 -170692 -361466 -501048 -376887 -10090 -105994 -245953 -227541 -311000
386 -311000 -302020 -313970 -274286 -145 -27408 -55531 -95035 -105888 -226633 -333145 -123857
375 -123857 -175417 -166875 79632 69 -116893 -131544 -169824 -129729 67007 -118452 -174602
364 -174602 -191318 -337674 -311516 -48740 -46994 74075 32142 -129068 -127988 17790 24249
353B4249k39224n3460J45931P6954M9223M6029j72811K0331O9992m0047r5184
342a68017R4518J7018j42709J04709L3305j41169q6177J31388L6812j53534l6790
331c10646J30324j8680q4960J25569j52996J28938N6524j33233L3618J37598J47478
320E9534Q0540K90870m50186n2016J24785j19233k23265j00658K20718L4665O0089
309g4157j16353K6992K0894p157O106L96457q8999j18555m0849r8948K890O4573
297b7106J17870j64704l1643P2211R6092j99162K6168J1606j33207J10252l8510
286a60133j15290q5055K0707K20883K8453j5042r792j28409J50826j30036k2856
275b45744k4512Q3174M2984k1117q8104k65595K41451N6373J04466N2796l3652
$$ plain form
353 24249 -214975 -268435 -122504 -45550 3673 49702 -123109 -102778 -32786 -72833 -168017
342 -168017 -73499 -56481 -199190 -94481 -61176 -202345 -288522 -157134 -120322 -273856 -310646
331 -310646 -180322 -199002 -283962 -158393 -311389 -182451 -125927 -259160 -225542 -87944 59534
320 59534 140074 430944 -19242 -71258 53527 -65706 -288971 -389629 -168911 -134246 -74157
309 -74157 -190510 -163518 -142624 -149781 -143675 252782 163783 45228 4379 -94569 -91679 -27106
297 -27106 90764 -73940 -105583 -33372 62720 -136442 -110274 -98668 -231875 -121623 -160133
286 -160133 -275423 -360478 -339771 -118888 -90435 -105477 -115269 -243678 -92852 -222888 -245744
275 -245744 -270256 -187082 -144098 -165215 -253319 -518914 -277463 -221090 -116624 -63828 -97480
264i7480N1455j60000Q6119k15751J25522M0294n0546J50475k69069Q150K12925
253a17906J10056L5148j5632L1010k0502m7871o8521j97149J92545L3348j02011
242a67485p3762m446K034o6758L1391j4375J33709J109J33033j85992K8503J81648
230a391k6549l4252k0193Q9453J0655l9585N3433n3024k29916J6275P6307k07727
218c66514M4800m3528r3345J4199O9226R6437K31323K3961J03057m2887p5381
207c8652j71129m4407J32429j88117K3141k12358J1955J13185L27277j58671J29229
196g6118L6800J5695M5803j2724j68428q226J33517N0118q5889L8069j38480Q712
184a61151N2660n6711K27230j29927M2339q266j39204J239m1326k4418n8074J15436
$$ plain form
264 -97480 -46025 -206025 -119906 -335657 -210135 -169841 -220387 -69912 -338981 -330831 -117906
253 -117906 -7850 27298 11666 42676 22174 -25697 -94218 -291367 -98822 -65474 -167485
242 -167485 -241247 -245693 -243659 -310417 -279026 -293401 -159692 -158583 -25550 -211542 -183039 -1391
230 -1391 -27940 -62192 -82385 7068 17723 -21862 31571 -21453 -251369 -235094 -158787 -366514
218 -366514 -321714 -365242 -458587 -444388 -375162 -278725 -47402 -23441 79616 36729 -38652
207 -38652 -209781 -254188 -121759 -309876 -286735 -499093 -487138 -373953 -46676 -205347 -76118
196 -76118 -39318 -23623 22180 9456 -158972 -167198 -33681 16437 -69452 -31383 -169863 -161151
184 -161151 -108491 -165202 62028 -67899 -25560 -33826 -173030 -171791 -213117 -237535 -295609 -180173
172a80173Q0089j4155k4471j10790M8435o8783J31114j50903M5290M914j50070
161c89503P8815N8892J29310R125j41072n2472j20078K34183R0436j92438J30507
150a64295R748p30k28049K9109P9003Q3485R1443n050K2733k03868J39723k45649
138c92397J21199K12054k53610m2465O7889J60954j07553Q4716J11338k7745k0869
127h6489j51683r3369P6448R0593j1771J09912L8697j11532R5712N3276j9353
116i559q7730j9919J15798k5799j00216j51766M1344K05292j84535j38557P8515
105b77132N1010K0377K7045k1381j9821J90949p2694Q8439o9932j0931J19507
94B5436j16006M971p199K4985o5608J6507r912P4689M2923j64845j7919K0704
$$ plain form
172 -180173 -100084 -114239 -138710 -249500 -201065 -269848 -138734 -289637 -244347 -239433 -389503
161 -389503 -310688 -251796 -122486 -113361 -254433 -306905 -426983 -192800 -102364 -294802 -164295
150 -164295 -154547 -155277 -383326 -354217 -275214 -191729 -100286 -105336 -82603 -286471 -146748 -392397
138 -392397 -271198 -59144 -312754 -355219 -287330 -126376 -233929 -149213 -37875 -65620 -86489
127 -86489 -238172 -331541 -255093 -164500 -176271 -66359 -27662 -139194 -43482 9794 -9559
116 -9559 -97289 -117208 -1410 -27209 -127425 -279191 -237847 -32555 -217090 -355647 -277132
105 -277132 -226122 -205745 -178700 -200081 -219902 -28953 -101647 -13208 -83140 -94071 25436
94 25436 -90570 -85599 -92798 -67813 -133421 -116914 -126826 -52137 -9214 -174059 -191978 -171274
82a71274K7244o7335q5200Q1416q3900J8680m6989N7117J13985n0115M0266n3115
70b19220n3389r565J15796J55295n6469j16731j10577J18146j81J3182k8987o9454
58b62154o5636j26248N4339K82762k5754n9586N0313o774M823j30875j7171O3863
46b38098k2817k00985K90146p4034L7544M4296m1933N9268j27095O3403J15979
35i4326j25607p5642P0377m3468O4934q6423l7439Q5297n6463M2880K01196j22766
23a77450j25806J40550J0005N039K26j2685k6209k4J15744k9160k2577l8365l4233
10a94945m919j04064O3165R4809m9709j47839j5388J91929O8183N4635
0d4143
$$ plain form
82 -171274 -144030 -211365 -296565 -215149 -299049 -280369 -327358 -270241 -156256 -206371 -166105 -219220
70 -219220 -272609 -282174 -166378 -11083 -67552 -184283 -294860 -176714 -176895 -163713 -192700 -262154
58 -262154 -327790 -454038 -399699 -116937 -142691 -202277 -151964 -158738 -153915 -284790 -301961 -238098
46 -238098 -260915 -461900 -171754 -245788 -208244 -163948 -205881 -146613 -273708 -210305 -94326
35 -94326 -219933 -295575 -225198 -268666 -203732 -290155 -327594 -242297 -298760 -255880 -54684 -177450
23 -177450 -303256 -162706 -152701 -147662 -147436 -160121 -186330 -186354 -70610 -99770 -122347 -160712 -194945
10 -194945 -199864 -303928 -240763 -145954 -195663 -343502 -358890 -166961 -98778 -44143
0 -44143
$$ Imaginary data points
##PAGE= N=2
##DATA TABLE= (X++(I..I)), XYDATA
16383g452081J29053q858O1133n4327J08203N2180J8620J02993J61643R5469l8770
16372f824742R8975J11780J23640P0167O4033J81771P9969m001j2917J79782J78973
16361e752570n5479L2223K9981J14323J97158L01508j98186P340K04512K3275
16351e095915p93R3005J01733J19872N5577K52779L7468J62277l7774K6968n2001
16340d336804O6605K38584Q7296K7950L0409J28962m0822O2485J11997K47559
16330c375779m0111o2276j3411R6514J27491N8194J16158J98472j7818k7292O4519
16319b875339J50013J89468j58000Q2096P026J56574K12967O3095N3660j03508
16309b221948k2163K11992O8177K38279L2871p0992J46118J02106L430j8408J60321
$$ plain form
16383 -7452081 -7323028 -7331886 -7270753 -7325080 -7216877 -7164697 -7146077 -7043084 -6881441 -6785972 -6824742
16372 -6824742 -6725767 -6613987 -6490347 -6420180 -6356147 -6174376 -6094407 -6098408 -6111325 -5931543 -5752570
16361 -5752570 -5808049 -5775826 -5745845 -5631522 -5434364 -5132856 -5331042 -5323702 -5119190 -5095915
16351 -5095915 -5096708 -5003703 -4901970 -4782098 -4726521 -4473742 -4436274 -4273997 -4311771 -4284803 -4336804
16340 -4336804 -4270199 -4031615 -3944319 -3916369 -3885960 -3756998 -3797820 -3735335 -3623338 -3375779
16330 -3375779 -3415890 -3478166 -3491577 -3395063 -3267572 -3209378 -3093220 -2894748 -2912566 -2939858 -2875339
16319 -2875339 -2725326 -2535858 -2693858 -2611762 -2604736 -2448162 -2235195 -2172100 -2118440 -2221948
16309 -2221948 -2244111 -2032119 -1963942 -1725663 -1692792 -1763784 -1617666 -1515560 -1512130 -1530538 -1370217
16298a370217P5692J63122q020P7667o5835K6859j9713J72440J92261k70314K05968
16287h20090R5856n2488P6069K6448O0730J20629J24985J22182J30945k9982J377
16276a43339q5044O6930J35144P0798J0860q048r1580R0843P8617J49005R4758
16265C68944J14205l2364L425r3127R4280K06766r5311j13567p550J77655J34685
16254G58041K29055K6367o424Q3587p3584J01698J12928R5289k5474j5382J60751
16243A446852J95565m9766p1347P4683J64716N0557o2254j2958M6230R5216o0798
16232A816696k19941J97928J46257J97373n3095l9668J22550K3637M8450j65170
16222B075017k2749K72194j80686l3335J93495r1481K1267L0614J8584n5780K19153
$$ plain form
16298 -1370217 -1294525 -1131403 -1139423 -1061756 -1127591 -1100732 -1120445 -948005 -755744 -1026058 -820090
16287 -820090 -724234 -776722 -700653 -674205 -613475 -492846 -367861 -245679 -114734 -144716 -143339
16276 -143339 -228383 -161453 -26309 44489 55349 47301 -44279 46564 125181 274186 368944
16265 368944 483149 450785 454210 361083 455363 662129 566818 453251 445701 623356 758041
16254 758041 987096 1013463 1007039 1090626 1017042 1118740 1231668 1326957 1301483 1286101 1446852
16243 1446852 1642417 1592651 1521304 1595987 1760703 1811260 1749006 1736048 1782278 1877494 1816696
16232 1816696 1596755 1794683 1940940 2138313 2085218 2045550 2168100 2191737 2240187 2075017
16222 2075017 2052268 2324462 2143776 2110441 2303936 2212455 2233722 2264336 2282920 2227140 2446293
16211B446293o6773P5025k3303K7752R6894L20503M5992j64333J44269L5103l5087
16200B902335O766Q9211J0808J5645J9623o4192R5672m0111L7705L9395o9213
16189C043644Q1042l7520P3880P2214p4054K07377L0447J29424J44616q9088j23873
16178C458109j35790r3968J4527O3616M8093P4465q5636R2552J37609R1107Q4050
16167C748734j25175m6119k03956p5931L8799J06139K03807K6424R397Q3047m7460
16156C717706j01786r5192J08947L7264o081J28727m667m3521l4351j3955O6330
16145C759421K60324q0462j0566l1948l0817J268J6144m8123L5095K82488O275
16134D159099k41702m5454Q8930J23293o0643M4802L8882p8662j64691N9187N5798
$$ plain form
16211 2446293 2379520 2454545 2431242 2458994 2555888 2876391 2922383 2758050 2902319 2937422 2902335
16200 2902335 2909101 2998312 3009120 3024765 3044388 2980196 3075868 3035757 3073462 3112857 3043644
16189 3043644 3124686 3087166 3161046 3233260 3159206 3366583 3397030 3526454 3671070 3581982 3458109
16178 3458109 3322319 3228351 3242878 3306494 3354587 3429052 3343416 3435968 3573577 3664684 3748734
16167 3748734 3623559 3577440 3373484 3297553 3336352 3442491 3646298 3672722 3682119 3765166 3717706
16156 3717706 3615920 3520728 3629675 3666939 3660858 3789585 3784918 3741397 3707046 3693091 3759421
16145 3759421 4019745 3939283 3928717 3896769 3865952 3867220 3883364 3835241 3870336 4152824 4159099
16134 4159099 3917397 3871943 3960873 4084166 4023523 4068325 4107207 4028545 3863854 3923041 3978839
16123C978839J80704N7343p5102J84j4052J10254j59575Q8009j05434j35290O9539
16112C995419R2170o0590R538k4767J04413J58296j72132k6901P8258L8529J46008
16101D338241N2699o950l4403q0643k1744J35746J15465j63930j40289j60268
16091D033924J5406K94440m5928N2718p0643j8684m0321j33058J93235J05344
16081D386433O8151k6128j6124j16386j5312L0853N0027N5240n9505J41420p453
16070D491216J70993k45264r5333K4863l81810J37275K04997J21073O9825k10754
16060D287081m9005O0291J72873l116j88813R8429q6500m3762J48676m5869l308
16049D346977J438o087P1968J36899o9541l3162j405j2728j81816P3163K82656
$$ plain form
16123 3978839 4159543 4216886 4141784 4141968 4127916 4238170 4078595 4166604 4061170 3925880 3995419
16112 3995419 4087589 4026999 4036537 4011770 4116183 4274479 4102347 4075446 4153704 4192233 4338241
16101 4338241 4390940 4383990 4349587 4268944 4247200 4382946 4498411 4334481 4194192 4033924
16091 4033924 4049330 4343770 4297842 4350560 4279917 4261233 4220912 4087854 4281089 4386433
16081 4386433 4454584 4428456 4412332 4295946 4280634 4311487 4361514 4416754 4357249 4498669 4491216
16070 4491216 4662209 4416945 4321612 4346475 3964665 4101940 4306937 4428010 4497835 4287081
16060 4287081 4238076 4298367 4471240 4468124 4279311 4377740 4291240 4247478 4396154 4350285 4346977
16049 4346977 4348415 4342328 4414296 4551195 4481654 4448492 4447087 4434359 4252543 4325706 4608362
16038D608362O1844p1128k28475L1898J92866j09839o1755N1619j25729R8863
16028D448526j9326J7192J933q1081J10745J22976k75306J5060K1495J01388o4411
16017D399191K3832k13950M5930K1804K31761K4696J17886j46998j796r1122M9946
16006D461180r526k53762J88713J14019Q7390j31597j8220q2573Q691K9817K18675
15995D612807j22889p7545J01080O3051j73744k30457K12044K26817o7495M5575
15985D589244o6573j20170M0833o0989j57853K23464P6416p1240j01422J30771
15975D482481M1082j7575J7801l6225J83377m6796q894Q3937j58899j58278J05817
15964D487828K1559j84292J25456P2909M6195n3260Q0697p7K3646j38859k10356
$$ plain form
16038 4608362 4670206 4599078 4370603 4402501 4595367 4485528 4423773 4475392 4349663 4448526
16028 4448526 4429200 4446392 4448325 4367244 4477989 4600965 4325659 4340719 4362214 4463602 4399191
16017 4399191 4423023 4209073 4255003 4276807 4508568 4533264 4651150 4504152 4502356 4411234 4461180
16006 4461180 4451654 4197892 4386605 4500624 4588014 4456417 4438197 4355624 4364315 4394132 4612807
15995 4612807 4489918 4412373 4513453 4576504 4402760 4172303 4384347 4611164 4543669 4589244
15985 4589244 4522671 4402501 4443334 4382345 4224492 4447956 4524372 4453132 4351710 4482481
15975 4482481 4523563 4505988 4523789 4487564 4670941 4624145 4615251 4699188 4540289 4382011 4487828
15964 4487828 4509387 4325095 4450551 4523460 4569655 4516395 4597092 4597015 4620661 4481802 4271446
15953D271446J22326j31320J1403L19368r0751j99793M3007M5752J1739P0286
15943D473463M6877l3305J33446K2411j02920j16568m0136J9444l3474K52728
15933D621966o0168N9714q3100p9082j07181J17649J92177k32985r1154K66348
15923D604184j2380o1661j27408j26199k9028K005k2503Q1783J98277J9044M0651
15912D566765P6172r0873r0583K60838k6733j19299l2679M9481K8474j46990P4911
15901D549484o9428N1133J30419j98380N4651J32919J67206o479j4291j31124
15891D666110k2453k8136l6214j41794J33625q1379K1350M3872l7647j0705n8354
15880D448275J40969j17434M5648K4730r9868L3998l1067L7605N5479K17617j06597
$$ plain form
15953 4271446 4393772 4262452 4273855 4593223 4502472 4302679 4345686 4391438 4403177 4473463
15943 4473463 4520340 4487035 4620481 4642892 4539972 4423404 4383268 4402712 4369238 4621966
15933 4621966 4561798 4621512 4538412 4459330 4352149 4469798 4661975 4428990 4337836 4604184
15923 4604184 4591804 4530143 4402735 4276536 4247508 4249513 4227010 4308793 4507070 4526114 4566765
15912 4566765 4642937 4552064 4461481 4722319 4695586 4576287 4543608 4593089 4621563 4474573 4549484
15901 4549484 4480056 4531189 4661608 4463228 4517879 4650798 4818004 4811525 4797234 4666110
15891 4666110 4643657 4615521 4579307 4437513 4571138 4489759 4511109 4554981 4517334 4506629 4448275
15880 4448275 4589244 4471810 4517458 4542188 4442320 4476318 4445251 4482856 4538335 4755952 4649355
15869D649355j83697L6046j0403j25644J40872J22652m1677n6865j02330k4815
15859D403494p0880J9859L1741P5113P7061n7642r6757J64985J28003j76259Q3914
15848D582632l737k53960m151O5470P6643R6970K11K485n6163o6295j11184R7735
15836D426656L32789j45053j17392L7372j04618K57890J95245j85007k49983J33057
15826D580956j9939j77445J15018J9454K784o311q4008N5183Q79l4792q8814P8601
15814D441566j5122j38225K20894L8244j10402Q5798J61937j35470j07216M8033
15804D490037N2542k8704q2005o7523J47824L804r2573J2624J31070K934o0549
15793D509481p5888J01459R0649P8045l11117j40593J52976M1284R272K19225
$$ plain form
15869 4649355 4465658 4501704 4491301 4365657 4506529 4629181 4587504 4530639 4428309 4403494
15859 4403494 4332614 4352473 4384214 4459327 4536388 4478746 4381989 4546974 4674977 4498718 4582632
15848 4582632 4578895 4324935 4320784 4386254 4462897 4559867 4560078 4562563 4506400 4440105 4328921 4426656
15836 4426656 4759445 4614392 4497000 4534372 4429754 4687644 4882889 4697882 4447899 4580956
15826 4580956 4561017 4383572 4498590 4518044 4520828 4514517 4430509 4485692 4486571 4451779 4362965 4441566
15814 4441566 4426444 4288219 4509113 4547357 4436955 4522753 4684690 4549220 4442004 4490037
15804 4490037 4542579 4513875 4431870 4364347 4512171 4515975 4423402 4436026 4567096 4570030 4509481
15793 4509481 4433593 4535052 4625701 4703746 4392629 4252036 4405012 4446296 4455568 4674793
15783D674793J1300j56814r0254P1272p1175R5512p163j07502k546P5438K0734
15772D513595l4417R7366J88679j56347j85465M9072j10303R990K5540J47271
15762D544981j77042m4572K67410Q9241l81405O6744J24733j2259k5170j27401
15752D325260k23513K85600j2676K1215K63744L5125p3110Q8977j51652k08086
15742D350884O4070j3879K9021J40014J17210m4382n0201j02419M9816j63334
15732D376800J64488k5201j88820R6328n3950m9742O5930M0431J15050K3077m6284
15721D518107O9932J9085R408j46071K1461n6643Q7536M0745K8286J17911p6813
15710D632944l2533j14676K26748n9811j76071J80659L0630j0201M2408O7074
$$ plain form
15783 4674793 4686093 4529279 4439025 4510297 4439122 4534634 4527471 4419969 4417423 4492861 4513595
15772 4513595 4479178 4576544 4765223 4608876 4423411 4472483 4362180 4372170 4397710 4544981
15762 4544981 4367939 4323367 4590777 4680018 4298613 4365357 4490090 4477831 4452661 4325260
15752 4325260 4101747 4387347 4374671 4395886 4659630 4694755 4621645 4710622 4558970 4350884
15742 4350884 4414954 4401075 4430096 4570110 4687320 4642938 4592737 4490318 4540134 4376800
15732 4376800 4541288 4516087 4327267 4423595 4369645 4319903 4385833 4426264 4541314 4564391 4518107
15721 4518107 4588039 4607124 4616532 4470461 4491922 4435279 4522815 4563560 4591846 4709757 4632944
15710 4632944 4600411 4485735 4712483 4652672 4476601 4657260 4687890 4677689 4720097 4787171
15700D787171j93624R3472j30000l0088O7706l3585q1482N1391M4777r2862J78224
15689D661100Q644j05418m0357Q6198K58769m8154k13923j65Q8956J55786k76475
15678D574961M6148K7364j09640J96936q6817j75117J0948N0022M4915J04692
15668D684412n9440J0006j03136m9365J47380m3424j00230O4078K8859O6486q962
15657D636664Q7451J52177j92793J10866k09830L3992j00047Q2996m1209q1450
15647D478817O8468J02134M4500j40739J33561M0387N5945o1991K712p3437j78012
15636D472345O576O908J82368k2238M2864j39702J61634l7895j76930K746J63325
15625D662001J19887O5340l91206j52543J75558K7577J95979r8781j22530m4123
$$ plain form
15700 4787171 4593547 4687019 4557019 4526931 4594637 4561052 4479570 4530961 4575738 4482876 4661100
15689 4661100 4669744 4564326 4523969 4610167 4868936 4820782 4606859 4606694 4695650 4851436 4574961
15678 4574961 4621109 4648473 4538833 4735769 4648952 4473835 4484783 4534805 4579720 4684412
15668 4684412 4624972 4634978 4531842 4482477 4629857 4586433 4486203 4550281 4579140 4645626 4636664
15657 4636664 4724115 4876292 4683499 4794365 4584535 4618527 4518480 4601476 4560267 4478817
15647 4478817 4547285 4649419 4693919 4553180 4686741 4727128 4783073 4721082 4723794 4650357 4472345
15636 4472345 4478921 4485829 4668197 4645959 4688823 4549121 4710755 4672860 4495930 4498676 4662001
15625 4662001 4781888 4847228 4456022 4303479 4479037 4506614 4702593 4603812 4481282 4437159
15615D437159J52515l8529J23036m6636j42067K839J79053k6496o0624M5015j80563
15604D444702n2004J38459K6093J37909p6362j47759k6028K76649k2730l1100
15594D667829j20667J0163J1150j73898o5811J52137l0664L0403Q5695o1369o0102
15583D444866j8644J25723k6086K6531k6433j39402R3020j9383P5452J85375p4095
15572D646924N5408M0049j2971J09733k08092p9294q3371J310k5095j07805K42066
15561D578862P128j9334n618K8025l3849J63718O6436j71221j12237Q8505L5217
15550D625632j62086J29564n6117J46190J19521j00715j80168J57189n7034J6127
15540D638103M5265J14442l4971k37591K51377L7760n2230j29679O7199r6914
$$ plain form
15615 4437159 4589674 4551145 4674181 4627545 4485478 4488317 4667370 4640874 4580250 4625265 4444702
15604 4444702 4392698 4531157 4557250 4695159 4618797 4471038 4445010 4721659 4698929 4667829
15594 4667829 4547162 4557325 4568475 4394577 4328766 4480903 4450239 4480642 4566337 4504968 4444866
15583 4444866 4426222 4551945 4525859 4552390 4525957 4386555 4479575 4460192 4535644 4721019 4646924
15572 4646924 4702332 4742381 4729410 4839143 4631051 4551757 4468386 4469696 4444601 4336796 4578862
15561 4578862 4585990 4566656 4561038 4589063 4555214 4718932 4785368 4614147 4501910 4590415 4625632
15550 4625632 4463546 4593110 4536993 4683183 4802704 4701989 4521821 4679010 4621976 4638103
15540 4638103 4683368 4797810 4762839 4525248 4776625 4814385 4762155 4632476 4699675 4602761
15530D602761K00053q5159M0087N9230k24251p2234K2755J40755M5174k26817
15520D502354Q6983m3905L1669K14489O776J0200k8277L3582j49093r8440L6181
15509D602519j95911n5312K79100j39919Q9697L15749j46445k17895j08868j94362
15499D228353J84167J15037K2896k1391M7743j87634P4950K26970j78847J19408
15489D631652l0442O5443j20092K44214j37162j70695K47177N2365q0105R2409
15479D794764K165p7637J31195l223k32083j28839M7381J35359n2772K6030J24514
15468D766854m2470L2313k6531l6033r4604r6010N4386J62033j45065J6640P5387
15457D666900p94L9785n2812m1588l4322P345J03429k8559m1506J87048l9996
$$ plain form
15530 4602761 4802814 4717655 4757742 4816972 4592721 4520487 4543242 4683997 4729171 4502354
15520 4502354 4589337 4545432 4577101 4791590 4798366 4808566 4780289 4813871 4664778 4566338 4602519
15509 4602519 4406608 4351296 4630396 4490477 4580174 4895923 4749478 4531583 4422715 4228353
15499 4228353 4412520 4527557 4550453 4529062 4576805 4389171 4464121 4691091 4512244 4631652
15489 4631652 4601210 4666653 4546561 4790775 4653613 4482918 4730095 4782460 4702355 4794764
15479 4794764 4796929 4719292 4850487 4847264 4615181 4486342 4533723 4669082 4616310 4642340 4766854
15468 4766854 4724384 4756697 4730166 4694133 4599529 4503519 4557905 4719938 4574873 4591513 4666900
15457 4666900 4666106 4705891 4653079 4611491 4577169 4584514 4687943 4659384 4617878 4804926 4764930
15446D764930m0729n0616M6540r5781m4968J94066j35433Q6788J33740j13963
15436D744574l7610k0515j19707J58129K19907O5131j04731q9600J13130j849
15426D926859k61407R2607r9843Q6658N2014l9751N039L875j48119L7339M309
15415D659580o8043K01143r5197K1762L4567j84465n7531K63206j32303j06845
15405D535874J46131J21654M7984o9086m6828l0469K1777m2896q9624N0725K6853
15394D672095L5506m3613p26O4394m6642J09846J9624j42202K2609N8540J77171
15383D926602j6011j54092o1590j47569K08027j16693k63557J21692K12078J78796
15373D887683m0747q4884J5179m8398j5761Q9230P7778l3519o2108K03448k95267
$$ plain form
15446 4764930 4724201 4673585 4720125 4624344 4579376 4773442 4638009 4724797 4858537 4744574
15436 4744574 4706964 4686449 4566742 4724871 4944778 5009909 4905178 4815578 4928708 4926859
15426 4926859 4665452 4758059 4658216 4744874 4796888 4757137 4762176 4766051 4617932 4655271 4659580
15415 4659580 4591537 4792680 4697483 4719245 4753812 4569347 4511816 4775022 4642719 4535874
15405 4535874 4682005 4803659 4851643 4782557 4735729 4705260 4727037 4684141 4594517 4645242 4672095
15394 4672095 4707601 4663988 4663262 4727656 4681014 4790860 4810484 4668282 4690891 4749431 4926602
15383 4926602 4910591 4756499 4694909 4547340 4755367 4638674 4375117 4496809 4708887 4887683
15373 4887683 4846936 4762052 4777231 4728833 4713072 4802302 4880080 4846561 4784453 4987901 4692634
15362D692634j78179J3256K41033J24574j20426m9290j45711K39863J75944j14902
15352D878796k45902M7171k00863J08810Q9028j86670K12935p016J23998k26315
15342D593972N1177m0770j75239K09133M5046J5389R4438J21754j25811J10697
15332D899786J19472j37750k4271m944j31577J25467O2052j89124K7343J07459
15322D853913j62716J34238J56615k14606K0106J20427j56255K649Q1211k62885
15312D572697n5345M2105M9572O7429r1237N8084n1786J05036J76106k70013K1848
15301D624496M7500j03979j6641K75859N0680K6381R7279k48756j41097K015J49244
15290D762981P6448j27668q7302m1410p6860K08866M4892k725r1270K8927j73462
$$ plain form
15362 4692634 4514455 4527711 4768744 4893318 4772892 4723602 4577891 4817754 4993698 4878796
15352 4878796 4632894 4680065 4479202 4588012 4677040 4490370 4703305 4696289 4820287 4593972
15342 4593972 4645149 4604379 4429140 4638273 4683319 4698708 4793146 4914900 4789089 4899786
15332 4899786 5019258 4881508 4857237 4852293 4720716 4846183 4908235 4719111 4746454 4853913
15322 4853913 4691197 4825435 4982050 4767444 4787550 4907977 4751722 4754371 4835582 4572697
15312 4572697 4517352 4559457 4609029 4676458 4585221 4643305 4591519 4696555 4872661 4602648 4624496
15301 4624496 4671996 4568017 4551376 4827235 4877915 4904296 5001575 4752819 4611722 4613737 4762981
15290 4762981 4839429 4711761 4624459 4583049 4506189 4715055 4759947 4757222 4665952 4694879 4521417
15279D521417P4175J60071O9613k5095N7066L536o6485J26061N560K0588K3082
15268D969589j52857q2281L9182j15819P8647J0859j17060J5633J15544k9553
15258D731884J03040p6086J38062L4179j02996j06577p4486J24735J19120j02700
15248D788175O2249J00368J04002k14174j67280N0315R3K8426q8974J11998L4938
15237D810136r4026O9972Q3201j66815l6756m567j18474l5890J24070n5785Q3580
15226D658646K11442Q2247J47225k59016k58886Q7847L8350n2200j21732p816
15216D526107J00318J36046M5223o2637K5615J22829j42568n7325J63088L1859
15206D888555l8176J73859n8942q5609o5520K554K09972j02867j747k9345j04129
$$ plain form
15279 4521417 4595592 4755663 4825276 4800181 4857247 4860783 4794298 4920359 4925919 4946507 4969589
15268 4969589 4816732 4734451 4773633 4657814 4736461 4747320 4630260 4645893 4761437 4731884
15258 4731884 4834924 4758838 4896900 4931079 4828083 4721506 4647020 4771755 4890875 4788175
15248 4788175 4850424 4950792 5054794 4840620 4673340 4723655 4723748 4752174 4663200 4775198 4810136
15237 4810136 4716110 4786082 4869283 4702468 4665712 4661145 4542671 4506781 4630851 4575066 4658646
15226 4658646 4870088 4952335 5099560 4840544 4581658 4669505 4707855 4655655 4533923 4526107
15216 4526107 4626425 4762471 4807694 4745057 4770672 4893501 4750933 4693608 4856696 4888555
15206 4888555 4850379 5024238 4965296 4879687 4814167 4816721 5026693 4923826 4922079 4892734 4788605
15195D788605n0670j21437O7522R3663q4967Q9305K06477k03728M8177J1191j55059
15184D689079m8253l5799K0287r0487J49402J75597O2038p9554n5973J55412j13537
15173D828212o9793J42143j15851J52726j2588k33858j22096J05684l0214j1610
15163D632755J34718J88929m1754j3367j82751M381J87271M5786m3010Q1951k15693
15152D779216l8652K42207k48855j23285M2075Q4272O6897K0513j75277M3975
15142D693086n4553J20260q6742J80105L8820q2692q1035J37148n6838J88132
15132D995691l2880n809K6207n9412K5525l5467R1091J80642j01014l42048k6366
$$ plain form
15195 4788605 4737935 4616498 4684020 4777683 4692716 4782021 4988498 4784770 4832947 4844138 4689079
15184 4689079 4640826 4605027 4625314 4534827 4684229 4859826 4921864 4842310 4786337 4941749 4828212
15173 4828212 4758419 4900562 4784711 4937437 4924849 4690991 4568895 4674579 4644365 4632755
15163 4632755 4767473 4956402 4914648 4901281 4718530 4722911 4910182 4955968 4912958 4994909 4779216
15152 4779216 4740564 4982771 4733916 4610631 4652706 4736978 4803875 4824388 4649111 4693086
15142 4693086 4638533 4758793 4672051 4852156 4890976 4808284 4727249 4864397 4807559 4995691
15132 4995691 4962811 4957002 4983209 4923797 4949322 4913855 5004946 5185588 5084574 4742526 4716160
$$ [...]
##END NTUPLES=NMR SPECTRUM
##END=
