##TITLE=1H_CG-1146-x3
 CDCl3, 8 sc, 
 29.04.2021
##JCAMPDX= 6.0         $$ Bruker NMR JCAMP-DX V2.0
##DATA TYPE= NMR SPECTRUM
##DATA CLASS= NTUPLES
##ORIGIN= UXNMR, Bruker Analytische Messtechnik GmbH
##OWNER= root
$$ XWIN-NMR		Version 3.5
$$ Thu Apr 29 14:53:00 2021 Russian Standard Time (UT+4h)  she@DPX200
##.OBSERVE FREQUENCY= 200.131506
##.OBSERVE NUCLEUS= ^1H
##.ACQUISITION MODE= SIMULTANEOUS
##.ACQUISITION SCHEME= undefined
##.AVERAGES= 8
##.DIGITISER RES= 18
##SPECTROMETER/DATA SYSTEM= spect
##.PULSE SEQUENCE= zg30
##.SOLVENT NAME= CDCl3
##.SHIFT REFERENCE= (INTERNAL, CDCl3, 0, 15.9906)
##AUDIT TRAIL= $$ (NUMBER, WHEN, WHO, WHERE, WHAT)
$$ ##TITLE= Audit trail, XWIN-NMR		Version 3.5
$$ ##JCAMPDX= 5.01
$$ ##ORIGIN= Bruker BioSpin GmbH
$$ ##OWNER= she
$$ F:/spectra/data/she/nmr/H-F/1/pdata/1/auditp.txt
$$ ##AUDIT TRAIL=  $$ (NUMBER, WHEN, WHO, WHERE, WHAT)
(   1,<2021-04-29 14:51:47.42 +0400>,<she>,<DPX200>,
      <created by zg, POWCHK disabled, PULCHK disabled
       configuration hash MD5:
       00 E9 B6 7A A2 85 ED C7 34 08 36 98 17 FE 4E 26
       data hash MD5: 16K
       78 83 A6 56 87 BE C5 82 94 DA 40 8E 42 0F E2 E7>)
(   2,<2021-04-29 14:52:00.75 +0400>,<she>,<DPX200>,
      <Start of raw data processing
       efp BC_mod = 2 LB = 0.24 FT_mod = 6 PKNL = 1 PHC0 = -11125.6 PHC1 = 14.60102 SI = 16K 
       data hash MD5: 16K
       35 42 B5 07 C8 D0 EF 50 B7 83 05 76 D1 71 FC A0>)
(   3,<2021-04-29 14:52:20.81 +0400>,<she>,<DPX200>,
      <pk PHC0 = 5.787077 PHC1 = -4.4 
       data hash MD5: 16K
       A6 7B 52 D0 06 65 5C F3 6C 19 F7 F9 28 41 51 61>)
(   4,<2021-04-29 14:52:24.04 +0400>,<she>,<DPX200>,
      <abs ABSG = 5 
       data hash MD5: 16K
       52 76 33 94 93 6A DB 11 14 48 E9 44 B9 32 EF B5>)
$$ ##END=
$$ 
$$ hash MD5
$$ 40 F8 B5 34 F9 5F 78 3A 25 2C 33 85 06 DB FC 25
##$RELAX= 
##$RELAX= 
##$RELAX= 
##$RELAX= 
##$RELAX= 
##$RELAX= 
$$ Bruker specific parameters
$$ --------------------------
##$DU= <F:/spectra>
##$EXPNO= 1
##$NAME= <H-F>
##$PROCNO= 1
##$TYPE= <nmr>
##$USER= <she>
##$AMP= (0..31)
100 100 100 100 100 100 100 100 100 100 100 100 100 100 100 100 100 100 
100 100 100 100 100 100 100 100 100 100 100 100 100 100 
##$AQSEQ= 0
##$AQ_mod= 1
##$AUNM= <au_zg>
##$AUTOPOS= <>
##$BF1= 200.13
##$BF2= 200.13
##$BF3= 200.13
##$BF4= 200.13
##$BF5= 200.13
##$BF6= 200.13
##$BF7= 200.13
##$BF8= 200.13
##$BYTORDA= 1
##$CFDGTYP= 0
##$CFRGTYP= 5
##$CHEMSTR= <none>
##$CNST= (0..31)
1 1 145 1 1 1 1 1 1 1 1 1 1 1 1 1 1 1 1 1 1 1 1 1 1 1 1 1 1 1 1 1 
##$CPDPRG= <>
##$CPDPRG1= <>
##$CPDPRG2= <>
##$CPDPRG3= <>
##$CPDPRG4= <mlev>
##$CPDPRG5= <mlev>
##$CPDPRG6= <mlev>
##$CPDPRG7= <mlev>
##$CPDPRG8= <mlev>
##$CPDPRGB= <>
##$CPDPRGT= <>
##$D= (0..31)
0 1.2 0 0 0 0 0 0 0 0.06 0 0.03 0 0 0 0 0.0002 0 0 0 0 0 0 0 0 0 0 0 0 
0 0 0 
##$DATE= 1619693506
##$DBL= (0..7)
120 120 120 120 120 120 120 120 
##$DBP= (0..7)
150 150 150 150 150 150 150 150 
##$DBP07= 0
##$DBPNAM0= <>
##$DBPNAM1= <>
##$DBPNAM2= <>
##$DBPNAM3= <>
##$DBPNAM4= <>
$$ [...]
##$SUBNAM3= <"">
##$SUBNAM4= <"">
##$SUBNAM5= <"">
##$SUBNAM6= <"">
##$SUBNAM7= <"">
##$SUBNAM8= <"">
##$SUBNAM9= <"">
##$SW= 16.9725357007746
##$SWIBOX= (0..15)
0 0 2 0 0 0 0 0 0 0 0 0 0 0 0 0 
##$SW_h= 3396.73913043478
##$TD= 16384
##$TD0= 1
##$TE= 0
##$TE2= 300
##$TE3= 300
##$TEG= 300
##$TL= (0..7)
0 120 120 120 120 120 120 120 
##$TP= (0..7)
150 150 150 150 150 150 150 150 
##$TP07= 0
##$TPNAME0= <>
##$TPNAME1= <>
##$TPNAME2= <>
##$TPNAME3= <>
##$TPNAME4= <>
##$TPNAME5= <>
##$TPNAME6= <>
##$TPNAME7= <>
##$TPOAL= (0..7)
0.5 0.5 0.5 0.5 0.5 0.5 0.5 0.5 
##$TPOFFS= (0..7)
0 0 0 0 0 0 0 0 
##$TUNHIN= 0
##$TUNHOUT= 0
##$TUNXOUT= 0
##$USERA1= <user>
##$USERA2= <user>
##$USERA3= <user>
##$USERA4= <user>
##$USERA5= <user>
##$V9= 5
##$VALIST= <valist>
##$VCLIST= <CCCCCCCCCCCCCCC>
##$VD= 0
##$VDLIST= <DDDDDDDDDDDDDDD>
##$VPLIST= <PPPPPPPPPPPPPPP>
##$VTLIST= <TTTTTTTTTTTTTTT>
##$WBST= 1024
##$WBSW= 4
##$XGAIN= (0..3)
0 0 0 0 
##$XL= 0
##$YL= 0
##$YMAX_a= 89681
##$YMIN_a= -107902
##$ZGOPTNS= <>
##$ZL1= 120
##$ZL2= 120
##$ZL3= 120
##$ZL4= 120
##$ABSF1= 16.00407
##$ABSF2= -0.9685936
##$ABSG= 5
##$ABSL= 3
##$ALPHA= 0
##$AQORDER= 0
##$ASSFAC= 0
##$ASSFACI= 0
##$ASSFACX= 0
##$ASSWID= 0
##$AUNMP= <proc_1d>
##$AZFE= 0.1
##$AZFW= 0.1
##$BCFW= 0
##$BC_mod= 2
##$BYTORDP= 0
##$COROFFS= 0
##$CY= -3
##$DATMOD= 1
##$DC= 0
##$DFILT= <>
##$DTYPP= 0
##$F1P= 0
##$F2P= 0
##$FCOR= 1
##$FTSIZE= 16384
##$FT_mod= 6
##$GAMMA= 0
##$GB= 0
##$INTBC= 1
##$INTSCL= 1.334414e-10
##$ISEN= 128
##$LB= 0.24
##$LEV0= 0
##$LPBIN= 0
##$MAXI= 10000
##$MC2= 0
##$MEAN= 0
##$ME_mod= 0
##$MI= 1.114404
##$NCOEF= 0
##$NC_proc= -9
##$NLEV= 6
##$NOISF1= 3.799351
##$NOISF2= 2.8
##$NSP= 0
##$NTH_PI= 0
##$NZP= 0
##$OFFSET= 15.9906
##$PC= 1
##$PHC0= -11119.81
##$PHC1= 10.20102
##$PH_mod= 1
##$PKNL= yes
##$PPARMOD= 0
##$PSCAL= 0
##$PSIGN= 0
##$REVERSE= no
##$SF= 200.13000417039
##$SI= 16384
##$SIGF1= 3
##$SIGF2= 2
##$SINO= 5.538805
##$SIOLD= 16384
##$SREGLST= <1H.CDCl3>
##$SSB= 0
##$STSI= 16384
##$STSR= 0
##$SW_p= 3396.73913043479
##$SYMM= 0
##$S_DEV= 0
##$TDeff= 16384
##$TDoff= 0
##$TI= <>
##$TILT= no
##$TM1= 0
##$TM2= 0
##$TOPLEV= 0
##$USERP1= <user>
##$USERP2= <user>
##$USERP3= <user>
##$USERP4= <user>
##$USERP5= <user>
##$WDW= 1
##$XDIM= 16384
##$YMAX_p= 408397463
##$YMIN_p= -2502076
$$ End of Bruker specific parameters
$$ ---------------------------------
##NTUPLES= NMR SPECTRUM
##VAR_NAME=  FREQUENCY,     SPECTRUM/REAL,   SPECTRUM/IMAG
##SYMBOL=    X,             R,               I
##VAR_TYPE=  INDEPENDENT,   DEPENDENT,       DEPENDENT
##VAR_FORM=  AFFN,          ASDF,            ASDF
##VAR_DIM=   16384,         16384,           16384
##UNITS=     HZ,            ARBITRARY UNITS, ARBITRARY UNITS
##FACTOR=    0.207333158178282, 1,           1
##FIRST=     3200.19877109187, 0,            0
##LAST=      -196.540359342922, 0,           0
##MIN=       -196.540359342922, -2502076,    0
##MAX=       3200.19877109187, 408397463,    0
$$ Real data points
##PAGE= N=1
##DATA TABLE= (X++(R..R)), XYDATA
$$ [...]
4450A9419339K23585q93482M54786L78905j2608K76349J76424J80571N56146N02507
4440B1262522n50252K11039l6644n0782m10123J99516k20737M27581p48329R7458
4430B0181249M72435Q9069j14950k84699j11710N45172K52451n29146o019O8042
4420B0561894M64090J50133Q49098q67241J63020l50622m72794K39187M90512
4411B1227277j50077j37282O1055M40908k87641M48292K03959R3285n63849j05213
4401B1230714j31390k94936K85704N07876k03541r264J57245j56120L22980j77093
4391B1532175n74170n25208J15474J55583Q23372K69471l68658p10415J30594
4382B0848218J63717O66884n86753q25411Q74465R0893K11140m87687K34120K28876
$$ y = [19419339, 19642924, 18749442, 19204228, 19583133, 19570525, 19846874, 20023298, 20203869, 20760015, 21262522, 20712270, 20923309, 20886665, 20835883, 20425760, 20625276, 20404539, 20832120, 20083791, 20181249, 20653684, 20742753, 20627803, 20343104, 20231394, 20776566, 21029017, 20499871, 20493852, 20561894, 21025984, 21176117, 22025215, 21157974, 21320994, 20970372, 20497578, 20736765, 21227277, 21077200, 20939918, 21000973, 21441881, 21154240, 21602532, 21806491, 21899776, 21335927, 21230714, 21099324, 20804388, 21090092, 21597968, 21394427, 21385163, 21542408, 21386288, 21709268, 21532175, 20958005, 20432797, 20548271, 20703854, 21527226, 21796697, 21428039, 20717624, 20848218, 21011935, 21678819, 21092066, 20266655, 21141120, 21232013, 21443153, 20955466, 21189586, 21418462]
4372B1418462J06610K7363n55561R702Q70272L17016j262253K33893m2494O8236
4362B1191246j05152K76378N69621L63676L12183r42820l08275P69974m5393o3185
4352B2018253m78013K21434Q20767L18624n78682j139508O12070Q97848M07279
4343B3100072l20l48868j28096l01490L38980j196394j74826J030881j13909J20184
4333B2326214o91112J09654M47295L62460L9407k0784K18617n30724k69715M06094
4323B2397406J96135O2252J11921K55712k3088K07865L47714l28139l92202R17667
4313B3753243O81449K02886n94955M5534J032438R8535j74226M9926o15907N53435
4303B5032358n2183O4121K9225P1119R50736l37230J39940J94081j63650L79030
$$ y = [21418462, 21525072, 21552435, 20996874, 21006576, 21876848, 22193864, 20931611, 21165504, 21123010, 21191246, 21086094, 21362472, 21932093, 22295769, 22607952, 21665132, 21356857, 22126831, 22081438, 22018253, 21540240, 21761674, 22582441, 22901065, 22322383, 21182875, 21794945, 22692793, 23100072, 23099752, 22750884, 22622788, 22321298, 22660278, 21463884, 21289058, 22319939, 22206030, 22326214, 21635102, 21744756, 22192051, 22554511, 22593918, 22573134, 22791751, 22261027, 21991312, 22397406, 22593541, 22655793, 22767714, 23023426, 23000338, 23208203, 23555917, 23227778, 22835576, 23753243, 24434692, 24637578, 24042623, 24088157, 25120595, 25219130, 25044904, 25094830, 24478923, 25032358, 24980175, 25044296, 25073521, 25144640, 26095376, 25758146, 25898086, 26092167, 25928517, 26307547]
4293B6307547L93071k29837o795j32859N8000Q3361M22031N2491k38272M93110
4283B7201848M6291N74516M56219k67195k09109J38653K66511R9300j42875L59097
4273B8523256O2331j65353O94699N82458q5565n57139m31662q455J069009m16356
4263B9267223P18816J080366O3985l04437o74859N56720O10714j06176k67096
4254C0945256P91265M78719M14823K81320M70624J4381p5979J03697K5441N52974
4244C4002521Q28141J10506k75219N35818n48304P7137n0461o20207L30700P61332
4234C5151964L50544J137168q01245J73680L35154O6926J24650p4167J107049
4225C7571723O00556K17393J64836j66046j14797l17042J3323L65105j37640l85433
$$ y = [26307547, 26700618, 26470781, 26463986, 26331127, 26389127, 26472488, 26894519, 26947010, 26708738, 27201848, 27248139, 27822655, 28278874, 28011679, 27802570, 27941223, 28207734, 28307034, 28164159, 28523256, 28585587, 28420234, 29114933, 29697391, 29611826, 29054687, 28623025, 28614570, 29683579, 29267223, 29986039, 31066405, 31130390, 30825953, 30151094, 30707814, 31318528, 31212352, 30945256, 31736521, 32215240, 32630063, 32911383, 33382007, 33396388, 33320409, 33424106, 33449547, 34002521, 34830662, 34941168, 34665949, 35201767, 34653463, 34730600, 34680139, 34059932, 34390632, 35151964, 35502508, 36639676, 35838431, 36012111, 36347265, 36414191, 36538841, 36464674, 37571723, 38172279, 38389672, 38554508, 38388462, 38273665, 37956623, 37969946, 38335051, 38197411, 37811978]
4215C7811978O50846M00945l81421k02619k93388J06173r3464K97179N4228j53827
4205C8196630m25848K5759L88460m501J66375r9456q8817Q83483J20248k7140
4195C9135193k12363j50311K02938K37589n1347O50946l22442p3048J26629M7523
4185C9591307P51573L05264K70147j84536l21285n5750q83557N3482K90068K30225
4175D0046938K42964J59511M34566l98409K85757K52851J7726J0967K32625P01267
4165D1986763N61022J3990n33230J65223k82447J57270K12815j47518m60270J86953
4155D1860571p7700M74117L6649j99796J34653J01527q7221k8950K86882j088867
4145D1411865K66452P5018J79053q0047R46380L57327o74765o8916R6150R4096
$$ y = [37811978, 38462824, 38863769, 38482348, 38279729, 37986341, 38092514, 37999050, 38296229, 38350457, 38196630, 37770782, 37796541, 38185001, 38180500, 38346875, 38247419, 38158602, 39042085, 39162333, 39135193, 38922830, 38772519, 38975457, 39213046, 39161699, 39812645, 39490203, 39417155, 39543784, 39591307, 40342880, 40648144, 40918291, 40733755, 40412470, 40356720, 39473163, 39526645, 39816713, 40046938, 40289902, 40449413, 40883979, 40485570, 40771327, 41024178, 41041904, 41052871, 41285496, 41986763, 42547785, 42561775, 42028545, 42193768, 41911321, 42068591, 42281406, 42133888, 41673618, 41860571, 41782871, 42256988, 42293637, 42093841, 42228494, 42330021, 42242800, 42213850, 42500732, 41411865, 41678317, 41753335, 41932388, 41852341, 42798721, 43156048, 42481283, 42412367, 42508517, 42602613]
4135D2602613O76668p31222L9966K79653K18717o76020k91479K05826m11745O96547
4125D2609524r1803l16433L08259j35315O26601M80062r45514j60581Q29174l57380
4115D2846594p75224O4072J45795k29873l57701N77624M61892N28807p14251m11685
4105D2136050n59780P5351L55613k7677j070738k33556J515927p12046K73865
4096D1753009L05168k24059o02181j107362M52449l41228K21972k92277j96447
4087C9969044q9345l8989J28338O90578r6155l68121p75613j77460N04615q38612
4077C8908280j439O00343L95352n0805l95282p61385K4191p4790l20239J623n34752
4066C7791097k35545J42326r3409o7692l35610j52203M4894q48184M01459P53137
$$ y = [42602613, 43279281, 42548059, 42588025, 42867678, 43086395, 42410375, 42118896, 42324722, 41912977, 42609524, 42517721, 42201288, 42509547, 42374232, 43000833, 43480895, 42535381, 42374800, 43203974, 42846594, 42071370, 42135442, 42281237, 42051364, 41693663, 42271287, 42733179, 43261986, 42547735, 42136050, 41576270, 41651621, 42007234, 41979557, 40908819, 40675263, 42191190, 41479144, 41753009, 42058177, 41834118, 41231937, 40124575, 40577024, 40235796, 40457768, 40165491, 39969044, 39879699, 39840710, 39969048, 40659626, 40563471, 40195350, 39419737, 39242277, 39746892, 38908280, 38906841, 39507184, 39902536, 39851731, 39456449, 38695064, 38719255, 38644465, 38324226, 38325849, 37791097, 37555552, 37697878, 37604469, 37536777, 37201167, 37048964, 37093858, 36245674, 36647133, 37400270]
4056C7400270J21045l71788l03331j79490L82432J24341l40271K96065n86887
4047C6542386o52898K06219M35638o66160k9236Q64958N77274p64847l47475J79862
4037C6345721j73522l46571j208364j97745K42301M58149j6648j43229K83876
4028C5243968J68313j44030n85587k84128P7134J028457j092390m02015J81503
4019C4191225K25753N805O77476q2925m78135l60606J23939K4658k08939J49051
4009C4267302k77176p515O18893J534431k27101l29905p19354q7666L13075q70567
3999C4214417L69666N45742K39273j25248k30408j23630k69673O312o37544O8289
3989C4057196J16627P23520J44730k14757L83826M19684J16710J85267K50040
$$ y = [37400270, 37521315, 37149527, 36846196, 36666706, 37049138, 37173479, 36833208, 37129273, 36542386, 35889488, 36095707, 36531345, 35865185, 35835949, 36700907, 37278181, 36513334, 36165859, 36345721, 36172199, 35825628, 34617264, 34419519, 34661820, 35119969, 35103321, 34960092, 35243968, 35412281, 35268251, 34682664, 34398536, 34475670, 35504127, 34411737, 34009722, 34191225, 34416978, 34422783, 35100259, 35017334, 34539199, 34178593, 34302532, 34327190, 34118251, 34267302, 33990126, 33982611, 34601504, 36135935, 35908834, 35578929, 34859575, 34771909, 35084984, 34214417, 34584083, 35129825, 35369098, 35243850, 35013442, 34889812, 34620139, 34626451, 33988907, 34057196, 34173823, 34897343, 35042073, 34827316, 35211142, 35630826, 35747536, 35932803, 36182843]
3980C6182843j22300j06237k02402j84980K33430O30486K58066J87557l74461
3971C6502002m05472J11575k18161j04729K46720L06191J62284r3771O35478N91970
3961C7734087o70440j20786K49722k42229J77942p9482m93030K80084O96584L82081
3951C7914533l58182P80445P34204n89409j40006J17157J33556l38959N24370
3942C8777709Q01659r77694k38426P34727m22231L13610O87322k9734j75436M0540
3932C9512046K5799J75054k50877P5127m37948M73979P04155Q7031L04303O56776
3922D1325445r1318O81137P95173M3977o62290Q6645R60642j73567j8623P4837
3912D3022058N31573J25192M1257L09886J93765L64860n8873N2367O18527K58772
$$ y = [36182843, 36060543, 35954306, 35751904, 35566924, 35800354, 36430840, 36688906, 36876463, 36502002, 36096530, 36208105, 35989944, 35885215, 36131935, 36438126, 36600410, 36506639, 37142117, 37734087, 37063647, 36942861, 37192583, 36950354, 37128296, 37048814, 36555784, 36835868, 37532452, 37914533, 37556351, 38336796, 39071000, 38481591, 38341585, 38458742, 38592298, 38253339, 38777709, 39579368, 38601674, 38363248, 39097975, 38675744, 38989354, 39676676, 39646942, 39471506, 39512046, 39537845, 39712899, 39462022, 39537149, 39099201, 39573180, 40277335, 40364366, 40668669, 41325445, 41234127, 41915264, 42710437, 42754414, 42092124, 42178769, 43139411, 42965844, 42947221, 43022058, 43553631, 43678823, 43720080, 44029966, 44223731, 44588591, 44529718, 44582085, 45200612, 45459384]
3902D5459384M72684M35275P41198k23923Q65509K24018k80677Q66272J253133
3893D9812873M36486j71939k56670N51404N26671J0038O38841J487592Q40004
3884E3875300j68742O16036O11899O15120O31540P40263P26495R1823j12243N11306
3874E8138797L24709M17452Q34271O55461M72505k26981J041923K22252k96332
3865F1584057M31409Q46401R82525K56443l64496Q10017j12864J40904j50489
3856F4423907p10293O00768M83169O879j13435m16280j3602P05208n60348j312
3846F4404661M99056j182r0876L0713L1605j220650l78350O03815L12062O78733
3836F4869587R2200n74716n88Q4517q7020p1019K94708Q78760j67988j7915l09181
$$ y = [45459384, 45932068, 46367343, 47108541, 46884618, 47750127, 47974145, 47693468, 48559740, 49812873, 50249359, 50077420, 49820750, 50372154, 50898825, 50908863, 51547704, 53035296, 53875300, 53706558, 54322594, 54934493, 55549613, 56181153, 56921416, 57647911, 57739734, 57627491, 58138797, 58463506, 58880958, 59715229, 60370690, 60843195, 60616214, 61658137, 61880389, 61584057, 62015466, 62861867, 63844392, 64100835, 63736339, 64546356, 64433492, 64574396, 64423907, 63713614, 64314382, 64797551, 64804430, 64690995, 64274715, 64261113, 64966321, 64405973, 64404661, 64903717, 64902535, 64811659, 64842372, 64873977, 63653327, 63274977, 63878792, 64190854, 64869587, 64961787, 64387071, 64386483, 64471000, 64383980, 64312961, 64607669, 65486429, 65318441, 65300526, 64991345]
3825F4991345k99232L14406N94165j11438j16337J62170N33226L26394K79214
3816F6673913q06008o2006L22010r4088O85271O39684r7011Q54621P2740L44610
3806F8533736k87611p16994L74517K08612P48767N33033k29557k53249K33519
3797F9144773P93587K29531k55182q82433j95533J026541M97398R71431n27744
3788G0802369j366011j89114O8401n30333K47929O60701l30752p30563K56134
3779F8888761n12752k86862M4635k41339j026075p73116Q26387J45159k81298
3770F6783500q80275n43582k62674o5314n98139m77356J06778q18876j400122
3761F1843940k75488L2938n92617m32831k91536m35470j360492o30066o7095o33589
$$ y = [64991345, 64692113, 65006519, 65600684, 65489246, 65372909, 65535079, 66068305, 66394699, 66673913, 65867905, 65805899, 66127909, 66033821, 66719092, 67358776, 67261765, 68116386, 68189126, 68533736, 68246125, 67529131, 67903648, 68112260, 68861027, 69394060, 69164503, 68911254, 69144773, 69938360, 70167891, 69912709, 69030276, 68834743, 69861284, 70358682, 71330113, 70802369, 69436358, 69247244, 69315645, 68785312, 69033241, 69693942, 69363190, 68632627, 68888761, 68376009, 68089147, 68133782, 67892443, 66866368, 66093252, 66919639, 67064798, 66783500, 65903225, 65359643, 65096969, 65031655, 64433516, 63956160, 64062938, 63244062, 61843940, 61568452, 61601390, 61008773, 60575942, 60284406, 59848936, 58488444, 57858378, 57791283, 57157694]
3751E7157694p47847P20395J41079k19768J18908j141288p83191o46629j111405
3742E3487948r57911J62951j54423J7711J31012j027346k96824k52192j006177
3733E0104749P70909L83292q64118n98403q74680l5752J14628j0227k26351o04473
3723D8159574K2389L10420l70120p14319l14927m04811j08213n66317m05929r2481
3713D5515266Q83085j17755n70914k01268N5966l44718j414235k18185o00987
3704D2986255O28245N20750n30541M29475K8424j84823J7537o57076J91944k12261
3694D3217929j36510j08889l06430q85239l55201P2168n36185N47049K9379n22015
3684D1016056K73053L38206n48755o53472L17708l56408l91395K55824p2987O32171
$$ y = [57157694, 56409847, 57130242, 57271321, 57051553, 57170461, 56029173, 55245982, 54599353, 53487948, 52530037, 52692988, 52538565, 52556276, 52687288, 51659942, 51363118, 51110926, 50104749, 50875658, 51258950, 50394832, 49796429, 48921749, 48885997, 49000625, 48990398, 48764047, 48159574, 48181963, 48492383, 48122263, 47407944, 47093017, 46688206, 46579993, 46013676, 45607747, 45515266, 46398351, 46280596, 45709682, 45508414, 45564380, 45219662, 43805427, 43587242, 42986255, 43614500, 44135250, 43604709, 44034184, 44062608, 43877785, 43895322, 43238246, 43430190, 43217929, 43081419, 42972530, 42666100, 41780861, 41425660, 41497828, 40961643, 41508692, 41538071, 41016056, 41289109, 41627315, 41078560, 40425088, 40742796, 40386388, 39994993, 40250817, 40177830, 40810001]
3674D0810001o88760m84185R0465N66763J81906o84335m90755J70551O43957l87692
3664C9727916l18174j14128M23061l60011K3254q69293J21760O4411N89983m88535
3654C8800244p43973k91671q77534J58598N9768L35380L49214n96632L18751k82467
3644C7229678l07964j92994j0801k04027k14213N43175l82146m09927J86024p10376
3634C5526429L38537L69435k39759Q35577p80722j028998J63413L28336l02169
3625C5210079K27424l6449R6350L80428J5214q13850J29080m0673q23314q70582
3615C3473707l33513J61638l7672r6018n6828p28809l65311J08370R5066q20634
3605C1399996P95458m82223j89552k86264L02264L25044m94658N43408m60004
$$ y = [40810001, 40121241, 39637056, 39727521, 40294284, 40476190, 39791855, 39301100, 39471651, 40115608, 39727916, 39409742, 39295614, 39718675, 39358664, 39381918, 38512625, 38634385, 38698796, 39288779, 38800244, 38056271, 37764600, 36887066, 37045664, 37105432, 37440812, 37790026, 37193394, 37512145, 37229678, 36921714, 36728720, 36717919, 36513892, 36299679, 36842854, 36460708, 36050781, 36236805, 35526429, 35864966, 36234401, 35994642, 36830219, 36049497, 35020499, 35183912, 35512248, 35210079, 35437503, 35401054, 35497404, 35877832, 35893046, 35079196, 35208276, 35167603, 34344289, 33473707, 33140194, 33301832, 33264160, 33168142, 33111314, 32382505, 32017194, 32125564, 32220630, 31399996, 32195454, 31713231, 31523679, 31237415, 31539679, 31864723, 31370065, 31913473, 31453469]
3596C1453469q23721n91241K70410N4935n88904l97709O8653K04582N68254j60858
3586C0057870p47078n26889l47667k61938J66379l03891m63127L36168k3460m99628
3576B7386739k47217K28978J23720K09969m37330n50326m07913Q2756p07636q22847
3566B4858893M346L52055O6247n55197l1211n0570L11926k3026j010822j090672
3556B2831969J63685M61692Q7805L55231L97605o34399l19667l53247n02989j3862
3546B2473823k10693l795j03620J59150n20195J02525N44069L49708k2850l90145
3536B2377977o44817p49234J58520j76926L24646O4587m57541m84041j65680M3591
3526B0291082o87477O84745k51178p53647L79852J12567m4776o14690p21283J07514
$$ y = [31453469, 30629748, 30038507, 30308917, 30363852, 29774948, 29377239, 29445892, 29650474, 30218728, 30057870, 29310792, 28783903, 28436236, 28174298, 28340677, 28036786, 27573659, 27909827, 27886367, 27386739, 27139522, 27368500, 27492220, 27702189, 27264859, 26714533, 26306620, 26389376, 25681740, 24858893, 24863239, 25215294, 25281541, 24726344, 24695133, 24644563, 24956489, 24933463, 23922641, 22831969, 22995654, 23457346, 23545151, 23900382, 24297987, 23663588, 23343921, 22990674, 22487685, 22473823, 22263130, 22259335, 22155715, 22314865, 21794670, 21897195, 22441264, 22790972, 22768122, 22377977, 21733160, 20983926, 21142446, 20965520, 21290166, 21354753, 20897212, 20413171, 20247491, 20291082, 19603605, 20288350, 20037172, 19283525, 19663377, 19775944, 19731168, 19116478, 18395195, 18502709]
3516A8502709N08210n66499k06970m58212K77009J24685n72665M15819J31266
3507A8155352p22394n40711l1533M39457N89291R6475N3957K52659K28779m98085
3497A8023247r16679R86816M39253l4827l9318p34276j121n91017n88878O96783
3487A7239983m14854m85875k159K00876J61618l66685K4848j44064L9158o8962
3477A6183884p9381m61561m73206K71789N27902p44810r64332N04155N56970J90395
3467A5511805L88433j43937m21141J88413k15081M19894J02301Q2251n05439o29778
3457A4777721M34131M40881j63056N13889N09414O59409p42127j2370r17614o83137
3447A4817141R24827m03949l03831j35412l3093L90273k65775J40469K45205k26227
$$ y = [18502709, 19010919, 18444420, 18237450, 17779238, 18056247, 18180932, 17608267, 18024086, 18155352, 17432958, 16892247, 16860714, 17300171, 17889462, 17985937, 18039894, 18292553, 18521332, 18023247, 17106568, 18093384, 18532637, 18497810, 18458492, 17724216, 17723095, 17132078, 16543200, 17239983, 16825129, 16339254, 16337095, 16537971, 16699589, 16332904, 16357752, 16213688, 16252846, 16183884, 16104503, 15642942, 15169736, 15441525, 15969427, 15224617, 14260285, 14764440, 15321410, 15511805, 15900238, 15756301, 15335160, 15523573, 15308492, 15728386, 15830687, 15912938, 15407499, 14777721, 15211852, 15652733, 15489677, 16003566, 16512980, 17172389, 16430262, 16417892, 15500278, 14817141, 15741968, 15338019, 15034188, 14898776, 14865683, 15255956, 14990181, 15130650, 15375855, 15149628]
3437A5149628N55719n21891j83207N91016l0374m36475j06260j60088n98488L55455
3427A4615035N91148K92096j823j84916J99531p86027j29587J72155M67159M22922
3417A5657693K91875k78095O61k43439N822l70238O74218L91566M18090p31269
3407A5816884o67652O01152m86166l46485l910N95167M83228Q7731q4377j83166
3397A5812406M12283K73467M88332k06603p39355n93030L95533J6478K38603j55546
3387A5942568k21350L26920l76306k11976P36721M51651o60221M70625k27247
3378A6231385k03267M04667n80201L01111J139883j2382j03372O9693N14352L06408
3368A8068277k93528k26752J67370O69348J235r82834m1980J85178J87072j57945
$$ y = [15149628, 15705347, 15183456, 15000249, 15591265, 15560891, 15124416, 15018156, 14858068, 14259580, 14615035, 15206183, 15498279, 15496456, 15311540, 15511071, 14725044, 14595457, 14767612, 15234771, 15657693, 15949568, 15671473, 15672134, 15428695, 15434517, 15064279, 15738497, 16130063, 16548153, 15816884, 15149232, 15750384, 15264218, 14917733, 14913823, 15508990, 15992218, 16079949, 15995572, 15812406, 16224689, 16498156, 16986488, 16779885, 16040530, 15447500, 15843033, 15859511, 16098114, 15942568, 15721218, 16048138, 15671832, 15459856, 16196577, 16648228, 15988007, 16458632, 16231385, 16028118, 16432785, 15852584, 16153695, 17293578, 17281196, 17177824, 17247517, 17761869, 18068277, 17774749, 17547997, 17715367, 18384715, 18385950, 17403116, 17361136, 17546314, 17733386, 17575441]
3358A7575441l7458J32295J083426N3721j36636M49845m71685O06680M36288j95237
3348A9496680p91822L5020M00228L96584M7584J88053k22923J7211M7953Q04229
3338B0418797m272j270473K15045m22855J13447m7882J49112J72426O92610M96103
3328B0512058j55684l99492l07232J91205k7046J28452M62446k79645o10599m09905
3318A9104558L88161P60342J102760l04259r97986J89091K977M84112M32393m08542
3308B0753607j99378J08161K87815O37848n86759l94997O53213m7086j01404j29969
3298B0981051K58844p1380m15965L47982N67559K29560M13675K74413j024213
3289B1561526o4201L21817Q94054L80204k07778O51142l85530o07028l76499Q24932
$$ y = [17575441, 17537983, 17670278, 18753704, 18807425, 18670789, 19120634, 18648949, 19255629, 19691917, 19496680, 18704858, 18739878, 19140106, 19536690, 19584274, 19772327, 19549404, 19566615, 19614568, 20418797, 20414525, 19144052, 19359097, 18936242, 19049689, 19001807, 19150919, 19323345, 20015955, 20512058, 20356374, 19956882, 19649650, 19840855, 19813809, 19942261, 20404707, 20125062, 19514463, 19104558, 19492719, 20253061, 21355821, 21051562, 20053576, 20242667, 20245644, 20729756, 21162149, 20753607, 20554229, 20662390, 20950205, 21588053, 21001294, 20606297, 21259510, 21212424, 21111020, 20981051, 21239895, 21168515, 20752550, 21100532, 21668091, 21897651, 22311326, 22585739, 21561526, 21497325, 21819142, 22713196, 23093400, 22885622, 23536764, 23151234, 22544206, 22167707, 22992639]
3279B2992639O36727q95438M36838L99415p50578M97543L43660N30800r29803
3270B3261803N20821N25372r79814k00220N32997l47187L42120N37699R01664
3261B5095255J02782m39892M53486K9336N83141K76034J65553L5557K95892p77080
3251B5820064K16718j70619O30983L59043q0938L52628Q94256p57223p49048Q95526
3241B7411390J98962P05838J58380l34560j24354P4827P96544N76215j54142k19562
3231B9089538N6270p46502J86060M95709Q8129m18809j4884k47758k49466J42334
3221B8380621q6710M33349k77095q3512k23790L39827K9392k9810K63781p36728
3211B8009325j5790M27276K91528k97821N85654o47143N54155o29188n66420P81708
$$ y = [22992639, 23629366, 22733928, 23170766, 23570181, 22819603, 23317146, 23660806, 24191606, 23261803, 23782624, 24307996, 23328182, 23127962, 23660959, 23313772, 23655892, 24193591, 25095255, 25198037, 24758145, 25211631, 25240967, 25824108, 26100142, 26265695, 26301252, 26597144, 25820064, 26036782, 25866163, 26497146, 26856189, 26775251, 27127879, 28022135, 27264912, 26515864, 27411390, 27610352, 28316190, 28474570, 28140010, 28015656, 28090483, 28887027, 29463242, 29309100, 29089538, 29145808, 28399306, 28585366, 29081075, 29169204, 28750395, 28735511, 28487753, 28238287, 28380621, 28293911, 28727260, 28450165, 28366653, 28142863, 28482690, 28512082, 28482272, 28746053, 28009325, 27993535, 28420811, 28712339, 28414518, 29000172, 28353029, 28907184, 28277996, 27711576, 28493284]
3201B8493284o00352o59992J36927K52020k79349k87660j55108L09736P53100
3192B7962606r99787n42974J02969k49661j37311m00127Q28049k87127j26911
3183B6149726l24186M20894n68879q07700l66068l23862N8218J073153o10966
3174B4700330q7123O8011j06851k5182J26329k99930k82812N04656N03993n90123
3164B4511298j32384N31314O25838n80236o4377Q7617J55921o27690o3107O28063
3154B5072257m4838r2962r43447K13351J53160N93218M96665j1029k82334n09964
3144B4644077K39524O39032k96804J12742P3706l0197j15874K75586O85301P97551
3134B7024644l87589k2972j11041j60226k54242L58267l65974r2493Q29946Q90010
$$ y = [28493284, 27892932, 27232940, 27369867, 27621887, 27342538, 27054878, 26899770, 27209506, 27962606, 26962819, 26419845, 26522814, 26273153, 26135842, 25735715, 26563764, 26276637, 26149726, 25825540, 26246434, 25677555, 24869855, 24503787, 24179925, 24238143, 25311296, 24700330, 24613207, 24681218, 24574367, 24549185, 24675514, 24375584, 24092772, 24597428, 25101421, 24511298, 24378914, 24910228, 25536066, 24955830, 24891453, 24979070, 25134991, 24507301, 24444194, 25072257, 25027419, 24934457, 23991010, 24204361, 24357521, 24950739, 25447404, 25436375, 25154041, 24644077, 24883601, 25522633, 25225829, 25338571, 25412277, 25382080, 25266206, 25541792, 26227093, 27024644, 26637055, 26614083, 26503042, 26342816, 26088574, 26446841, 26080867, 25988374, 26818320, 27708330]
3124B7708330o5273j40102J12065j08272M09550R43970K67030R17764L59156J22241
3114C0526459M89110M48743P65773r5491N53600J114405P65957K92786J385578
3105C6246920M60273R95834J900929K00024M59294J098154J395514k32936m04355
3096D2119651J207980l55378O80475m5673j100588l07462K5682r32633k28230
3087D1063824l92875o8026j73445l04660n536l27645q68596J61377o59212o61646
3077C7763560K50302j70068N77881n3520k15343K82669L71529Q9322J46326j54717
3067C8887941K69597L45169n44687N61023Q44372O70970N99860L03770J115478
3058D3053493L47863J69790Q50836J143173K30441k32009J003706J786843P48982
$$ y = [27708330, 27643057, 27502955, 27615020, 27506748, 27916298, 28860268, 29127298, 30045062, 30404218, 30526459, 31015569, 31464312, 32230085, 32134594, 32688194, 33802599, 34568556, 34861342, 36246920, 36707193, 37703027, 39603956, 39803980, 40263274, 41361428, 42756942, 42524006, 42119651, 43327631, 42972253, 43652728, 43607055, 42506467, 42199005, 42224687, 41292054, 41063824, 40670949, 40602923, 40429478, 40124818, 40119282, 39791637, 38923041, 39084418, 38425206, 37763560, 38013862, 37843794, 38421675, 38368155, 38152812, 38435481, 38807010, 38896332, 39042658, 38887941, 39157538, 39502707, 38958020, 39519043, 40363415, 41034385, 41634245, 41938015, 43053493, 43401356, 43571146, 44421982, 45565155, 45795596, 45563587, 46567293, 48354136, 49103118]
3049D9103118O71468M81496M60408R02779J360380O75357P55196J365042R91450
3040E6766694N31725J281532O37891n49687o93814n17510j719925r47312k1060
3031E4768534K88502K80047o51709n96401L23777P31030m04211q63379J1630o26102
3021E3261718M16469p13567M23791k77511m50952p30577O0211J45856o91607q56953
3011E0586878j098159n95931j386646k67497q95465j725966j684034j036372m10594
3002D1486214o91373j824526m48910l03470m30945j065069q34851l09325j552783
2993C4024962o87137q4457j110621j014767j008476M0961j096261j076449o62869
2984B7324886j66717R216l76369j253593p45163j68117P84221j025223q11355
$$ y = [49103118, 49774586, 50256082, 50716490, 51619269, 52979649, 53655006, 54410202, 55775244, 56766694, 57298419, 58579951, 59217842, 58668155, 57974341, 57456831, 55736906, 54789594, 54768534, 55057036, 55337083, 54685374, 54088973, 54412750, 55143780, 54739569, 53876190, 53887820, 53261718, 53678187, 52964620, 53388411, 53110900, 52659948, 51929371, 51989582, 52135438, 51443831, 50586878, 49488719, 48892788, 47506142, 47238645, 46343180, 44617214, 42933180, 41896808, 41486214, 40794841, 38970315, 38521405, 38217935, 37786990, 36721921, 35887070, 35577745, 34024962, 33337825, 33253368, 32142747, 31127980, 30119504, 30160465, 29064204, 27987755, 27324886, 27158169, 27167385, 26791016, 25537423, 24792260, 24624143, 25408364, 24383141, 23571786]
2975B3571786J62663l86714r78660q37466j3201m44640n86981O21631M08642n79005
2965B0938055n01732k86133k07118l78965m71481k49603j09463m34873j24594
2956A8174093j54961Q38220K95880l95135l77678k4342m42148p32591k11569n8894
2946A6910875Q50434k74389J063126J34606j107139K06406m94191L4740Q69840
2937A8194308k06432j52604j06741J62106k32427l56480J074721J64954o30266
2928A7911139K85331O16938j98050n65400K83251N80679m54315K06077N37463
2919A9203113M29640o63444K22731k37667N83145K55874q20184q816K45316R38326
2909B0148034M167l60539j42815k72414m43075N94375M52142k47454L7797J77213
$$ y = [23571786, 23734449, 23347735, 22369075, 21531609, 21518408, 21073768, 20486787, 21108418, 21517060, 20938055, 20436323, 20150190, 19943072, 19564107, 19092626, 18843023, 18733560, 18298687, 18174093, 18019132, 18857352, 19153232, 18758097, 18380419, 18356077, 17913929, 17181338, 16969769, 16910875, 17761309, 17486920, 18550046, 18684652, 17577513, 17783919, 17289728, 17324468, 18194308, 17987876, 17835272, 17728531, 17890637, 17658210, 17301730, 18376451, 18541405, 17911139, 18196470, 18813408, 18615358, 18049958, 18333209, 18913888, 18459573, 18665650, 19203113, 19632753, 18969309, 19192040, 18954373, 19537518, 19793392, 18973208, 18964392, 19209708, 20148034, 20152201, 19791662, 19648847, 19376433, 18933358, 19527733, 19979875, 19732421, 19770218, 19947431]
2899A9947431K87342l04692o1216l40625N56585O76671Q09088j58225l20889M07786
2889B1499256P29792l3333l44574K58701K50866P28655J65994j65860o1397R75708
2879B4003808j97316j2365j49659J113713L95272K24973L47387o04603N35671
2870B5656881M70915M54180j99166P35415N91733l10145P45005N60045N3817L68894
2860B9127574r2410R00166O44337R35435K48531O07194J062555K56442n9575O54132
2850C4284381R84333n3925r7310l36419Q5371R41053q4402j38787R60008P33412
2840C7277715L30705K31925L5312M33778L36744o372k64089p81345J11270O7815
2830C7773458N66818k38242N0402J12245N62963O41082q72124q6444M69071J49845
$$ y = [19947431, 20234773, 19930081, 19868865, 19528240, 20084825, 20761496, 21570584, 21412359, 21091470, 21499256, 22229048, 22195715, 21851141, 22109842, 22360708, 23089363, 23255357, 23089497, 23028100, 24003808, 23806492, 23794127, 23644468, 24758181, 25153453, 25378426, 25725813, 25121210, 25656881, 26127796, 26581976, 26382810, 27118225, 27709958, 27399813, 28144818, 28704863, 28758680, 29127574, 29035164, 29935330, 30579667, 31515102, 31763633, 32370827, 33433382, 33689824, 33630249, 34284381, 35268714, 35214789, 35117479, 34781060, 34866431, 35807484, 35723082, 35584295, 36544303, 37277715, 37608420, 37840345, 37875657, 38309435, 38646179, 38639807, 38375718, 37594373, 37705643, 37773458, 38340276, 38102034, 38152436, 38264681, 38827644, 39468726, 38596602, 38510158, 38979229, 39129074]
2820C9129074k4730N31385j36569M33118j96157l59488J009023K53289J21906
2811D0760851M72857M61809R93459L66526J7227P46477J351574R05097N12322
2802D6588199J727J087802P14785R38203Q43815R85716Q88277J028533L71771
2793E3448828K6285J476613J695170R11050Q84474M69838R90565R67222J054826
2784F1924871J252701Q93818P23520J79570J138594J60864Q78004Q07057Q17878
2775F8776877K45388Q49573N87586R58279k37014j000083l64282k50566Q027n66527
2765F9007258Q9597K33775n41612j159555j183249o20061J65273p34281j171605
2756F4085540j254187o81728J27273p40400j01128l84128k72875j51450O57588
$$ y = [39129074, 39104344, 39635729, 39499160, 39932278, 39736121, 39376633, 40385656, 40638945, 40760851, 41233708, 41695517, 42688976, 43055502, 43072729, 43819206, 45170780, 46075877, 46588199, 46589926, 47677728, 48392513, 49330716, 50174531, 51160247, 52048524, 53077057, 53448828, 53475113, 54951726, 56646896, 57557946, 58442420, 58912258, 59902823, 60870045, 61924871, 63177572, 64071390, 64794910, 64974480, 66113074, 66273938, 67151942, 67958999, 68776877, 69022265, 69871838, 70459424, 71417703, 71180689, 70180606, 69816324, 69565758, 69573785, 69007258, 69096855, 69330630, 68789018, 67629463, 66446214, 65826153, 65991426, 65257145, 64085540, 62831353, 62149625, 62276898, 61536498, 61435370, 61051242, 60778367, 60626917, 61284505]
2747F1284505K45846j00918n28231j006919l73757l3151K18381M35442L73062
2738F0514260R87025J61668N54998l70070K95478M27790J077777O20786M81833
2729F4751545J154070o1618K87214J32786M28328J28599P82317J80231l24219
2720F7459253l99380M1565j29191q12075L76811P64630J83386k12499j037386
2711F6235114j93017K37095m89776k47944j242155p31692k30567o12896l74879
2702F2349283l35210l12601p38097r74158l89682m03430j473068n79280k58210
2693E6885547J15412j037644r21026N6238m28852m09842q77758l44548q87776
2684E2149751p58242M04755o85332k51112K94296N03389k12708j41608k942L12031
$$ y = [61284505, 61530351, 61429433, 60901202, 59894283, 59520526, 59487375, 59705756, 60141198, 60514260, 61501285, 61662953, 62217951, 61847881, 62143359, 62571149, 63648926, 64269712, 64751545, 65905615, 65843997, 66131211, 66263997, 66692325, 66820924, 67603241, 67783472, 67459253, 67059873, 67101438, 66972247, 66160172, 66536983, 67301613, 67484999, 67272500, 66235114, 66042097, 66279192, 65789416, 65541472, 64299317, 63567625, 63337058, 62724162, 62349283, 62014073, 61701472, 60963375, 59989217, 59599535, 59196105, 57723037, 57143757, 56885547, 57000959, 55963315, 55042289, 55098527, 54669675, 54259833, 53382075, 53037527, 52149751, 51391509, 51796264, 51110932, 50859820, 51154116, 51657505, 51444797, 51303189, 51300247, 51612278]
2674E1612278n96323k34500m13518q20310P73918n8971J3170Q11777p50825R5431
2664E0432127O99159M92789O40274k60734m5332L0156L84332O78908k23378O65523
2654E3493824O41428Q0303K20101P85714N0125O1367J125769J321330Q54662J79831
2644E8814454J010744P92835K03641l71401o2784L19273J026216J291861M64526
2635F3489365P35729K08291L40153O71946M85633P12443j30893J167503J023954
2626F8704124k3060J052871L22879l0672J079101J409583O77106J312325J245430
2617G5749687P03666N73620J304857Q23031Q90396O54489J437059J221677R16358
2608H4274840N85911O46195R54040J385308P34792R64522J924384L08713L66459
$$ y = [51612278, 51015955, 50781455, 50367937, 49547627, 50321545, 50262574, 50275744, 51087521, 50336696, 50432127, 51131286, 51624075, 52264349, 52003615, 51958283, 51988439, 52372771, 53051679, 52828301, 53493824, 54135252, 54215555, 54435656, 55221370, 55271495, 55332862, 56458631, 57779961, 58634623, 58814454, 59825198, 60618033, 60821674, 60450273, 60387489, 60706762, 61732978, 63024839, 63489365, 64225094, 64433385, 64773538, 65445484, 65931117, 66643560, 66512667, 67680170, 68704124, 68681064, 69733935, 70056814, 70026142, 71105243, 72514826, 73191932, 74504257, 75749687, 76453353, 77026973, 78331830, 79154861, 80045257, 80699746, 82136805, 83358482, 84274840, 84860751, 85506946, 86460986, 87846294, 88581086, 89545608, 91469992, 91778705, 92145164]
2599I2145164L76834P96641J194506J285018J320841Q14252q6962K12003R32624
2590I8990921Q05189M55676R2312l74039k99309p2344K27855l83793k07573j25582
2580I9109313p29856q29459l56611L65385j085718l24506L20295o43736l30164
2571I5494943l90866P47884M4612j08110j53702k68901j030783M11115m37994
2562I4308198k65097M6133O40816K51901j97588Q76142Q6241J84492M92743J50889
2552I6574870L25684O66935K129969J614107Q14788J730701J465349J343984J330392
2543A07996779M58041j60196j260385j960329n16614K28721l87384M75559J152398
2534A06026590J26623o78524J18028J15351l96810n6636R6217p27969j177313
$$ y = [92145164, 92521998, 93318639, 94513145, 95798163, 97119004, 97933256, 97846294, 98058297, 98990921, 99796110, 100251786, 100344098, 99970059, 99670750, 99598406, 99826261, 99442468, 99234895, 99109313, 98379457, 97549998, 97193387, 97558772, 96473054, 96148548, 96468843, 95825107, 95494943, 95104077, 95851961, 95896573, 95788463, 95634761, 95365860, 94335077, 94746192, 94308198, 94043101, 94089234, 94730050, 94981951, 94784363, 95660505, 95746746, 95931238, 96423981, 96574870, 96900554, 97567489, 99697458, 101311565, 102126353, 103857054, 105322403, 106666387, 107996779, 108454820, 108294624, 107034239, 105073910, 104557296, 104786017, 104398633, 104874192, 106026590, 106153213, 105474689, 105592717, 105708068, 105311258, 105254622, 105350839, 104622870, 103445557]
2525A03445557r32585n84072m21641j242692j73133n84496j993099j404273p38621
2516I5370945o53728j916423j558231j028225j431945n21667j500651j901599
2508H4858476n13203j682130k082712k052204m84302j134887k540195q77348o94068
2499G2797427j882035j907287k177349j996749j020613n83549j204890j853458
2491F0171497j644052j817013j088092q18162j052957j261301n23142k31433j047653
2482E0687692j378406p66205j050252n44630j01778j44244q09597k17719j014349
2473D4660512m50220n98338j090577l44137k42379k8255l55977j187079j44958
2464D0218592r3381r1213j82262k29337o284p56599q22096R9471o31406k54650
$$ y = [103445557, 102512972, 101928900, 101507259, 100264567, 100091434, 99506938, 97513839, 96109566, 95370945, 94717217, 92800794, 91242563, 90214338, 88782393, 88260726, 86760075, 84858476, 84345273, 82663143, 80580431, 78528227, 78043925, 76909038, 74368843, 73491495, 72797427, 70915392, 69008105, 66830756, 64834007, 63813394, 63229845, 62024955, 60171497, 58527445, 56710432, 55622340, 54804178, 53751221, 52489920, 51966778, 51735345, 50687692, 49309286, 48543081, 47492829, 46948199, 46846421, 46702177, 45892580, 45674861, 44660512, 44210292, 43611954, 42521377, 42177240, 41934861, 41906606, 41550629, 40363550, 40218592, 40125211, 40033998, 39851736, 39622399, 39616115, 38859516, 38037420, 38136891, 37505485, 37250835]
2454C7250835o30214p23903m13844N3902L43029n41872n82701m73734j77961j70476
2444C3933061p83158J0030k63749n64413l03529L79855j10530o59450m44870m82888
2434C0710359j4793m28196l59101m13894N01700j93251n72374K29222j09413L1123
2424B9381382k5785l45154l09067J08561n04290p01740r43803l45342L08717J00459
2414B6723938L28539o04243p0593k00696K82951O66188n62417l26328K50376m4146
2404B6443569K45903O36203J13183o06616K73543l77915N50541l12349K50330
2395B7216392L67945k62271N83732o67597j2422K41260k94503o32750L74772L06299
2385B7220857M35873j27553k74242J90351J89367J03719j00963j45858j50075
$$ y = [37250835, 36620621, 35896718, 35482874, 35536776, 35879805, 35337933, 34755232, 34281498, 34103537, 33933061, 33149903, 33159933, 32896184, 32331771, 32028242, 32408097, 32297567, 31638117, 31193247, 30710359, 30695566, 30267370, 29908269, 29494375, 29996075, 29802824, 29230450, 29459672, 29350259, 29381382, 29355597, 29010443, 28701376, 28809937, 28305647, 27603907, 26660104, 26314762, 26623479, 26723938, 27052477, 26448234, 26377641, 26176945, 26459896, 27126084, 26563667, 26237339, 26487715, 26443569, 26689472, 27325675, 27438858, 26832242, 27105785, 26727870, 27278411, 26966062, 27216392, 27584337, 27322066, 27905798, 27238201, 27225779, 27467039, 27172536, 26539786, 26914558, 27220857, 27656730, 27529177, 27254935, 27445286, 27634653, 27738372, 27637409, 27491551, 27341476]
2376B7341476J88278K06308K85255N73172M27881j09879o54938k6235L93492l99575
2366B8225235K5586K15080k95952l0905J257012N24107M25733L56887K84600J18956
2356C1106339N86170P04207K15042M07977K89034l91650M77180J67936Q73847
2347C4436082O86287M95082L45545J315778K12811o35997J033568J198423J072679
2338D0160258L77929M03719O39478K31599J045008R36174P22340J318558l4072
2329D5800991P8297L70779P02015M16003L88730R45906L41542L57641L49594K30157
2319D9981655J156631Q57850J023257J132519R03542O80957R85646J44768L84989
2310E7251814N83412P15295L53647K06183N13040N60501R43642N54158J434247
$$ y = [27341476, 27529754, 27736062, 28021317, 28594489, 29022370, 28912491, 28257553, 28231318, 28624810, 28225235, 28250821, 28465901, 28169949, 28139044, 29396056, 29920163, 30345896, 30702783, 30987383, 31106339, 31692509, 32396716, 32611758, 33019735, 33308769, 32917119, 33394299, 33562235, 34436082, 35122369, 35617451, 35962996, 37278774, 37491585, 36855588, 37889156, 39087579, 40160258, 40538187, 40941906, 41581384, 41812983, 42857991, 43794165, 44516505, 45835063, 45800991, 45879288, 46250067, 46952082, 47368085, 47756815, 48702721, 49044263, 49401904, 49751498, 49981655, 51138286, 51996136, 53019393, 54151912, 55055454, 55736411, 56722057, 56866825, 57251814, 57835226, 58550521, 58904168, 59110351, 59623391, 60183892, 61127534, 61681692, 63115939]
2301F3115939R84308J42526K27039J100099J323274O64536J11532N19357Q70799
2292F9059409N07224N36319O02675J570980J166763Q13557N29948J005443R40228
2283G6732546P06561J077050J190926J374337P44139J515422J635398Q37195J267077
2274H7080651J570942J208217J925279J872806J794605J502136J933183J187660
2266A00075479J442631J978387J740736J707444K009162K727874J722479J306692
2258A14710884J209524K246883J094945J099174K289513J849118J529354J683994
2250A27713389J213165J213322J248811O91305J218998J102598n455L04220J189342
2241A35889695J09063k1354J48808q6580l6863l7205M95774m59026j76348j19826
$$ y = [63115939, 64100247, 64242773, 64469812, 65569911, 66893185, 67557721, 67669253, 68188610, 69059409, 69566633, 70102952, 70705627, 72276607, 73443370, 74256927, 74786875, 75792318, 76732546, 77439107, 78516157, 79707083, 81081420, 81825559, 83340981, 84976379, 85813574, 87080651, 88651593, 89859810, 91785089, 93657895, 95452500, 96954636, 98887819, 100075479, 101518110, 103496497, 105237233, 106944677, 108953839, 111681713, 113404192, 114710884, 115920408, 118167291, 119262236, 120361410, 122650923, 124500041, 126029395, 127713389, 128926554, 130139876, 131388687, 132079992, 133298990, 134401588, 134396133, 134700353, 135889695, 135998758, 135977404, 136126212, 136039632, 136002769, 135965564, 136461338, 136002312, 135825964, 135706138]
2231A35706138n84646K63544l21687k94134N29176j17079L06101K87137j6405
2222A35758145j933731O99759j18876r58177j36823J13270o8999j512113m5922
2213A31796533l49422k63987n34268j740919q79759p14630j100644q71528j428437
2204A23912939j910016j648928j612542j536683k233672k475871p78308j857197
2196A09859722k385997j616370j724546k367719k084883k257149j753451j585158
2188I4084449j837910j558502j527859j199651j132148j474746j232352j074633
2180H3046648r11866j039864k08850J58500q29404q67074l30904l9686j10514
2171G8866986m46262J0428p13427K2399Q38304P37088O36229R41565J192962L21736
$$ y = [135706138, 135121492, 135385036, 135063349, 134769215, 135298391, 135181312, 135487413, 135774550, 135758145, 133824414, 134524173, 134405297, 133447120, 133310297, 133423567, 133354568, 131842455, 131796533, 131447111, 131183124, 130648856, 128907937, 128028178, 127313548, 126212904, 125341376, 123912939, 122002923, 120353995, 118741453, 117204770, 114971098, 112495227, 111716919, 109859722, 107473725, 105857355, 104132809, 101765090, 99680207, 97423058, 95669607, 94084449, 92246539, 90688037, 89160178, 87960527, 86828379, 85353633, 84121281, 83046648, 82134782, 81094918, 80886068, 81044568, 80215164, 79348090, 79017186, 78977500, 78866986, 78420724, 78431152, 77717725, 77740124, 78578428, 79315516, 79951745, 80893310, 82086272, 82408008]
2161H2408008l53801o56935j241457r52614j141279n91684j400937m53553k32331
2152G5383417j081041j81453n56960l70693p60113j37515J55477O87390j52060
2143G2986449j210071p73629r64275l59001n20078n83103l98461m73026p40317
2134F6964488o12036j15320l57280j9358p05567j489772o22513R03441L31570
2125F4277653l62048j50355m23526J01850J13203O22107L95818P0996K53903J6319
2115F4915920L79784R79007J160638P59279K39931k4316J531642J499903J476234
2106G2918022Q82864O58293J500450J616754P87423O15179J396983J148793J171078
2097H2695839J662187J139869J200090J052381P11593J826228R53611J580695
$$ y = [82408008, 82054207, 81397272, 80155815, 79203201, 78061922, 77470238, 76069301, 75615748, 75383417, 74302376, 74120923, 73563963, 73193270, 72433157, 72295642, 72451119, 73138509, 72986449, 71776378, 71002749, 70038474, 69679473, 69159395, 68576292, 68177831, 67704805, 66964488, 66352452, 66237132, 65879852, 65860494, 65154927, 63665155, 63042642, 63946083, 64277653, 63915605, 63765250, 63341724, 63443574, 63556777, 64178884, 64574702, 64645698, 64899601, 64915920, 65295704, 66274711, 67435349, 68194628, 68434559, 68410243, 69941885, 71441788, 72918022, 73800886, 74459179, 75959629, 77576383, 78363806, 78978985, 80375968, 81524761, 82695839, 84358026, 85497895, 86697985, 87750366, 88461959, 90288187, 91241798, 92822493]
2089I2822493J280900J301376J133719P10206J427313R69355R02806J023044Q05914
2080A02377126K066722J679992J307431J467220J061811J112950K64605O98739
2072A12036596O69485j51182M37600L7682k42778l34481m66817l34689k44048
2063A11407368p43331j423374j399154q53277r86411k393403l042014k439179
2055I8127225k117101k463010j595064k594338k422573k858435l294923k376426
2047G8405355k155428k575140k333653k255551k307741j796705j814867j587747
2039F1578523j470712k335280o02193p82194o53360j145907j841115j272235k42879
2030E1232648j306783j153773j318098j686414p69485j280437n06191l44249j72801
$$ y = [92822493, 94103393, 95404769, 96538488, 97248694, 98676007, 99645362, 100548168, 101571212, 102377126, 104443848, 106123840, 107431271, 108898491, 109960302, 111073252, 111337857, 112036596, 112706081, 112554899, 112992499, 113030181, 112787403, 112452922, 111986105, 111651416, 111407368, 110664037, 109240663, 107841509, 106988232, 106001821, 103608418, 100566404, 98127225, 96010124, 93547114, 91952050, 89357712, 86935139, 84076704, 80781781, 78405355, 76249927, 73674787, 71341134, 69085583, 66777842, 64981137, 63166270, 61578523, 60107811, 57772531, 57170338, 56388144, 55734784, 54588877, 52747762, 51475527, 51232648, 49925865, 48772092, 47453994, 45767580, 44998095, 43717658, 43211467, 42867218, 42694417]
2021D2694417p80845j478287n79918q81834p71765o37980p48285j261323n36205
2012C5017975m28726j0501n58006p33246Q4277o58748n29832R2258k5556o16808
2002C1633087k0351m78794l99130n10372J43185M99339k00750p98805r03021o13995
1992B8350393N64774Q6017l8022r31152n30921k49037O5949j01834n52284n08804
1982B6155079q10886l62230Q01602n93541o2079K94152j031027K37944R50623
1973B5579637p06087j383943K31056m38758m38657J33267o01263l61148j38394
1964B1875710r0268n30480j93507k81473P94074N38026K42103q60921o12728O21538
1954B1502074p93951k98609O61968K02031N34587l33750N48526r1337n05901O0865
$$ y = [42694417, 41913572, 40435285, 39855367, 38973533, 38201768, 37563788, 36815503, 35554180, 35017975, 34589249, 34578748, 34020742, 33287496, 33371773, 32713025, 32183193, 32275451, 32249895, 31633087, 31612736, 31133942, 30734812, 30224440, 30367625, 30866964, 30666214, 29867409, 28964388, 28350393, 28915167, 29001184, 28963162, 28032010, 27501089, 27252052, 27318001, 27216167, 26663883, 26155079, 25344193, 24981963, 25783565, 25190024, 25127945, 25422097, 24391070, 24629014, 25579637, 24873550, 23489607, 23720663, 23281905, 22843248, 22976515, 22375252, 22014104, 21875710, 21785442, 21254962, 21061455, 20779982, 21574056, 22112082, 22354185, 21493264, 20880536, 21502074, 20708123, 20409514, 21071482, 21273513, 21808100, 21474350, 22022876, 21931539, 21425638, 21486503]
1944B1486503N81728K2919M77722M62103Q82471L26361j92076M87041q9542K50653
1934B4695883P25756O75300l15067l65979o18837j51750N15542R15302L0455m51458
1924B5655147m6316j31637k85621P74383q23205m22571j43428k15535l62871L44648
1914B4342994j32503n81310L98609j07655n51366O15012o0813J139768m47373
1905B4615363q95711K56828j69510J61694K12096M84357O62109K01541q93304
1896B4635463j41187K42470r1641M12139P55189R9790j14080K66856J73166P70429
1886B7008594Q5105Q73035R4895P48962O66078j12397N69849O66545O04629M88037
1876C1693332l3727R26186M15553R44701O79730n1634L03917j82453J039541J636565
$$ y = [21486503, 22068231, 22091150, 22568872, 23030975, 23913446, 24239807, 24047731, 24534772, 24445230, 24695883, 25421639, 26096939, 25781872, 25415893, 24797056, 24645306, 25160848, 26076150, 26106605, 25655147, 25608831, 25477194, 25191573, 25965956, 25142751, 24720180, 24576752, 24361217, 23998346, 24342994, 24210491, 23629181, 24027790, 23920135, 23368769, 23983781, 23922968, 25062736, 24615363, 23719652, 23976480, 23806970, 23968664, 24180760, 24665117, 25327226, 25528767, 24635463, 24494276, 24736746, 24645105, 25057244, 25812433, 25912223, 25798143, 26064999, 26238165, 27008594, 27093699, 27966734, 28061629, 28810591, 29476669, 29364272, 29934121, 30600666, 31205295, 31693332, 31659605, 32585791, 33001344, 33946045, 34625775, 34574141, 34878058, 34695605, 35735146, 37371711]
1866C7371711N30303j18582O92852O33042R51090O49915R37799P28245K64857
1857D2641232J450447J401249J210078J225770J132169J261624N43781K016158
1849E2882508J408846J206753J259368J426237J710613K174791J590063J350142
1841F5009321J976915R66270J616876K261900J666507J093055J297204K287617
1833G8175665J909113J206123J940125K131822K324127K655352J782969K439882
1825I4565178K980596K701818K609399K801619L369392K547635K502524M416028
1817A18494189L708478M046442M274723L879461M183404N218036M536913L874318
1809A52215964L729488L014109J859216K731557J752988Q80847J195388J712669
$$ y = [37371711, 37902014, 37783432, 38476284, 39109326, 40060416, 40710331, 41648130, 42376375, 42641232, 44091679, 45492928, 46703006, 47928776, 49060945, 50322569, 50866350, 52882508, 54291354, 55498107, 56757475, 58183712, 59894325, 62069116, 63659179, 65009321, 66986236, 67952506, 69569382, 71831282, 73497789, 74590844, 75888048, 78175665, 80084778, 81290901, 83231026, 85362848, 87686975, 90342327, 92125296, 94565178, 97545774, 100247592, 102856991, 105658610, 109028002, 111575637, 114078161, 118494189, 122202667, 126249109, 130523832, 134403293, 138586697, 143804733, 148341646, 152215964, 155945452, 158959561, 160818777, 163550334, 165303322, 166184169, 167379557, 169092226]
1801A69092226Q26962J852446K664694K604789J985769K522521L659186L448022
1793A88656615K537291M736459L810016L530054M793642N798504O430867O975699
1785B27269147O770302P241852R210141R033528J0413784J0815814J2202357J3158925
1777C06115850J3708820J4412745J5165216J4509218J2822424J2422476R715426
1770C98872175O401609K977072J46607l323716o609226q660303j0643475j1280080
1762C67880663j3831331j6098106j6817239j7068718j6453279j5555458j4827085
1755B57229447j2794697j1857897j0764506j0044773q865043r077754p119695
1748A86705082p266932o746322o112445n829447n459144m793578m968554n425106
$$ y = [169092226, 169919188, 171771634, 174436328, 177041117, 179026886, 181549407, 185208593, 188656615, 191193906, 195930365, 199740381, 203270435, 208064077, 213862581, 220293448, 227269147, 234039449, 241281301, 250491442, 259524970, 269938754, 280754568, 292956925, 306115850, 319824670, 334237415, 349402631, 363911849, 376734273, 389156749, 398872175, 405273784, 408250856, 408397463, 405073747, 398464521, 389804218, 379160743, 367880663, 354049332, 337951226, 321133987, 304065269, 287611990, 272056532, 257229447, 244434750, 232576853, 221812347, 211767574, 202902531, 193824777, 186705082, 179438150, 172691828, 166579383, 160749936, 155290792, 150497214, 145528660, 140103554]
1740A40103554n918750n019983n064071m688914n149705l758153m686519l539917
1732A02277542l691209l904520k958030k953393k329088j764138k306291l065718
1724G9305155k351469k123108j719308j342815j977587j937170p98103j329498
1716F5726097j040316p13436j978700k101281j118862q83059m00645n11854p69668
1707E6208276r76110n79776j056865j273799j070095j443186j771508j006674
1699D7030263q05287j729089p29293n86436r87594p23771j427025j818980l95711
1690C7827077J16587q09932j163716j029811m38102p9932n0973M4422L02032j396550
1680C3321102l98662l7525l82357J88995J264010Q16970M58601Q01415N69290
$$ y = [140103554, 134184804, 129164821, 124100750, 119411836, 114262131, 110503978, 105817459, 102277542, 98586333, 94681813, 91723783, 88770390, 86441302, 84677164, 82370873, 79305155, 76953686, 74830578, 73111270, 71768455, 69790868, 67853698, 67055595, 65726097, 64685781, 63972345, 61993645, 59892364, 58773502, 57890443, 57489798, 56977944, 56208276, 55232166, 54652390, 53595525, 52321726, 51251631, 49808445, 48036937, 47030263, 46224976, 44495887, 43766594, 43180158, 42192564, 41468793, 40041768, 38222788, 37827077, 37943664, 37133732, 35970016, 34940205, 34502103, 34422171, 34371198, 34415620, 34717652, 33321102, 32922440, 32884915, 32502558, 32691553, 33955563, 34772533, 35231134, 36032549, 36601839]
1671C6601839J27062m23603l34475M34378m55509K47104o80668j393487o18957
1662C3503684Q9652n15505K9772m73225j639627r99272r17437r55284j347929
1653B6774829k072466j338401m73475j110540r29328m39395N4729j155655r76147
1644A8334151j57457m80452n55139k47942n00340n85455j109k86761K75269r926
1634A5784839J53255q54600l57758J05151o13971l40095j52973K25787M98437
1625A4448072k88598j71500r18266r43723K19652J43527j25890M41013N77621
1616A3381908l62304m16867q31449m29616p4934k02663l2434n15020k03183j71521
1606A0141917m31125M74177p15211j39404l86578O41969J53420j50069k37660
$$ y = [36601839, 36728901, 36305298, 35970823, 36405201, 35949692, 36196796, 35516128, 34122641, 33503684, 33593336, 33077831, 33107603, 32634378, 30994751, 29995479, 29078042, 28122758, 26774829, 24702363, 23363962, 22890487, 21779947, 20850619, 20411224, 20465953, 19310298, 18334151, 18176694, 17696242, 17141103, 16893161, 16392821, 15807366, 15806257, 15519496, 15794765, 15784839, 15938094, 15083494, 14725736, 14830887, 14216916, 13876821, 13723848, 13949635, 14448072, 14159474, 13987974, 13069708, 12125985, 12345637, 12489164, 12363274, 12804287, 13381908, 13019604, 12602737, 11771288, 11341672, 11266738, 11064075, 11031641, 10516621, 10313438, 10141917, 9710792, 10184969, 9469758, 9330354, 8943776, 9585745, 9739165, 9589096, 9351436]
1597I351436r3971J97246o32609K64130k92589j61156m28204j95824k86267m75206
1587G246986n00704O29294n16345p061N28466L05884p04883r01146K95619J94543
1577F570653j012560N69703K9230j2095j24229j22799L9739o40021J08856L5715
1567E442192l5134l87279L12419q92090l49598O17044M27965p6019K47748j49635
1557E157613p06961l91721L25873n59504P82776n15102K26910L05865o4730L7508
1547D598527j61389o71445m03460l44503L47786N31124L49291k43553L9869L45312
1537D387559J89064J41633m97166p95360o13733O2078j53183l30421M55991M14105
1527C260567K97581p22170m42427m3069k76803Q29354k42806K98634J27530n96370
$$ y = [9351436, 9257465, 9454711, 8822102, 9086232, 8793643, 8632487, 8204283, 8008459, 7722192, 7246986, 6746282, 7375576, 6859231, 6852170, 7380636, 7686520, 6981637, 6080491, 6376110, 6570653, 5558093, 6127796, 6157026, 6144931, 6020702, 5897903, 5937642, 5297621, 5406477, 5442192, 5407058, 5019779, 5332198, 4440108, 4090510, 4707554, 5135519, 5059500, 5307248, 5157613, 4450652, 4058931, 4384804, 3825300, 4608076, 4092974, 4319884, 4625749, 4561019, 4598527, 4437138, 3765693, 3362233, 3017730, 3365516, 3896640, 4245931, 4002378, 4042247, 4387559, 4576623, 4718256, 4221090, 3425730, 2811997, 2874075, 2720892, 2390471, 2846462, 3260567, 3558148, 2835978, 2393551, 2350482, 2073679, 2903033, 2660227, 2958861, 3086391, 2490021]
1517B490021K25143O62215l13240l05503k10342k66110O69873P33304m1959K21669
1507C865071k41357m51222K99783Q1508k71931j7505j29373J15966l47939k70653
1497B632348l44431O93167j22026l0009K54931p07208O9260K10416k7963M40794
1487C069279l14268M00833o449M3180K46233n16321N64459N66577k41406n1391
1477C760726M57320k79094k16084n08001k26200N78694P25638Q528J34314j43794
1467D292047o21737O609M88410K90458m26168L60136m64931k02823K27674m25128
1457C524547k47520j4464M70252p56318J27042J91129L7631j59351r72396p7744
1447B122808J58873p0427O58648R56183O06448k8410l10809q56329l94698k87335
$$ y = [2490021, 2715164, 3377379, 3064139, 2758636, 2548294, 2282184, 2952057, 3685361, 3643402, 3865071, 3623714, 3172492, 3472275, 3553783, 3281852, 3264347, 3134974, 3250940, 2903001, 2632348, 2287917, 2981084, 2859058, 2829049, 3083980, 2376772, 2446032, 2656448, 2628485, 3069279, 2755011, 3155844, 3149395, 3192575, 3438808, 2922487, 3486946, 4053523, 3812117, 3760726, 4218046, 3938952, 3722868, 3214867, 2988667, 3567361, 4292999, 4301527, 4435841, 4292047, 3670310, 3676919, 4165329, 4455787, 4029619, 4389755, 3924824, 3722001, 3949675, 3524547, 3277027, 3262563, 3732815, 2976497, 3103539, 3294668, 3332299, 3172948, 2200552, 2122808, 2281681, 2211254, 2869902, 3826085, 4432533, 4404123, 4093314, 3236985, 2842287, 2554952]
1437B554952q0166L92325j20819m80390k15945J014798J30078q27041M19930J66512
1427B954234k31891n54321O15993L94527J57238p25281r59204Q24443M10965o57075
1417B229628k44855J50754j26111l99457K28936M46182m47134P64817J03574p41049
1407A965285n2186N19875L7505J69561R4571K5229l28728m37973k72378Q86764
1397B607525K74415K99698k26849l53161O13352k01861K28956Q1675j040249K8886
1387B312387n5372M64970O3525l66815K74925k56574m10711L45043L47825l83340
1377B335863L23826j59722k24128M91278j059898K18905K45421m20550L47027
1368B098022k84291j24064l32744M25684L82317n05876M20566j57485L02804K81778
$$ y = [2554952, 2474786, 2867111, 2746292, 2265902, 2049957, 3064755, 3194833, 2367792, 2787722, 2954234, 2722343, 2168022, 2784015, 3178542, 3335780, 2610499, 1651295, 2475738, 2886703, 2229628, 1984773, 2135527, 2009416, 1609959, 1838895, 2285077, 1837943, 2602760, 2706334, 1965285, 1913099, 2432974, 2470479, 2640040, 2734611, 2759840, 2431112, 1993139, 1720761, 2607525, 2881940, 3181638, 2954789, 2601628, 3214980, 3013119, 3242075, 3323750, 2283501, 2312387, 2257015, 2721985, 2785510, 2418695, 2693620, 2437046, 2026335, 2371378, 2719203, 2335863, 2659689, 2499967, 2275839, 2767117, 1707219, 1926124, 2171545, 1750995, 2098022, 1813731, 1689667, 1356923, 1782607, 2164924, 1659048, 2079614, 1922129, 2224933, 2506711]
1358B506711K13017r83270N6821J10666k80099J24969l98224K30449N68326K52022
1348B401388K7415N649o66637R3738J70405j062338l38961K80188l61775K9922
1338E78994m29295J488220j73680l52474J17412K98812K93465n91527L23798O8827
1328A622552k21693j02461K22521k60076o7219R4080J55831l52138K94655K0913
1318A406965J12017J14123J08394P95507p83181l80097m58130L95109k09128l13234
1308G88345l3249J88449l3201N35689n13294L27400M5984K24909n3860N42047
1298B019219L67058k2302M28549j317263J91892m87168j38112K42908L12697J78650
1288A776128O69615P4806n91136J88174l58885N35272R9839R4749o83885N1527
$$ y = [2506711, 2719728, 1736458, 1793279, 1903945, 1623846, 1748815, 1350591, 1581040, 2149366, 2401388, 2428803, 2434452, 1767815, 1861553, 2031958, 969620, 630659, 910847, 549072, 578994, 149699, 1637919, 1464239, 1111765, 1229177, 1527989, 1821454, 1229927, 1553725, 1622552, 1400859, 1298398, 1520919, 1260843, 1193624, 1287704, 1443535, 1091397, 1386052, 1406965, 1518982, 1633105, 1741499, 2537006, 1753825, 1373728, 915598, 1310707, 1101579, 788345, 755096, 943545, 910344, 1446033, 932739, 1260139, 1306123, 1531032, 1477172, 2019219, 2386277, 2363975, 2792524, 1475261, 1667153, 1179985, 1041873, 1284781, 1597478, 1776128, 2445743, 2520549, 1929413, 2117587, 1758702, 2293974, 2393813, 2488562, 1804677, 1856204]
1278A856204n10177l68880j73259K39160K80298M84182N11113r9347k94004K14136
1268B139426J97673n7275J51995j18745n00796l44314O14059l25219m29057M9124
1258A376871K67511J2223p7851k86786m2080l72173n10354L21639j38139j69791
1248C81070J001568n46742n12735M21718M22182N75904L12963m32249j43706j51381
1238A328592m83671l46417O61888L22170K91515M24994J89925J4142p47019l55200
1228A300919j17811j65188K87151l7824r6564p02470n69147M67187J045671J7507
1218A429431m00351K2008k23264r19634O87885j45370K11099M75569J57843q02597
1208D92619J26531N93665K6844j39249k87833L8888L98642N73505q40725q89401
$$ y = [1856204, 1346027, 977147, 803888, 1043048, 1323346, 1807528, 2318641, 2219294, 1925290, 2139426, 2337099, 2279824, 2431819, 2313074, 1812278, 1467964, 2082023, 1756804, 1327747, 1376871, 1644382, 1656605, 1578754, 1291968, 1249888, 877715, 367361, 689000, 550861, 381070, 1382638, 835896, 323161, 744879, 1167061, 1742965, 2055928, 1623679, 1479973, 1328592, 844921, 498504, 1160392, 1482562, 1774077, 2199071, 2388996, 2403138, 1656119, 1300919, 1183108, 1017920, 1305071, 1267247, 1170683, 468213, -100934, 366253, 1411924, 1429431, 1029080, 1051088, 827824, -91810, 596075, 450705, 661804, 1137373, 1295216, 492619, 619150, 1212815, 1239659, 1100410, 812577, 851465, 1250107, 1823612, 982887, 93486]
1198I3486M13532M00433k5306o9939J29998l75263k32105M097M97180j73668L7606
1187G00051O35396k84703n61985q979P18786m83467o28017j19972K87888Q63929
1177A118927M13535q76084m36959O08631N50808j97476l10268L0184L76471M0941
1167A318710R46150l33113n05550K0072n27172l17909J16772O50560n13516j93644
1157F61360N03921k80499l80482R0373M36350n21455J008992m89656K17178K470
1147A248552o40625n5682M61121k9752k52337k67439J60566M82971k47851o95760
1137A63764m28993L79898J79863R78034p2795q87397N35466J74551J0263K72129
1127A304783N41541m19290n40287m0108k27356K92752r33784K4908L18791K26052
$$ y = [93486, 507018, 907451, 882145, 812206, 942204, 566941, 334836, 338933, 836113, 662445, 700051, 1335447, 1050744, 488759, 479780, 1198566, 715099, 87082, -32890, 254998, 1118927, 1532462, 656378, 219419, 828050, 1378858, 1181382, 871114, 901298, 1277769, 1318710, 2264860, 1931747, 1426197, 1446269, 919097, 601188, 717960, 1368520, 855004, 661360, 1165281, 884782, 504300, 594673, 1031023, 509568, 1518560, 1028904, 1246082, 1248552, 607927, 552245, 1013366, 983614, 731277, 463838, 624404, 1107375, 859524, 163764, -265229, 114669, 294532, 1272566, 1199771, 312374, 847840, 1022391, 1032654, 1304783, 1846324, 1427034, 886747, 846639, 619283, 912035, -21749, 3159, 321950, 548002]
1117E48002K02296O95078J84134r30337j57642R11600k55054m99329L58143N87501
1107A644392L63191M4821m44181N2686l11501K76110K63769O01160M06319j54118
1097B742648J72688K24537o10687n74197J93673j49249L14323n93148k18740m28452
1087A073396P992M98674P9934M15099j72042R3340q1409R4079O08494n18752n48135
1076A550670M92968N8617N30464k81190m3738P023r48556l19499L90017L84828
1066A821604n29791l37432Q95776P01760r05242j087675k64537O86523j15279
1057H65707J53161K17073J52216j33578j45467O12007M64345n4922O4792k45514
1047A949820J02393M32855K86936j3678J2778l6095l50157Q4056J85565l21659
$$ y = [548002, 750298, 1445376, 1629510, 699173, 541531, 1453131, 1198077, 698748, 1056891, 1644392, 2007583, 2052404, 1608223, 1660909, 1349408, 1625518, 1889287, 2490447, 2896766, 2742648, 2915336, 3139873, 2529186, 1954989, 2148662, 1999413, 2313736, 1720588, 1501848, 1073396, 1081388, 1580062, 1659996, 2075095, 1903053, 1996393, 1914984, 2009063, 2617557, 2098805, 1550670, 2043638, 2102255, 2632719, 2351529, 2307791, 2314814, 1366258, 1046759, 1436776, 1821604, 1291813, 954381, 1850157, 2551917, 1646675, 559000, 294463, 980986, 865707, 1018868, 1235941, 1388157, 1254579, 1109112, 1721119, 2185464, 2130542, 2195334, 1949820, 2052213, 2485068, 2772004, 2758326, 2771104, 2735009, 2384852, 2468908, 2654473, 2332814]
1037B332814k91399N66320k16826m1839l44154O0920K68561L67781l8147j62497
1027B501534O23830l79254L69667J625823N34143n85692l48964p4786R50774J23611
1017E340686k55391J71549k64995J04581Q22196K38459l19001k88965m79257m23915
1007D645947K22257O03116N494o51459P63545N82530q2587O7821P98733K03224
997G158621L88578P5195K20357q8793K59580R5942k33362k79408P31424R72030
987I300164L36506j0513N94160P98450j06604k85055J55783R76393N08910Q59831
977A3128025R52321N35104L09201J614733J100458R78415J555904J263274J488479
968B2925914Q70465J886535J898936L273231J458305K087935L362522M283490
$$ y = [2332814, 2041415, 2607735, 2390909, 2349070, 2004916, 2065836, 2334397, 2702178, 2664031, 2501534, 3125364, 2746110, 3115777, 4741600, 5275743, 4690051, 4341087, 4266301, 5217075, 5340686, 5085295, 5256844, 4991849, 5096430, 5918626, 6157085, 5838084, 5549119, 5069862, 4645947, 4868204, 5471320, 5476814, 4825355, 5588900, 6171430, 6088843, 6156664, 6955397, 7158621, 7547199, 7622394, 7842751, 7753958, 8013538, 8109480, 7876118, 7596710, 8328134, 9300164, 9636670, 9626157, 10220317, 11018767, 10912163, 10627108, 10782891, 11759284, 12268194, 13128025, 14080346, 14615450, 14924651, 16539384, 17639842, 18618257, 20174161, 21437435, 22925914, 23796379, 25682914, 27581850, 30855081, 32313386, 34401321, 37763843, 42047333]
960D2047333N084454O605758Q129106R710535J2448023J5069959K0167615K3020095
952A42282878K4430582K7072422K6846749K2012856r12010n6582654n6003539
945A29147284k8539378j8274676j1945789q943418p451219o082800m124967m314637
937C9470400k163496k221170j562281j869660j675322q68209l452466l379890
929B2277906j871650k154602j002257p98990n39541p42625j209417j685141k04788
920A2068895p10604o90177r2303n45010m75967K1887q23114n64309n14537l70563
910G304198J59187J7384q98725j70297O6172N39200q00300q00198M38613l16010
900E539224k33240l44662k67466k33159r05701o56658O86625j26521j73030j81527
$$ y = [42047333, 47131787, 53737545, 61866651, 71577186, 84025209, 99095168, 119262783, 142282878, 166713460, 193785882, 220632631, 242645487, 241733477, 185150823, 129147284, 100607906, 82333230, 70387441, 61444023, 53992804, 47910004, 43785037, 39470400, 37306904, 35085734, 33523453, 31653793, 29978471, 29110262, 25657796, 22277906, 20406256, 18251654, 17249397, 16450407, 15910866, 15168241, 13958824, 12273683, 12068895, 11358291, 10668114, 10575811, 10030801, 9554834, 9576721, 8753607, 8189298, 7674761, 7304198, 7463385, 7480769, 6582044, 6411747, 6477919, 7017119, 6216819, 5416621, 5855234, 5539224, 5305984, 4961322, 4693856, 4460697, 3554996, 2898338, 3584963, 3458442, 3285412, 3103885]
890C103885l8429Q33855K77999J58492j023849J8315L3865n34527K80721k68378
880B841949p6173L54313m1735L83067K00044m87560q49573n78443N68305J15689
870B429883J33460J30989j46399l27212K18801L73303l60094l98013l93582O6475
860A727611n9658j31289l09223L58851n51171J15330J89383J79447j96661L6421
850A359041j64163J3182k85397m49715k87864N55407J23173j89138R6807R63986
840A735319j24477N31178o49197p92667n6493l3504n85875M4428O53246l23042
830C98916k91295L24789Q8268r6669J66187l10227J52413k0517N17388n24365
820D04888m386M72728J32410J22150o95086k35867L87981m93477m24438N72249
$$ y = [3103885, 3065456, 3899311, 4177310, 4335802, 3311953, 3330268, 3364133, 2829606, 3110327, 2841949, 2765776, 3120089, 3078354, 3461421, 3661465, 3173905, 2324332, 1745889, 2314194, 2429883, 2563343, 2694332, 2547933, 2220721, 2439522, 2812825, 2452731, 2054718, 1661136, 1727611, 1667953, 1536664, 1227441, 1586292, 1035121, 1150451, 1339834, 1519281, 1322620, 1359041, 1194878, 1208060, 922663, 472948, 185084, 740491, 863664, 674526, 771333, 1735319, 1610842, 2142020, 1492823, 700156, 643663, 610159, 24284, 68712, 721958, 398916, 107621, 432410, 520678, 424009, 590196, 279969, 432382, 411865, 929253, 404888, 400502, 873230, 1005640, 1127790, 432704, 196837, 584818, 91341, -333097, 239152]
810B39152n9430l76721K87853k01835K08676J74695k74569k27223k92870j29914
800f52186N67391K26351m1154O2100m458j19146O1854l54706K99017m6242M60922
789D59743j44608M9989l77857m59321j401k41836K15510k01964k01280M37774
779d65251K51480L31653n4845Q45416j06929k59588k93504M08242N96763q8414
769A165023l32172n61662n78035m46650M14388k23302K06128N08314p04301k45003
759g97272P22162O21612l6557j31648k06786k52380j12860J56101r4566l04930
749d37124Q00091k52705p03744M80685N60657j77904j139739M5183J7597P47069
739e9934J30884m06191k79906m9553m35474N46134M59508k26209N19188j45513
$$ y = [239152, 179722, -196999, 90854, -110981, 97695, 272390, -2179, -229402, -522272, -652186, -84795, 141556, 100402, 162502, 158044, 38898, 100752, -253954, 45063, -1179, 459743, 315135, 365124, -12733, -472054, -473455, -715291, -499781, -701745, -903025, -465251, -213771, 117882, 63037, 908453, 801524, 541936, 248432, 656674, 1253437, 1165023, 832851, 271189, -306846, -753496, -339108, -562410, -356282, 152032, -552269, -797272, -75110, 546502, 509945, 378297, 171511, -80869, -193729, -37628, -132194, -437124, 362967, 110262, -593482, -112797, 447860, 269956, -869783, -824600, -807003, -59934, 70950, -335241, -615147, -664700, -1100174, -554040, -94532, -320741, 198447, 52934]
729E2934K02751l73875m2002m67325k69722j56538l35064K20773o4045N40968
719f91145m57006K21840Q99738j86495J52415k85119l6238J88556m84998K90626
709c87826P52710j15913r05178k90069K25154N95786L15712j142429P14784R78118
699G40849l16267j363410q3100L38042K63009N03218P1963j04060n93012k71053
689h13821K01375j37212r80035L47066J337973k30061Q6029j71627m9868l70313
679g80494j03502K44980O27456p06134K3577L71395K6347o0692m57737O06267
669b08537J0196L24773R00414J89479j240744M49529O97080l29669k20505o09229
659c7213L78727l45785o56093J074307J13318k35519K93895N4446m33014j11533
$$ y = [52934, 255685, -118190, -160192, -627517, -897239, -1053777, -1388841, -1168068, -1232113, -691145, -1148151, -926311, -26573, -213068, -60653, -345772, -382010, -193454, -678452, -387826, 364884, 248971, -656207, -946276, -721122, -125336, 190376, -952053, -237269, 740849, 424582, -938828, -1021928, -683886, -420877, 82341, 154304, 50244, -542768, -813821, -612446, -749658, -1729693, -1382627, -44654, -274715, -188686, -360313, -410181, -780494, -883996, -639016, -11560, -717694, -694117, -322722, -296375, -357067, -814804, -208537, -198341, 126432, 1026846, 1216325, -24419, 425110, 1122190, 792521, 572016, -37213, 341514, -4271, -660364, 413943, 527261, 291742, 585637, 640083, 207069, 95536]
649I5536N58068K82399l49701j477663J97587L38233O94532L71893l88185L62523
639F85222r96922l80657J68010k08331L54996l09312L02200K51312q9288j58977
629c81747k06787k2340M11588k07908k52868R7682m35177L18878j68394K4350
619h22723l31299k65835R46381O4585n63979K90030l70423K32478J70679l96045
609a046151N6443L15691K88694k78468L21558k02697L44090l44943J11030J86434
599b48319O9423J05912n85554O03610n07674m79271k39219K50356M74440j080688
589a636984K10422R88582o97330K17818J16363j9915O10525n99492M9070R651
579g51290R90934n7178K85404j60272p37188M30184l69343N75855p91152L92260
$$ y = [95536, 653604, 936003, 586302, -891361, -693774, -355541, 338991, 710884, 322699, 685222, -311700, -692357, -524347, -732678, -377682, -686994, -384794, -133482, -222770, -381747, -588534, -610874, -199286, -407194, -660062, -562380, -997557, -678679, -847073, -822723, -1154022, -1419857, -473476, -408891, -972870, -682840, -1053263, -820785, -650106, -1046151, -989708, -674017, -385323, -663791, -342233, -544930, -200840, -545783, -434753, -248319, -178896, -72984, -658538, -54928, -562602, -1041873, -1281092, -1030736, -556296, -1636984, -1426562, -437980, -1135310, -917492, -801129, -821044, -210519, -810011, -760941, -751290, 239644, 182466, 467870, 307598, -429590, 594, -368749, 207106, -584046, -191786]
569a91786K90828K02643k96826n85308O1227L84150j37448M70967n3455o97773
559e52781N2598M54561m12477j84761m19037M24734j09312J27955L05771J9705
549b93044J12092p64666k2393m48182L21545O06289N00911r07509j94130m48052
539a537139L50617M05665j10051n19266J80420J80983M93948r0736m46773O03096
529d89236K31831M26523m53491n84722M81464j57601l41436L86758p16426L63486
519h52850M87254k37635k39930j3791N5350J86644n2967p9591K02955J9490r2859
508f17930K22415o9315K17541l92117k69106o00732M98569j14878R3110J078034
498D5591M00263L36531m21573n04307l81997k0500q95242n2063O82204m7007L55454
$$ y = [-191786, 99042, 301685, 4859, -580449, -519222, -135072, -272520, 198447, 144992, -552781, -500183, -45622, -458099, -642860, -1061897, -637163, -746475, -618520, -312749, -293044, -180952, -945618, -968011, -1416193, -1094648, -488359, 12552, -894957, -1089087, -1537139, -1186522, -780857, -890908, -1410174, -1229754, -1048771, -554823, -645559, -1092332, -489236, -257405, 169118, -284373, -869095, -387631, -545232, -886668, -499910, -1216336, -852850, -365596, -603231, -843161, -856952, -801602, -614958, -667925, -747516, -544561, -525071, -617930, -395515, -464830, -247289, -639406, -908512, -1509244, -1010675, -1125553, -1032443, 45591, 445854, 782385, 360812, -143495, -525492, -545992, -1441234, -1493297, -811093, -858100, -502646]
487e02646Q56012q71168q73484R96196O17170q77469J9129K28431k17448q21329
477a446606O0788O57711M8907J82120j98531N3362k49285l7070j1212m96726m84404
466a920946J54331M28708M50333j53844Q48548l75114J12497M20708m60858n05917
456a001554K13652P56668j61554p46782l80274R50589O72742J19743n92218o05244
446g74232j51735n6376n22417O21561J35931j05899O87925j79982k2738J20394
436b47568n03946J13528K80675M98179j439391L21887K17954q0150k79663o7326
426a185821N56714M97050P3821J03724J70101j097798L44403R16386q02924p05174
416a129518L66853q3828q8361K86255k32546j16698q51021N7220N44375L13611
$$ y = [-502646, 353366, -517802, -1391286, -395090, 222080, -655389, -636260, -407829, -625277, -1446606, -1385818, -728107, -679200, -497080, -695611, -642249, -891534, -928604, -939816, -1436542, -1920946, -1766615, -1337907, -887574, -1041418, -192870, -567984, -455487, -34779, -495637, -1001554, -787902, -31234, -192788, -939570, -1319844, -369255, 303487, 423230, -168988, -774232, -925967, -982343, -1504760, -883199, -747268, -853167, -165242, -345224, -367962, -247568, -751514, -637986, -357311, 140868, -1298523, -976636, -758682, -838832, -1118495, -1185821, -629107, -132057, -58236, 45488, 215589, -882209, -537806, 378580, -424344, -1129518, -762665, -846493, -934854, -648599, -881145, -997843, -1848864, -1791644, -1247269, -933658]
406i33658R9985J55484j90120M921M02069l27509K64875l77891J08970J0039q18612
395a601447N54251L45542P88049K36418p93486n4725k47426J93085k69369Q0306
385g68802j98501O75250K7962n91142l2564J23341L90868J15971L48667m31569
375c40519N8871L50536l08887J07927q63863n1952L12637J12395r6913j91126
365i10894j59782k21071n44966K93219P82543J73376l87224L84643J16006J20105
355c54045N15112n51365n49170N33125M09588j123255o01999J09129m93856M5471
345b061265L55689K03198O45412l09973J98486J17349j04668K15920k19487j94235
335a153574m30524n69646K30292N05285k44019L21176L28423L56116L31846j13764
$$ y = [-933658, -833673, -678189, -868309, -863388, -461319, -788828, -523953, -901844, -792874, -782835, -1601447, -1047196, -701654, 86395, 322813, -470673, -525398, -772824, -579739, -849108, -768802, -967303, -292053, -264091, -855233, -887797, -764456, -373588, -257617, 91050, -340519, -281648, 68888, -239999, -132072, -995935, -1047887, -735250, -622855, -719768, -910894, -1070676, -1291747, -1836713, -1543494, -760951, -587575, -974799, -590156, -474150, -354045, 161067, -390298, -939468, -406343, 3245, -1120010, -1722009, -1612880, -2106736, -2061265, -1705576, -1502378, -856966, -1166939, -968453, -851104, -955772, -739852, -959339, -1153574, -1584098, -2153744, -1923452, -1418167, -1662186, -1341010, -1012587, -656471, -324625, -438389]
325d38389o81653J663P69255l65256o05971P74570M57548m8097n62239N60111
315a38458n6977j35541j143849p9794Q73022k10678M3862k28049O12446k22603
305f86619n20031K80499N3045m12455q4951M96322L17265l75277J05479m50866
295a277589L51683L91993j77276m4250n4522m10427o06492J77722R7875k93036
285a844319J002583n44409k50599K38019k23594k3101L30239L24407p4670j5556
275a081000L5284K26885o84434M30766K53376r52490p7588J167500P37206j90343
265a34838K98291k11726k54999N03751K76150j099804n88882M37551J51591k12194
255h35109k93834J7962l99186O68593N34886r2219k91794L43887j8721j05014
$$ y = [-438389, -1120042, -1118379, -349124, -714380, -1320351, -545781, -88233, -136330, -698569, -138458, -195435, -330976, -1474825, -1554619, -681597, -892275, -848413, -1076462, -464016, -686619, -1206650, -926151, -873106, -1285561, -1370512, -874190, -556925, -932202, -826723, -1277589, -925906, -533913, -711189, -755439, -809961, -1220388, -1826880, -1649158, -1551283, -1844319, -841736, -1386145, -1636744, -1398725, -1622319, -1645420, -1315181, -990774, -1065444, -1081000, -1045716, -818831, -1503265, -1072499, -819123, -1771613, -1849201, -681701, 55505, -134838, 163453, -48273, -303272, 200479, 476629, -623175, -1212057, -774506, -622915, -835109, -1128943, -1110981, -1510167, -841574, -306688, -398907, -690701, -346814, -365535, -470549]
245d70549O4975p34030J01976N5407P03266l72254j48236J84005J44302l95433
235h66571r55013l21829J2833P53952M81497q6829j3572j66557m19898K84463
225a297524l07410O31012M68809j251831K45116N19887L02561L18891n69580n58516
215a498585M0617J90798l75816O08302Q7682j38220q34246k4318N18930r3357
205a518213L46098m92275K53245k34296N89610j63188k2740L79130J0066N25300
195c27263j96845k4779l62194m5764n5153l79562L23982L6350K55855P21572l52630
184d06431j31952l79749q72094K31594J150940M69396o54534n57949j95472L77958
174i68293k2986k58749k836j42286j81298j07307j86111O16513K7389P8051m8703
$$ y = [-470549, -405574, -1139604, -1037628, -982221, -278955, -651209, -799445, -615440, -471138, -866571, -1821584, -2143413, -2130580, -1376628, -895131, -981960, -995532, -1162089, -1581987, -1297524, -1604934, -973922, -505113, -1756944, -1511828, -991941, -689380, -370489, -940069, -1498585, -1457968, -1267170, -1642986, -1034684, -947002, -1085222, -1919468, -1943786, -1424856, -1518213, -1172115, -1664390, -1411145, -1645441, -1055831, -1219019, -1241759, -862629, -852563, -327263, -524108, -548887, -911081, -956845, -1011998, -1391560, -1067578, -1031228, -775373, -53801, -406431, -538383, -918132, -1790226, -1558632, -407692, 61704, -592830, -1150779, -1346251, -968293, -991279, -1250028, -1252864, -1395150, -1576448, -1683755, -1869866, -1253353, -1225964, -1147913, -1196616]
163a196616r9008K94854j53079m5015J19451R63342o75075n42476n64822l08307
153b206751k6842N20797m30824J84922M22066j15113J6058n9357j2840o18519
143b326403l52566N08450M12700L72619Q0941k78998m5333J96702R4988m1429
133a378329l29388J1114n8162K11220k25540m2033M60816Q4179P6619K55275J64960
122g69269m89476K72102l7920L2434L90258J34616q0487K14468j75745k65406
112g74425k27048K42059k14559k23947j13089J88657N6692k80239k63983N18937
102a090945p97845J03280L47973P8302L36978q883k21157j31998M66322J27382
92g90591j47261m03116j96575J58249J81566J99525J52300j85905k2867j19888
$$ y = [-1196616, -1295624, -1000770, -1153849, -1198864, -1079413, -116071, -791146, -1333622, -1898444, -2206751, -2233593, -1712796, -2143620, -1958698, -1536632, -1651745, -1635687, -1695044, -1707884, -2326403, -2678969, -2170519, -1757819, -1385200, -1304259, -1583257, -1628590, -1431888, -1336900, -1378329, -1707717, -1696603, -1754765, -1543545, -1769085, -1811118, -1350302, -1266123, -1189504, -934229, -769269, -1258745, -986643, -1024563, -992129, -601871, -467255, -547742, -333274, -509019, -774425, -1001473, -759414, -973973, -1197920, -1311009, -1122352, -1065660, -1345899, -1609882, -1090945, -1888790, -1785510, -1437537, -1359235, -1022257, -1031140, -1252297, -1384295, -917973, -790591, -937852, -1340968, -1537543, -1379294, -1197728, -998203, -845903, -1031808, -1054675, -1174563]
82a174563n04081n88016O03670L87545j95150J26553o26304K17341L32819l63230
72a783416K69998K47243m4627O30099m37517q6769Q9089j2618j00778l46277k48245
61a823818J26060L22298j07292K91735M95577o33814m03119M32761l74705K19199
51a455118J38803l14468j72224N714L65760o0177l35060J27375J94327l2346l78639
40a916053M03347K29415k17623k66509N00036K57178L23908m23049j63594K82335
30i90609n17296l34270j37479L89750M62600K51585l60912l29778J86463m24972
20a804918K17376m59091L34966K86638l6357j74736j1108j66888k37286K63748
10a787656K07061k31732k26285K90588L40854M80116j57105j41475j52763Q2038
$$ y = [-1174563, -1678644, -2266660, -1662990, -1275445, -1470595, -1344042, -1970346, -1753005, -1420186, -1783416, -1513418, -1266175, -1310802, -680703, -1118220, -1204989, -1115900, -1128518, -1229296, -1575573, -1823818, -1697758, -1375460, -1482752, -1191017, -695440, -1329254, -1732373, -1299612, -1674317, -1455118, -1316315, -1630783, -1803007, -1797293, -1431533, -1491710, -1826770, -1699395, -1505068, -1537414, -1916053, -1512706, -1283291, -1500914, -1767423, -1267387, -1010209, -686301, -1109350, -1272944, -990609, -1507905, -1842175, -1979654, -1589904, -1127304, -875719, -1236631, -1566409, -1379946, -1804918, -1587542, -2046633, -1711667, -1425029, -1461386, -1636122, -1647230, -1814118, -2051404, -1787656, -1580595, -1812327, -2038612, -1748024, -1407170, -927054, -1084159, -1225634, -1378397, -1296359]
0a296359
$$ y = [-1296359]
$$ Imaginary data points
##PAGE= N=2
##DATA TABLE= (X++(I..I)), XYDATA
16383g810647k00236k0658N12682k50784j38760j87209M79186L05168P8135K49254
16373f983869l84515j1768Q80378P25840p87194n9497J88187R2928j04480M1531
16363f402459P99226k81280K1263k52l88405L76554J36769K53276K50964l85146
16353e619490l2620K76201L8127L41114j51469L42314o3257O7073o30977k03694
16343e636678P93429L86783l69906r8259J78150P0475P2169J85522k10643L38544
16333d290414R2271L88703Q0555k01671N55330N98531L68663K49999k99003l10309
16323b767345M76796k65215j69713q6333L01682l2934J9853j90031K05523J91616
16313b316101k94477J85895P88233K03786j40084k38107Q6629j45356J62707O70018
$$ y = [-7810647, -8010883, -8031541, -7518859, -7769643, -7908403, -8095612, -7616426, -7311258, -7233123, -6983869, -7368384, -7380152, -6499774, -5773934, -6561128, -6620625, -6432438, -6339510, -6443990, -6402459, -5603233, -5884513, -5863250, -5863502, -6251907, -5875353, -5738584, -5485308, -5234344, -5619490, -5652110, -5375909, -5337782, -4996668, -5148137, -4805823, -4869080, -4802007, -5432984, -5636678, -4843249, -4456466, -4826372, -4924631, -4746481, -4676006, -4603837, -4418315, -4628958, -4290414, -4198143, -3809440, -3728885, -3930556, -3375226, -2776695, -2408032, -2158033, -2457036, -2767345, -2290549, -2555764, -2725477, -2811810, -2510128, -2543062, -2523209, -2713240, -2507717, -2316101, -2610578, -2424683, -1636450, -1432664, -1572748, -1810855, -1724226, -1869582, -1706875, -1036857]
16303a036857p17665J66168M80660J39315p1524K36702L16416m80117m2157K72987
16293g36072L5637j42049N0326O5723Q587K46112j01602N67044P1360m54407k05437
16282e94778K67848O4546K58852K82163n5699k73759M02346O5324l709k5963k91626
16271I5545L06166P82888M9720n15994J3923j83943N07758L13550K43868l00992
16261A312489M04004l5808k62345J78740K2665k01950Q50459K5211k90895M64425
16251B466995K04729o63199j02302j63193M21771K54594n75938M6515O70254j93358
16241B366868j39544J17115L11981R5669O1227J1594Q4332r355n26633O47031
16231C020285L10669P7593J08407l90464K3425J09332r7784l94789K54353N21252
$$ y = [-1036857, -1754522, -1588354, -1107694, -968379, -1039903, -803201, -486785, -966902, -1009059, -736072, -700435, -842484, -792158, -726435, -717848, -471736, -573338, -6294, 65066, -389341, -594778, -326930, -262384, -3532, 278631, 222932, -50827, 351519, 416843, 413134, 387171, 95545, 401711, 1184599, 1234319, 718325, 732248, 548305, 1056063, 1369613, 1613481, 1312489, 1716493, 1680685, 1418340, 1597080, 1619745, 1417795, 2268254, 2293465, 2002570, 2466995, 2671724, 2008525, 1906223, 1743030, 2164801, 2419395, 1843457, 1889972, 2560226, 2366868, 2227324, 2344439, 2656420, 2752089, 2813316, 2824910, 2909242, 2899887, 2373254, 3020285, 3330954, 3408547, 3516954, 3126490, 3149915, 3259247, 3161463, 2766674, 3021027, 3542279]
16221C542279n07027k20504M08779R9616O38375l14167j41347K50951l4396n3438
16211C669121J96669L83176M58688r7628p54944j40164J116535J43007m58173
16202D516287k16571p20398l33909Q84814J26085n19050L07180M16248k59660
16193D201026p21496l1314N57409L73133Q23467j72844l66342n103l49591K96640
16183D604985r1872N13216m19981l06420M55457L5393o49339K70307K13772M33534
16173E059052n44319l77014M5267k50367N1536L11954j46923L31394p74806L67039
16163D072813K32130j6073L17726r3238L48393N0874Q1996l03469n24818Q47420
16153E013754K09193j66519m18591M67829j21217L43601l75047n84421J472379
$$ y = [3542279, 3035252, 2814748, 3223527, 3323143, 3961518, 3647351, 3506004, 3756955, 3722559, 3669121, 3865790, 4248966, 4707654, 4610026, 3855082, 3714918, 4831453, 4974460, 4516287, 4299716, 3579318, 3245409, 4130223, 4256308, 3737258, 4044438, 4460686, 4201026, 3479530, 3448216, 4005625, 4378758, 5202225, 5029381, 4663039, 4657936, 4308345, 4604985, 4513113, 5026329, 4606348, 4299928, 4755385, 4790778, 4141439, 4411746, 4625518, 5059052, 4514733, 4137719, 4182986, 3932619, 3984155, 4296109, 4149186, 4480580, 3705774, 4072813, 4304943, 4288870, 4606596, 4513358, 4861751, 4912625, 4994621, 4691152, 4166334, 5013754, 5222947, 5056428, 4637837, 5105666, 4984449, 5328050, 4953003, 4368582, 5840961]
16144E840961j59793k09049m54937M11946K29383m07197k53486L31324r462L28069
16134E647759m48043o9445J86692l3323O45448j34162m78663l04455L54702J29330
16124E495840R06359r17125l95524l67619K37548Q15226M13036M79399o44405
16115F022735j91081J11720j54029o76615n32838M34196L35340K33752m10215
16106E172965l99867P2182K45480N11252n4459m1948k58352P04365k20634k2811
16096E708173J2973K09888j18351k26751N7327o66048L50308k80369k90746M20489
16086E176893Q8675K87152j5319K61931J17125J09930k07173K38626K22520J41271
16076F421631M05302m26963n25195j8645q6285k15026J12583M18229n2402j82706
$$ y = [5840961, 5681168, 5472119, 5017182, 5429128, 5658511, 5251314, 4997828, 5329152, 5319690, 5647759, 5199716, 5130271, 5316963, 5283640, 5929088, 5794926, 5316263, 5011808, 5366510, 5495840, 6402199, 5485074, 5089550, 4721931, 4959479, 5774705, 6187741, 6667140, 6022735, 5831654, 5943374, 5789345, 5112730, 4579892, 5014088, 5349428, 5583180, 5172965, 4773098, 4845280, 5090760, 5602012, 5547553, 5505605, 5247253, 5951618, 5730984, 5708173, 5721146, 5931034, 5812683, 5585932, 5643259, 4977211, 5327519, 5047150, 4756404, 5176893, 5265568, 5552720, 5537401, 5799332, 5916457, 6026387, 5819214, 6057840, 6280360, 6421631, 6826933, 6399970, 5874775, 5856130, 5769845, 5554819, 5667402, 6085631, 6033229, 5850523]
16066E850523Q10792k5463j000981o15201l94624L53662N6429M616J16627O06274
16056E762654K0711o54899k67065L16536l35362r05755O04637O77429l62666k4965
16046D831255J05931Q30096N28937k61088m29064j95168J46899j0853N70141q765
16036F108321p39894R89025k58786K95803n50464O8597M63953L12814p81051m64689
16026E443629N31214k09759k05872K81365K52797K12240j46540q52965Q5349p8814
16016E312644j43115m05112Q55064J55215L4185P88538k81594p82295m39539Q795
16006E102786R0799l84308k23503M04962P98860n5319k47148k07477R2069j56807
15996E214914J21345J60506l18877L54857L45876o60100M09778o8587N26077o94729
$$ y = [5850523, 6661315, 6635852, 5634871, 5019670, 4625046, 4978708, 5035137, 5039753, 5156380, 5762654, 5783365, 5128466, 4861401, 5177937, 4842575, 3936820, 4541457, 5218886, 4856220, 4831255, 4937186, 5767282, 6296219, 6035131, 5606067, 5410899, 5557798, 5546945, 6117086, 6108321, 5368427, 6357452, 6098666, 6394469, 5844005, 5912602, 6376555, 6689369, 5908318, 5443629, 5974843, 5765084, 5559212, 5840577, 6093374, 6305614, 6159074, 5306109, 5391458, 5312644, 5169529, 4764417, 5619481, 5774696, 5808881, 6597419, 6315825, 5533530, 5093991, 5102786, 5193585, 4809277, 4585774, 4990736, 5789596, 5734277, 5487129, 5279652, 5371721, 5214914, 5336259, 5496765, 5177888, 5532745, 5878621, 5218521, 5628299, 5559712, 6085789, 5391060]
15986E391060K12662M09342O7929J18351j94619L40239o83698k0239L31041m60090
15976E511978N9459O22792L36621p42932l24051J61960k51307P1034O0675N16160
15966F022389Q4748k866p2942L98852n87038p14531N84908k80238L20377J85417
15956E939076l59605L9693j79041N39810J63735p12353M22949j7676L17678L60988
15946F515254j32428k34356M110m59125m12585O42456K80224l39278O6933K49904
15936F181109n8484r2755l8340m1478m58890M61380k6648k03175N09155K98617
15926F530491K81275k22503n1978k49826K67851Q3047p71347l47946M11831N42670
15916F473565j21531L6523l83221J28557M43689K10737k92878o38113m17360P69045
$$ y = [5391060, 5603722, 6013064, 6080993, 6199344, 6004725, 6344964, 5661266, 5641027, 5972068, 5511978, 5571437, 6194229, 6530850, 5787918, 5463867, 5625827, 5374520, 5445554, 5506229, 6022389, 6107137, 6104271, 6031329, 6430181, 5843143, 5128612, 5713520, 5433282, 5753659, 5939076, 5579471, 5619164, 5440123, 5979933, 6143668, 5431315, 5854264, 5836588, 6154266, 6515254, 6382826, 6148470, 6152580, 5693455, 5280870, 5923326, 6203550, 5864272, 5931205, 6181109, 6122625, 6029870, 5991530, 5950052, 5491162, 5952542, 5925894, 5722719, 6231874, 6530491, 6811766, 6589263, 6537285, 6287459, 6555310, 6638357, 5867010, 5519064, 5930895, 6473565, 6352034, 6388557, 6005336, 6133893, 6577582, 6788319, 6495441, 5857328, 5439968, 6209013]
15906F209013m96723m22304P6669J45819Q85322M15237J67633j079963J19322
15897F020025Q05640J50338l90826j007715N65090J73241J03779j83203o87600
15888E548769k31457K77842p13420N40226N14872J60337o71523m83411L20522
15879E262757M45980m50539m58601J111221K73517N09127L82528j9559J68562
15870G224993k66171r10973M4573L84739M56681p49844o62714K4673j5113J410837
15860F941681q0491j01724m28674j09218N21936n99984o0649j066825L30604P91878
15850F138534j98653n75683L37421j22860N6163M22710j93224m27044j02694J38195
15840E472865k16731Q93J090658n65939o85065M38498R74927R0319k17122j019638
$$ y = [6209013, 5712290, 5289986, 5366655, 5512474, 6397796, 6813033, 6980666, 5900703, 6020025, 6825665, 6976003, 6585177, 5577462, 6142552, 6315793, 6419572, 6236369, 5548769, 5317312, 5595154, 4881734, 5421960, 5936832, 6097169, 5425646, 4942235, 5262757, 5708737, 5258198, 4799597, 5910818, 6184335, 6693462, 7075990, 7056431, 7224993, 6958822, 6047849, 6092422, 6477161, 6933842, 6183998, 5521284, 5545957, 5530844, 6941681, 6861190, 6759466, 6330792, 6221574, 6743510, 6143526, 6082877, 5016052, 5346656, 6138534, 5939881, 5364198, 5701619, 5578759, 5634922, 6057632, 5864408, 5437364, 5334670, 5472865, 5256134, 5257027, 6347685, 5781746, 5096681, 5535179, 6510106, 6600425, 6383303, 5363665]
15830E363665J15426N21049K02592k11535l96667L72445n3043l24698L21370L23925
15820F234529k26156m09198M01201J404280p08500n57138O83959n34048n64923
15811E724006J60683K61790j98590m98198M26905j61484M44225k10316k55321
15802E693700n44032p272K33782J20760L3574j72971M29565O48917q59417K24153
15792E800759J87086O90801j19505q4630j305914l64755Q77010M43710p4622k32433
15782E817507r159O00040R25224l89830k74354m55645J1314l08739o8795J58022
15772F005585K41214M0689J94167m55665L05056K4161J10963j50872l29497k97686
15762E688115M72406K32568k54793J90558J25091k97j59340j72785K97680Q76453
$$ y = [5363665, 5479091, 6000140, 6202732, 5991197, 5594530, 5966975, 5913932, 5589234, 5910604, 6234529, 6008373, 5599175, 6000376, 7404656, 6696156, 6139018, 6822977, 6288929, 5724006, 5884689, 6146479, 5947889, 5449691, 5876596, 5715112, 6159337, 5949021, 5693700, 5149668, 5142396, 5376178, 5496938, 5530512, 5357541, 5787106, 6436023, 5576606, 5800759, 5987845, 6678646, 6559141, 6474511, 5168597, 4803842, 5680852, 6124562, 6049940, 5817507, 5808348, 6408388, 7333612, 6943782, 6669428, 6213783, 6225097, 5916358, 5847563, 6005585, 6246799, 6287488, 6481655, 6025990, 6331046, 6355207, 6466170, 6315298, 5985801, 5688115, 6160521, 6393089, 6138296, 6328854, 6453945, 6453648, 6294308, 6121523, 6419203, 7295656]
15752G295656m71977o74765k8384J1687Q53620l55414J66162M7576m86809m35483
15742E921869K01111M5522l20526J81945m4891J20438L98766j00352l17951k25013
15732E860918M633K8054L07100k14785l91950N9482J124874M57554j094867Q46998
15722F988011n88067K12616o31848n9127k05669P0327R77666p19618M88421J10284
15712F642996k24038j74528l96567j64214q19983N85496K20924K33186N09866
15703F413138Q30848L4875n79863O250p948l64110j5494o35273K24642Q22727
15693F729792p81512L53001M99613j3234m83332K57143j51649J17483J60602N93794
15683G281701l45287l54164l63860J88980R04850k30859k65879j68975p0414j33796
$$ y = [7295656, 6823679, 6148914, 6120530, 6132217, 6985837, 6630423, 6796585, 6844161, 6357352, 5921869, 6122980, 6168502, 5847976, 6029921, 5985030, 6105468, 6504234, 6403882, 6085931, 5860918, 5865551, 5893605, 6200705, 5985920, 5593970, 5653452, 6778326, 7235880, 6141013, 6988011, 6399944, 6612560, 5980712, 5921585, 5715916, 5786243, 6763909, 6044291, 6532712, 6642996, 6418958, 6244430, 5847863, 5683649, 4863666, 5449162, 5670086, 5903272, 6413138, 7243986, 7278861, 6698998, 6705248, 6697300, 6333190, 6317696, 5682423, 5907065, 6729792, 5948280, 6301281, 6800894, 6787660, 6304328, 6561471, 6409822, 6527305, 6687907, 7281701, 6936414, 6582250, 6218390, 6407370, 7312220, 7081361, 6815482, 6646507, 6576093, 6442297]
15673F442297o59015J76247l075O78587K19040n20413k83453k33604q50943n3446
15663D912222L36303P41606K77327L23981Q43791q69441m18881j60531L5976L49708
15653F372061P54522j23854m22197j7584k82943L01863K92343j89526n84418O27149
15643F727416J53540K90115N2829m50525o7732n39531k20501K9058k42708q99152
15633D832809M88324M25582r84256O85615Q56998n08782l44370l77121O28196
15624E702995R66439l29789q442K31257P2598k37365l78684J91762l72647K59146
15614F097270m64376m22073M19821J93269o4391p57872L16914J112726n2648o51313
15604E727327J42725L82230j82497M5889k6142J67146j84024P02365k0422j71160
$$ y = [6442297, 5783282, 5959529, 5956454, 6635041, 6854081, 6333668, 6050215, 5816611, 4965668, 4912222, 5248525, 5990131, 6267458, 6591439, 7435230, 6565789, 6146908, 5986377, 6022353, 6372061, 7126583, 7002729, 6580532, 6562948, 6280005, 6581868, 6874211, 6684685, 6100267, 6727416, 6880956, 7171071, 7223900, 6773375, 6705643, 6166112, 5945611, 5974669, 5731961, 4832809, 5321133, 5746715, 4762459, 5448074, 6305072, 5796290, 5451920, 5074799, 5702995, 6669434, 6339645, 6331203, 6562460, 6635058, 6397693, 6019009, 6210771, 5838124, 6097270, 5632894, 5210821, 5630642, 5823911, 5759520, 5001648, 5318562, 6431288, 6378640, 5727327, 5870052, 6252282, 6069785, 6115674, 6089532, 6256678, 6072654, 6775019, 6754597, 6583437]
15594F583437n08921K20921O82940j74158j85942l67447p7723j03079j96513m3982
15584E829533J25029r8346O06558P5474o45771N32906q2402r10286K4299J087659
15574F544653M04137k19079K26402J15595n76047m32744L16199p9069P6453l56421
15564F020079r9756m04815L6842j20574k9031O85413k36635J46324r0618L06671
15554F213900M54892k01468m10706r319j96285r1060M92052O5818o11605K38817
15544E945036K99114o82919N37299L61293l47857j7869j57732n4050L85826R035
15534F277176p88211J60191M90056J11219j00328k87665p23953L23906K38776
15525E701167P17207J08578L08298K99331j232598p7452K27497m80630M83839
$$ y = [6583437, 6074516, 6295437, 6978377, 6804219, 6618277, 6250830, 6173107, 6070028, 5873515, 5829533, 5954562, 5856216, 6462774, 6538248, 5892477, 6425383, 6342981, 5432695, 5456994, 6544653, 6948790, 6729711, 6956113, 7071708, 6495661, 6062917, 6379116, 6300047, 6376500, 6020079, 5920323, 5515508, 5552350, 5431776, 5402745, 6088158, 5851523, 5997847, 5907229, 6213900, 6668792, 6467324, 6056618, 6047299, 5851014, 5759954, 6252006, 6317824, 5706219, 5945036, 6244150, 5561231, 6098530, 6459823, 6111966, 6094097, 5936365, 5882315, 6268141, 6277176, 5488965, 5649156, 6139212, 6250431, 6150103, 5862438, 5138485, 5462391, 5701167, 6418374, 6526952, 6835250, 7134581, 5901983, 5824531, 6052028, 5571398, 6055237]
15516F055237P62151k85754J18368l63693Q2042o8271K63936q4823J30459j44021
15506F465631n17017K37877n70752J11052l0474J77960O49345K19062M75831k90952
15496F927563p28111m36929J00962K92992P9377N8425k17294r8159K15581J28105
15486F322512j065156m70299L50278k88879J51823M62579O68045k29238K0370
15477E922035O15318j46760r2954M93893m49759J74750j14553L09832O2191m87900
15467F286093M05813n91215n5191L99569n0645k34010j44236J15106n3390M3968
15457F121862J58240J21848m00802J52617j8511L0309j70905K54528p9247K85673
15447F455612O74707l85030l85054M1337J86793m04653j47157n3990m18690j73945
$$ y = [6055237, 6817388, 6531634, 6650002, 6286309, 6368351, 6300080, 6564016, 6479193, 6609652, 6465631, 5948614, 6186491, 5615739, 5726791, 5696317, 5874277, 6523622, 6742684, 7218515, 6927563, 6199452, 5762523, 5863485, 6156477, 6235854, 6294279, 6076985, 5978826, 6194407, 6322512, 5257356, 4787057, 5137335, 4848456, 5000279, 5462858, 6130903, 5901665, 5922035, 6537353, 6390593, 6297639, 6791532, 6341773, 6516523, 6401970, 6711802, 6773993, 6286093, 6691906, 6100691, 6045500, 6445069, 6394424, 6160414, 6016178, 6131284, 6077894, 6121862, 6280102, 6401950, 6001148, 6153765, 6135254, 6165563, 5994658, 6249186, 6169939, 6455612, 7130319, 6745289, 6360235, 6401572, 6588365, 6183712, 6036555, 5982565, 5563875, 5389930]
15437E389930o7451M74215o66812O02831L83774p72699O73133j6519L72409j15710
15427F257101j1692o4315M1462r4454k46287M1138q11690O86160O75385o62299
15417E810509m1330Q9468j97664J58949O74314L02736j344849J69475J219692
15408F841300l00744p58382j97957N85131l37188l67948J22505k827M29094L14894
15398F327878P9943Q1085m05602m0626l81752O2971M01611l18932Q6117M9767
15388E942460N5882L14116k04142J58854l637K84546j69839R4201K00030J88967
$$ y = [5389930, 5322479, 5796694, 5129882, 5732713, 6116487, 5343788, 6016921, 6000402, 6372811, 6257101, 6245409, 6181094, 6222556, 6128102, 5881815, 5922953, 5111263, 5797423, 6472808, 5810509, 5769179, 5858647, 5660983, 5819932, 6494246, 6796982, 5452133, 5621608, 6841300, 6540556, 5782174, 5584217, 6169348, 5832160, 5464212, 5586717, 5583890, 6012984, 6327878, 6407821, 6488906, 6083304, 6042678, 5660926, 5723897, 6125508, 5806576, 5892693, 5942460, 5998342, 6312458, 6108316, 6267170, 6263533, 6548079, 6378240, 6472441, 6672471, 6861438]
$$ [...]
##END NTUPLES=NMR SPECTRUM
##END=
