##TITLE=1H_CG-1146-x1
 DMSO, 8 sc, 
 26.04.2021
##JCAMPDX= 6.0         $$ Bruker NMR JCAMP-DX V2.0
##DATA TYPE= NMR SPECTRUM
##DATA CLASS= NTUPLES
##ORIGIN= UXNMR, Bruker Analytische Messtechnik GmbH
##OWNER= root
$$ XWIN-NMR		Version 3.5
$$ Mon Apr 26 16:03:00 2021 Russian Standard Time (UT+4h)  she@DPX200
##.OBSERVE FREQUENCY= 200.131506
##.OBSERVE NUCLEUS= ^1H
##.ACQUISITION MODE= SIMULTANEOUS
##.ACQUISITION SCHEME= undefined
##.AVERAGES= 8
##.DIGITISER RES= 18
##SPECTROMETER/DATA SYSTEM= spect
##.PULSE SEQUENCE= zg30
##.SOLVENT NAME= DMSO
##.SHIFT REFERENCE= (INTERNAL, DMSO, 0, 15.9968)
##AUDIT TRAIL= $$ (NUMBER, WHEN, WHO, WHERE, WHAT)
$$ ##TITLE= Audit trail, XWIN-NMR		Version 3.5
$$ ##JCAMPDX= 5.01
$$ ##ORIGIN= Bruker BioSpin GmbH
$$ ##OWNER= she
$$ F:/spectra/data/she/nmr/H-F/1/pdata/1/auditp.txt
$$ ##AUDIT TRAIL=  $$ (NUMBER, WHEN, WHO, WHERE, WHAT)
(   1,<2021-04-26 16:01:31.50 +0400>,<she>,<DPX200>,
      <created by zg, POWCHK disabled, PULCHK disabled
       configuration hash MD5:
       00 E9 B6 7A A2 85 ED C7 34 08 36 98 17 FE 4E 26
       data hash MD5: 16K
       EA 02 CD FF 61 24 EB 38 61 F0 8E AA DA E6 B3 B9>)
(   2,<2021-04-26 16:01:34.34 +0400>,<she>,<DPX200>,
      <Start of raw data processing
       efp BC_mod = 2 LB = 0.24 FT_mod = 6 PKNL = 1 PHC0 = -11123.62 PHC1 = 16.00096 SI = 16K 
       data hash MD5: 16K
       0C A5 79 38 CA 1D A7 D0 FD CE 38 B7 AD CA C0 AD>)
(   3,<2021-04-26 16:01:54.37 +0400>,<she>,<DPX200>,
      <pk PHC0 = -2.191981 PHC1 = 0.4 
       data hash MD5: 16K
       F1 FD 3B D7 EF FA ED 2F 8E 1E AA 01 31 84 A5 FD>)
(   4,<2021-04-26 16:02:10.39 +0400>,<she>,<DPX200>,
      <abs ABSG = 5 
       data hash MD5: 16K
       7D 3E D8 D3 60 08 1D 71 AA CC 1D 3B D1 DA C9 F1>)
$$ ##END=
$$ 
$$ hash MD5
$$ 3C F8 8F C8 7F 44 8E A6 63 C1 CB 3B 12 BD 92 3B
##$RELAX= 
##$RELAX= 
##$RELAX= 
##$RELAX= 
##$RELAX= 
##$RELAX= 
$$ Bruker specific parameters
$$ --------------------------
##$DU= <F:/spectra>
##$EXPNO= 1
##$NAME= <H-F>
##$PROCNO= 1
##$TYPE= <nmr>
##$USER= <she>
##$AMP= (0..31)
100 100 100 100 100 100 100 100 100 100 100 100 100 100 100 100 100 100 
100 100 100 100 100 100 100 100 100 100 100 100 100 100 
##$AQSEQ= 0
##$AQ_mod= 1
##$AUNM= <au_zg>
##$AUTOPOS= <>
##$BF1= 200.13
##$BF2= 200.13
##$BF3= 200.13
##$BF4= 200.13
##$BF5= 200.13
##$BF6= 200.13
##$BF7= 200.13
##$BF8= 200.13
##$BYTORDA= 1
##$CFDGTYP= 0
##$CFRGTYP= 5
##$CHEMSTR= <none>
##$CNST= (0..31)
1 1 145 1 1 1 1 1 1 1 1 1 1 1 1 1 1 1 1 1 1 1 1 1 1 1 1 1 1 1 1 1 
##$CPDPRG= <>
##$CPDPRG1= <>
##$CPDPRG2= <>
##$CPDPRG3= <>
##$CPDPRG4= <mlev>
##$CPDPRG5= <mlev>
##$CPDPRG6= <mlev>
##$CPDPRG7= <mlev>
##$CPDPRG8= <mlev>
##$CPDPRGB= <>
##$CPDPRGT= <>
##$D= (0..31)
0 1.2 0 0 0 0 0 0 0 0.06 0 0.03 0 0 0 0 0.0002 0 0 0 0 0 0 0 0 0 0 0 0 
0 0 0 
##$DATE= 1619438490
##$DBL= (0..7)
120 120 120 120 120 120 120 120 
##$DBP= (0..7)
150 150 150 150 150 150 150 150 
##$DBP07= 0
##$DBPNAM0= <>
##$DBPNAM1= <>
##$DBPNAM2= <>
##$DBPNAM3= <>
##$DBPNAM4= <>
$$ [...]
##$SUBNAM3= <"">
##$SUBNAM4= <"">
##$SUBNAM5= <"">
##$SUBNAM6= <"">
##$SUBNAM7= <"">
##$SUBNAM8= <"">
##$SUBNAM9= <"">
##$SW= 16.9725357007746
##$SWIBOX= (0..15)
0 0 2 0 0 0 0 0 0 0 0 0 0 0 0 0 
##$SW_h= 3396.73913043478
##$TD= 16384
##$TD0= 1
##$TE= 0
##$TE2= 300
##$TE3= 300
##$TEG= 300
##$TL= (0..7)
0 120 120 120 120 120 120 120 
##$TP= (0..7)
150 150 150 150 150 150 150 150 
##$TP07= 0
##$TPNAME0= <>
##$TPNAME1= <>
##$TPNAME2= <>
##$TPNAME3= <>
##$TPNAME4= <>
##$TPNAME5= <>
##$TPNAME6= <>
##$TPNAME7= <>
##$TPOAL= (0..7)
0.5 0.5 0.5 0.5 0.5 0.5 0.5 0.5 
##$TPOFFS= (0..7)
0 0 0 0 0 0 0 0 
##$TUNHIN= 0
##$TUNHOUT= 0
##$TUNXOUT= 0
##$USERA1= <user>
##$USERA2= <user>
##$USERA3= <user>
##$USERA4= <user>
##$USERA5= <user>
##$V9= 5
##$VALIST= <valist>
##$VCLIST= <CCCCCCCCCCCCCCC>
##$VD= 0
##$VDLIST= <DDDDDDDDDDDDDDD>
##$VPLIST= <PPPPPPPPPPPPPPP>
##$VTLIST= <TTTTTTTTTTTTTTT>
##$WBST= 1024
##$WBSW= 4
##$XGAIN= (0..3)
0 0 0 0 
##$XL= 0
##$YL= 0
##$YMAX_a= 411494
##$YMIN_a= -349616
##$ZGOPTNS= <>
##$ZL1= 120
##$ZL2= 120
##$ZL3= 120
##$ZL4= 120
##$ABSF1= 15.99682
##$ABSF2= -0.9758434
##$ABSG= 5
##$ABSL= 3
##$ALPHA= 0
##$AQORDER= 0
##$ASSFAC= 0
##$ASSFACI= 0
##$ASSFACX= 0
##$ASSWID= 0
##$AUNMP= <proc_1d>
##$AZFE= 0.1
##$AZFW= 0.1
##$BCFW= 0
##$BC_mod= 2
##$BYTORDP= 0
##$COROFFS= 0
##$CY= -3
##$DATMOD= 1
##$DC= 0
##$DFILT= <>
##$DTYPP= 0
##$F1P= 0
##$F2P= 0
##$FCOR= 1
##$FTSIZE= 16384
##$FT_mod= 6
##$GAMMA= 0
##$GB= 0
##$INTBC= 1
##$INTSCL= 1.334414e-10
##$ISEN= 128
##$LB= 0.24
##$LEV0= 0
##$LPBIN= 0
##$MAXI= 10000
##$MC2= 0
##$MEAN= 0
##$ME_mod= 0
##$MI= 1.114404
##$NCOEF= 0
##$NC_proc= -6
##$NLEV= 6
##$NOISF1= 3.799351
##$NOISF2= 2.8
##$NSP= 0
##$NTH_PI= 0
##$NZP= 0
##$OFFSET= 15.99682
##$PC= 1
##$PHC0= -11125.81
##$PHC1= 16.40096
##$PH_mod= 1
##$PKNL= yes
##$PPARMOD= 0
##$PSCAL= 0
##$PSIGN= 0
##$REVERSE= no
##$SF= 200.1300029262
##$SI= 16384
##$SIGF1= 3
##$SIGF2= 2
##$SINO= 5.538805
##$SIOLD= 16384
##$SREGLST= <1H.CDCl3>
##$SSB= 0
##$STSI= 16384
##$STSR= 0
##$SW_p= 3396.73913043479
##$SYMM= 0
##$S_DEV= 0
##$TDeff= 16384
##$TDoff= 0
##$TI= <>
##$TILT= no
##$TM1= 0
##$TM2= 0
##$TOPLEV= 0
##$USERP1= <user>
##$USERP2= <user>
##$USERP3= <user>
##$USERP4= <user>
##$USERP5= <user>
##$WDW= 1
##$XDIM= 16384
##$YMAX_p= 448106962
##$YMIN_p= -423638
$$ End of Bruker specific parameters
$$ ---------------------------------
##NTUPLES= NMR SPECTRUM
##VAR_NAME=  FREQUENCY,     SPECTRUM/REAL,   SPECTRUM/IMAG
##SYMBOL=    X,             R,               I
##VAR_TYPE=  INDEPENDENT,   DEPENDENT,       DEPENDENT
##VAR_FORM=  AFFN,          ASDF,            ASDF
##VAR_DIM=   16384,         16384,           16384
##UNITS=     HZ,            ARBITRARY UNITS, ARBITRARY UNITS
##FACTOR=    0.207333158178282, 1,           1
##FIRST=     3201.44372343419, 0,            0
##LAST=      -195.295407000596, 0,           0
##MIN=       -195.295407000596, -423638,     0
##MAX=       3201.44372343419, 448106962,    0
$$ Real data points
##PAGE= N=1
##DATA TABLE= (X++(R..R)), XYDATA
$$ [...]
10343 99145 188787 180878 191146 242503 143854 139949 111267 130591 127472 347925 314165 202092
10331 202092 332548 265967 242849 281215 165656 211676 271313 275448 226476 284274 281447
10320 281447 391188 300692 311765 276957 313267 252075 243406 160930 159217 339042 404081
10309 404081 222968 184113 273190 239445 290206 313110 345070 289476 226256 267217 294497
10298 294497 249584 363383 392558 207215 262560 367156 343327 245640 108721 412644
10288 412644 302942 235329 291670 278836 379711 348750 264866 316301 347799 294287 276817
10277 276817 257881 261612 175489 77623 287493 443991 387103 398147 382009 410185 454999
10266 454999 469708 300709 213801 389227 461510 447012 301197 297466 250821 187791 78462
10255 78462 196694 329090 343908 357086 307312 268621 245470 248975 94583 218020 482343
10244 482343 303698 225018 298248 354831 384328 404441 439903 455015 367504 364842 385711
10233 385711 464734 488232 589500 465056 393589 497605 489880 435086 488112 602732 536328
10222 536328 516039 691478 702394 669841 659072 451772 532303 517272 667618 732322 564992
10211 564992 695823 543762 473897 639861 665970 605005 553896 660228 581333 662805 689395
10200 689395 649216 684312 737741 716910 659163 721831 743007 819602 842839 743758 537379
10189 537379 558811 729641 602033 545608 505986 536592 800518 810150 877839 864242 723134
10178 723134 867914 837990 791173 820331 799066 955982 1045907 875994 896489 986659 985165
10167 985165 880731 869644 861270 888672 1019154 864552 874796 954007 1025054 1078492 1118690
10156 1118690 1124028 1055045 951418 914147 1009034 937951 924327 1126689 1058252 1060235 983690
10145 983690 993449 1152735 1065461 966698 1025918 1103527 1091982 1129885 1118937 1090974 1068460
10134 1068460 1052388 1058719 1023415 1050430 1067763 1162814 1193566 1041450 1134040 1114856 1123682
10123 1123682 1260158 1360225 1259133 1230651 1297979 1318497 1362645 1382859 1210853 1282547
10113 1282547 1358091 1375148 1349505 1503431 1569672 1425681 1420773 1553309 1524566 1506641 1669053
10102 1669053 1676304 1610106 1601073 1588623 1653248 1697060 1728414 1720902 1634447 1552046 1631314 1717151
10090 1717151 1703652 1755186 1962182 1961663 1916984 1812418 1856612 2014346 2042093 2053962 2042451
10079 2042451 2051879 1958407 2037601 2254246 2361372 2248515 2249492 2379963 2405231 2365750 2435176
10068 2435176 2502909 2384810 2328396 2559052 2490242 2572816 2649466 2923138 2988113 2853978
10058 2853978 2938366 2948692 2962851 3116903 3112547 3052126 3142397 3253275 3342377 3395072 3474528
10047 3474528 3568685 3808313 3856849 3803100 3936382 4103778 4234196 4188295 4245189 4332489
10037 4332489 4314484 4513355 4777593 4776726 4874956 5015046 5117268 5140800 5345759 5582607
10027 5582607 5699055 5542657 5719734 5897951 6002960 5996105 6026507 6277811 6412753 6578684
10017 6578684 6394591 6427071 6624045 6683079 6750745 6783139 6885511 7037399 6972617 7009470
10007 7009470 7191552 7325232 7506070 7595472 7619140 7642046 7876977 7924184 8026606 8163310
9997 8163310 8171963 8410976 8489572 8661324 8688090 8873076 9092475 9081663 9167484 9403632 9668384
9986 9668384 9970814 9978895 10083902 10303754 10554365 10637590 10697897 10923399 11186973 11397888
9976 11397888 11466049 11535057 11683972 11880953 11998398 12151504 12322286 12312833 12464925 12699179
9966 12699179 12716479 12679770 12653942 12685312 12802088 12763965 12880011 12825544 12688460 12686182 12658496
9955 12658496 12794879 12818586 12858557 12830153 12662855 12641370 12730791 12723522 12616537 12806836 12857376
9944 12857376 12792349 12670344 12622528 12686123 12639673 12667739 12746651 12825122 12961481 13029703 13068999
9933 13068999 13195463 13267643 13455285 13324299 13324448 13410342 13521325 13478955 13489490 13592419 13625892
9922 13625892 13792279 13970903 13897835 13970354 14026205 13931770 14003908 14050087 14215834 14236582 14171266
9911 14171266 14320002 14223497 14107868 14166045 14128127 14091651 14104527 13965485 14030733 14190664
9901 14190664 14219086 14177496 14112430 13928132 13771653 13701335 13696236 13718177 13738920 13925305 13847004
9890 13847004 13688021 13568402 13470208 13340978 13307531 13300896 13242748 13235929 13219445 12919101 12906711
9879 12906711 12785694 12613133 12619994 12665920 12585336 12482329 12614943 12495658 12240823 12211703
9869 12211703 12130667 12179389 12063585 12116963 12105745 11958875 12149936 12080668 12050663 12003045 12172501
9858 12172501 12246336 12208714 12262378 12358353 12202007 12143781 12230219 12153278 12073153 12089829 12052516
9847 12052516 11892024 11822496 11745325 11569006 11506722 11582614 11556702 11414503 11103029 11020379
9837 11020379 10931959 10635800 10465488 10370738 10217526 10160362 10075867 9989591 9795665 9531376
9827 9531376 9353130 9133780 9068881 8950280 8797769 8700606 8560938 8308707 8199055 7990728
9817 7990728 7786880 7625208 7656280 7623908 7471291 7314984 7207816 7146382 7020768 6827816
9807 6827816 6726020 6607142 6456980 6314888 6368762 6348510 6137659 6085990 6086669 5984115 5834316
9796 5834316 5699063 5615624 5529180 5588516 5523727 5431746 5305892 5192368 5117399 4894881 4864336
9785 4864336 4970789 4888601 4716197 4727157 4355180 4228048 4308847 4248210 4129234 4113410
9775 4113410 3908085 3865112 3702771 3435795 3493655 3346681 3099444 3094487 3012081 2832467
9765 2832467 2781877 2704213 2778580 2738276 2649928 2598924 2458609 2472639 2418274 2491005 2254291
9754 2254291 2077686 2026500 2015550 2048180 2080824 1741922 1785963 1832133 1789055 1906739 1772400
9743 1772400 1635631 1437899 1449042 1556896 1518935 1316160 1262131 1487063 1494144 1525593 1469869
9732 1469869 1312351 1373895 1363894 1354784 1498044 1374752 1298004 1275112 1237072 1168174 1210545
9721 1210545 1482320 1305661 1191470 1168280 1195665 1178254 1097207 953351 1040460 870963
9711 870963 820355 956066 970983 908135 822896 939489 936133 938517 868047 780956 952498
9700 952498 793097 780528 814519 824396 703238 783866 911062 887712 829295 871476 953842
9689 953842 946740 568954 688812 741348 679485 633061 553676 524953 585441 582497 559059 495836
9677 495836 479760 574247 387577 445848 595516 602597 496032 496560 579310 574650 452579 437628
9665 437628 525556 515194 377375 345747 482341 479970 459574 415554 271403 337290 396188
9654 396188 529911 425044 624890 609655 547962 502721 371444 342016 307658 281518 220424
9643 220424 291183 364348 419356 409909 382075 417144 363290 307999 194087 218848 206862 200468
9631 200468 297719 395010 352818 349846 207061 166456 233968 235169 345396 478521 448098
9620 448098 438461 348894 286581 314568 201974 107426 317889 260650 185992 229459 240489
9609 240489 101805 191825 263462 134801 2877 43059 -84241 18989 94222 121567 194082
9598 194082 189447 203418 82274 135119 52688 31634 -62721 -8449 -185159 -109875 -10661
9587 -10661 6923 51781 59398 54081 132836 83754 25336 -20141 103859 115774 -14692 90680
9575 90680 235135 261288 229921 91854 -45622 -99254 100539 210708 83120 44077 37117
9564 37117 153070 181096 79086 172192 91846 94543 -7877 -128287 33694 57065 2753
9553 2753 -18032 35807 -2738 -9862 79255 -62991 -8156 24499 -90746 -18793 25664 66540
9541 66540 164734 200391 26424 61083 93404 -118111 -63674 83214 98316 70983 120028
9530 120028 40532 28098 204880 213892 -12071 -133901 -56409 33038 -6748 -197162 -272501
9519 -272501 -256518 -8617 45649 51336 209914 231581 123676 35184 7057 73881 43341
9508 43341 50951 217626 129184 60826 103695 161060 141372 193617 157591 216009 225015 199158
9496 199158 288095 177085 124778 46210 -62297 26350 70701 -27726 -69819 -77847 -17660
9485 -17660 38523 -94807 -115324 7418 105290 218765 95123 -45450 -46205 91274 53673
9474 53673 -40709 -122090 72576 265907 236713 177421 101323 151299 142379 155508 30545
9463 30545 41984 166023 122589 130189 163270 236377 206008 252619 164672 185657 181413 -91889
9451 -91889 -174357 -135013 -43393 -47795 -29031 -167021 -161768 7829 10093 86391 158918 139920
9439 139920 -84473 -109493 61954 48946 39112 69697 30138 -18009 34562 165917 16562
9428 16562 -146641 -26985 73686 19417 -92782 -111553 5582 -79080 -67408 2959 -42332
9417 -42332 -76685 -9073 -44951 -174805 -146173 -151576 -224793 -262308 -153159 -79343 -102597 -125708
9405 -125708 -20224 -33623 -90463 -65721 -138549 -104763 -102764 -161425 -154594 -77823 -172768 -228756
9393 -228756 -68404 83058 66876 -81321 -241960 -217201 -151111 -303747 -213952 -212915 -208481
9382 -208481 -240244 -242113 -306085 -402843 -220531 -201677 -229989 -289210 -133587 110150 25537
9371 25537 20679 -1772 -46192 37846 -238563 -313882 -117786 -21999 -86201 -151785 -153197 -240310
9359 -240310 -64077 -58448 -82853 -151070 -205656 10112 -37541 -121781 -56378 -147003 -93031
9348 -93031 -277154 -134770 -173959 -95114 -89965 -101123 -95992 -101725 -102868 -28956 90173 -35441
9336 -35441 -29281 -92328 39829 -74309 -150585 -158171 34945 -42815 -97130 -55974 -131850 -191658
9324 -191658 -133549 -217784 -270464 -316923 -91020 82738 -83824 -148505 -218802 -110952 -76433
9313 -76433 -122480 -93296 62833 -30219 -156416 -264073 -357852 -293618 -179340 -178791 -154626
9302 -154626 -107662 -186025 -41204 -39844 -116582 -74975 6963 -81549 -148400 -95157 -165672 -145256
9290 -145256 -93051 -13949 72848 70017 -71238 -62557 -14167 -20492 57192 116270 144244 147530
9278 147530 121899 17367 50921 20133 2320 -39320 -141801 -125583 -74475 -151707 -153532
9267 -153532 -87906 49913 -74423 -110916 87298 69916 -23275 -39876 -28810 -127819 -52529
9256 -52529 71107 73916 -112090 -154258 -40537 106508 -7405 -21581 -9911 -90279 -131731
9245 -131731 -77683 -181741 -51992 17842 -98064 -56390 -4312 -110551 -173709 -143649 -68252
9234 -68252 16521 -132047 -183529 -80702 -157135 -181718 -101809 -164497 -140411 -58434 -3812
9223 -3812 8119 264978 194742 227667 183657 12483 43653 84857 5078 -60580 -171631
9212 -171631 -89244 -163587 -215248 -106215 -99142 -11121 -10651 170340 54529 -72476 -7111
9201 -7111 -15918 -46129 -44191 -17453 64540 -18439 44530 77850 53824 156602 113239 27445
9189 27445 61234 8726 -8308 -11053 16257 15474 38549 -78166 -32163 99615 -10010 59724
9177 59724 92346 109027 54748 62632 80432 1313 12059 -1578 -45946 23366 14006 106904
9165 106904 98690 35876 -80262 -48319 -6348 131169 156097 15570 -29386 -36406 -25956
9154 -25956 -52641 -39830 91404 -40916 -63285 -60870 -96871 19137 78309 51033 3853
9143 3853 -26822 -20290 -159128 -161380 -116021 -138226 -214339 -164208 -93945 -133382 -38106 -56249
9131 -56249 -82496 -227091 -134990 46181 -58246 -83262 -173990 -171701 -110662 -121134 -64814
9120 -64814 -67333 36495 -25516 -114756 -6951 98191 -83694 -204334 -134057 -98185 -67095
9109 -67095 -84742 -40935 129968 89521 198697 104375 205771 268300 126754 52843 80587
9098 80587 248499 112903 7743 129559 175936 344464 307437 243660 68479 37877 175652
9087 175652 283090 293512 219920 196143 190137 136097 47813 30843 46365 100743 131872 72448
9075 72448 77974 4134 96790 2269 175005 121258 57508 159208 135775 183354 247798 267851
9063 267851 204951 220070 166205 373045 263198 113582 272868 401539 346927 207222
9053 207222 279243 298753 352499 394294 242236 437377 467059 376037 227870 262698 298324
9042 298324 428920 599847 789227 742037 767408 830989 920520 1061090 1111975 1166183 1385622
9031 1385622 1490214 1801522 2024387 2028427 2230000 2203801 1717919 1305803 1061203 884144
9021 884144 696834 667057 594594 555843 453528 377735 412212 454115 485277 375132 277157
9010 277157 340217 155636 109339 332953 340906 268308 137493 280960 260797 164822 204477
8999 204477 183105 244949 311545 242820 93964 -67508 -45646 27152 120136 124240 55632
8988 55632 27964 -1684 106268 62955 105927 164582 86525 -12327 -34002 152364 24785
8977 24785 10915 55359 -82673 -68413 -85909 -59263 103700 183380 90565 -45995 13414
8966 13414 -44184 -55388 128611 139998 75441 162686 249944 279797 161644 175636 156988
8955 156988 32533 85272 198087 168837 127143 107764 218583 228292 350990 163552 23216
8944 23216 130238 32850 31872 161750 65094 230848 243504 237560 254067 189187 202410 171003
8932 171003 129129 163616 201709 165364 48095 -53592 103804 170592 160598 176074 170234
8921 170234 177842 165943 138400 207859 218656 205183 171094 236047 268132 255767 69825 -31336
8909 -31336 2009 -99873 -45156 91352 170867 146009 127733 149189 -5026 -34418 -4041
8898 -4041 -8913 68420 140591 53408 62227 12595 96074 176800 199252 59328 82066 1143
8886 1143 -28131 -86768 -121100 -93361 124955 250415 161603 108836 191816 35144 -83552
8875 -83552 50199 119829 260279 21699 27743 115588 60827 2621 -72360 -150571 44860
8864 44860 60758 83984 -41960 -148261 -42161 111359 159858 88499 56566 96372 104903
8853 104903 -13712 19039 88043 77019 16845 -35173 -67238 -3932 8284 -41069 -140599
8842 -140599 -129935 -95588 -61820 -11377 49693 110841 50945 -57314 -121371 48573 -36428
8831 -36428 -81178 113583 89867 2774 74675 32305 65941 57443 115958 58105 -40013 -48288
8819 -48288 -46298 33283 194940 296625 151552 10738 99357 110977 -15663 -52322 68444
8808 68444 213212 193666 238141 273368 235618 107062 168830 33180 75828 138879 26295
8797 26295 83838 192096 102070 139090 119763 157423 108995 98864 56132 80675 249826
8786 249826 246572 110405 7307 130095 185897 156050 179783 14736 -101347 66803 137861
8775 137861 78606 128459 140711 92461 94388 92561 93315 25579 38057 51163 47367 204181
8763 204181 283617 65884 13885 12841 14925 -50391 33582 125878 52178 -38179 121068 307294
8751 307294 229844 133750 209861 290658 161780 126871 161398 78631 164879 123744 105898
8740 105898 368021 406853 288350 172274 91294 205555 160951 198829 290411 231322 101418
8729 101418 146056 135589 116837 84997 15669 73397 124590 79143 -16436 71060 104469 10666
8717 10666 129629 139743 -69348 -118087 48647 120378 69618 110243 176524 37714 77225
8706 77225 107749 18465 -41303 96752 210040 91264 160852 182332 284533 142366 114268
8695 114268 104528 -48574 -140107 -47159 62100 108912 99134 195429 115949 150583 231276 238153
8683 238153 271689 267436 183711 235781 246462 236479 291326 260451 311002 296150 353455 408364
8671 408364 228890 167671 172807 117757 9435 -82436 11567 18969 -86682 126561 171860
8660 171860 79668 166508 324338 279918 108253 224869 227171 121699 40325 147691 160692
8649 160692 237799 353115 284505 312990 362264 210600 166405 94000 125304 206131 148258
8638 148258 187989 216592 185068 21432 -37024 73924 108384 92417 110571 30499 99398
8627 99398 251441 242936 340059 372851 305487 225073 211526 230861 283665 168739 270550
8616 270550 338502 249418 317518 302809 270533 223724 117843 195309 209632 160033 206449
8605 206449 247692 159402 168624 196273 241735 256312 246891 241374 245141 207036 354976 554092
8593 554092 405968 269115 137726 149052 153670 191383 278264 220150 98637 168986 415635
8582 415635 351665 314541 284379 274828 201610 247038 199528 165060 309251 312930 256978 188007
8570 188007 346476 431224 466956 467699 419173 359191 307564 277083 210011 329546 427825 360339
8558 360339 365065 387051 448728 454100 385397 585313 556898 457061 437452 339006 451931 537342
8546 537342 545699 534741 548400 518922 611038 441599 504507 607575 587906 508143 530175
8535 530175 531874 626036 672729 674101 642617 554800 564950 641965 611185 586186 567627 684229
8523 684229 671642 695817 713758 491568 325681 383014 597461 731579 729163 722540 619652
8512 619652 568139 410285 424483 521119 632865 599277 477421 482331 512713 650207 522099
8501 522099 588992 571156 469201 616973 732050 651756 560831 629561 694318 623944 628451
8490 628451 526738 580808 662742 647603 575774 536434 447191 411504 504008 661834 496483
8479 496483 414389 420574 405398 550453 582375 639811 613639 567235 611354 631003 607100 634777
8467 634777 808829 877970 839168 877389 938960 833300 668072 576515 736678 697725 649935
8456 649935 734754 573582 484472 559373 604348 563507 489042 690995 827327 616243 583528
8445 583528 774389 653306 584274 581798 595635 722137 678511 498080 632748 715237 781832
8434 781832 705502 596053 603895 727855 690519 611042 781461 851482 874690 737665 686188
8423 686188 742281 762840 759193 761709 822980 816232 816731 823859 823518 858138 890181 918486 1004320
8410 1004320 1043800 1021598 909412 973206 950863 947827 1002220 921041 1036785 997688 982635
8399 982635 881400 912163 845311 728608 647180 852244 923055 983115 1091455 1060474 1079728
8388 1079728 1026969 1044993 1144973 1278583 1294337 1256687 1239941 1195005 1269289 1204888 1285128
8377 1285128 1443794 1472757 1466997 1454366 1494251 1559081 1485190 1629346 1669611 1770605 1809106
8366 1809106 1836265 1983579 1932686 1809958 1897331 1894099 1827583 1916925 2065000 2165274 2159981
8355 2159981 2292858 2254018 2324633 2405371 2425756 2428106 2556435 2544433 2582307 2737100 2653509
8344 2653509 2670448 2789268 2960624 3004243 3007736 3088739 3172058 3089290 3245930 3395830 3336220
8333 3336220 3314305 3504897 3632112 3780659 4077323 4119051 4231066 4333521 4421522 4702251
8323 4702251 4974155 5060008 5356277 5473567 5747215 5965316 6290387 6641926 6901260 7220649
8313 7220649 7632478 8170292 8835371 9479755 10006001 10627717 11602903 12460672 13182833 14260066
8303 14260066 15473276 16849804 18198741 19321643 20581729 21868232 22700272 23211085
8295 23211085 23561465 23504853 23100066 22430421 21408831 20324284 19022943 17642217 16355562
8286 16355562 15207009 14133179 13381532 12786831 12331436 11974871 11750162 11725783 11696874
8277 11696874 11560789 11572726 11759075 11938071 12312056 12654313 13165528 13636399 14241778 15095532
8267 15095532 15918479 16872642 17944352 19176176 20405669 21796555 23218459 24714173
8259 24714173 25838387 26687536 27199875 27264941 27194282 26639479 25369723 23962159 22412847
8250 22412847 20750590 18983551 17248276 15647593 14206431 13033075 11840294 10854826
8242 10854826 10206909 9649999 8936068 8467973 8042581 7769213 7286541 6870746 6618564
8233 6618564 6547165 6451547 6123205 5891427 5691782 5471039 5212246 5038052 5019411 5029271
8223 5029271 4936277 4725134 4639155 4423874 4552349 4561996 4497129 4390157 4290249 4262418 4231650
8212 4231650 4246256 4249622 4238425 4194369 4130492 4106563 4091098 4094224 4072030 4178411 4291951
8201 4291951 4312152 4163435 4232839 4019718 4097939 4359739 4578972 4664146 5518287 6024691
8191 6024691 4369641 4228334 4092990 4174231 4331704 4420439 4495037 4649712 4673285 4812827
8181 4812827 4962537 5033327 5041290 5112923 5516450 5724196 5935227 6110452 6366566 6721805
8171 6721805 6991300 7237958 7517158 7952155 8493392 9086743 9564932 10143660 10841874 11562933
8161 11562933 12556956 13498848 14535312 15765096 17236279 18694288 20220608 21405152
8153 21405152 22498512 23357136 23991983 24343440 24421620 24158874 23546284 22729306 21630916
8144 21630916 20422774 19152841 17671156 16330691 15107412 14201540 13397262 12865811 12541785
8135 12541785 12227387 12030189 11919923 11992974 12219420 12384759 12629913 12969030 13554717 14154980
8125 14154980 14806409 15705573 16755658 17955722 19220625 20567886 22074008 23700397
8117 23700397 25285358 26769167 27881078 28373545 28259563 27841796 27076173 26106171 24986262
8108 24986262 23564267 21961701 19910220 17929435 16169867 14558365 13145900 11955531
8100 11955531 10753391 9867144 9202698 8460787 7837494 7418553 7085456 6592350 6427663
8091 6427663 6103349 5681665 5487188 5331968 5132602 4925725 4709312 4515681 4191915 4260536
8081 4260536 4054419 3834388 3662039 3569047 3627026 3743053 3462866 3243722 3018337 2956559
8071 2956559 3053746 2925429 2837248 2909906 2756912 2663085 2758475 2674875 2578738 2588224 2616326
8060 2616326 2560212 2480358 2361242 2341301 2157545 2158607 2036346 2079135 2067325 2040022 2039582
8049 2039582 2046353 1940899 1916898 1967616 1855926 1883166 1824909 1613503 1564475 1630264 1694071
8038 1694071 1590442 1588709 1622306 1587652 1548963 1483944 1582708 1454670 1345765 1564593 1514378
8027 1514378 1500155 1455239 1443511 1431700 1430198 1535458 1576883 1410449 1352652 1415551 1412235
8016 1412235 1346538 1282137 1262771 1337951 1276020 1258195 1284150 1342662 1489873 1453534 1342501
8005 1342501 1219831 1180743 1156697 1162370 1182691 1087240 1178874 1312610 1381131 1407481 1259156
7994 1259156 1223440 1176742 1216038 1369168 1395133 1316098 1371820 1393553 1515804 1360878 1275829
7983 1275829 1398153 1411679 1588471 1607920 1510020 1678680 1540392 1563500 1536577 1544829 1657294
7972 1657294 1649444 1644181 1682699 1587444 1592065 1668703 1780954 1768689 1748973 1856870 1837534 2024530
7960 2024530 2056507 2192775 2073380 1894775 1889943 1928819 2075779 2154625 2294387 2385753 2532647
7949 2532647 2520448 2437864 2433057 2485592 2595525 2689408 2777303 2857060 2983486 3063273 3114672
7938 3114672 3067939 3173356 3334018 3492186 3479671 3560463 3636790 3789798 3973266 4137700
7928 4137700 4148973 4269310 4595158 4855929 5002782 5236308 5524729 5776150 5996513 6360550
7918 6360550 6847887 7288721 7786751 8377941 8824995 9439764 10186526 10938969 11581922 12105445
7908 12105445 12570644 12774128 12899867 12771917 12977164 12851025 12540809 12205895 11640027
7899 11640027 11021731 10492512 10223465 10192878 9966446 9833999 9934727 9967012 10148915 10494503
7889 10494503 10697032 11032229 11503608 11841064 12336430 12984642 13796728 14720512 15854969
7880 15854969 16825879 17892308 19158842 20462066 21746925 22920532 23610646 23904997 24158255
7871 24158255 24133456 23977429 23517083 22930727 22128717 21155599 20152766 19164992 18016728
7862 18016728 16904788 15868642 14843657 14111643 13447910 12995449 12628116 12206007 11860132
7853 11860132 11761000 11727875 11710594 11849244 11932240 12095721 12296077 12504016 12955898 13525754
7843 13525754 14249524 14813341 15550522 16306133 17116671 18036011 18674577 19190652 19520121
7834 19520121 19387478 19155232 18743789 18293736 17798731 17188735 16412274 15476927 14568169
7825 14568169 13611198 12810947 12089952 11554864 11186661 11110990 10801950 10529653 10423644 10552186
7815 10552186 10646512 10828089 11034172 11233618 11612394 12102240 12579947 13125794 13739713 14461220
7805 14461220 15318136 16284168 17410818 18796653 19971982 20891098 21950481 22620711 22674650
7796 22674650 22517418 22137692 21663932 20823140 19615263 18162836 16707146 15554317 14537891
7787 14537891 13828224 13167300 12617983 12281150 12026965 11655546 11547789 11652166 11751885 11886957
7777 11886957 11985096 12320581 12825013 13300674 13891011 14520583 15320679 16319130 17524319
7768 17524319 18811902 20003877 21365938 22738924 23928638 24877199 25330175 25520033 25326522
7759 25326522 24790532 23826619 22652151 21019993 19269211 17642684 15959425 14501555
7751 14501555 13249988 12068231 11314414 10863152 10343041 9780504 9526822 9310593 9053508
7742 9053508 8705650 8632963 8529396 8343797 8259190 8416658 8533917 8690968 9094966 9255039
7732 9255039 9507356 9955856 10469669 10948175 11328929 11575690 11555702 11319820 10947509 10360199
7722 10360199 9632584 8892727 8126831 7331559 6806282 6238080 5731038 5179427 4596969
7713 4596969 4472864 4407288 4105801 3921788 3863341 3601692 3449110 3242043 3057996 2939976
7703 2939976 2821416 2873525 2775196 2620342 2559832 2546189 2399472 2266476 2130865 2295208
7693 2295208 2224643 2064596 2001723 2005451 1791516 1745906 1751328 1650175 1695856 1553842 1324931
7682 1324931 1278781 1246711 1268790 1116295 1168330 1264512 1173651 1139313 1057645 1045550 971639
7671 971639 1082542 1147713 1122570 949917 688091 679141 861754 880751 866234 826245 770341
7660 770341 736146 693157 605812 595409 656023 610894 610986 721634 695878 542863 493790 504836
7648 504836 532075 566534 530709 484093 574137 433723 500084 405878 393244 443878 368447
7637 368447 212315 289046 317923 244714 310372 416700 391601 418348 507826 403775 317812
7626 317812 268252 201453 161565 238414 279946 305037 293201 265305 313235 334780 141470
7615 141470 174202 109848 232898 170266 286327 302476 235050 212892 88286 198506 271036
7604 271036 88622 141712 146499 188671 228201 237909 342915 230166 147392 130662 129894 101218
7592 101218 180060 179245 137587 99959 33680 -88362 -39697 -7271 -36981 -52471 -149290 -210187
7580 -210187 -17492 165294 70145 15716 -87800 -6591 175963 143183 130324 110345 24039
7569 24039 80989 146504 223510 152076 -83201 -136470 -156536 -107668 1282 107611 28224
7558 28224 114557 149219 17780 40242 -16479 -80298 -97115 43389 36329 75361 112098 5672
7546 5672 -97258 -82860 59838 18094 -40085 37212 99923 92179 127073 105587 92531 -15580
7534 -15580 -119807 16390 82746 91856 -61241 -40022 -19469 -106892 -131413 -105467 -117499
7523 -117499 -123968 -71686 97400 6696 -78575 63189 17879 -77167 -228211 -173216 -177780
7512 -177780 -89928 -68838 -199483 -77770 55624 -26584 -125635 7159 -17055 -36731 45046
7501 45046 -49194 35305 86770 -33781 -21495 12357 -81916 -82810 -77628 -196549 -103452 -97415
7489 -97415 -109725 -985 -61770 3016 -21695 -65198 57914 87001 15446 -1922 -37125
7478 -37125 -159127 -118578 -109131 -180221 -177702 -209018 -167487 -159269 -65161 -174062 -106208 -139331
7466 -139331 -151053 -135690 -210272 -260678 -186027 -60484 -58120 -14468 -45768 -146401 -118707
7455 -118707 -35037 -3154 60437 58032 39525 18886 -84308 -152853 -227297 -313204 -177763
7444 -177763 -115935 -45511 89929 -70256 52673 56653 -180654 -184869 -227934 -187551 -127898
7433 -127898 -256195 -319091 -129676 -163993 -109221 -89803 22910 -50115 -199604 -266532 -251994
7422 -251994 -132769 -154407 -227306 -177437 -67927 17377 -71170 -215941 -63352 -72565 -102313
7411 -102313 -223270 -124405 -12083 108821 43613 24853 4238 18058 -43314 -184558 -27102
7400 -27102 -198047 17017 -41538 -136469 -58749 -105346 -44684 -6824 -40473 23698 88397
7389 88397 -25810 -249257 -252203 -82512 -112048 -2438 24104 -135752 -42132 47397 -98101
7378 -98101 -109309 -31344 -120914 -132101 -181479 -24131 79373 -53026 -158647 -232324 -26880
7367 -26880 -3195 3840 -54404 -99285 3337 88150 -87152 -188253 -134484 -116102 53025
7356 53025 74790 -54725 -182012 -45136 -84322 -161369 -116966 -138310 -205311 -171815 -108988
7345 -108988 -128643 -100229 -151051 -186349 -99914 35443 4012 -338 68108 130005 113565 17642
7333 17642 -155008 -184199 -178379 -190735 -188545 -180836 -179637 -99368 -73276 -11067 91231 12550
7321 12550 51511 -56870 -101435 -51170 -168430 -181036 -198819 -317182 -263976 -174312 -103795
7310 -103795 -213719 -169641 -121404 -241790 -108397 -17012 -82206 -53450 -32100 -30230 -57652
7299 -57652 -157496 -39208 52759 -3854 -50748 -160811 -60856 -143298 -232960 -243577 -193059
7288 -193059 -337111 -332893 -138536 -187385 -316503 -176629 -121230 -312222 -271867 -224463 -198350
7277 -198350 -130496 -34644 -24429 4811 -224300 -151101 -146448 -63799 59059 39085 -41379
7266 -41379 -139385 -75338 -26454 -81095 -47665 -103500 -76148 -43440 -110494 -70800 -147544 -60623
7254 -60623 -101393 -299846 -310833 -117471 -241332 -369277 -365763 -400067 -400155 -314742 -57399 -2711
7242 -2711 -128031 -143832 -243070 -230393 -151912 -173426 -262821 -218264 -298926 -248075 24027 -37049
7230 -37049 -134672 -179383 -211052 -304190 -359122 -235877 -85306 18009 -97248 -85669 -11284
7219 -11284 -58146 -187791 -207134 -92653 -160946 -270322 -315497 -217948 -239488 -208407 -85343
7208 -85343 -77624 -250032 -167583 -66175 8916 -27571 -123905 -246725 -203649 -150903 -179020
7197 -179020 -249342 -178722 -76089 -249133 -313036 -210364 -38785 50827 15344 28630 15985
7186 15985 -113840 -263245 -35208 50691 -103388 -164480 -199888 -221856 -244858 -128560 -302742
7175 -302742 -223613 -165867 -240030 -180568 -228903 -94502 -227421 -261220 -326765 -293446 -132874
7164 -132874 -36580 -53456 -64276 -71187 -23312 -74024 -83055 23632 -50015 56396 -75914
7153 -75914 -22726 -2063 -47498 -88299 -64768 38873 73903 7135 -140195 -153702 -67001
7142 -67001 -125918 -77634 -156417 -155310 -214600 -293698 -205253 -54841 -203155 -200876 -250397 -296794
7130 -296794 -225048 -124498 -112825 -200285 -254271 -269366 -126120 -175331 -187166 -147441 -118397
7119 -118397 -94515 -249694 -246750 -236413 -184056 -108711 -46443 61853 -59024 -77922 107308
7108 107308 124542 -22267 -94231 -36458 -94100 -239978 -68062 -8548 57909 48344 20747
7097 20747 -27116 -109386 -159368 -146060 -99370 -59423 72222 -42180 -18481 -93135 -151974
7086 -151974 -92034 -143114 -74812 -140084 -245086 -362000 -268530 -289843 -344764 -355848 -259359
7075 -259359 -211717 -124036 -222329 -225300 -173134 -226037 -217405 -242029 -204426 -261280 -201522 -257404
7063 -257404 -358282 -306313 -195037 -178308 -225224 -241378 -343598 -271639 -293049 -226243 -100455
7052 -100455 -73021 -80716 -130697 -190970 -131123 -112297 -32469 -94699 -210122 -137684 -92308 -75962
7040 -75962 -265699 -259017 -215188 -215481 -172402 -76152 -256954 -280187 -82876 -34923 -174282 -250044
7028 -250044 -98241 -13957 20828 -27932 -137371 -141587 -224786 -143660 -111074 -73686 -34553
7017 -34553 -105807 -168334 -162968 -148138 -106933 -130110 -74652 -92769 -62194 -71749 -62199 38037
7005 38037 18066 -2565 5390 88282 -81039 -90141 41470 32333 -63223 13781 -113673 -105874
6993 -105874 11929 -29727 -100710 -138176 -39885 -77319 -267890 -214696 -79119 -40875 -156478
6982 -156478 -122756 -49133 -61750 2800 -100204 -160128 -44593 -36801 -157376 -201834 -126591
6971 -126591 10678 32965 -74187 -49435 -69353 -198929 -166317 -59690 -13428 -52185 -151911
6960 -151911 -166829 -125407 -301713 -230273 -152714 -168428 -39982 -152528 -239197 -211910 -197730
6949 -197730 -289698 -199923 -178974 -124522 -72674 -110901 -213688 -135551 -35863 -142254 -178112
6938 -178112 -220266 -113987 -127021 -191859 -104274 -62241 -153912 -44918 -17153 -175518 -151825
6927 -151825 -41505 -227483 -261351 -254705 -113916 -117299 -255159 -263742 -198041 -96619 -57594
6916 -57594 -52129 -34242 -64621 -55628 -1135 -135260 -140132 -149134 -91304 -191935 -137381 -60333
6904 -60333 -151737 -130591 -199612 -181354 -152911 -112364 14908 -92829 -190697 -110257 116950
6893 116950 15530 -143454 -169292 -85781 -100851 -261166 -356475 -116762 196669 122134 20745
6882 20745 -14053 31903 131672 51354 -23400 -10136 -154475 -148261 -106160 -122943 -46373 -24794
6870 -24794 4105 -6139 -164009 -202529 -174319 -90479 -27023 -62772 19987 27356 -16059 79288
6858 79288 -28676 -92359 -228160 -166659 -79092 65216 -91952 -116328 -86509 -69457 -31049
6847 -31049 -40045 -163547 -136941 -128843 -143970 -161156 -360737 -259256 -201349 -187202 -142617 -147615
6835 -147615 1268 31950 -179936 -204183 -68849 -117071 -121994 -53034 30665 -21632 -90932
6824 -90932 -167988 -148103 -9966 74591 41782 -89225 -121823 -147509 -53225 -43914 -117563 -18122
6812 -18122 103479 -2115 -174562 -145281 -98307 25748 -145819 -275953 -190716 -139208 84748
6801 84748 -165051 -224770 -223708 -166933 -127954 3016 113651 62325 -87865 12910 -65002
6790 -65002 -125704 -109779 -121118 -27403 157285 128383 42298 -53428 -99389 -143787 -72192 -40615
6778 -40615 -128302 -115057 36995 14736 -19691 -194036 -106856 37077 -755 -65978 -22619
6767 -22619 -8343 -33166 -117153 -91327 57064 -22568 -107520 -120418 -110218 -122690 -79777 -10125
6755 -10125 -39806 -111177 -28291 -17433 37838 -3106 -42294 -174716 -216346 -185244 -27744
6744 -27744 -185100 -195279 -166639 -138386 -148881 -230640 -269611 -107180 -32708 -10966 -19575 -161421
6732 -161421 -172907 -179447 -117116 -84444 -99815 -147234 -106502 -29088 -17357 -76794 36284 70928
6720 70928 45454 -68734 -147486 -13700 -28989 -2317 -115603 -2092 -22338 -178909 -141855
6709 -141855 8733 -45751 -62186 122523 130157 93882 37226 -129169 -76873 -3888 -109997
6698 -109997 -251718 -189421 -75011 -174869 -207412 -155189 -95884 -10547 -37590 -49513 -36086
6687 -36086 -74603 14710 52677 -86400 -151153 -16536 73852 138365 105610 13170 -6593
6676 -6593 93986 37935 1913 73170 -89904 -89225 3913 111277 230985 187971 76183
6665 76183 48893 111817 93004 152295 164583 44745 84846 101831 172245 192672 219066 71223
6653 71223 96422 219865 73089 104421 231186 156276 168033 166093 111123 34388 -38630
6642 -38630 79297 24723 -23373 -18392 -32380 71556 48706 7558 -25096 58990 91617 -90136
6630 -90136 -109263 -21061 53091 5023 -67860 -93079 -37700 94170 143934 20901 -35667
6619 -35667 -74053 128938 142286 91941 -40231 -107362 -33845 47041 -29476 -135200 -70147
6608 -70147 -157273 -178151 -31728 -51809 -84565 -126729 -19022 -180364 -148497 -3770 87489
6597 87489 87437 103197 186238 91170 3153 -48346 -106233 -67006 -75695 -68262 -103719 -67921 95064
6584 95064 109111 188100 219040 61317 -162752 -170057 -90020 -110361 -123592 9722 39642
6573 39642 215080 124124 -35993 -74387 -152880 -57903 81683 160458 -35194 42742 165645
6562 165645 208217 192892 77669 149759 40767 86119 156050 20383 -62216 41191 61152
6551 61152 111091 72965 29431 -50896 150645 36225 -69350 14002 -21361 89909 -65774
6540 -65774 -110036 -21279 -68476 87058 98059 108158 -645 -112026 -126525 -18323 117092
6529 117092 93196 -32262 -115159 -13658 -67178 23532 89076 154746 107373 30620 33601
6518 33601 166823 68214 -159591 -105825 8657 -94802 56384 185687 199602 206577 29899
6507 29899 -30004 147356 223821 117308 70756 -9775 106230 123666 84305 171869 232750
6496 232750 165243 36061 79920 144164 105758 218448 228785 85875 -42146 -52485 2339
6485 2339 38643 55940 -39680 55457 9148 838 -43641 -135883 -72985 33885 73117 59998
6473 59998 94623 13617 -4486 -30922 -32004 17274 65173 56342 74747 49167 88118 165071
6461 165071 292247 307507 292533 189727 273361 253731 159484 28397 118949 98244 6822
6450 6822 109674 2756 70880 98698 -18326 64510 116978 -146 34618 81528 -62950
6439 -62950 -73230 -23372 12219 -4194 39554 4289 -188532 3501 -52576 -1689 -38948
6428 -38948 -119472 -54026 5128 -82524 -63174 55572 52352 -55300 -45560 98971 169550 69200
6416 69200 76543 115517 130666 -83328 -177567 -33262 209765 172209 64641 160806 -7941
6405 -7941 -125509 -18154 -7272 -80541 -35129 41056 28135 58028 -17303 -44766 -55070 -81539
6393 -81539 -115981 24927 -25731 -85515 86283 104434 118272 60310 13716 -91841 -7805
6382 -7805 37313 33015 56992 138902 170261 186469 273049 234362 131319 142031 197270 225779
6370 225779 102614 28512 51635 26439 12180 48387 245591 167249 -55057 -43884 234035
6359 234035 202601 127151 46329 -4269 14719 -68723 145642 81776 193304 121312 135628
6348 135628 139747 56729 -42408 23236 -16193 -49933 34053 51392 -15663 -120161 -78454 291782
6336 291782 315469 193094 57301 90898 41156 99778 -27875 -190634 -124824 -29842 126598
6325 126598 203086 77959 142340 225157 135190 231237 179683 74635 -46926 -60707 -101108
6314 -101108 -6224 6751 -79980 -104609 26402 45719 103148 206478 60170 -103033 -158477
6303 -158477 -152271 197005 104190 12060 -76103 -38490 -82692 19633 118729 49681 108695
6292 108695 101574 -89258 -103592 -59275 35435 144376 32564 34749 71094 52612 37872
6281 37872 104070 243214 149630 78671 33329 56513 81834 -713 10800 68574 106774 138142
6269 138142 162305 290307 235748 57992 157072 193162 100765 34311 -71537 -52927 31738
6258 31738 -40090 37889 114840 114306 92807 187157 111203 154686 247757 115744 -30134 -97849
6246 -97849 114128 109369 157304 50133 -62679 -33926 130300 42555 14461 126787 128468
6235 128468 130792 201961 80187 115804 159002 22944 61817 -1992 35380 102496 -15605
6224 -15605 -113244 80596 47964 145643 26047 41976 150545 283579 311633 260022 187787
6213 187787 136326 189803 -27519 -78953 1153 14534 -12394 44010 196386 210755 224810
6202 224810 157757 152750 223855 259463 215606 197366 299407 313427 258010 388674 345637
6191 345637 396873 293269 124637 188214 203049 99667 55682 33419 62290 218471 194785
6180 194785 218112 316286 159103 227534 258070 163946 107556 151293 122023 215008 371125
6169 371125 321927 242613 211457 218708 147709 72389 50922 94743 68756 174644 233952 175001
6157 175001 166280 200517 65606 74233 124126 92157 93590 73659 -57694 64358 86882 136596
6145 136596 264876 201051 214289 245632 154961 229228 208002 215500 268846 248432 243228 240642
6133 240642 338891 278136 106325 84620 114130 147375 277699 248528 132928 224647 182741
6122 182741 83823 118179 152121 258373 216678 180649 85313 2328 137125 232693 239757
6111 239757 250861 315728 255257 39794 196579 294899 304818 273965 186317 -7137 58384
6100 58384 9214 121226 243160 247345 264207 128180 161990 258927 157041 88906 19360
6089 19360 66 77076 -32734 102909 288241 160517 70374 42231 14456 6392 45026
6078 45026 -5985 -53971 109944 20742 177509 255346 215972 131890 43133 94209 118956
6067 118956 71401 215405 192878 226493 139559 137280 150460 152815 93699 124890 27689 133312
6055 133312 297858 218648 60085 143409 253101 150867 30043 73392 277547 447966
6045 447966 429825 369077 361676 195181 195610 267710 282468 271176 270164 290261 461549 473941
6033 473941 455334 378824 318623 337656 268739 95149 82566 194427 105598 217211 238671
6022 238671 219072 151355 234609 422671 363698 277736 293713 335643 294503 235416 111568
6011 111568 182554 218126 211213 273842 231703 212644 307071 193266 253539 193546 134294 231205
5999 231205 338360 297684 188613 214570 330188 225932 6114 87922 254322 314185
5989 314185 189236 193774 228987 269655 327170 398007 485272 392531 370172 295479 200494 192346
5977 192346 266515 312046 502926 466150 339159 192762 282707 327619 285232 231655 299368
5966 299368 460658 513009 476673 331819 353190 263644 198697 361623 390233 441938 441166
5955 441166 383653 488865 521470 602330 656653 647223 539921 472490 565071 543862 507850
5944 507850 466178 456759 422055 437433 519505 549390 389073 519699 472762 508913 567002
5933 567002 549679 474592 432810 470283 381485 483721 564313 556114 449822 364601 349083
5922 349083 315865 211699 293588 394224 377410 287592 250784 287147 223464 207020 267617
5911 267617 398154 432100 452102 433982 342927 352849 317139 317988 168970 224211 141515 104583
5899 104583 27134 141436 225572 104565 155441 237503 345350 425225 357931 203224 262089
5888 262089 289990 123113 140897 79894 187655 363705 303072 139546 241690 316271 297501
5877 297501 188016 233651 267944 168458 166710 153085 136978 286292 329832 385188 413040
5866 413040 507941 294813 195268 370708 476736 418455 221879 319728 241576 251487 304747
5855 304747 378144 389090 386525 500158 425257 446142 474533 406936 97110 72762 282236
5844 282236 269902 369358 281078 278294 295654 376997 420348 271233 281845 256820 300128 332812
5832 332812 278624 427313 458534 473074 399885 368535 274538 241434 287791 287281 308353 369503
5820 369503 439531 545209 408401 177523 98073 202450 329065 317154 444266 380492
5810 380492 437169 397746 345868 389192 374816 307592 424338 429986 426960 444629 533382 469190
5798 469190 272079 243867 330455 389459 208948 269540 282402 188407 153844 282547 432567
5787 432567 348309 314179 333853 180842 212330 143248 277793 250080 265745 348961 377830
5776 377830 278559 223151 273490 354233 363424 338959 233939 221234 266288 370291 461916
5765 461916 455945 293926 258568 353733 366526 367974 404884 518245 472172 384536 388263 371983
5753 371983 457481 525818 374554 370899 355956 407381 452386 520039 544311 513766 453399 427124
5741 427124 516637 560199 468585 469830 441195 286725 380140 447835 465891 527765 496572 467721
5729 467721 458239 420188 291384 366797 532343 552810 507111 386622 480193 700109 619250
5718 619250 531983 697865 660939 606839 632966 655242 651812 510824 448915 346991 439063
5707 439063 447673 463982 509109 322385 365053 348441 383528 607497 409140 362916 483066
5696 483066 565019 594202 626367 519007 471131 582095 382669 392716 302239 437105 450595
5685 450595 293310 175843 138103 331827 445396 507489 536606 524864 615349 565477 591861
5674 591861 578560 416887 552461 718799 691569 638564 634107 680083 690771 500932 527365
5663 527365 450998 722007 766131 666912 621319 558049 559586 679690 673217 650949 742182 627412
5651 627412 713739 740700 736839 748563 713021 818566 870941 730190 675088 682940 662211 636537
5639 636537 730418 831364 926228 768119 685872 721168 625640 759844 788878 818074 639942
5628 639942 659455 698022 679393 714039 879461 862603 827948 920839 862271 778646 717429
5617 717429 731512 765447 721741 881917 756329 691275 860583 863674 785502 860782 860071 884632
5605 884632 873248 895086 744521 775566 909149 826131 819110 654583 762299 895466 968118
5594 968118 813258 792872 768060 797660 813252 943745 895152 807775 814720 859954 881603
5583 881603 794904 893717 932944 928311 964161 917994 1012354 1009921 967542 867153 745197 673413
5571 673413 899427 1079862 1134465 1041355 965780 896094 1006688 966494 820872 792132 796151
5560 796151 863991 849582 853209 873994 750190 639671 786748 887848 902945 951089 932057
5549 932057 988606 1056598 1062280 965491 921807 996782 851457 854093 1007970 938019 780387
5538 780387 559358 691523 822939 837679 823251 787045 907310 899157 809003 859135 943300
5527 943300 1001036 1052852 748575 795690 960355 1001513 1051619 1115565 1178726 1209107 1115822
5516 1115822 1047588 1079795 995568 1109400 1302546 1276375 1133175 1087108 1115370 1090136 1113184
5505 1113184 1094359 1267451 1218417 1132822 1163841 1169631 1118908 1073099 1068331 981347 1182102
5494 1182102 1078927 1063307 1132377 1284989 1266741 1225350 1312722 1195838 1219040 1165079 1270147
5483 1270147 1221185 1234860 1209882 1362104 1446549 1342221 1353979 1384433 1444568 1280665 1271510
5472 1271510 1338597 1516024 1554623 1587978 1465622 1359070 1579762 1608328 1645315 1682600 1662678
5461 1662678 1671704 1640437 1826009 1842193 1747126 1805890 1823837 1809152 1918482 1888816 1898911
5450 1898911 1988915 1955907 1949394 2040990 1919886 1798104 1783400 1893815 1949444 2059239 2091055
5439 2091055 2186325 2264617 2250797 2341480 2304255 2205896 2308433 2358057 2288141 2501088 2364728
5428 2364728 2438949 2697782 2705272 2655553 2675845 2629579 2748730 2717059 2826564 2848281 2974270
5417 2974270 3019769 3051990 3055445 3121773 3230077 3442738 3472045 3684339 3719904 3750144 3980552
5406 3980552 4235419 4431866 4372285 4423546 4604549 4753594 4895025 5165524 5400353 5731138
5396 5731138 5948073 6138088 6375452 6643452 6837098 7268514 7747491 7925427 8117172 8468884
5386 8468884 8883464 9186356 9543093 9952606 10336623 10642125 10872924 11276806 11562156 11751913
5376 11751913 11882296 11964771 12217503 12429315 12421422 12443039 12355699 12445983 12635359 12518176
5366 12518176 12433313 12619845 12499038 12265523 12165877 12076569 11785955 11604979 11272466 10865024
5356 10865024 10520565 10221690 10012833 9673503 9386280 9093732 8673231 8349796 8230905
5347 8230905 8085668 7973700 7857851 7697715 7645009 7747763 7751183 7661384 7592067 7737526
5337 7737526 7900627 7804684 7812921 8041245 8335485 8403986 8512363 8751891 8947673 9193294
5327 9193294 9573861 9896966 10207337 10617566 10998432 11376987 11936785 12288192 12798302 13412562
5317 13412562 13847155 14466749 15010631 15459798 15949659 16453064 16870473 17241979 17591358
5308 17591358 17943349 18272922 18458207 18520684 18498122 18450254 18397132 18181569 18166055 18099752
5298 18099752 17963384 17873598 17522443 17317564 17051509 16640880 16209905 15828726 15271291 14898626
5288 14898626 14364730 13843496 13193025 12678035 12157529 11751613 11434712 10938461 10495769
5279 10495769 10125563 9704489 9339056 8859121 8399055 8180037 8005923 7901942 7529437
5270 7529437 7249130 7179817 6864098 6664532 6570603 6450947 6275261 6035820 5960243 5816768
5260 5816768 5764868 5675293 5436092 5536325 5702363 5475131 5341173 5241219 5171134 4983708
5250 4983708 4988672 5106991 5044828 4975767 4905449 4873189 4875148 4727309 4787159 4819336 4725178
5239 4725178 4624338 4613862 4635740 4659640 4633080 4694084 4535307 4629604 4719103 4687821 4777327
5228 4777327 4655949 4593204 4747276 4695761 4575091 4616442 4752217 4678009 4742818 4797344 4767119
5217 4767119 4691599 4708841 4727934 4728514 4791533 4853359 4846967 4712287 4889940 5069575 5052210
5206 5052210 5157837 5250215 5136658 5117462 5280386 5285803 5291300 5246072 5382124 5574530 5598278
5195 5598278 5577041 5768177 5840077 5867559 5963718 5991571 6166540 6274702 6330606 6457930 6521469
5184 6521469 6605024 6731051 6809145 6994229 6974789 7080246 7378663 7406488 7505027 7693109
5174 7693109 7851233 8017442 8113176 8350932 8462620 8523889 8504851 8761213 8842399 9060254
5164 9060254 9292922 9224611 9247203 9328849 9330915 9426782 9418236 9448185 9493230 9572522 9788931
5153 9788931 9883628 10029031 10066785 10218990 10282649 10419862 10472457 10714565 11131706 11326655
5143 11326655 11374957 11633217 11889757 11996114 12243600 12448539 12848180 13245156 13402912 13784503
5133 13784503 14131367 14239429 14546831 14846102 15113348 15342026 15649749 16010264 16341760
5124 16341760 16641918 16919074 17379325 17760628 18158111 18745140 19191339 19711182 20248959
5115 20248959 20938494 21784460 22381317 23046974 23738137 24463887 25356643 26074556 26900246
5106 26900246 27669312 28568115 29435117 30146887 30750253 31522324 32238162 32870984 33237682
5097 33237682 33758787 34326464 34592911 34727001 35015856 35395991 35606540 35861930 36026770
5088 36026770 36168680 36545082 36755242 37132101 37505968 37875932 38333473 38841338 39342366
5079 39342366 39921251 40680991 41433266 42120506 42755233 43620319 44473930 45204099 46067546
5070 46067546 46874997 47894719 48757991 49467698 50359361 51155917 51959809 52595017 53087873
5061 53087873 53556230 54069498 54377538 54633728 54776277 54822460 54990736 55160736 55152445 55394799
5051 55394799 55697707 55912744 56288544 56759385 57128121 57777147 58415787 59043372 59617279
5042 59617279 60371760 61127683 61859349 62629227 63277726 63755963 64239354 64955577 65645482
5033 65645482 66215252 66660711 67255892 67743195 68263348 68958792 69576205 70312473 70886781
5024 70886781 71699330 72688802 73692210 74766205 75978754 77342522 78924311 80710997
5016 80710997 82582975 84817289 87251046 89889758 92851271 95923171 99125944 102649337
5008 102649337 106765264 111045655 115618728 120560103 125941947 131710806 138139146 145263949
5000 145263949 152979992 161379153 170619724 180660492 191747481 203987317 217461117
4993 217461117 232075761 248035484 265424663 284626167 305406888 327645639 350675201
4986 350675201 373818770 396102535 416210530 432748713 443884593 448106962 444248953
4979 444248953 432310537 413355959 389521237 362922404 335655512 309194385 284514406
4972 284514406 261837056 241296571 222703131 206347057 191600290 178461646 166756431
4965 166756431 156289763 146847560 138345224 130397216 123266769 116810460 110957057 105519739
4957 105519739 100399077 95785209 91407223 87530256 83937594 80445566 77284677 74302185
4949 74302185 71401604 68759175 66250202 64106185 61962760 59816695 57861675 55820167
4941 55820167 54021984 52345832 50575842 49018326 47461765 45889193 44520338 43170040
4933 43170040 42117361 40842182 39549030 38520038 37363533 36208489 35280612 34261454
4925 34261454 33308421 32500263 31544956 30717471 29930509 29067414 28254818 27728406 26963203
4916 26963203 26198548 25553424 24985153 24444699 23818233 23315731 22841446 22354699 21837172
4907 21837172 21431401 21032789 20499710 20040801 19599897 19154269 18790343 18509890 18163629
4898 18163629 17932161 17519196 17189062 16858943 16558474 16181463 15851119 15611944 15225909
4889 15225909 15046337 14804276 14405567 13910343 13616393 13389266 13085350 12830425 12700949
4880 12700949 12244972 12048326 11847076 11595749 11280116 11191421 10998148 10829915 10687055 10487593
4870 10487593 10186023 9847115 9678783 9524978 9402606 9243861 9036930 9033290 8785539 8452959
4860 8452959 8432000 8284213 8132107 7991935 7858538 7739879 7831871 7693097 7482842 7364395
4850 7364395 7194095 7159459 7111230 6961976 6758851 6708536 6742981 6590494 6384468 6341300
4840 6341300 6275077 6251921 6102651 5845661 5936249 5890539 5901974 5840557 5705005 5680497 5669449
4829 5669449 5560724 5561804 5311171 5208152 5150082 5048281 5043690 5032207 5054329 5003136 4817407
4818 4817407 4547168 4295276 4439912 4551802 4495894 4268892 4167371 4157261 4168801 4177877
4808 4177877 4018314 3871158 3797752 3769268 3879740 3745651 3715374 3608384 3537875 3477553
4798 3477553 3332475 3325848 3432154 3508276 3380695 3290117 3343299 3328517 3247101 3200604 3137260
4787 3137260 3157369 2999073 3004678 3028951 3014188 2989082 3127418 2977649 2837856 2847956 2813854
4776 2813854 2748781 2821726 2743111 2722558 2669348 2774285 2527562 2558893 2661184 2680764 2587542
4765 2587542 2564543 2756182 2574240 2489347 2385828 2435314 2531259 2626278 2578464 2568565 2470717
4754 2470717 2435468 2433108 2363094 2375203 2415340 2585214 2536160 2467503 2470184 2458077 2444135 2408036
4742 2408036 2283950 2143984 2158766 2061366 1979809 2031100 2243274 2307517 2375505 2285912 2279104
4731 2279104 2312590 2201213 2113952 2190642 2067650 2081641 2109807 2016509 2029042 2090306 1898012
4720 1898012 1906877 2171679 2006518 2064366 2020162 2053595 1972949 1983833 2105651 2175307 2119343
4709 2119343 2074656 2190701 2053374 1965077 2034521 2120890 2075700 2072703 2195193 2178256 2153978
4698 2153978 2172326 2085530 2147200 2131057 2125250 2063996 2011726 1973217 2050841 2060476 2179201 2275076
4686 2275076 2049840 2135961 2175540 2056373 2133305 2069158 2062050 2257723 2171377 2120224 2138177
4675 2138177 2170389 2146405 2276629 2438142 2533213 2501188 2383549 2341071 2209071 2241840 2244209
4664 2244209 2323002 2270540 2341864 2414669 2472661 2434815 2327407 2381691 2488744 2570625 2508499
4653 2508499 2504061 2534299 2611639 2623741 2743853 2706542 2764811 2841975 2962655 2945275 2905743
4642 2905743 2962769 3045502 3149664 3233681 3150326 3254057 3472587 3424504 3497276 3727809 3853901
4631 3853901 3868036 3970090 3978731 3991916 4308823 4508241 4621764 4810644 4836500 4976105
4621 4976105 5171030 5378019 5419051 5590325 5757429 5992280 6178212 6340715 6420183 6493204
4611 6493204 6771720 6936689 7163491 7435421 7687868 7810013 7933491 8107242 8334332 8518805
4601 8518805 8666226 8885445 8991039 9149304 9268254 9558040 9892754 9950788 10113319 10190060
4591 10190060 10350788 10596793 10804318 10885240 10894010 10859831 10836552 10977098 11075669 11092891 11042194
4580 11042194 10715968 10727720 10803054 10972854 10995786 11033353 11048556 11106224 11188979 11167813 11230381
4569 11230381 11244499 11210817 11407151 11344600 11403089 11616313 11732541 11747043 11736033 11934836
4559 11934836 12068581 12140441 12215794 12198296 12307093 12446026 12544716 12798139 12996983 13036437
4549 13036437 13158753 13365008 13371570 13563764 13654173 13879654 14076288 14030826 13940853 14327270
4539 14327270 14458462 14529177 14630425 14722537 14609913 14618848 14577193 14503124 14547276 14494410 14195029
4528 14195029 14061255 13917033 13671651 13547119 13493953 13343123 13159548 12944405 12924453 12681287
4518 12681287 12386175 12067996 11907245 11717677 11391390 11143285 10956427 10649582 10288730
4509 10288730 10031982 9718545 9408277 9063025 8945680 8598542 8326482 8007939 7575151
4500 7575151 7438358 7176885 6813422 6518959 6197812 5972819 6017496 5860076 5543371 5376876
4490 5376876 5279876 5047292 4692935 4636641 4373087 4308259 4231502 4119443 3952826 3941635
4480 3941635 3836341 3639898 3631287 3692577 3651817 3543509 3464950 3302870 3237283 3047962 2993589
4469 2993589 3011675 2866226 2749930 2955834 3009079 2959162 2816774 2714873 2797627 2786540
4459 2786540 2761283 2710935 2788508 2608558 2395193 2458428 2574323 2667532 2532459 2309654
4449 2309654 2411013 2479705 2414576 2383418 2371653 2463090 2515555 2403530 2287916 2289521 2410386
4438 2410386 2280428 2200615 2169399 2289755 2396329 2409825 2269492 2289066 2401965 2476797
4428 2476797 2301443 2313667 2339204 2308172 2365093 2476084 2360756 2482798 2447563 2474535 2532343
4417 2532343 2388495 2515699 2583094 2656217 2692754 2614380 2715002 2729389 2635229 2734969 2865486
4406 2865486 2904965 2998198 3084350 3053606 2986051 3115507 3058391 3125047 3259277 3250488 3250383 3178508
4394 3178508 3387326 3378840 3281671 3340261 3508804 3503359 3661515 3558442 3643607 3751279 3849488
4383 3849488 4050594 4245472 4304928 4293541 4291789 4305018 4422471 4539002 4617803 4821541 4844197
4372 4844197 4788562 4792406 4829347 4909348 4933400 4941887 5146420 5198946 5253289 5328222 5346420 5504239
4360 5504239 5686889 5917965 6046860 6209015 6403678 6507743 6702038 6789630 6736907 6788643
4350 6788643 7102914 7387260 7460349 7458236 7519986 7743840 8040939 8110668 8152041 8312971 8494954
4339 8494954 8610644 8748276 8767070 8881628 9058923 8971138 8991883 9239009 9247150 9173020 9264671
4328 9264671 9374538 9529974 9537293 9480912 9540795 9598230 9735451 9811661 9942288 10031455 10076598
4317 10076598 10233620 10162532 10388952 10474387 10539559 10650180 10750820 10969413 11209172 11400303
4307 11400303 11366501 11374523 11440372 11455979 11465390 11683019 11574294 11608224 11699793 11696342 11574152
4296 11574152 11461648 11462044 11415360 11475277 11370060 11221692 11347786 11244209 11147943 11131851 11044455
4285 11044455 11054523 10919287 10956720 10934735 10998682 10811854 10851178 10947006 10886943 10878404 10909286
4274 10909286 10845010 10812166 10804609 10811962 10771862 10734276 10683880 10730443 10693902 10508879 10561333
4263 10561333 10703483 10765802 10792963 10694094 10566465 10572694 10446042 10467935 10350544 10294270 10176130
4252 10176130 9965457 9832270 9803976 9728919 9672097 9755390 9787064 9666720 9523387 9410785
4242 9410785 9245301 9143474 9018950 8888754 8847808 8851694 8732480 8583723 8422377 8278354
4232 8278354 8150197 8282504 8300081 8278356 8105488 7838599 7767652 7754101 7759932 7663861 7719547
4221 7719547 7628834 7495731 7288744 7268110 7449723 7437178 7299184 7328342 7446123 7453748 7576487
4210 7576487 7621801 7507190 7472515 7518927 7504852 7579930 7545086 7501973 7315526 7437191 7508202
4199 7508202 7366678 7302092 7336384 7281265 7271264 7234280 7193987 7381760 7432321 7406492 7483093
4188 7483093 7365017 7412198 7476580 7443400 7460056 7409951 7443767 7420481 7475581 7353846 7338136
4177 7338136 7491464 7398411 7251358 7264030 7326164 7206130 7147150 7171591 7044563 7055328 7049058
4166 7049058 7001537 7056380 7097197 7084605 7086881 7185080 7073131 6992905 7005021 7037191 7206991
4155 7206991 7166093 7005262 6995316 6959703 7040443 7043627 6957989 6969382 6995130 7044274 7050866 7034835
4143 7034835 6923734 7069727 7044533 7038969 7063741 7207075 7247286 7259865 7312397 7337510 7516397
4132 7516397 7474210 7575746 7663681 7683299 7903142 8124946 8209040 8291152 8617679 8711629 8821860
4121 8821860 9013992 9318258 9644350 9708553 9973811 10366134 10398638 10670802 11130079 11265950
4111 11265950 11611550 11798526 11872472 12097076 12300770 12571258 12920412 13040639 13119405 13428809
4101 13428809 13591302 13725801 13842937 14006804 13953629 14043051 14175166 14246911 14213357 14301858
4091 14301858 14368874 14452883 14584895 14678902 14727868 14857049 15012363 15183281 15301266 15386530
4081 15386530 15423870 15567500 15722765 15728951 15876924 16045972 16170569 16460148 16626726 16834099
4071 16834099 17001859 17081710 17265157 17458940 17649504 17642097 17825198 17909363 18030705 18125781
4061 18125781 18355640 18390440 18555170 18699343 18893030 18956475 19100824 19364880 19391871 19559470
4051 19559470 19777830 20080882 20302909 20446901 20555692 20598661 20922362 21292433 21509138 21785884
4041 21785884 22081640 22331360 22498475 22666207 22913675 23099559 23250008 23436470 23454732 23577555
4031 23577555 23440698 23313152 23557526 23538569 23486221 23347805 23207770 22951251 22880690 22828035
4021 22828035 22757058 22590821 22419316 22165750 21756025 21463919 21172887 20886211 20657294 20368873
4011 20368873 20063110 19676275 19271174 19001623 18681978 18245294 17847303 17523008 17113473
4002 17113473 17047983 16755213 16245023 15845488 15495409 15280887 14881291 14490659 14235067 13761569
3992 13761569 13386705 12993667 12520228 12172987 11819217 11607513 11269057 11121374 10810151
3983 10810151 10624767 10358015 9909705 9761479 9661195 9572674 9424846 9336726 9196796 9107225
3973 9107225 8925673 8783464 8834876 8883761 8715935 8655918 8746285 8664814 8703545 8725325 8784839
3962 8784839 8843725 8890434 8899157 8825568 8942609 8993987 9000439 8907747 8832257 8890781 9038398
3951 9038398 9019926 8960040 8938533 8889614 8941860 8761075 8773178 8725740 8681529 8673392 8797314
3940 8797314 8867859 8733047 8748452 8706890 8726710 8537301 8479333 8355151 8111497 8063049 8120567
3929 8120567 7963404 7995231 7951294 7881478 7857813 7792499 7838606 7682896 7621038 7720964 7518598
3918 7518598 7544499 7464283 7439412 7627456 7476391 7632408 7623106 7507011 7380815 7266466
3908 7266466 7411309 7400140 7444275 7550633 7522555 7520308 7560047 7603094 7555147 7685457 7727986
3897 7727986 7599282 7727663 7808347 7938495 7913145 8094875 8127241 8241758 8347103 8314548
3887 8314548 8413513 8531191 8725666 8855618 8942934 9021556 9031679 9060803 9296241 9585671
3877 9585671 9706644 9744469 9954726 10081619 10205428 10269001 10414829 10555111 10690209 10763128
3867 10763128 10851880 11132293 11410251 11571513 11762813 11856857 12075475 12384687 12588047 12676813
3857 12676813 12801420 13111327 13368168 13646973 13755427 13950656 14219149 14529395 14766339
3848 14766339 14986598 15285847 15444685 15746362 15999182 16170216 16479174 16670737 16910327
3839 16910327 17198858 17477710 17879422 18224369 18571973 18963413 19304456 19764293 20073389
3830 20073389 20576997 21006906 21562196 22245949 22538301 23242035 23990799 24645109 25290882
3821 25290882 26044418 26634600 27472152 28296775 29125745 30123573 31289752 32333344 33459263
3812 33459263 34827904 36125855 37604086 39219329 41045269 42836049 44634986 46539604
3804 46539604 48841754 51474106 53908750 56551682 59489889 62597104 65935130 69374285
3796 69374285 72675353 75738478 78877014 81703115 84079371 85955315 87197180 87575466
3788 87575466 87432124 86780165 85717254 84693051 83587308 82779039 82073693 81414713 81070411
3779 81070411 81028079 81273439 81746531 82398066 83015716 83828117 84632509 85326823 86091844 86471613
3769 86471613 86272042 85448501 84196027 82335999 79722253 76625323 73409458 70222511
3761 70222511 67052789 63852490 60967175 58463865 56076514 53765254 51661955 49861543
3753 49861543 48181280 46509703 45174853 43918606 42797346 41367168 40141260 39212272
3745 39212272 38460613 37626810 36806048 36042635 35275989 34538991 33834842 33179328 32641382
3736 32641382 32084613 31424853 30945166 30495418 30007740 29486795 29150986 28759116 28154235
3727 28154235 27716181 27463850 27078092 26698369 26325256 26042719 25566848 25248857 24973776
3718 24973776 24688052 24351123 23995515 23614405 23341101 23245610 23092291 22707725 22603454 22346561
3708 22346561 22148678 21882106 21712950 21416124 21230993 21017402 20719044 20534277 20356008
3699 20356008 19993627 19925698 19665680 19373393 19116464 18900379 18611878 18361506 18223155 17850669
3689 17850669 17636181 17259081 16991620 16732474 16489508 16289225 16068498 15843554 15672036
3680 15672036 15316119 14954863 14767090 14563016 14282063 14041010 13865425 13548049 13418757
3671 13418757 13489360 13129321 12873172 12756803 12625422 12362147 12118138 11981090 12010361 11798681
3661 11798681 11507019 11375328 11293623 11235024 11123845 11006236 10916103 10790819 10632220 10348638
3651 10348638 10149094 9905284 9827993 9723507 9689505 9485190 9300905 9139749 8954351 8819076
3641 8819076 8624835 8545215 8404651 8152575 8036260 8101986 7977212 7792079 7505118 7416476
3631 7416476 7308169 7225264 7302029 7214648 7036076 6834497 6672533 6641342 6427386 6289205
3621 6289205 6269049 6131467 6030919 5989767 5934752 5756631 5508858 5473172 5519114 5328639
3611 5328639 5294246 5356523 5299264 5187445 5108580 4926307 4962123 4984661 5002546 4768465 4569473
3600 4569473 4654926 4625857 4560561 4431758 4418020 4334937 4315998 4302528 4152002 4129369 4187419
3589 4187419 4116260 4041415 3972712 4019658 3956072 3962698 3991060 3956493 3914412 3871090 3808549 3741203
3577 3741203 3641490 3650485 3567309 3430943 3466027 3507484 3471073 3373337 3250053 3333576 3315044
3566 3315044 3207120 3370884 3325080 3196602 3207962 3219473 3068954 3047717 2924356 2916612 2947811
3555 2947811 2926965 3057446 3113679 2978584 2928094 2951403 2842511 2801746 2703042 2655162 2636516
3544 2636516 2609755 2766147 2792205 2782876 2822159 2747887 2627267 2582196 2554797 2412813 2399143
3533 2399143 2361133 2304077 2200783 2358580 2347512 2282086 2285343 2295064 2301533 2281605 2293428 2346377
3521 2346377 2513685 2296288 2330465 2334641 2260159 2186794 2105398 2114356 2086477 2089385 2076052 2137585
3509 2137585 2240832 2231257 2187975 2306956 2294827 2229870 2255377 2257395 2186753 2174499 2226153
3498 2226153 2437103 2408751 2308395 2266084 2229320 2233491 2314970 2316184 2326242 2343957 2315916
3487 2315916 2248019 2270286 2277281 2373901 2383231 2308016 2461069 2445393 2411054 2456117 2430641 2409689
3475 2409689 2441592 2462080 2511049 2682143 2645392 2451921 2455744 2395696 2452480 2576944 2690579
3464 2690579 2734493 2809813 2901534 3003932 2948987 2937965 2991306 3117622 3158232 3148191 3246232
3453 3246232 3312795 3311194 3412123 3424538 3545313 3492072 3497778 3762337 3873911 3813189 3907695
3442 3907695 4045218 3959123 4007364 4160418 4250640 4380313 4490748 4495469 4515997 4635136 4783457
3431 4783457 4759420 4786636 5011098 4984046 5023503 5173600 5357064 5573877 5559359 5677223
3421 5677223 5792509 5883801 5901976 5992493 6018124 6293745 6365773 6516898 6641232 6703967 6876037
3410 6876037 7076614 7340589 7611589 7763976 8049450 8390079 8641212 9049143 9519138 9812894
3400 9812894 10192543 10681423 10978358 11615493 12349960 13080822 13748094 14367587 15368438
3391 15368438 16507336 17552809 19063299 20758898 22388477 24274364 26535147 28889895
3383 28889895 31313867 33861507 36478866 39021277 41370510 43423248 45399313 47732860
3375 47732860 50557489 53673712 56958574 60114693 62498754 63901981 64502406 64845497
3367 64845497 65469751 66854951 68762853 70771220 72372103 72967135 71825105 69066219
3359 69066219 66105922 63714726 61824531 60429787 59616459 58794611 57347535 54605417
3351 54605417 51100366 47537356 44254697 41709476 39601514 37761574 36136810 34138315
3343 34138315 31696309 29169840 26316935 23911851 22073364 20261746 18705796 17530167
3335 17530167 16618106 15715204 14863289 14071307 13450902 12746717 12068723 11654015 11237896
3326 11237896 10824852 10614956 10374887 9978341 9590472 9281615 9007552 8748562 8562286
3317 8562286 8376948 8096458 7876524 7638780 7455204 7157618 6841223 6579297 6492083 6481327
3307 6481327 6276288 6175358 5977029 5692301 5682049 5431065 5280427 5361984 5236371 5106805
3297 5106805 4812380 4809435 4792039 4508485 4341806 4294022 4314559 4274948 4252990 4311238 4169895
3286 4169895 4114201 4081225 4012684 3849607 3702513 3528527 3499511 3477257 3453321 3437724 3457768
3275 3457768 3372313 3387438 3270563 3227126 3319302 3235247 3002229 2762103 2817688 2886297 3025636
3264 3025636 2947951 2871357 2917943 2915162 2736011 2656325 2771280 2801006 2613606 2650199 2733094
3253 2733094 2656256 2553212 2353455 2337979 2413919 2217002 2173185 2211083 2331378 2268536 2233609
3242 2233609 2339102 2306783 2226832 2060480 2124369 2166850 2050899 2007222 2015633 2081846 2087374
3231 2087374 2039090 2034048 1902783 1903665 2175192 2133610 1964694 2012262 2121296 2038010 2137499
3220 2137499 2086389 1950235 2049030 2003284 1994559 1964833 1953874 1981790 1906440 1884593 1885386 1874247
3208 1874247 1907241 1971791 2028911 1954846 1937586 1866944 1876958 1772992 1785993 1918402 1956470
3197 1956470 1819498 1921499 1864524 1728758 1706799 1649439 1719764 1739100 1948577 2023048 1875376
3186 1875376 1934908 1997863 1939409 1949638 1957550 2032800 2020082 1991253 2103356 2009795 1847862
3175 1847862 1971859 2002690 2050624 2020436 1982899 2038361 2023857 1939865 2060246 2143288 2226318
3164 2226318 2199567 2099962 2165584 2120459 2132289 2163363 2340008 2442493 2414632 2429570 2250161
3153 2250161 2136153 2058747 2260574 2455858 2373827 2468894 2454949 2601123 2789150 2639087
3143 2639087 2570485 2622830 2596357 2526282 2588764 2751759 2810392 2862611 2929969 2983908 3096453
3132 3096453 3010592 3007740 3026415 3106200 3263573 3243353 3209880 3251891 3328830 3394575 3590405
3121 3590405 3566491 3555045 3535845 3586551 3756586 3924007 3882519 4004715 3911645 3990524 4219417
3110 4219417 4340014 4589614 4679229 4598318 4595139 4753257 4937462 5072907 5167375 5158454 5163660
3099 5163660 5174867 5205173 5277630 5435713 5460120 5571075 5699607 5872750 5965825 6031266 6154995
3088 6154995 6178092 6192528 6270110 6525073 6730359 7018428 7289479 7441446 7625023 7718442
3078 7718442 7944329 8252395 8421865 8668835 8941517 9201643 9567605 9960108 10018950 10322981
3068 10322981 10613807 11051813 11346017 11722785 12027650 12481217 13034354 13376010 13796944
3059 13796944 14322407 14901866 15414267 15904066 16504249 17066019 17726199 18365000 18974805
3050 18974805 19642607 20372083 21055974 21731054 22448238 23274571 24010934 24764438 25374053
3041 25374053 25938969 26419356 27263074 28106926 28830216 29738022 30464864 31051355 31801329
3032 31801329 32604210 33144909 33843495 34448034 34949751 35623063 36226659 36805482 37487482
3023 37487482 38045862 38762963 39387783 39864174 40303998 40528936 40890809 41274716 41496913
3014 41496913 41813488 41908071 41909012 41847244 41676488 41492630 41474427 41357876 41095002 40779848
3004 40779848 40427080 40172661 39807120 39477402 38940570 38324801 37888463 37495029 37124402
2995 37124402 36780880 36423260 36047446 35751476 35502639 35417939 35243108 34970938 34835414 34732221
2985 34732221 34711753 34591783 34560993 34563686 34501643 34414869 34319880 34379421 34250540 34163867 34033491
2974 34033491 34027671 33878962 33744605 33624732 33394000 33154569 32841602 32494610 32444688 32254875
2964 32254875 32212473 32379848 32470521 32758497 33523468 34288766 35083264 36180620 37484466
2955 37484466 38613621 39919027 38730435 35236720 32445208 30426118 28921427 27789121
2947 27789121 26945627 26264015 25833384 25454803 24939029 24502480 24109852 23793932 23465408
2938 23465408 22987997 22534297 22014633 21465637 21104120 20636148 20030773 19594469 19133710
2929 19133710 18683950 18091478 17483512 17007022 16660403 16291814 15895469 15383551 14997873
2920 14997873 14749956 14471540 14186967 13948914 13524195 13134352 12845117 12502444 12402131
2911 12402131 12218542 11901046 11744852 11431398 11223994 10957163 10630277 10402201 10351200 10025513
2901 10025513 9802484 9664180 9563848 9432293 9112195 8878608 8531797 8352409 8258214 8090287
2891 8090287 7875514 7639204 7419660 7303740 7166834 6880305 6731610 6676494 6409145 6259426
2881 6259426 6098982 6018332 5998932 5969389 5772324 5662077 5722228 5443470 5258568 4965758
2871 4965758 4811733 4827969 4940288 4838046 4626077 4428378 4512560 4349153 4280311 4222049
2861 4222049 4190653 4232952 4235933 4179693 4006363 3861806 3821922 3711178 3747566 3715687 3690201
2850 3690201 3646049 3512649 3454015 3378996 3355803 3527973 3388540 3299068 3351128 3260566 3120305
2839 3120305 3200440 3184402 3205433 3167829 3075860 3100455 3062915 2953855 2851235 2952280 2809904
2828 2809904 2809946 2734739 2802451 2824747 2839131 2822027 2722625 2538203 2526504 2651354 2818205
2817 2818205 2745331 2680818 2534313 2542886 2669172 2720008 2617459 2536284 2448194 2585733 2633293
2806 2633293 2595520 2611313 2726888 2655585 2543585 2509883 2563809 2617450 2656941 2457827 2374862
2795 2374862 2507227 2505796 2615046 2762557 2805948 2823075 2740807 2813440 2819804 2770893 2642654
2784 2642654 2525555 2492231 2617434 2619507 2702813 2760950 2737304 2741466 2860395 2744231 2616778
2773 2616778 2677133 2755633 2742430 2735763 2742579 2681561 2805889 2851596 2900985 2888253 2913404 2939634
2761 2939634 3050376 3029957 3055361 3015277 3023632 3166238 3146758 3166676 3143252 2990813 3128696
2750 3128696 3106395 3104347 3154900 3255700 3311664 3380966 3390731 3383631 3371767 3491560 3516271 3544895
2738 3544895 3509527 3471742 3411221 3509955 3678421 3750573 3797640 3914704 3957484 3994530 4068359
2727 4068359 3967083 3991714 4147409 4144646 4158137 4202073 4244788 4347126 4424020 4608621 4640139
2716 4640139 4633711 4679319 4761457 4860501 4878483 4979158 5030818 5025094 5158935 5164641 5225147 5339231
2704 5339231 5486383 5605560 5574511 5752254 5862409 6012939 6151487 6204613 6405047 6549528
2694 6549528 6592190 6601713 6679487 6922605 7111869 7220784 7353202 7464974 7474701 7798154 8041160
2683 8041160 8135921 8293552 8465537 8718113 8782957 8942374 9224036 9572825 9856220 10108929
2673 10108929 10343468 10502338 10531688 10820122 11346951 11613492 11824274 12267813 12694848 12990228
2663 12990228 13560931 14075109 14291059 14640870 15188132 15847906 16466830 16956491 17530213
2654 17530213 18114110 18868796 19726488 20494114 21352833 22247895 23055218 24067611 25303763
2645 25303763 26500519 27730642 28938559 30253262 31586226 33118488 34763252 36334170
2637 36334170 37818083 39282089 40753739 42191527 43686432 44831431 45964500 46942096
2629 46942096 47755914 48530264 49140046 49538338 49753844 49940487 50019615 49941255 49717942 49498716
2619 49498716 49246999 48852581 48172322 47441235 46706350 45951542 44932492 43946347 42767198
2610 42767198 41536780 40139234 38660951 37203132 35588238 34159562 32837968 31360277
2602 31360277 29992231 28761091 27516501 26407098 25371207 24313330 23300178 22466158
2594 22466158 21713439 20903576 20213990 19505016 18823020 18326754 17782716 17287240 16888240
2585 16888240 16460843 15967574 15537597 15164189 14823385 14575402 14276830 13991086 13812253
2576 13812253 13633866 13487063 13248891 13063687 12800596 12551885 12494788 12291255 12079671 12132745
2566 12132745 12019847 11952045 11925575 11722838 11685002 11429159 11469837 11498313 11369711 11350204
2556 11350204 11468466 11458514 11446886 11458126 11371859 11435736 11523466 11680855 11787049 11766611 11785085
2545 11785085 11806103 11954507 12150844 12119263 12337489 12434328 12620700 12846646 12983203 13044001
2535 13044001 13329740 13477437 13657041 13958996 14213504 14430976 14686761 15070805 15485550
2526 15485550 15834024 16160120 16592251 16950152 17193824 17676533 18016389 18277778 18649853
2517 18649853 18672253 18711660 18977190 19319060 19474155 19587343 19646515 19740873 19715095 19767190
2507 19767190 19759786 19752903 20023001 20239992 20260287 20544688 20713735 20812186 21190535 21558349
2497 21558349 21848310 22036533 22405929 22725102 23167247 23695224 24256962 24763186 25267175
2488 25267175 25835354 26600661 27352120 28037950 28909042 29748433 30807632 32015365 33118689
2479 33118689 34215137 35397888 36697243 38001175 39477909 41140218 42866788 44556907
2471 44556907 46467546 48580359 50690826 52806149 54869432 57036843 59235829 61460848
2463 61460848 63599966 65728723 67731827 70024171 72264928 74198848 76071716 77627094
2455 77627094 79241430 80814279 82132221 83210452 84029768 84880205 85275453 85271403 85192206
2446 85192206 84906847 84156308 83151684 82117771 80916851 79652953 78205105 76562980
2438 76562980 74777560 72890064 71324552 69508585 67657615 65977018 64103870 62090113
2430 62090113 60236071 58598990 56838822 55003019 53038304 51009231 49172486 47520659
2422 47520659 45682708 43787519 42115468 40537473 38996843 37528011 36076387 34829750
2414 34829750 33415919 32167730 31076430 30012055 29055245 28167264 27241365 26378279 25674049
2405 25674049 24910966 24302261 23674736 23132230 22733968 22212723 21647359 21204903 20824122
2396 20824122 20554686 20346291 19936807 19745924 19477208 19156700 19170363 18995042 18712566 18548502
2386 18548502 18511902 18577502 18316886 18024653 18122568 18167310 18069638 17972904 17911980 17736420 17536369
2375 17536369 17451481 17355105 17190247 16795724 16516636 16300854 15962487 15637274 15301846 14924484
2365 14924484 14568477 14226005 13940764 13433476 13083254 12750673 12584658 12225395 11929755
2356 11929755 11713990 11386881 11147899 10845170 10665627 10567952 10611003 10241415 10045567 9971914
2346 9971914 9852294 9599522 9483568 9395350 9303133 9223155 9055992 8973965 8762794 8645481
2336 8645481 8573139 8424774 8285934 8216834 8058154 8135980 8031596 7961329 7964961 7960652 7937119
2325 7937119 7848375 7857202 7892348 7775667 7584896 7576237 7568418 7688644 7529139 7338627 7391389
2314 7391389 7588758 7589235 7536882 7293222 7311325 7388911 7372239 7311136 7453925 7368482 7418191
2303 7418191 7476572 7488692 7520995 7456645 7667551 7592533 7492456 7523340 7597962 7735690 7705020
2292 7705020 7722181 7933725 8123551 8228920 8077846 8142349 8295936 8368721 8611919 8645834
2282 8645834 8620280 8825146 9055832 9191693 9273096 9480222 9635106 9725605 10001294 10175530
2272 10175530 10250689 10462484 10628557 10893509 11202051 11336199 11507689 11903500 12129101 12367730
2262 12367730 12557035 12821768 13068314 13407827 13720088 13934139 14178733 14290085 14491947
2253 14491947 14811789 15014098 15338498 15783948 16170310 16234163 16358950 16701609 16981684 17141255
2243 17141255 17425569 17818062 17975743 18365640 18818881 19205323 19428693 19809030 20336160
2234 20336160 20852407 21431341 21861113 22305941 22915679 23701752 24365976 25043063 25947065
2225 25947065 26869830 27917412 28972475 29984415 31141437 32447295 33754959 35183065
2217 35183065 36648837 38202138 40024288 41833292 43746497 45754165 48029575 50232920
2209 50232920 52541767 55189052 57841381 60469658 63310111 66236982 69157273 71940848
2201 71940848 74741050 77391735 80045499 82701845 84888542 87076358 89009004 90780359
2193 90780359 92397304 93525857 94363257 95040599 95533739 95957262 96052039 95863734 95290040
2184 95290040 94633992 93798965 92546803 91115567 89572210 87881480 85923160 83729570
2176 83729570 81448784 79107374 76661825 74155166 71648680 68978660 66111593 63430199
2168 63430199 60878902 58239112 55930219 53578876 51303484 49097624 47033172 45236969
2160 45236969 43357738 41725681 40193386 38693067 37421217 36101161 34936403 33883698
2152 33883698 32739701 31976093 31117825 30395030 29651640 29036672 28426034 27815926 27303562
2143 27303562 26828101 26334526 25868177 25360910 25046998 24656393 24229729 23792793 23243065
2134 23243065 22803891 22453853 22062073 21628508 21168115 20923484 20702834 20452216 20148462
2125 20148462 19647075 19324029 19080644 18890498 18641410 18417999 18115641 17953431 17604712
2116 17604712 17382563 17237177 16960354 16639675 16462447 16313961 16224106 16210089 15941644 15714114
2106 15714114 15551337 15380675 15153222 14995840 14962563 14816158 14735450 14743224 14802344 14707219
2096 14707219 14794724 14686963 14632557 14576248 14501805 14692244 14907661 14841504 14680834 14622212
2086 14622212 14512882 14491535 14504561 14630064 14432340 14285619 14406009 14534620 14569313 14582869
2076 14582869 14677346 14822211 14953775 15202525 15328277 15485001 15641676 15827639 16312298 16556607
2066 16556607 16842548 17269425 17701421 18103610 18530752 18971991 19402946 19839863 20530383
2057 20530383 21074901 21808537 22533434 23138057 23861235 24757303 25612345 26424287 27570649
2048 27570649 28880766 29965351 31197157 32514508 33950769 35291576 36749539 38424913
2040 38424913 40241296 42078067 43733608 45625199 47385768 49057614 50691806 52283621
2032 52283621 53645336 54879536 55987865 56837292 57328075 57666697 57570072 57214609 56532108
2023 56532108 55851973 54814391 53458497 51806286 49941811 48240121 46397520 44447303
2015 44447303 42441759 40390187 38711544 36748229 34920558 33493817 31941516 30334045
2007 30334045 28860817 27687153 26601361 25360238 24332627 23357901 22479593 21567750 20848521
1998 20848521 20259867 19427945 18786481 18186022 17577022 16935903 16435673 15948933 15561305
1989 15561305 15376120 14942899 14349581 13831597 13523555 13296616 12963778 12623849 12306811
1980 12306811 12132065 11905345 11544062 11224301 11169149 11173983 11017838 11005223 10804052 10553732
1970 10553732 10473214 10547351 10682299 10553158 10342052 10087697 9968350 10007970 9846602 9925505
1960 9925505 9846358 9530248 9494389 9278483 8970816 8796105 8559574 8356770 8284233 8212789
1950 8212789 8035873 7863223 7768716 7628892 7434430 7239112 7214463 6942144 6808933 6915453
1940 6915453 6834933 6576904 6498593 6481089 6342034 6203455 6234370 6216143 6047186 6016189 5955369
1929 5955369 6006913 6115431 5999685 6080585 6024050 5853185 5808822 5926392 5613682 5474839
1919 5474839 5486214 5479194 5499512 5527521 5538819 5417549 5399923 5414250 5390847 5236523 5224864
1908 5224864 5202586 5121622 5109512 5141138 5245722 5230222 5160606 5330402 5290570 5326777 5370960
1897 5370960 5343793 5416681 5369102 5401944 5540719 5541536 5642592 5618847 5529373 5634700 5704240
1886 5704240 5707223 5769897 5835497 5872132 5891977 5868297 5889648 5889754 6018339 6136617 6196894 6198097
1874 6198097 6262332 6217600 6057199 6346991 6327881 6241523 6339525 6385688 6574019 6609883 6778950
1863 6778950 6847240 6849688 6939617 7039138 7073667 7079146 7227876 7498749 7680794 7861759 7943663
1852 7943663 8013783 8207532 8413137 8569922 8795342 8804076 8927685 9169631 9300958 9559463
1842 9559463 9648536 9815496 10115221 10387620 10584859 10751756 11086808 11272293 11492624 11741113
1832 11741113 12006136 12268963 12593425 12806941 13035339 13421775 13643786 13894625 14330811
1823 14330811 14776492 15180317 15612240 15874496 16221521 16649240 17102455 17513568 18099601
1814 18099601 18644614 18979630 19477751 20050922 20613707 21264738 21834511 22591214 23260802
1805 23260802 24117513 24802581 25531838 26205706 27225319 28161993 29019859 29856903 30877545
1796 30877545 32210505 33458354 34787534 36252419 37731943 39345048 41093446 42848314
1788 42848314 44694662 46791260 49154683 51674271 54199691 56926403 59966415 63240665
1780 63240665 66603304 70250058 74415205 79034399 84122243 89625554 95659986 102081684
1772 102081684 109080085 116435383 124430235 133021472 142460360 152324800 162803306 173999037
1764 173999037 185545048 197000962 208340841 218782897 227573083 234174942 237746384
1757 237746384 237475379 233150536 225109836 214257610 201662272 188257491 175041380 162394408
1749 162394408 150535461 139575209 129760937 120784064 112723860 105176525 98461793 92449010
1741 92449010 86989997 82020483 77573886 73447224 69685613 66295400 63045731 60092089
1733 60092089 57268897 54798902 52447588 50124264 47883826 46033670 44259781 42658284
1725 42658284 41258495 39792658 38512183 37076835 35783443 34606558 33327895 32276500
1717 32276500 31250867 30408944 29514064 28540734 27523562 26745653 26051144 25274936 24558833
1708 24558833 23845293 23014161 22455930 21959119 21346525 20597759 20076192 19691276 19263681
1699 19263681 18756812 18278914 17738068 17290443 17032544 16782402 16380127 16149540 15697369
1690 15697369 15321292 15093082 14607135 14301899 13978577 13766751 13594667 13228503 12926677
1681 12926677 12621274 12338250 12192756 11983281 11848649 11635587 11310526 11077423 10959528
1672 10959528 10692076 10420740 10248852 10003189 9857575 9726832 9473219 9356311 9263027 9093755
1662 9093755 8921811 8738295 8579533 8495786 8339459 8188064 7997758 7885367 7687007 7678516
1652 7678516 7489300 7240427 7037333 6865019 6772806 6623332 6423338 6471889 6323672 6207131
1642 6207131 6194134 6090602 5833705 5592728 5618529 5485167 5234740 5280503 5179243 5276096
1632 5276096 5250085 5046328 5001748 4994287 4865469 4772697 4879980 4818227 4757724 4625567 4610918
1621 4610918 4664820 4511432 4293088 4251076 4153866 4110036 4161783 4284654 4248446 4148563 3953158
1610 3953158 3871644 3796715 3719605 3811971 3797963 3656931 3689264 3719897 3444769 3417369 3576734
1599 3576734 3591419 3353575 3297338 3292700 3249944 3166704 3026112 3023484 2973869 3040914 3085697
1588 3085697 2982384 2830711 2852272 2898089 2960774 2848140 2715752 2675271 2597846 2617139 2532764
1577 2532764 2399180 2342143 2368112 2354014 2238119 2289747 2346993 2479813 2373613 2279665 2299174
1566 2299174 2345416 2399689 2409576 2265156 2242839 2102841 2075568 2225211 2075895 2053031 1975029
1555 1975029 1940221 1863476 1853348 1953773 1917375 2033888 2048033 1935677 1858375 1879672 1988881
1544 1988881 1906859 1805960 1791898 1769546 1814796 1817067 1778746 1852360 1817242 1760470 1714911
1533 1714911 1604147 1603468 1752756 1751505 1535618 1397778 1417370 1438008 1445280 1535308 1621442
1522 1621442 1554552 1556969 1500436 1464748 1571554 1516238 1572501 1552464 1395453 1504707 1418614
1511 1418614 1451163 1568379 1552561 1499830 1375321 1389953 1415848 1420183 1349684 1375677 1368176
1500 1368176 1463692 1440192 1370441 1402994 1416331 1473614 1477473 1438428 1543213 1402290 1387861
1489 1387861 1425411 1402413 1381173 1434430 1526340 1374412 1396270 1392906 1467550 1535018 1571679
1478 1571679 1408383 1403695 1440202 1552887 1568129 1586799 1621764 1646329 1664311 1826205 1700314
1467 1700314 1706823 1838015 1798979 1851815 1817374 1813115 1921054 1957980 1995258 1991957 2204534
1456 2204534 2214242 1901444 1814626 1901636 1913150 1918685 1806637 1673765 1755415 1710936 1670610
1445 1670610 1559937 1476749 1432038 1341196 1229407 1280165 1351949 1269124 1263031 1308356 1177014
1434 1177014 1105144 1197706 1302817 1262747 1215099 1114282 1060030 920028 846514 905722 1066777
1423 1066777 923417 884573 729025 719827 837838 932047 938792 979279 968889 890896 788331
1412 788331 773666 798695 735296 795269 805643 897981 942869 753334 770185 896965 937818
1401 937818 864315 775136 893098 768571 695786 849122 844855 863965 820912 832223 770703
1390 770703 622323 692422 585097 531585 466354 691149 659694 657142 738581 718512 763760
1379 763760 741072 770190 807349 648431 654792 701193 717283 674754 716579 704703 496228
1368 496228 653219 592655 486430 758906 772194 736055 792394 729263 803808 586548 739182
1357 739182 850990 752860 798724 702912 624997 455833 466605 450270 355319 531418 659408
1346 659408 530729 469690 603717 421850 302502 391973 429113 391497 430595 391158 363832
1335 363832 489953 767448 814461 746016 654334 535595 422862 439005 507588 505678 699309
1324 699309 688046 741979 593617 593936 456080 418663 553508 607127 553402 602244 560628
1313 560628 468921 580667 553777 482295 397169 438983 567660 427521 438483 515371 574818
1302 574818 586262 470704 460101 457439 419895 387023 353151 379693 416138 426445 344327 271580
1290 271580 409107 505789 391858 471780 676495 744016 632984 403765 497000 593054 464787
1279 464787 595820 590677 587310 574755 485877 496154 415310 510146 453161 387179 446513 554791
1267 554791 481028 394343 356443 429794 483389 308622 341207 330937 398505 469585 396738
1256 396738 391853 489219 464015 429358 425813 307757 453952 416605 427921 360181 405815 379081
1244 379081 335111 348777 387741 275038 344855 388300 382028 413081 270524 270527 260000 414973
1232 414973 407731 368971 331947 300549 290700 352276 419460 347926 437266 377349 126259 217129
1220 217129 346697 306443 371408 372965 349679 325428 166168 319932 289641 158402 281270
1209 281270 273644 281317 403924 370705 212820 191474 216781 313002 375957 344699 221817
1198 221817 211258 272956 227882 135696 348367 390666 449133 335131 287155 357379 332205
1187 332205 382514 381688 261085 228021 264326 82951 57016 113009 263706 227535 339429
1176 339429 354634 359106 200003 225855 209365 188053 185870 362824 345072 235322 279823
1165 279823 315201 396959 172907 341827 251778 269502 183420 199163 318817 229089 198185
1154 198185 247602 335221 291648 260778 337525 404737 439602 293260 226574 113442 44988
1143 44988 125658 247577 246510 142161 110183 205367 222596 69502 87184 -71012 38786
1132 38786 146245 177539 279825 297560 365502 325203 203124 183866 108967 161013 187356
1121 187356 124168 299379 346623 88013 114028 205261 255325 132789 168889 78663 42652
1110 42652 125518 145048 71255 126623 218047 -36444 -136528 -38865 -9979 102680 21023
1099 21023 -30020 184499 96421 -330 192797 303558 302150 347893 362135 250594 307624
1088 307624 394451 352254 115828 -50164 -22970 210092 137380 84566 95100 51667 159092
1077 159092 204306 117538 136374 275021 153939 -32079 -30784 62500 101954 279740 214633
1066 214633 168383 198664 149078 7685 93871 120675 113422 192525 142601 35748 115841
1055 115841 137422 326250 273821 124164 104652 140364 167040 253647 150864 174866 285008
1044 285008 319023 275585 169878 36092 178465 215221 113756 133736 176030 267657 416053
1033 416053 278827 147692 244546 188690 230753 247173 262629 382428 301358 291296 303767
1022 303767 223137 159767 116925 201360 307752 223629 231094 329116 278786 279511 227650 225034
1010 225034 99477 -94225 100009 190818 136335 136557 242254 183884 151843 266201 176631
999 176631 425230 478804 364246 275295 308937 157305 156882 423524 528817 392275 397362
988 397362 316861 317550 284792 276651 440771 509823 472989 447554 329604 287496 240312 324995
976 324995 398644 451314 467386 330355 399851 501099 512817 530788 652356 784726 851565
965 851565 808199 725940 783990 889607 934305 951715 1010294 1107015 1100528 1228825 1268887 1368251
953 1368251 1523561 1699618 1842383 1952160 2170622 2499646 2884301 3294447 3942444 4440260
943 4440260 4971620 5485389 6193080 7024020 7605538 6828599 5403806 4318004 3568128
934 3568128 3052840 2574679 2180733 1924920 1740857 1720032 1713393 1448656 1299074 1371090
924 1371090 1264865 1082388 1105452 1016839 932414 812813 802225 919798 807651 626075
914 626075 713803 626219 568123 605833 679831 601532 678539 542815 412732 520667 681649
903 681649 663805 555725 466791 515468 560650 491129 351829 423985 496113 401837 351288
892 351288 381143 433333 353120 232840 346408 311139 255372 120668 2067 202231 209761
881 209761 126719 78713 26057 116780 96965 16916 178028 302916 307297 248796 224483 177232
869 177232 158480 193396 178720 259315 184336 46490 -2507 -101754 45111 153487 88580
858 88580 28813 -10740 15486 149418 95285 -30843 32159 142635 205347 226166 139920
847 139920 210519 267164 313342 239025 199299 255484 79910 12829 66687 93867 70044 73095
835 73095 123211 110640 14407 -2009 188504 132033 74453 216102 208881 232158 357539 375220
823 375220 207876 98382 147815 145380 113046 104595 120573 18639 36121 99432 55355 57174
811 57174 -94408 -144674 -114710 -65840 -43955 -47549 1306 -147024 -124010 -123048 -39942 -27940
799 -27940 -45930 -19059 -19077 -48015 7992 70302 163908 -10596 -92158 -114990 -97092 15765
787 15765 78639 -46478 -68323 70784 -41008 -69608 -47772 -68798 86685 242841 109696
776 109696 17612 30681 -143001 -106755 28355 49270 43251 -105206 -170550 -165237 49882
765 49882 27982 -44531 -76477 66872 91604 93783 12424 29560 -115287 -6699 1270 -38734
753 -38734 -112426 -103497 98886 97502 51804 65870 42341 9103 -29262 -72671 -75838 -157595
741 -157595 -88597 42565 98072 -27400 -21836 -137241 -20969 -28555 -42540 -53620 -96692
730 -96692 -24784 -57557 -87568 -25657 -114051 -68899 -59492 -121712 -30008 -48754 -39279 -95121
718 -95121 -88820 -29312 67326 -32521 -156407 -69583 -78148 -192015 -41438 -114409 -146275 31340
706 31340 159897 56965 33730 -89600 -144498 -101722 -112096 -25979 61271 6968 -86760
695 -86760 -38342 -24144 -152185 -234759 -197052 -72984 43527 71472 -111624 16018 121455
684 121455 -30945 -99906 -170929 -55290 -150787 -174906 -31830 62572 70070 175225 69207
673 69207 39876 -13374 53028 -47543 -138400 -142777 -248346 -291048 -114787 -30252 -65272 -109038
661 -109038 11817 -75356 12815 135062 97080 118102 62587 63036 97760 189905 152564 105950
649 105950 82225 -18073 -93668 -94216 -5043 185522 122047 133208 -104807 -81715 62502
638 62502 -29936 -133824 -158082 -42855 -43158 -180618 -160158 -129231 -144347 -136254 -226565 -76075
626 -76075 -43318 -217071 -178302 -50753 67948 -3670 -105827 14319 -21692 -33834 -7457
615 -7457 -149551 -98990 -12563 -91423 -13848 -175781 -114091 -206234 -360397 -148116 -151023 -212544
603 -212544 -212619 -88665 -91300 54888 40742 888 -35305 -93447 -86147 -67245 -163528 -225099
591 -225099 -108346 -95639 -159116 -243087 -240817 -155625 -145152 -279916 -214116 -267269 -233727 -220364
579 -220364 -129716 -43086 -113987 -152820 -238608 -210668 -186365 -289812 -349817 -15736 -122437
568 -122437 -121240 -53081 -94819 -56391 -113590 -116434 -105440 -50805 -136188 -55662 32063 129840
556 129840 441 -145591 194 -20359 -156203 -295243 -209403 -190602 -228643 -159714 -266763
545 -266763 -172285 -178036 -238812 -142246 -151843 -17167 17182 -149358 -53084 62521 -47915
534 -47915 -151839 -163172 -123521 -77123 -184014 -313694 -226372 -146291 -122215 -108338 -140626
523 -140626 -83150 -58170 -118254 8747 124961 -20207 -57875 4096 37891 -4286 -77485
512 -77485 -24846 -37282 -166609 -177482 -118334 -103379 -58551 11585 -46258 -7983 2429 -126982
500 -126982 -180720 -116151 -42805 -182030 -202406 -159636 -94894 -90868 -148466 -260147 -232196 -127736
488 -127736 -170929 -305064 -216366 -185830 -129762 -154238 -196595 -209601 -294767 -196443 -161886 -106826
476 -106826 86999 93403 -104781 -110131 -137706 -41988 75773 -26978 -177303 -146431 -5721
465 -5721 118098 34024 -129537 -160297 -169729 -188583 -219306 -268625 -362311 -231851 -246977 -152047
453 -152047 -153895 -222075 -153368 -184002 -278940 -166418 -93897 -85616 -222823 -342013 -265865 -215105
441 -215105 -223789 -231137 -199121 -224694 -124317 -104544 -117264 -180488 -90404 -176892 -85042 -207573
429 -207573 -218455 -220918 -170344 -33549 -124334 -109432 -130442 -183556 -133310 -241809 -181576 -88062
417 -88062 31367 25271 -74833 -116901 -142261 -133178 -45346 -113540 -262990 -173768 -280444 -258772
405 -258772 -199344 -332176 -402773 -290820 -172774 -210735 -252676 -219505 -314304 -379786 -387552
394 -387552 -116666 -85579 -185136 -160231 -159270 -274728 -235995 -143466 -20680 -161679 -387170
383 -387170 -460875 -293669 -268709 -261356 -203313 -217126 -206601 -285220 -265208 -290536 -97849 -166475
371 -166475 -175078 -269168 -379174 -316329 -303580 -413286 -425754 -289823 -180958 -176891 -235104
360 -235104 -108683 -43699 -88029 -232793 -237170 -102386 -209754 -300701 -312502 -192944 -108402
349 -108402 -183290 -129341 -118330 -321055 -278016 -270536 -198566 -268258 -433317 -376496 -321496 -238319
337 -238319 -373770 -462826 -430622 -292518 -260356 -322753 -359488 -367484 -240596 -253228 -248648 -184689
325 -184689 -162625 -40464 -178508 -186806 -353826 -312178 -307511 -439445 -328959 -250652 -331283
314 -331283 -430426 -450429 -508790 -373598 -358618 -285059 -348749 -298552 -250904 -306807 -234305 -202055
302 -202055 -257078 -115826 -137029 -254135 -348528 -357728 -314095 -262455 -281563 -287365 -406974 -437610
290 -437610 -381910 -304728 -221724 -273993 -79398 -307451 -362844 -451259 -301963 -180659 -236582
279 -236582 -288553 -173788 -51394 6002 -106157 -215355 -283444 -299390 -318990 -340852 -318640
268 -318640 -279876 -104765 -175952 -256546 -267971 -391555 -291703 -350632 -362632 -398277 -422820
257 -422820 -361737 -303208 -233000 -229655 -224284 -335054 -451099 -308862 -248185 -306817 -301171 -186863
245 -186863 -153415 -144625 -37645 -298949 -272566 -289035 -246761 -277483 -254893 -309340 -343858 -343968
233 -343968 -386015 -378408 -450368 -422568 -289154 -294337 -403204 -437121 -465187 -407275 -275495 -348578
221 -348578 -272482 -213922 -210745 -141931 -349317 -418482 -307034 -202365 -255560 -289297 -273413
210 -273413 -188211 -271761 -374997 -285118 -336685 -303066 -307109 -400896 -431434 -369722 -374677 -344745
198 -344745 -405569 -356923 -322489 -165521 -149280 -85688 -194836 -163757 -192635 -368248 -305017
187 -305017 -250405 -246102 -163606 -191341 -228549 -333282 -433105 -374216 -286974 -248386 -314974 -426282
175 -426282 -499411 -525487 -381070 -368808 -390270 -406519 -441969 -475025 -471145 -385284 -485854 -412146
163 -412146 -376696 -487106 -379851 -280628 -293403 -433915 -505974 -426747 -446999 -437425 -517728
152 -517728 -498008 -452628 -275351 -386490 -400582 -289703 -297229 -303774 -313307 -187688 -152570 -396132
140 -396132 -432088 -253174 -306424 -387581 -239666 -356724 -302794 -316254 -233498 -381045 -381742
129 -381742 -330304 -361140 -359055 -273035 -374377 -393109 -295268 -359490 -358901 -272551 -335498 -367647
117 -367647 -262232 -303242 -368860 -296595 -228850 -286612 -294263 -332168 -389604 -392878 -293195 -410791
105 -410791 -486810 -390007 -188584 -250717 -303903 -364552 -324168 -218921 -271017 -284080 -370585
94 -370585 -393120 -405894 -438741 -363954 -377843 -448686 -382638 -326966 -379857 -399470 -333170 -323323
82 -323323 -362714 -316400 -319052 -399574 -303384 -274459 -434044 -338541 -311089 -286519 -336974 -371781
70 -371781 -432998 -418998 -362771 -299046 -292140 -300243 -312648 -366217 -419890 -432577 -369920 -435218
58 -435218 -350540 -335283 -365123 -276414 -387896 -424583 -403601 -421202 -408809 -521412 -437582 -369417
46 -369417 -407148 -470958 -457596 -422249 -351006 -307969 -481395 -406981 -314235 -473515 -481452 -466634
34 -466634 -460511 -437019 -452832 -432706 -406216 -438135 -373398 -335859 -284634 -319095 -318432 -325463 -463537
21 -463537 -557508 -531689 -392527 -376472 -338877 -321725 -335653 -326530 -417401 -428178 -413457 -462888
9 -462888 -474997 -452740 -356893 -362089 -360297 -341105 -285398 -345200 -319305
0 -319305
$$ Imaginary data points
##PAGE= N=2
##DATA TABLE= (X++(I..I)), XYDATA
16383 -2963389 -2957851 -2936080 -2922543 -2869560 -2783292 -2806365 -2768313 -2787207 -2612720 -2555185 -2444247
16372 -2444247 -2411976 -2532694 -2540341 -2510596 -2504514 -2246499 -2216368 -2218798 -2269343 -2299038 -2164018
16361 -2164018 -2157245 -2222898 -2001731 -1857402 -1869656 -1878155 -1947924 -1997300 -1895556 -1852490 -1889887
16350 -1889887 -1818489 -1772312 -1707364 -1619475 -1544012 -1623792 -1605455 -1587471 -1571741 -1484801 -1432113
16339 -1432113 -1374665 -1295678 -1286435 -1319990 -1255570 -1143157 -1098714 -1107816 -1044586 -1093888 -987394
16328 -987394 -988189 -1045474 -958994 -863147 -748891 -704059 -636217 -662757 -791128 -738002 -618831
16317 -618831 -544681 -524583 -486691 -500188 -465169 -490186 -395120 -326025 -320853 -305218 -297537 -326262
16305 -326262 -260421 -229658 -242523 -230881 -135249 -82087 47621 127965 54308 -32065 -25431
16294 -25431 160670 182923 192692 137873 88996 117495 279392 350137 286507 267605 328195
$$ [...]
##END NTUPLES=NMR SPECTRUM
##END=
