##TITLE=1H_CG-1146-x
 CDCl3, 8 sc, 
 26.04.2021
##JCAMPDX= 6.0         $$ Bruker NMR JCAMP-DX V2.0
##DATA TYPE= NMR FID
##DATA CLASS= NTUPLES
##ORIGIN= UXNMR, Bruker Analytische Messtechnik GmbH
##OWNER= root
$$ XWIN-NMR		Version 3.5
$$ Mon Apr 26 13:49:01 2021 Russian Standard Time (UT+4h)  she@DPX200
##.OBSERVE FREQUENCY= 200.131506
##.OBSERVE NUCLEUS= ^1H
##.DELAY= (6, 6)
##.ACQUISITION MODE= SIMULTANEOUS
##.ACQUISITION SCHEME= undefined
##.AVERAGES= 8
##.DIGITISER RES= 18
##SPECTROMETER/DATA SYSTEM= spect
##.PULSE SEQUENCE= zg30
##.SOLVENT NAME= CDCl3
##.SHIFT REFERENCE= (INTERNAL, CDCl3, 0, 15.7039)
##AUDIT TRAIL= $$ (NUMBER, WHEN, WHO, WHERE, WHAT)
$$ ##TITLE= Audit trail, XWIN-NMR		Version 3.5
$$ ##JCAMPDX= 5.01
$$ ##ORIGIN= Bruker BioSpin GmbH
$$ ##OWNER= she
$$ F:/spectra/data/she/nmr/H-F/1/audita.txt
$$ ##AUDIT TRAIL=  $$ (NUMBER, WHEN, WHO, WHERE, WHAT)
(   1,<2021-04-26 13:45:58.71 +0400>,<she>,<DPX200>,
      <created by zg, POWCHK disabled, PULCHK disabled
       configuration hash MD5:
       00 E9 B6 7A A2 85 ED C7 34 08 36 98 17 FE 4E 26
       data hash MD5: 16K
       8D 47 44 16 95 35 60 6F 23 92 8D A6 C4 83 7C 2E>)
$$ ##END=
$$ 
$$ hash MD5
$$ 04 F6 4E 8E F9 71 42 85 4C C9 4D A1 53 F7 47 38
##$RELAX= 
##$RELAX= 
##$RELAX= 
##$RELAX= 
##$RELAX= 
##$RELAX= 
$$ Bruker specific parameters
$$ --------------------------
##$DU= <F:/spectra>
##$EXPNO= 1
##$NAME= <H-F>
##$PROCNO= 1
##$TYPE= <nmr>
##$USER= <she>
##$AMP= (0..31)
100 100 100 100 100 100 100 100 100 100 100 100 100 100 100 100 100 100 
100 100 100 100 100 100 100 100 100 100 100 100 100 100 
##$AQSEQ= 0
##$AQ_mod= 1
##$AUNM= <au_zg>
##$AUTOPOS= <>
##$BF1= 200.13
##$BF2= 200.13
##$BF3= 200.13
##$BF4= 200.13
##$BF5= 200.13
##$BF6= 200.13
##$BF7= 200.13
##$BF8= 200.13
##$BYTORDA= 1
##$CFDGTYP= 0
##$CFRGTYP= 5
##$CHEMSTR= <none>
##$CNST= (0..31)
1 1 145 1 1 1 1 1 1 1 1 1 1 1 1 1 1 1 1 1 1 1 1 1 1 1 1 1 1 1 1 1 
##$CPDPRG= <>
##$CPDPRG1= <>
##$CPDPRG2= <>
##$CPDPRG3= <>
##$CPDPRG4= <mlev>
##$CPDPRG5= <mlev>
##$CPDPRG6= <mlev>
##$CPDPRG7= <mlev>
##$CPDPRG8= <mlev>
##$CPDPRGB= <>
##$CPDPRGT= <>
##$D= (0..31)
0 1.2 0 0 0 0 0 0 0 0.06 0 0.03 0 0 0 0 0.0002 0 0 0 0 0 0 0 0 0 0 0 0 
0 0 0 
##$DATE= 1619430358
##$DBL= (0..7)
120 120 120 120 120 120 120 120 
##$DBP= (0..7)
150 150 150 150 150 150 150 150 
##$DBP07= 0
##$DBPNAM0= <>
##$DBPNAM1= <>
##$DBPNAM2= <>
##$DBPNAM3= <>
##$DBPNAM4= <>
##$DBPNAM5= <>
##$DBPNAM6= <>
##$DBPNAM7= <>
##$DBPOAL= (0..7)
0.5 0.5 0.5 0.5 0.5 0.5 0.5 0.5 
##$DBPOFFS= (0..7)
0 0 0 0 0 0 0 0 
##$DE= 6
##$DECBNUC= <off>
##$DECIM= 32
##$DECNUC= <off>
##$DECSTAT= 4
##$DIGMOD= 1
##$DIGTYP= 9
##$DL= (0..7)
0 120 120 120 120 120 120 120 
##$DP= (0..7)
150 150 150 150 150 150 150 150 
##$DP07= 0
##$DPNAME0= <>
##$DPNAME1= <>
##$DPNAME2= <>
##$DPNAME3= <>
##$DPNAME4= <>
##$DPNAME5= <>
##$DPNAME6= <>
##$DPNAME7= <>
##$DPOAL= (0..7)
0.5 0.5 0.5 0.5 0.5 0.5 0.5 0.5 
##$DPOFFS= (0..7)
0 0 0 0 0 0 0 0 
##$DQDMODE= 0
##$DR= 18
##$DS= 0
##$DSLIST= <SSSSSSSSSSSSSSS>
$$ [...]
##$SUBNAM2= <"">
##$SUBNAM3= <"">
##$SUBNAM4= <"">
##$SUBNAM5= <"">
##$SUBNAM6= <"">
##$SUBNAM7= <"">
##$SUBNAM8= <"">
##$SUBNAM9= <"">
##$SW= 16.9725357007746
##$SWIBOX= (0..15)
0 0 2 0 0 0 0 0 0 0 0 0 0 0 0 0 
##$SW_h= 3396.73913043478
##$TD= 16384
##$TD0= 1
##$TE= 0
##$TE2= 300
##$TE3= 300
##$TEG= 300
##$TL= (0..7)
0 120 120 120 120 120 120 120 
##$TP= (0..7)
150 150 150 150 150 150 150 150 
##$TP07= 0
##$TPNAME0= <>
##$TPNAME1= <>
##$TPNAME2= <>
##$TPNAME3= <>
##$TPNAME4= <>
##$TPNAME5= <>
##$TPNAME6= <>
##$TPNAME7= <>
##$TPOAL= (0..7)
0.5 0.5 0.5 0.5 0.5 0.5 0.5 0.5 
##$TPOFFS= (0..7)
0 0 0 0 0 0 0 0 
##$TUNHIN= 0
##$TUNHOUT= 0
##$TUNXOUT= 0
##$USERA1= <user>
##$USERA2= <user>
##$USERA3= <user>
##$USERA4= <user>
##$USERA5= <user>
##$V9= 5
##$VALIST= <valist>
##$VCLIST= <CCCCCCCCCCCCCCC>
##$VD= 0
##$VDLIST= <DDDDDDDDDDDDDDD>
##$VPLIST= <PPPPPPPPPPPPPPP>
##$VTLIST= <TTTTTTTTTTTTTTT>
##$WBST= 1024
##$WBSW= 4
##$XGAIN= (0..3)
0 0 0 0 
##$XL= 0
##$YL= 0
##$YMAX_a= 78930
##$YMIN_a= -92694
##$ZGOPTNS= <>
##$ZL1= 120
##$ZL2= 120
##$ZL3= 120
##$ZL4= 120
##$ABSF1= 10
##$ABSF2= 0
##$ABSG= 5
##$ABSL= 3
##$ALPHA= 0
##$AQORDER= 0
##$ASSFAC= 0
##$ASSFACI= 0
##$ASSFACX= 0
##$ASSWID= 0
##$AUNMP= <proc_1d>
##$AZFE= 0.1
##$AZFW= 0.1
##$BCFW= 1
##$BC_mod= 2
##$BYTORDP= 1
##$COROFFS= 0
##$CY= 11.3945322036743
##$DATMOD= 1
##$DC= 2
##$DFILT= <>
##$DTYPP= 0
##$F1P= 15.9154993809931
##$F2P= -4.1035820241983
##$FCOR= 0.5
##$FTSIZE= 0
##$FT_mod= 4
##$GAMMA= 1
##$GB= 0.15
##$INTBC= 1
##$INTSCL= 1
##$ISEN= 128
##$LB= 0.24
##$LEV0= 0
##$LPBIN= 0
##$MAXI= 10000
##$MC2= 0
##$MEAN= 0
##$ME_mod= 0
##$MI= 1.114404
##$NCOEF= 0
##$NC_proc= 0
##$NLEV= 6
##$NOISF1= 3.799351
##$NOISF2= 2.8
##$NSP= 1
##$NTH_PI= 0
##$NZP= 0
##$OFFSET= 15.70392
##$PC= 1
##$PHC0= -11110.75
##$PHC1= 5.200948
##$PH_mod= 1
##$PKNL= yes
##$PPARMOD= 0
##$PSCAL= 0
##$PSIGN= 0
##$REVERSE= no
##$SF= 200.130013532006
##$SI= 16384
##$SIGF1= 3
##$SIGF2= 2
##$SINO= 400
##$SIOLD= 16384
##$SREGLST= <1H.CDCl3>
##$SSB= 0
##$STSI= 0
##$STSR= 0
##$SW_p= 3612.71676300578
##$SYMM= 0
##$S_DEV= 0
##$TDeff= 0
##$TDoff= 0
##$TI= <>
##$TILT= no
##$TM1= 0
##$TM2= 0
##$TOPLEV= 0
##$USERP1= <user>
##$USERP2= <user>
##$USERP3= <user>
##$USERP4= <user>
##$USERP5= <user>
##$WDW= 1
##$XDIM= 8192
##$YMAX_p= 0
##$YMIN_p= 0
$$ End of Bruker specific parameters
$$ ---------------------------------
##NTUPLES= NMR FID
##VAR_NAME=  TIME,          FID/REAL,        FID/IMAG
##SYMBOL=    X,             R,               I
##VAR_TYPE=  INDEPENDENT,   DEPENDENT,       DEPENDENT
##VAR_FORM=  AFFN,          ASDF,            ASDF
##VAR_DIM=   8192,          8192,            8192
##UNITS=     SECONDS,       ARBITRARY UNITS, ARBITRARY UNITS
##FACTOR=    0.0002944,     1,               1
##FIRST=     0,             0,               0
##LAST=      2.4114304,     0,               0
##MIN=       0,             -92694,          0
##MAX=       2.4114304,     78930,           0
$$ Real data points
##PAGE= N=1
##DATA TABLE= (X++(R..R)), XYDATA
0@%%%%%%%%%%%%%Nj3J6j6J6j6K4l2L6m4N1n9P2q3R1j04J20j39J62j83K05k33K63
36A39k95L29l68M10m52N03n59O18o85P55q32R17j009J112j225J349j486J638j811
55i52K007k227K480k775L125l546M059m706N548o686Q324j0878J5400k5635Q5606
70F9144R786j71624J32176k4007m0260M2565Q608k1886j799R718l052k2211M1134
83B8292j9093l7566O3946l1410k0528L1027O567k6319j4404N3736n3690L084M7533
96C1175l7309j1950K8393j04k6838J7294J2230k8888O596M0527n9616K0136M6373
109C8019p3300M2022J0748l4214R928J4213L27k9714K8110P329l3623K0267J8027
122A8139m1745K6006J2502l3785J7099Q740l609k6126M1263j2495m0460O0204
$$ y = [0, 0, 0, 0, 0, 0, 0, 0, 0, 0, 0, 0, 0, 0, 5, -8, 8, -8, 8, -8, 16, -16, 20, -24, 27, -32, 40, -43, 48, -56, 64, -75, 87, -96, 109, -124, 139, -156, 173, -195, 215, -237, 266, -293, 325, -360, 395, -437, 480, -529, 583, -642, 707, -779, 859, -952, 1055, -1172, 1308, -1467, 1658, -1888, 2171, -2535, 3013, -3673, 4651, -6227, 9173, -16462, 69144, 78930, -92694, 39482, 15475, -24785, 17780, 26388, 4502, 2703, 12421, 9369, -12842, 28292, 9199, -28367, 35579, 4169, -16359, 14668, 21235, -5084, -19488, 34248, -19442, -16358, 31175, -6134, -18084, 10309, 10205, -16633, 661, 12891, -15997, -9401, 31126, -28490, -8354, 38019, -35281, 6741, 17489, -16725, -6797, 7416, 7743, -21971, 6139, 13468, -20155, 112, 18139, -23606, 2400, 14902, -18883, -1784, 6956, 3347, -22779, 18484, 5989, -34471, 25733]
134B5733k5139k3149L6374r376k1346K3315P90j5920M658J4551q958k0587M2987
147B3933k8890r523L6505k7711j358J2635N337k3239J4031J4183k8994J1756J7840
160A6505k4491j312K8156k6045J016J5394n044j4761J2802J5325m1331L4006K076
173A2296l1779K7302k46j5846M852J5249j6146l813J6445k575k2510K6334N41
186A0104l2717L7599j1766j4162J3955L681j1460l648K3725k3707P23J9771j4530
199b432r558K2856r453j5724K3508p473r403M283J6259k3146L191K4465l0762
212a3389J1089J1398j2314m932J6812o083j5181K1462l985j5585J2325J2259k8979
225a5103J7069J1428k4867J3040N006m845j1730K0852p162j6831K4753q590j2286
$$ y = [25733, 594, -22555, 13819, 4443, -16903, 6412, 7202, -8718, -4060, 10491, 1533, -19054, 23933, -4957, -14480, 22025, -5686, -7044, 5591, 10928, -12311, 1720, 15903, -13091, -1335, 16505, -7986, -9298, 18858, -7187, -6171, 9223, 4179, -10582, 2220, 17545, -23786, 10220, 12296, -19483, 7819, 7573, -8273, -3421, 11828, -4318, -8131, 8314, 5739, -16771, 9563, 10104, -22613, 14986, 3220, -10942, 3013, 6694, -4766, -8414, 15311, -8396, -7673, 12098, -2432, -11990, 10866, 1413, -14311, 9197, 1724, -7679, -3396, 12863, -10283, -7092, 17373, -13389, -2300, 9098, -3216, -8148, 8664, 2581, -12600, 8862, 4877, -10708, 1617, 13876, -15103, 1966, 13394, -11473, 1567, 6573, 1728, -10002, 10850, 3688, -13143, 11610, 3020, -9266]
238i266J4234M168k0717J4989N173j5214L613J1661p401j5526L0301j7684j0560
251a2229K4432j2412p852J0883N322k0098J4045O071j7357O617J2323j5397l184
264h836K2629k1051J212J2294n565q940Q758R687k5179J8692L650j7644R658P941
278G306j2649j148J6549j4590j851J1888j709j6067J8111J870k3281K3941m542
291C828j0714O434P784j0639l172J8042j5376j813J3440n450j2297J8294m053
304D308j4559J6984k922q166J824J4013j7619J081J8929k0860L992J0981p249
317G37q905J6183m876j2154J4860j356j1304O094J1722k1264J0395Q976j6556
330g448O346N349k800j0637J6442m959j2519J5756k188j1536Q468P928j8432J0622
$$ y = [-9266, 4968, 9136, -11581, 3408, 8581, -6633, -3020, 8641, 1240, -14286, 16015, -1669, -12229, 12203, -209, -8061, 2822, 8144, -11954, 2091, 8162, -9195, -2578, 9745, -5652, -8836, 13793, -7258, -6046, 6248, 683, -8257, 501, 10188, -14991, 3701, 7351, -10293, -635, 7306, -5343, -6491, 10058, -4532, -6383, 5505, 3796, -12271, 5840, 7710, -15571, 8370, 3828, -6886, -452, 7332, -3307, -6479, 11563, -3813, -5626, 7814, 2364, -9933, 8361, 4308, -10251, 6733, 3811, -4355, -2531, 11482, -6137, -5056, 13873, -6987, -2995, 7986, 737, -8168, 8015, 3139, -9015, 5845, 4489, -6815, -721, 11001, -10263, 132, 9108, -7448, -1102, 4247, 1447, -9190, 7252, 2293, -10226, 5530, 3342, -8194, 274, 8202, -10230, 392]
344C92N527j1068Q40R837m886j2091K1720j1721p672J5707n417q031P356O753
358G246j6325R135O617j1728M83J3159j1209n741J9454j4934o83R146j899q921
372f200P192Q053j9103J2862M469j3196M199J0473j2225j357J4336j1837j491
385c825Q196M60j3508J3101K839j7633J5539q27q682K657R558j0838k607J4941
399I371j1784l126J1181k833j2448J6140l396j1452J2181j025o280o10J2814j3972
413e239L8J4206j3778K82R312l896r497J3879l313r587R648J950r721K133J3063
428I480j7795O124R478j2232J551P743k808j0053J4826m484r412J1027J035j1313
442f833O799Q253j5925Q351M737p578j218Q914l410j0458J6892p751o535J0328
$$ y = [392, 5919, -5149, -4309, 5528, 642, -11449, 10271, -1450, -9122, 6585, 1168, -6863, 493, 7246, -9079, 56, 6673, -5055, -4572, 8587, -2622, -8363, 11091, -3843, -4526, 4620, 2721, -6200, 992, 9045, -10058, 2804, 7273, -5923, -1724, 8749, -3476, -4833, 9503, -2334, -3825, 4371, 4831, -8677, 4424, 7263, -10370, 5169, 4342, -4340, -1683, 7875, -2963, -5570, 9371, -2413, -5539, 5642, 2809, -9639, 6501, 3105, -8347, 3834, 2809, -3471, -4081, 8733, -5239, -5201, 9005, -4773, -4491, 4821, 925, -8572, 5307, 1994, -7593, 2055, 4005, -5716, -3583, 9480, -8315, -2191, 7287, -4945, -3394, 4349, 1541, -8512, 6314, 1830, -7582, 3445, 4480, -6833, -34, 8219, -7706, 645, 5382, -2196, -3414, 5500, 2090, -8368, 8524, 773, -5762, 4566]
456D566q29q912O248O320j3609O933N094p494k745J2239q261o396J5908j0595
470a533k331P030N45r544O780O064j4293Q152M429q906j49J1021j0190j966J1534
485F643q560k085N764K349j2196J0224L311j3868J0220J713p619N49J0155j0226
499c626j192J0735p791k957Q040J13j2004J3024j561r621R035P00o084k66J0661
514G206j1244N98R987q496j932Q012j699r370J2133l075o832O329K839p621P10
529b455J0934j3801M204P378q271j181P743k495q464J2060l819o419O566L053
543E033r844L951Q230j3293N925M564o044k276Q728l934p852J2779n364n409O740
558A934J959r513N892N194j0976N338L810n303l046J0401o419n552J2116o897
$$ y = [4566, 3737, -5175, 1073, 7393, -6216, 717, 5811, -1683, -4428, 7811, -450, -6846, 9062, -1533, -3864, 3166, 3711, -5833, 947, 7011, -7282, 870, 5299, -3607, -3756, 7265, -2925, -4891, 6643, -1917, -4002, 1762, 4111, -8085, 2139, 5450, -8418, 1802, 3515, -4104, -3555, 6600, -3626, -4818, 5917, -1874, -4831, 3209, 3322, -8682, 4342, 2781, -6840, 2195, 2895, -3189, -3455, 7206, -4038, -3440, 6547, -1949, -3881, 4131, 2432, -6938, 5195, 2120, -4712, 1617, 4456, -3165, -2455, 8479, -5322, -1118, 6260, -2011, -3192, 4551, 2056, -6408, 5652, 1833, -4586, 1980, 5033, -4811, -860, 7370, -5923, 2, 4566, -1478, -3754, 4974, 1040, -6812, 5967, 603, -4806, 1934, 3893, -5620, 272, 5466, -5510, -172, 3638, -1665, -4711, 5690, -729, -6281, 5835, -1062]
572a062l290N744J870r133O324M171j0519N648M031n999k158J0426q287k398R671
587E039o018k622N125K364j0440Q479K502j0036O311L194n995j103R740r019o17
602c096Q121m971l437N948J503j0535J0346o33p764N700K931o067p81R489r616
617b862O23P146n227l284O819l82q824R965k018n832M374L388o735L11Q918j0442
633d062K310N744m661l332P284j721p794R962k513n223M024L891q552L044P125
648E526j0488L793M254l884l710Q232l242o522J0008l507m501M442L399q670M514
663c56N051r058L620L901l660l981R444m884m793R106l892l767M135L289q861
678d706N328L957q041L099M167m255l256R670o874k518P544l497l462M129K957
$$ y = [-1062, -4352, 1392, 3262, -5871, 453, 4624, -5895, -247, 3784, -2215, -4373, 6053, -2234, -4632, 5039, -979, -3601, 1524, 3888, -6552, 1927, 4429, -5607, 704, 3898, -2097, -3200, 6540, -2479, -3096, 5025, 54, -3383, 2565, 4068, -6467, 3879, 3246, -4518, 1182, 4113, -1954, -2735, 6754, -2862, -2239, 4907, -320, -3604, 3215, 2833, -5991, 3974, 1956, -3876, 498, 3886, -2849, -2538, 6380, -4062, -1752, 3992, -669, -4001, 3283, 1562, -6232, 3730, 1217, -4006, 18, 3909, -4643, -1599, 5526, -4962, -1169, 3085, -799, -4509, 3723, 481, -6041, 3967, 460, -4041, 401, 3800, -4870, -356, 4695, -4363, -743, 3158, -502, -4483, 4961, 77, -4716, 4390, 498, -3269, 866, 4155, -4706, 622, 4579, -3462, -363, 3804, -451, -3707, 5963, -911, -3429, 4115, 618, -2844, 1285, 4242]
693D242r290O848K127p523L435L742m729k154Q863p259r47N969k705m428N297
708A488K038r416Q065M65o207L040L803n233j394Q520p683l06N753k691m604O457
724B095J98q014Q124j035m697K390M414o210j58P834p979J061M657k495m250O481
740B416p40o498P244j008m131J925M997p385J721O279p618J713M073k317m440
755c769P331k236n710P527j441m288K697M290p840L311M263o801K025L503k111
770G51m526P954l607m098O516j692l823K667L749p737M126L147o005J294M220
785B936l171l798Q488n191k394N542j675l571K936L133p789N155J782n091J411
800a297M149l988k294P380n610q57M366q97m370M069K383p717N881P70m209R93
$$ y = [4242, -5048, 1800, 3927, -3596, -161, 3581, -1148, -3302, 5561, -1698, -2645, 3324, 619, -3809, 1488, 3526, -5890, 2175, 2640, -3567, -527, 3276, -1957, -3351, 5169, -2514, -2820, 2933, 242, -4362, 2095, 2293, -5721, 2403, 1368, -3329, -939, 3475, -2735, -2893, 4941, -3038, -1977, 2680, 185, -4065, 2416, 1676, -4822, 2422, 1414, -2717, -792, 4205, -3180, -1459, 4820, -2798, -1085, 2988, 671, -3769, 3562, 1326, -4384, 3143, 1702, -2586, 111, 4401, -3439, -128, 4135, -2666, -641, 2862, 751, -3775, 4179, 572, -3526, 2990, 1298, -2525, 142, 3891, -3846, 280, 3427, -2578, -1284, 2936, -235, -4033, 4455, -736, -3130, 2412, 737, -2834, 102, 3235, -4554, 601, 2383, -2708, -1297, 2852, -1136, -3430, 3950, -1660, -2517, 1849, 952, -3418, 651, 3034, -4683, 1198, 1968, -2241, -1248]
816a248M266m516j249O839n498o63M025n90m888N340O21o568O138j42l676Q93
832i16M631n352j40O087n923K49L578r00m550N856q35n022N234k52l162N50M664
849C797o078J181M888n659O34L464j402m244O082j802m101N030l72l570J261M519
865C628o850K490L505m818N77L288j599l968O578l002k940M380k42l524J901L662
881C066o607L336K423l792j27L783k187l370O678l591k010L815j51l915K921K601
897B873o099L786J586l455K9M071l119k458O486m252r72L136J06l992L208J819
913B753n755M296Q09l294q0M438l953j302N627m273o02K835K51m590M334O74n206
930c038M218N57k997m8M442m805J04M542m068n27L019j86m712N244o59m174L977
$$ y = [-1248, 3018, -1498, -2747, 4092, -1406, -2069, 1956, 1366, -3522, 1818, 2439, -4129, 2009, 1867, -1809, -916, 3715, -1637, -1777, 4310, -1613, -1364, 2214, 1314, -3236, 2620, 1785, -3237, 1997, 1745, -1417, -867, 3797, -2281, -1100, 3788, -1871, -1237, 2227, 825, -3419, 2663, 861, -3240, 1790, 1418, -2152, -891, 3628, -3222, -732, 2773, -2045, -1468, 1820, 221, -3747, 2831, -171, -3111, 1269, 1027, -2497, -596, 3066, -3541, -205, 2218, -1574, -1701, 2082, -105, -3475, 3203, -388, -2398, 1417, 1266, -2649, 272, 2873, -3226, 560, 2146, -1309, -1280, 2791, -328, -2786, 3700, -552, -1524, 1612, 1718, -2274, 934, 2753, -3002, 1294, 2103, -1191, -1271, 3167, -786, -2088, 3539, -734, -1336, 1499, 1750, -2840, 1494, 2168, -3038, 1180, 1737, -1260, -1308, 3134, -1671, -1567, 2975, -1093, -1620, 1399, 1213, -3499, 1745, 1086, -3088, 889]
947H89M10k983J93M448n021Q36L580l704l93L098m78m252N544j633l166L390L64
964A122k846P34L953n648J984K851l105o07L345j157l606N495k276k237L075N39
980A616l382J344L465n569K881J702k671o36L472j916k680N223k671j677K547
995A048O54l853K521K295n121K944J224k417r01M096k676k276N077k995j106K355
1011H69O69m021L004J361m500L053R09k311p23M164l475j096M421l053r14K228
1027E85P12m223L795M76l922K784J159k529n72M357m206nL673k818q38K368N13
1044A309m173M109k17l343K706J144k713q4M121m312O47K879k332j060K725j16
1060A290l874M608j084k598K399J040k936L93L782m751J255K324j997j217L069
$$ y = [889, 1299, -1684, -1491, 2957, -2064, -1228, 2352, -1352, -1745, 1353, 875, -3377, 2167, 534, -2632, 758, 1122, -1724, -990, 2963, -2685, -701, 2150, -955, -1562, 1783, 626, -2980, 2515, 239, -1998, 1077, 1616, -1766, -422, 3043, -2526, 355, 2057, -614, -1250, 2222, 306, -2374, 2849, 178, -1499, 1048, 1702, -2151, 370, 2665, -2456, 488, 1712, -705, -1606, 2490, -186, -2462, 2615, -380, -1486, 869, 1538, -2483, 521, 1882, -2618, 435, 1344, -967, -1690, 2474, -1001, -2097, 2324, -729, -1643, 585, 1297, -2926, 869, 1345, -2577, 207, 1366, -1163, -1735, 2622, -1584, -1589, 2084, -734, -1572, 796, 1309, -2864, 1245, 1028, -2315, 391, 1535, -1178, -1262, 2859, -1453, -806, 2073, -259, -1319, 1406, 1290, -2584, 2024, 940, -1658, 741, 1781, -1155, -762, 3020, -1731, -476, 1848, -149, -1366, 1703]
1075A703r29l019M468j618k106J927J229l398J440K641m310J668J806j865j328
1090a691L451j568k541M234j789j515J402J554l635J892J989l893J823J352j569
1105e04j354L645k181j857M002j924j413J694J359l737K413J560l732J877J359
1120A207j688j129L801k718r91L211j870j134K069Q28l785L080N91k807J403J345
1136A413j762r89L816l222j17K557j564j236J865P28l579L424l04k410J342J618
1152A580k175n69L611l445K60K195j275j711K342J32l045L441o59j892J120J492
1168A402k451M3K909l339N65J800j079j764K939n27k862L305n07j691Q29J846
1184A418k834P01K338k939O49J497j108j408L091j421j916L152j057j314J076
$$ y = [1703, 774, -2245, 2223, 605, -1501, 426, 1655, -1743, -303, 2338, -1972, -304, 1502, -363, -1691, 1760, 192, -2349, 1885, 96, -1419, -17, 1537, -2098, -206, 1783, -2110, -287, 1065, -504, -1858, 1787, -394, -2251, 1751, -173, -1586, 108, 1467, -2270, 143, 1703, -2029, -152, 1207, -481, -1610, 2191, -527, -1518, 1693, -177, -1311, 758, 1586, -2199, 881, 1472, -1335, 68, 1413, -349, -1338, 2478, -744, -861, 1696, 132, -1104, 761, 1489, -2090, 1334, 1030, -1380, -38, 1580, -595, -1164, 2447, -998, -738, 1457, 182, -1529, 813, 945, -2100, 1341, 682, -1210, -90, 1402, -1049, -1006, 1903, -1436, -871, 929, -150, -1914, 1025, 498, -2364, 941, 434, -1257, -428, 1418, -1416, -715, 1623, -1316, -667, 830, -278, -1686, 1405, -16, -1932, 1220, 163, -1151, -75]
1199g5J429k733J353J716k860J040J114r64j439L151j682j340K631j006j367J231
1215A99J448l290K156Q55k304Q30J369j295j222L312k314n71K018q49j287J036
1231I1J326k907K092M62k016P32J365j528q49K941k314l49J937r00j158J353Q31
1248A109k986K491J84j910N50J610j665n68K768k443m7J511n66j542J880L68k417
1265a673K250j33j378O58J417k112J50K340k486K81J364j88j866K278m16j729
1281a243K106k79j280L97J630k243O31J698k165M49J107m43j360K359q01j474
1297i11J924n82j057N59J529k371R82J120j840L22J141o95j225K319j265r37J650
1314F63k80j181O54J277k385J503N42j483K32J085m88j495K448j409p10J524j95
$$ y = [-75, 1354, -1379, -26, 1690, -1170, -130, 984, 20, -1419, 1732, 50, -1290, 1341, 335, -1032, 199, 1647, -1643, 513, 1368, -936, -106, 1263, -32, -1254, 2058, -256, -827, 1191, 342, -945, 91, 1417, -1490, 602, 1064, -952, -220, 1145, -383, -1232, 1709, -605, -954, 983, 83, -1075, 278, 1109, -1877, 614, 798, -1112, -562, 1048, -617, -1185, 1583, -860, -907, 604, 38, -1504, 376, 744, -1673, 577, 444, -934, -276, 1141, -971, -821, 1519, -967, -686, 678, 490, -1376, 902, 486, -1243, 863, 584, -696, -299, 1331, -912, -281, 1417, -748, -299, 808, 365, -995, 1364, 563, -911, 1013, 431, -626, -67, 1462, -909, 73, 1193, -647, -325, 816, 121, -1104, 1215, -50, -987, 663, 383, -798, -144, 1133, -1252, 251, 793, -690, -458, 627, 139, -1356, 1092, -317, -1027, 497, 302]
1331C02j379R51J047k371J575M87j364J48J347r65q05K359j845k66J280k50j088
1348h37J171N07k143J727P2j067J72J477j440l20J967j727k8R86M3j384J417K97
1366H90j890J681l1j087K23J345j477O6J703j761Q7P77J04j501J830m62j333J335
1384D99k26q23J05J407j774M30J159j267R6J025l40j249J537m71q59J240j28j048
1402f87K79J093j676P18Q14j080R2R00k91j288J797p23m97P41p2p48N17R66j863
1421a008R47O24j025j2Q18k40r74J720j018l13P34O1q16M88R71j716Q90N25r48
1440b92J8R83n56p03J460q72l35P05k8j096R85M30j332J065M8n77p6J068r74n61
1460f40J488j014j48O63J52j249J006J06j059J090j50m35k52J144j039j21J194
$$ y = [302, -1077, -126, 921, -1450, 125, 612, -752, -604, 743, -222, -1027, 1332, -513, -779, 501, 251, -837, 334, 841, -1302, 425, 497, -570, -398, 1079, -361, -681, 1286, -441, -469, 517, 560, -824, 593, 890, -1000, 681, 650, -437, -214, 1131, -346, -280, 1423, -338, -251, 526, 630, -871, 959, 497, -836, 499, 273, -550, -445, 962, -812, -382, 777, -490, -394, 631, 291, -958, 579, 108, -751, 489, 361, -687, -408, 685, -991, -273, 541, -539, -447, 453, 162, -1126, 671, -52, -549, 192, 120, -628, -111, 855, -1008, -61, 563, -462, -474, 344, 104, -870, 850, -168, -481, 253, 314, -502, -14, 957, -759, 131, 656, -292, -274, 709, 153, -550, 910, 38, -297, 408, 380, -716, 269, 699, -633, 432, 480, -97, -173, 895, -79, -640, 848, -166, -314, 349, 501, -748, 258, 364, -695, 395, 245, -190, -442, 702, -337, -458, 736]
1477G36j262Q3L97L31j055J067j25j088J170j40o32O3J121j265K47P70p82M3O32
1496C11j24r06J136l30p02Q28j6n54N2J056j182L14N23o78J27M34l6p94J170n73
1516E6k85M29Q4m42K51O02j242P22K51n41n8P21k89o90J086o45o6K31K77o15K15
1537E2M20j039O97J33l86k72Q10l23n90J026n75l24O02J46r26O20K48j067O94
1556e4K42m10p3M29n09L9O76m99m7J75K95q42O69P9n81M90j9k16j42P91p69M4
1578b32O42n34J17J54J85j011J068j93o43O74j28j91J6N60o71K94K28n22P2L27
1598B12Q9o35Q03l19k61K18Mk53Q0O61r37M33J66l47q9M38j18n55Q67n83Q3J46
1620A03M8j99m3L91q28N62O4j88k56N91k11l06N11n12L8K62o9j91J91J70n49M22
$$ y = [736, -526, -443, -46, 285, -770, 297, 172, -916, 254, 114, -518, -455, 666, -599, -352, 418, -364, -321, 311, 187, -719, 417, 87, -615, 213, 197, -357, -305, 751, -431, -117, 406, -272, -145, 289, 253, -541, 629, 56, -229, 200, 284, -158, 93, 695, -547, 175, 426, -115, -173, 548, 259, -431, 655, 10, -56, 175, 452, -163, 52, 472, -567, 130, 263, -123, -395, 415, 92, -498, 528, -47, -371, 231, 377, -549, 71, 319, -748, -54, 188, -222, -295, 134, -375, -336, 340, -159, -206, -31, 264, -578, 91, 170, -411, 79, 60, -156, -298, 493, -276, -232, 410, -124, -7, 147, 332, -679, 389, 196, -447, 227, 99, -92, -76, 484, -187, 107, 335, -187, -115, 212, 301, -334, 469, 150, -111, 107, 111, -142, -62, 599, -338, 95, 261, -86, -175, 263, 145, -410, 457, -126, -43, 103, 151, -48, -91, 300, -528, 34, 98, -90, -346, 245, 34, -272, 239, -273, -235, 27, -42, -233, -42, 128, -421, 1]
1642Aj60Q4n9L13l31r0N35m86J05P3O7l14L34J42n27M19k6k5j35K87j28k67N92
1665D04n60K20N4M1l48O70l24l14M72j44m4k05N04m36J3K35l05J71l7J7k53L83
1687B14l44P2L59r7j08p1L02n61J23J14r5m6J84R4m58N31l60p1J49j16p3K47K0
1710Ik87L37o8j50J34N5j3k39M50n03K97L2o9m0J53J82o92M42p8j1J15m8lk77
1734b72M97l68K51L5L1k48L33r2m00M61j89N9K0J47j46NJ85l87K01k46J27N0J93
1757B47k05j91N18m30M5J72J9k70J56Q4l35J23J42j92m9M21l82o9L00j06j37R3
1779d6P9k33K34j04k47M85k48R8k8J29k99M7K23k08J36j55J74r6K28j88k19K59
1801B1q1q9N7K00k43J92J29k33J78l7r5k67M54k74q3L47o6k33P2L09m86L44O8
$$ y = [1, -159, -75, -134, 179, -152, -242, 293, -193, -88, -15, 52, -262, 72, 214, -313, 106, 80, 55, -80, 207, 79, -188, 404, -156, 64, 118, 159, -189, 481, 157, -157, 315, 171, 127, -78, 426, -10, 3, 238, -67, 104, 67, 84, -169, 214, -130, -58, 301, 204, 96, 25, 327, -234, -111, 3, -92, -138, 46, 140, -318, 213, -147, -218, -69, -185, -258, -11, 9, -278, 59, -9, -159, -25, 30, 17, -222, 228, -275, 22, 54, -15, -55, 98, 280, -412, 30, -48, -59, 56, 8, 5, -272, 225, -143, 108, 143, 174, -74, 259, 167, -233, 228, 39, 98, 118, 265, 119, 124, 309, -78, 123, -123, 4, 54, 247, 42, -149, 369, -61, -16, 156, 175, -95, 61, 145, -190, -67, 75, -117, -166, 255, -127, -196, 104, -2, -139, -46, 33, -200, 34, -70, -317, 168, -80, 18, -10, 119, -180, -133, 90, -118, 18, -137, 37, -59, 169, -19, -238, 21, -60, -149, -92, 108, -135, 57, 186, -47, 131, 94, -1, -268, 186, -88, -171, 176, 110, -123, -51, 258, -228, 116, 184]
1824A84m9K7Q4j33k30O15n29O6OK2j06K42P8n52M78k12j27J54J28j81M9J99l26
1847a13L2K26j70%L3J02m69N69l78L6J36N0l54J63L45m75K44J08k44J7L04j82
1869b0m32P05l22R5kJ42m81L00J79m39M86q0j38j46M56m05o7M65k56j44M08j13
1891A91l29J73J95n50L26J44n2k90N68l74o5L31k89Q9n3J80m02L40M2k69K24N7
1913A87k25k76O54m56o5M27m27l6M48j3m71L32J18l30J14L08m95k23Q10n66M8
1934a37L27k87p5J23K16n05N40l8n45M33K50n82r2P28o28K26K51q8k58J93O3n22
1956d07Q14l74k94K63L56o26J55M08m55J31M17l74o9M02l01l22N59k3l46J49K28
1977B91l25J21K59o45M04J54l08j67M43m23j67P05m54l8K37J82o07M17K14o24
$$ y = [184, 135, 162, 246, 113, -117, 498, -31, 35, 41, 63, -43, 199, 277, -275, 203, -9, -136, 18, 146, -35, 14, 213, -113, -81, 145, -25, -25, 8, 110, -359, 210, -168, -132, 4, 54, -300, -137, 208, -267, -23, 85, -159, -142, 162, -20, -452, 253, -69, 26, 24, 166, -315, -15, 164, -275, 211, 131, -7, -153, 303, -102, -169, 296, 40, -104, 304, 191, -138, 35, 230, -320, 6, 150, 98, -192, 376, 2, -63, 268, -21, 68, 15, 195, -207, 133, 175, -94, 130, 187, -38, -314, 340, -116, -181, 246, -181, -217, 231, 218, -253, 79, 197, -133, -19, 289, -206, -429, 381, -185, -137, 190, -97, -172, -49, 167, -338, 202, 164, -381, 52, 302, -280, -372, 356, -272, -46, 205, 117, -141, 52, 115, -407, 407, 33, -261, 2, 358, -268, -113, 295, -160, -29, 388, 14, -55, 347, 46, -276, 283, 260, -86, 63, 291, -34, 87, 346, -299, 105, 259, -49, -216, 227, -196, -363, 342, -112, -150, 87, 269, -338, 79, 293, -331]
1997c31L48l1o0k96O49l36j77L90j78r3K38L1m82L91J55m63R1R2K8l54P19n76
2019b45N8M60m02k12N46Rn75N95m5o06L87K82m69p4O56m47J4M50k72l78M22P8
2041B32n54O02k96k08K15M42m78j57O98q44M49J65q4l97O67j98o90P88m17j70
2061b35L37J90m53O1N59p21R3L28l56j72N67k68l82O81j89k97J31L30m35K53L93
2082D15q20M41J78j36l21M91k40m61P05k30l32K55L72o49L99K80o69M73J1k71
2102a09j10N20n53q2P53m51l23N13N7o74O77K35p65M24J53m29r9Q06p98MO63m35
2124b3k35M85O4q11R06k38k99K28L51m72j54P01n82j38M99k86l17M84J83q55Q58
2145C49k44m41M53K75p86J23P98r14J98M66j41n21O16j23n42P51k67l98K18J78
$$ y = [-331, 17, -14, -74, -370, 279, -57, -234, 156, -22, -115, 123, 154, -328, 63, 218, -245, -154, -62, -34, -388, 331, -245, -187, 273, -129, -341, 205, 214, -361, 234, 189, -417, -30, 252, -217, -291, 365, -82, -68, 382, 110, -268, 154, 232, -322, 280, -16, -224, -9, 433, -45, -202, 496, -348, 101, 266, 182, -215, 452, 254, -436, 352, -65, -235, 102, 292, -161, -100, 459, -262, -169, 159, -197, -369, 198, -70, -452, 229, 40, -257, -126, 204, -231, 22, 415, -405, 36, 214, 78, -243, 248, 8, -453, 252, 22, -310, -55, 317, -332, 67, 347, -322, 151, 162, -109, -219, 301, -252, -334, 419, -32, -355, 158, 215, -459, 218, 453, -312, 112, 265, -164, -263, 543, -255, -251, 412, -23, -258, 227, 291, -520, 386, 148, -151, 77, 428, -44, -198, 503, -79, -217, 282, -4, -321, 163, 346, -509, 349, 105, -336, 117, 392, -394, -271, 527, -387, -189, 277, 136, -385, 231, 108, -434, 317, 50, -348, -130, 48]
2165D8k26J29L80q78N72J85l91j16N79k80n13O84l1m93L96M16p03J35N29p25L37
2186C4K21k88j90O31n35k30Q65n88j73L24K32o50N13J63o82L99J73j90m86R59
2206E02o35n6N35m27j31K38M76j138Q94J39q16L98L57m20l05R36p08L2M68m52
2226a13k38N62J52r13P71o7l90K43L81m98j71Q58q70P4M97l38k67O39m7q60J028
2247D33k57n95M36M25p85J17O78q27J90L74j73n52Q38j74n71P87p1n05J94O39
2267F01q62J99M20o27J70M63k91m17Q16n16l99Q18k37l61L47L00p32L19M89r83
2287d83L31M83l78l24Q98n91k84O57j16n18K80M84j067O66K32p16L55N05n06m73
2307e65J126q48m1N68k56l09L94M16j133R47j65m85K25M24l90l20R36o48j2M43
$$ y = [48, -178, -49, 331, -547, 25, 210, -181, -297, 282, 2, -511, 173, 142, -351, 45, 461, -242, -107, 422, -303, 34, 255, -33, -223, 408, -127, -357, 508, -80, -253, 71, 303, -347, 166, 329, -353, 46, 219, 29, -457, 502, -133, -189, 346, -81, -212, 26, 502, -636, 258, 397, -419, -21, 336, -84, -389, 547, -161, -129, 339, -113, -351, 211, 363, -550, 221, 154, -236, 7, 388, -110, -281, 577, -293, -219, 278, -60, -327, 312, 265, -595, 433, 176, -419, 17, 442, -343, -226, 452, -375, -185, 189, 16, -536, 302, 128, -443, 344, 273, -232, -38, 601, -261, -62, 358, -269, -99, 364, 73, -344, 472, -44, -443, 375, 138, -223, 124, 424, -308, 11, 500, -483, -152, 331, -47, -371, 527, -64, -348, 309, 193, -325, -45, 439, -628, 38, 270, -446, -91, 414, -92, -565, 561, -287, -328, 240, -16, -325, 69, 485, -648, 299, 134, -351, -126, 298, -92, -412, 524, -124, -136, 307]
2327C07j89n47O95J74r52Q43L2p10L49M50p06K3Q65r56m8P27j14o78P69K5r00
2348e41R13k09n17L19N56q55J43P93p92O5K47p9p08J145m48l74N88j00o01M44
2368a1N17r97M84M35p97L51K83k93m96R89m29n82P26L3n61K29O28j122N85L13
2388B85o34J37N67m81l13J002o72l27N81j2o17N09M83j167Q43J51o72N7O26m40
2408i4l90J114p56j93N35j02p35P59K88r59R28j06o41J81N81l70l62Q19o76p4
2428b53O86k18o88P26K9p67R27r0o52Q3P79r04M9Q48q62M4M75n3o46P13N8r10
2450f26Q24L2m03MO95r52K25P61p24L8K97l4n86R05j00q66O32M0m98J24P60q81
2472c33K48M12o18Q1N31l90m45Q73l58m69P55qp40M59N59j080M96L37m23k05N81
$$ y = [307, 118, -429, 266, 440, -512, 331, 363, -347, 2, 452, -254, -231, 634, -322, -370, 357, 243, -435, 334, 359, -541, 372, 163, -354, -35, 521, -334, -191, 602, -190, -125, 122, 43, -665, 480, 32, -342, 246, 146, -455, -11, 506, -491, -7, 428, -369, -18, 265, -28, -524, 465, 36, -546, 180, 213, -348, -119, 509, -613, -28, 285, -349, -212, 355, -126, -439, 563, -109, -436, 145, 133, -484, 25, 508, -659, 184, 335, -337, -280, 346, -94, -484, 630, -126, -319, 216, 114, -621, 138, 426, -533, 395, 289, -352, -171, 410, 40, -322, 497, -179, -253, 433, 215, -473, 253, 282, -485, 442, 352, -300, -217, 562, -342, -293, 555, -307, -263, 212, 159, -487, 226, 284, -626, 198, 230, -173, -169, 526, -426, -201, 560, -164, -126, 171, 137, -449, 456, 356, -510, 122, 162, -336, -212, 548, -333, -85, 327, -291, -210, 321, -69, -514, 359, 1, -468, 287, 279, -461, -2, 557, -523, -27, 310, -113, -318, 263]
2493B63k53o08J114o03l73Q59k62o30N78N59j322P78K64o33J01O21m78m85J133
2512F23p21j91M56J69o79L49M02j002P80M0m32q6Q09o94k44R74p35j91O29J47
2532D03r05P71oq41Q41J5o18P1P97r28O4Q53p07q0N69k00p00R87j16q88P32K06
2554C20o49m7Q94r25K26N90o80J3N50Pr19Q69K5o29N47J49o89L93O80j248M24
2575i9O28p19k17Q16k24n92J071o57m02O34J44p56K84N55r06M29M79o39r2O45
2595C82l47n13Q87l69m31O50J08j016O18P79j231M72K35m46k19Q29n06k00Q27
2614E09o72l04O65p5n61N66J33o71L22K80k50k63Q48p90j27Q57n74j33L40K44
2634C44r15Q20J11r85N80L02m77p6R32j018P8Q00n49k97N72P6q87Q40Rq50N18
$$ y = [263, 10, -598, 516, -87, -460, 399, 137, -493, 85, 644, -678, 100, 364, -269, -168, 453, -25, -510, 623, -98, -289, 167, 336, -343, 6, 408, -594, 186, 226, -206, -292, 517, -177, -421, 553, -182, -373, 256, 403, -502, 269, 263, -578, 263, 278, -340, -269, 528, -400, -336, 517, -190, -270, 299, 99, -601, 386, 270, -618, 114, 320, -329, -376, 518, -407, -181, 409, -271, -258, 292, 299, -620, 249, 274, -355, 192, 341, -348, 45, 725, -523, -99, 529, -190, -407, 409, 185, -407, 664, 7, -395, 239, 383, -373, -89, 466, -440, -11, 468, -171, -263, 382, 35, -478, 409, 40, -391, 259, 367, -649, -31, 748, -483, -11, 224, -222, -441, 388, -118, -318, 509, -163, -467, 198, 123, -438, 128, 261, -410, -88, 192, -58, -321, 527, -263, -390, 467, -107, -240, 100, 344, -571, 249, 360, -625, -45, 257, -220, -296, 636, -382, -304, 496, -53, -350, 222, 298, -589, 251, 260, -590, -72]
2655g2M41m78l04J182j157K72P40o35m55O82q2o54Q85j14o79N81J37p27L99O13
2675E75j031L88N53o09l16Q71k64p62J112m55n22N83J64o10J52O82r93L34L48
2694B00l64l88J013m09n78R49n94j45L38M56q83L23M49r07M34L59l99k40R47n83
2714b2k95R04p53m1M24J05q94O79L42q55L63N06m19l61J089r89k48R39n08k59
2734b93N37K41j118Q06L13q39L44L99p13k6J057p94q8O41n78j66O42j53r45J129
2754C96j06o98M66K04m73k6Q69r91J40N59l55m30O78L9j034J146k59n39M56M05
2774D47p77K05N94q96M19L95n06l88Q83j89q31J125m86m76M34N79j015L31O29
2793D77r52M60L62m04l72Q62n58l95J035m29m30L47L21q00O06M02r99L03M81l36
$$ y = [-72, 369, -109, -413, 769, -388, -116, 624, -11, -466, 216, 134, -520, 365, 251, -428, 153, 290, -437, -38, 575, -456, -68, 485, -124, -440, 431, 167, -595, 517, 62, -460, 123, 287, -323, -171, 511, -482, -148, 200, -164, -552, 461, 52, -526, 423, -171, -316, 22, 478, -405, -82, 367, -540, -106, 253, -146, -386, 561, -22, -317, 587, -166, -207, 217, 322, -572, 107, 449, -406, -43, 463, 44, -317, 772, -217, -465, 474, -34, -293, 244, 485, -633, 173, 486, -353, -9, 390, -323, -349, 708, -86, -174, 467, -111, -277, 365, 212, -733, 396, 290, -408, 58, 262, -211, -237, 632, -359, -219, 340, -15, -445, 233, 272, -762, 384, 125, -414, 42, 447, -330, -125, 469, -427, -8, 387, -119, -507, 376, 187, -644, 481, -5, -481, -47, 532, -483, -152, 477, -475, -15, 347, -57, -429, 433, -125, -520, 515, 86, -344, 3, 324, -476, 130, 532, -467, -164, 317, -19]
2813a9m39R30m16m06Q20m56k88M00L71j061O47M51q74K34M60o04j56R28n78k34
2833b90Q52k74n86M21Q5p49P35J64q21L92M82o39k08J236r69q9O80l58l25M95
2853B34Ko49Q30k90m27K71L51n77j03Q05q01P8P10m17m42P21n2o27P78l71l29
2874c05K78M55q54M22L61o73K18L40n8p21Q93k05n79P73j21n66K19O06j043M41
2894a19N92r45M34M13l18o07J114n02n91R64m02l57K88M40q53N40L07o41P2M88
2914C17k55n24R77m84l18O02k49m09L09L92r13N85K81m62L0M69l24n49R78n84
2934a31k6M92k35n36N76K55j073R14O1o62J53N35n13j86Q63n26j85N19j87n64
2954d56P99k5q66O47J40n02K85O10r44k8R60j024K15M43p1o25O99J01q48Q50k11
$$ y = [-19, -458, 472, 56, -350, 470, 14, -274, 126, 497, -564, 83, 534, -340, -106, 354, -250, -406, 522, -56, -290, 562, 288, -298, 123, 208, -541, 194, 358, -463, -71, 411, -228, -436, 800, -169, -258, 422, 64, -261, 234, 236, -413, 417, 127, -300, -29, 322, -255, -358, 447, -354, -276, 434, 17, -425, 296, 244, -383, 395, 24, -305, -27, 428, -426, -4, 357, -316, -98, 242, 184, -537, 356, 151, -428, 345, 224, -342, -123, 483, -560, -119, 473, -472, -38, 375, 57, -550, 564, 62, -529, 435, 33, -324, -36, 404, -449, 91, 398, -243, -171, 317, 62, -462, 515, 31, -287, 315, 66, -343, -34, 358, -555, 30, 311, -151, -121, 348, 24, -525, 453, -131, -157, 335, 100, -436, 140, 395, -678, 236, 297, -365, -212, 323, -190, -376, 487, -39, -224, 295, 108, -456, 343, 318, -548, 99, 239, -263, 22, 632, -312, -340, 620, -404, -189, 254, 183, -442, 257, 358, -490, 360, 149]
2975A49l22pO78r31K42P69o90j45L20Q7p22J032l10o31P24n6m13K80L98q35L81
2996bK59n79J47N52k31o32R15m97m23O52j05m05L10M89p49M11K18p19J49O57k75
3017A42n85R88o29k40N62lo11M51M48j127O92L42o58N5O67m38o35J170p59j03
3037b71N12q7n69O86K43j059P57O3n94J52O71n52l31J067o30l27N69j64o57O19
3057I8L18r86P40m3k12P6N58o91j8O54p63J10K55K19q41Q01J0p17O56Q1n19J22
3079i2P84j121K40O23o76q0O27m4r60J103j44p31O64r9l55K24N00q89L69L72m92
3100a77j19O01k46n74R83l93m47M36j4l85M10M31j035N52M29o62P8M60l96l53
3120d21P89l31l49N90m6o76M03N45j066N49L55n23k23Q89o06j53P94n69j39L02
$$ y = [149, -173, -180, 498, -433, -191, 578, -112, -257, 63, 150, -572, 460, 150, -481, 243, 187, -226, 54, 452, -383, -2, 257, -322, -175, 377, 146, -486, 429, -68, -491, 161, 56, -349, -39, 450, -299, 112, 330, -389, -240, 417, 142, -443, 545, -84, -324, 238, 235, -376, 75, 523, -604, 88, 430, -228, -173, 494, 56, -579, 591, -168, -271, 241, 154, -415, 271, 514, -545, 212, 275, -319, -167, 504, -48, -379, 688, 58, -269, 300, 136, -521, 98, 416, -570, 170, 127, -85, -9, 549, -142, -160, 494, -269, -159, 96, 315, -526, 275, 285, -432, 224, 305, -214, -92, 692, -429, -189, 434, -242, -322, 305, 261, -699, 404, 260, -471, 193, 94, -261, -37, 463, -426, -57, 315, -177, -296, 305, 59, -515, 468, 75, -372, 64, 50, -335, 75, 506, -529, 23, 452, -210, -132, 328, -68, -421, 368, 37, -312, 278, 232, -444, -41, 504, -562, -13, 342, -181, -404, 485, -121, -274, 520, -49, -188, 114]
3140A14J10o50N74J90p03M71R0l55l3M92m69j46P11m77j47L87M1q19P09J82p27
3161d55O40K1m42m5P09q25K20O52n90j36N60k9j000Q61J8o65N50K9k51l7O93j025
3183e47L70N30m84q9K77Q0p67J068k54m55K86L98o43J76P75j111L23M63m13k43
3203b60O36l74n54Q69l14m33N36K52o45L28N70j035K75N06m05l87Q94m42l51Q77
3223E43n21l45M54K62p00M58K76q58M42K60l57k71O92l11l63P25m77k58L11L78
3243C40q27O28J90p90O80J70n59j79R22q06o3O87n36p1L42J14p42P53j9n61M36
3264A09J10l17k06Q56p78m8O94m24k25M56K2o86O90q3m16K58J88l26j29P79q41
3285c17K36L36l20k05M60j8o74P04j16m15M18J50n44O8P32r56L99M38m27l47P31
$$ y = [114, 224, -426, 148, 338, -365, 106, 196, -159, -192, 300, -169, -315, 396, -81, -228, 159, 200, -619, 90, 272, -455, 185, 206, -236, -281, 428, -397, -177, 475, -115, -251, 309, 280, -720, 141, 159, -506, 44, 73, -178, -215, 478, -547, -177, 353, -131, -220, 57, 137, -630, 438, 184, -271, 15, 413, -230, -54, 721, -390, -67, 396, -17, -260, 376, 2, -552, 317, 3, -430, 106, 358, -287, 41, 611, -424, -149, 357, -48, -435, 459, 17, -334, 543, 22, -323, 131, 393, -307, 151, 427, -431, 11, 271, -86, -357, 335, 24, -339, 386, -91, -349, -38, 340, -487, 141, 331, -459, 221, 391, -168, -347, 575, -231, -294, 393, -143, -214, 128, 242, -500, 253, 234, -327, 109, 219, -98, -304, 552, -226, -274, 420, -4, -229, 227, 249, -437, 253, 170, -246, 12, 200, -126, -255, 524, -317, -81, 255, -65, -270, 190, 172, -502, 202, 86, -329, 89, 239, -305, -237, 495, -461, -62, 376, -51, -398, 333]
3306C33j87n95Q33m54k30J22N37p89N53L41o88J58L85m86k31Q78n03n00R46j88
3326B35o37L06L69p77N39L33p59L79L16l24m12R10m82l44O31o4m92J54O37r72
3346d54N98K39o71M63O4l10l73J027o14k81P50k74n11M89K32q36P18j43m30K43
3366g4L95m71j89P60n30j70O46l38l98N14O0q83R20j07l92L20K36l71j26Q14r66
3387c50K13L03k44k72N89l0o00Q06r8o63L89K18n44K06L40o49L64K97p8o23O50
3408B24l6n78O37p8m31L59K68p96M29K52m95K25L15m01k52Q06m40m77P66k66j11
3429h0P0K61q02O57J91o88M19K64l48j98O97n69m3M51j1m65K35L08p79N58pl48
3451b27L20J38m25j65O91m12k60N95q5n50M18K55q46Q36m3m70K10K30l13k9O72
$$ y = [333, 146, -449, 384, -70, -300, -178, 359, -430, 123, 464, -224, -66, 319, -167, -398, 480, -23, -523, 423, 235, -402, -96, 273, -504, 35, 368, -391, -12, 304, -20, -432, 478, -4, -348, 283, 219, -273, -119, 518, -454, 144, 383, -288, 175, 239, -71, -444, 583, -31, -312, 438, 164, -347, 142, 374, -462, 256, 113, -317, -74, 321, -150, -339, 421, -109, -279, 367, 29, -369, 145, 205, -678, 242, 135, -257, 63, 299, -72, -198, 616, -350, -137, 166, -78, -350, 239, 209, -391, 415, 317, -346, 43, 261, -283, -77, 263, -386, -22, 275, 197, -426, 224, 188, -390, 247, 169, -262, 97, 365, -431, -2, 250, -245, -20, 295, -106, -358, 448, 8, -469, 297, 31, -80, -10, 251, -551, 106, 297, -391, 28, 292, -56, -254, 443, -126, -169, 282, 271, -194, 41, 349, -430, 128, 121, -227, 93, 231, -194, -359, 332, -80, -340, 255, 170, -380, 38, 293, -553, 283, 240, -230, -20, 210, -103, -132, 540]
3472E40p46j91N60n5o13P59O3q14Q38j89l85J98N20o78J23M77p02J76K52P5n22
3493c14N60q2o70P11m3k76J05N24p28K44L67n81J59K31j83m02N95j62m00N47j48
3514E4k51Q5N85p62L11L52n00j7M78l19l74Q50n30k60N51l8o05L49N40q38K44
3535i5L95n88J86L23k35m52R83n80j94L93R3n65L94K44o85K62L48l90M6L97k75
3556El39O11l17k25N36j08o74N58L12r10O57J25m37J53L00m52l3O61m25l28M88
3577A58J06n73N57Oo44M57J28l01M8O44q73K58N11q51K17M21o1n76N94j20m76
3598c70O48M4m91K58M48r47K62M82n16jK46j1m27P37k97l80L64J14l25R8N75q60
3620c49L46J10l88j0L98r1l04O66k90k98L80j9l46KM64o37L62L24n21M6N76m81
$$ y = [540, -206, -397, 163, 108, -505, 254, 317, -497, 341, 152, -233, -35, 485, -193, -70, 407, -295, -119, 133, 208, -314, 246, 164, -506, 205, 162, -114, -9, 515, -213, 31, 398, -183, -24, 207, 24, -378, 217, 55, -345, 202, 54, -197, -112, 473, -289, 22, 374, -126, -143, 335, 16, -358, 492, -38, -298, 253, 215, -390, -41, 499, -339, -95, 300, -288, -102, 221, -14, -466, 517, -63, -257, 136, 229, -336, 58, 302, -383, -121, 227, -163, -117, 280, 5, -334, 277, -40, -265, 271, 163, -511, 47, 359, -551, 106, 231, -206, -53, 247, -205, -238, 423, -2, -330, 158, 264, -309, 248, 254, -390, 67, 195, -106, -58, 586, -287, -29, 482, -369, -152, 269, 208, -368, 226, 106, -370, 278, 322, -169, 89, 537, -410, -148, 334, -182, -183, 63, 52, -375, 362, 65, -315, 49, 163, -162, -64, 511, -349, -3, 107, -281, -291, 107, 16, -288, 378, 88, -210, 170, 151, -195, -193, 271, -366, -4, 320, -201, -155, 421, -60]
3642f0l83Q34l97k48N14k20m06K93L52n84L62J67n13J31M74n25j59P47n37j37
3662b95L94k3m05M04J69o72N28N1k85L1M88n07k12P40m26q0J68K05n90N23m5m12
3684b51L79K08m15r9M99m72p1K71m9k99M59j67l49N70l4m88L60J68m41R4O18p38
3706b47K30L34l34j80L97m8m72N00o1l43K32K38m58J45M95p65M07L51n62m0M92
3727C11j58l83L84l62j53K90L43o32L10L90q15N28J98k86j46M92k24l99N99l38
3747e1k97N17J54o37L65K07n69L31l1k05Q6L98l89k22O44l96l16L42J33n34O04
3768A34p6m55K66L98m06m0N27m75o5M72k73k07L65K2m54M25R1l74K23J44l62j36
3790b56O12m80K8M44k98k47M09n2m49N43j51k68L09Q1m60O0M92n82K74K10l96
$$ y = [-60, -443, 391, -6, -254, 260, 40, -366, -73, 279, -305, 57, 224, -289, -158, 316, -209, -368, 379, -158, -295, 99, 76, -329, 75, 244, -428, 100, 151, -134, -103, 385, -122, -334, 406, -20, -100, 68, 273, -317, 206, 161, -251, 128, 336, -79, -178, 321, -151, -222, 49, 0, -299, 160, -7, -356, 214, 180, -308, 52, 220, -221, -127, 491, -247, -17, 317, -17, -197, 200, 152, -320, 180, 119, -224, 8, 246, -212, -67, 428, -337, 70, 421, -141, -181, 311, 153, -230, 154, -208, -361, -71, 272, -360, -50, 340, -475, 53, 251, -35, -181, 311, 87, -312, 287, -51, -348, 169, 323, -314, 51, 258, -311, 20, -11, -216, -130, 268, -121, -343, 301, -95, -411, -69, 64, -470, 134, 58, -397, -131, 267, -139, -179, 348, -127, -192, 280, 7, -200, 165, 187, -267, 158, 249, -125, 98, 242, -120, -256, 356, -124, -96, 348, 50, -197, 212, 160, -289, 254, 103, -165, 144, 225, -235, -175, 317, -265, 9, 219, -177]
3811a77j7K46L6l75L48mm06N12J78o39K22M09o28M12M4l2k51M14j51n38O32j28
3833A07k91K38P9l85L25K80o04K72K83m41q7N29l79k92N84k75k08L19J59o31M41
3854B3K70k73n8K94l67j0M30l75q8L70j74k96L70J11o61M51P0k90J49K04k87m3
3876a80M83n15k4L85j78K3R6J27o12N20p2k86K68M27o71rN35o02K61J85o5k96
3898b00N39j46m53M22L2o17O11q1l24K23L51p34L63J72j34k70N32k77l37M42o3
3919E1j81J13K21m79K62K03m98R7L77k45k09L31o0l07N84k44l09L09K44n19L58
3940I9J49l87L3L10k27j97O52n09j14L21j61l6J08Ql95M66L4l00qL29k35MK60
3963B04l41P6L15n3m05L09J20o38O62k6m37K65J36l41M7L87n24J19L43n8m67L69
$$ y = [-177, -194, 52, 88, -287, 61, 57, -349, 163, 341, -298, -76, 333, -295, 117, 161, 129, -122, 292, 141, -397, 235, 107, -184, 54, 133, -252, 73, 353, -251, 21, 304, -137, -224, 305, -74, -366, 218, -57, -265, 54, 213, -418, 23, 293, 20, -38, 256, -111, -121, 309, -66, -154, 216, 42, -254, 116, 227, -434, 17, 87, -203, -54, 150, -137, -180, 303, -212, -236, 149, -29, -6, 90, 217, -395, 125, 53, -233, 35, 462, -209, -218, 317, -285, -24, 161, 96, -200, 339, 193, -260, 162, 194, -423, 188, 107, -217, 6, 357, -377, -14, 158, 24, -246, 286, 9, -328, 114, 51, -130, -17, 204, -275, -13, 190, -308, -211, 166, -79, -288, 43, -17, -324, 260, 16, -293, 16, 260, -259, 99, 248, -139, -106, 204, -23, -220, 432, -77, -191, 130, -31, -67, 41, 49, -346, 120, 154, -146, -154, 175, -60, -56, 204, -137, -61, 254, 201, -204, 105, 225, -413, 249, 223, -214, 51, 187, -154, -107, 280, -244, -125, 218, 160, -307, 62]
3985F2J7l95M14N7k67n9L55k85j89N14l20J72Q9o2m37M23j29l41N99j00l49J52
4007g9M11o02Q0L44k49J68J01j73k21N53k50m73N84j91k27K29K29m52J05K76l01
4028a38qM39j94m67N85k40j68M56l29o0J28L42n51J26J66l92K73L12k08l40N94
4049C26k90j47M22j25m16K58J97n58L65J38l74J78J62k09k10N06k04k25K08l3
4069c1j83L41J23n08L27k3j64K4M77m78k81P28o58J57K00M0l29L53k6l75M49K3
4091A86m38J80L48n10rO13o59M6M45M0m25M41q4m45M36kk66K0K97m84J45K84j20
4114C9j57L30j41m47O95l21k42L90l3k12K00K38n41M9K64j51j22L22j5l58N86
4135C73l67j77J61Q2k97J95K59m60K72K60l89o7M03k65j76L69k65k22L74J6m07
$$ y = [62, 79, -316, 98, 155, -112, -171, 184, -101, -290, 224, -96, 76, 165, 103, -334, 89, -40, -381, 218, 118, -231, -79, 332, -270, -190, 154, -95, 73, 174, 1, -220, 333, 83, -390, 194, 3, -224, 5, 234, -218, -113, 163, -138, -146, 293, 99, -368, 217, -23, -191, 265, -64, -124, 4, 346, -205, -79, 87, -305, -32, 280, 72, -268, 326, 36, -111, 311, 186, -230, 28, 225, -333, 32, 170, -204, -26, 136, -73, -283, 223, 19, -206, 2, -31, -214, 127, 250, -258, 69, 46, -118, -94, 383, -95, -376, 352, -306, -149, 51, 91, -238, 115, 89, -286, 163, 186, -252, -72, 276, -234, -243, 370, -289, -243, 202, 242, -183, 258, 174, -271, 165, 163, -103, -83, 214, -270, -125, 159, 39, -118, 212, 71, -376, 319, -2, -244, 146, 113, -99, 101, 339, -202, -153, 111, -40, -162, 160, 145, -213, 373, 6, -171, -10, 72, -225, -30, 229, -231, 41, 301, -88, -155, 248, -17, -193, 176, -89, -311, 63, 79, -328]
4156c28M65J31m80L27J32l60j6M31j99j47L17m24K7K00k8m34M83L1l24M64k27
4177D1P1j49K86l43P4J60k16j05K75J0j88L10n1l67K31R1q6j21L00m21J3N02m30
4200a13q7L61j5n43N50Q7n47L19J48k73N6L18m31J5M37l43j35K79Mm14N87j65
4222I5l05K74J48l93J09K21m52K37K81l15J6L09k28k07L79k01j22K09K77m60m6
4243a74L76o17M55K28l38r0K88k23j57L64m8j97L11j03j87J93J4k07M6K87j69
4264E2k95O02m47k0K51j11j10K93Q0n21K02N0k44L03L1j91j3L31j09k85M04l30
4286g7r7M03j64l62M88j81l15M27j41o8j54N89n66J41J86k20r5M84n9n41O26j75
4308A29m80L44K16l34J48M10m43j4J00q4j08L33j25m10M52j04j05J18K99m82P0
$$ y = [-328, 137, 268, -212, 115, 247, -113, -129, 302, 103, -44, 273, -151, -124, 76, 48, -386, 97, 128, -196, 268, 41, 112, -37, 249, -94, -20, 140, -76, -181, 94, 104, -84, 226, 175, -192, 39, 130, 44, -77, 223, -198, -185, 317, -113, -200, 161, 146, -397, 153, 240, -307, 12, 160, -113, -57, 261, -170, -155, 282, -61, -196, 83, 87, -327, 260, 95, -210, 64, 212, -181, -72, 149, -303, -66, 215, -100, -84, 225, -3, -210, 169, -32, -154, 55, 332, -128, -174, 202, -415, 40, 268, -70, -160, 128, -95, -252, 112, 64, -133, 178, 75, -112, 81, 95, -112, -66, 221, 52, -243, 359, -88, -108, 143, 32, -78, 215, 295, -226, -24, 26, -218, 85, 116, -75, -88, 243, 134, -151, 253, -77, -174, 229, 65, -297, 191, 10, -305, 122, -19, -87, -241, 348, -218, -77, 109, -111, -206, 278, 219, -322, 304, 129, -351, -7, 209, -125, 23, 433, -10, -24, 76, -8, -116, 217, 92, -318, 134, 30, -75, 43, 342, -140, -70]
4329g0K68l87Q5K55k16j84M37l21J49K36l37o9K27J41l82K12K22n03K47K57j89
4350G8l31M92k33o7L6J4j23J83K17m73J66J70m02J95L04l32l7L83k89r1L00k65
4372a05j79M84L6n61L50K00l92L1J28n2j31L91k69J5L50l69k29M11om11M97j93
4394dk39J60L44l64N1K20m56K73M9O9l42L13J35m28K56L4q6N3O7l38K74L07m87
4417a39K62k4j0j77J73N4l48M59o3j51qK23m51L2N20m48L9L21k05k05L28j01l78
4440b97M94j78j40J61J33k51n2L73m14J81R2p5j91L12j51j18K58j14k96L00P1
4461I8k61J26J96l25J9L37k02m30O19k26q6L86m28K3K05R7l87K08J78k25R9K21
4483B42k25j05K30k41OL06j45k87L46P1n37N48j7l36J43K80l06j99M81l93R4K80
$$ y = [-70, 198, -189, -104, 151, -65, -249, 188, -133, 16, 252, -85, -154, 73, 214, -168, 44, 266, -237, 10, 267, 78, -253, 239, 6, -61, -25, -11, -134, 49, 266, -207, -41, 129, -273, -78, 226, -106, -143, 240, -49, -140, 160, -105, -284, 200, 236, -325, 25, 225, -167, -136, -8, -60, -191, 200, -69, -54, 296, -73, -302, 109, 103, -308, 189, -4, -243, -83, 261, -103, -52, 168, -288, -15, 34, 103, -239, 74, 209, -219, 37, 71, -15, 38, 105, -233, 41, 348, -139, 123, 99, 89, -88, 85, 139, -209, 250, 187, 36, 28, 251, -200, -168, 352, -96, -57, 264, 59, -146, 182, 81, -297, 197, 19, -121, 40, 173, -78, -130, 243, -171, 10, 102, 27, -164, 148, -3, -121, 137, 23, -273, 27, 98, -163, -37, 159, -166, -147, 190, -12, -442, 177, -49, -135, 251, -177, -154, 51, 148, -239, -31, 147, -78, 21, 242, 17, -88, 142, -99, -93, 213, 68, -219, 127, 198, -339, 209, 192, -144, -1, 279, -27, -226, 255, -138, -44, 236]
4505B36j45j51J06R0n01N72pm57P0L94m63K1M99l35r6L47r5l85N35l8m09M04k07
4528a5j63L9K23k89K24J98k46j95J84J35l03M42k71k7Q7N8k02J07J27j56M3K02
4550B02k98J8K08l5m12O60n43J43J15N7l41K60J91l22K35Jl78J28L22j68k46M02
4572A99j71mL2K12l11J7J32l64L84o9l34J39J93j29k16M78j25j73K36j28j02K91
4594A87p0l74K57J04k19K7L74m08P7O1p9q8L53j67j96J27N9j34O1m5n2p2L72l00
4618a45J6K32k9j65J57p4j68L79k07j34K16M6j95l7L93m60J35K16k40K40j87N6
4640D5k08L17j60j15J05J55j27k3K19m17K43J61l92J49K88k21k47M59k05k76K84
4661C4l9j15O3K24m07L28J58m06J0K80o9k60L56j52j50N0K37j76O3M2m16J71L13
$$ y = [236, 91, -60, 46, 136, -365, 207, 200, -257, -187, 207, -256, -235, 264, -71, -167, 180, 85, -300, 235, 197, -212, 192, -15, -178, -139, 84, -205, 19, 217, -29, -224, -40, 95, -208, 234, -37, -64, 23, 81, -121, -14, 113, -43, 0, 202, -96, -78, 130, 95, -317, 343, -200, -57, 58, 115, -226, 34, 225, -97, 138, 139, -239, -111, 211, 43, -203, 199, 28, 24, 56, 268, -43, -26, 106, -258, 126, 57, -277, -138, 55, -74, -290, 188, 63, -110, 126, -2, -104, 187, 117, -257, 0, 104, -115, -88, 286, -122, -45, 16, -63, -151, 202, 35, -161, -34, 25, -109, -48, -93, -145, -217, 155, -145, -129, 103, 74, -91, 66, -8, -176, 203, -4, -138, 78, 124, -71, -108, 285, -175, -40, 176, -64, 176, -11, 45, -163, 154, -6, -121, -16, 139, 12, -11, 208, -209, 34, 195, -197, -48, 240, 19, -228, 231, 26, -250, 34, -5, -120, -57, 167, -240, 88, 246, -160, -150, 130, 61, -199, 157, 5, -145, -95, 142, -34, 29, 71, -345, -174, 139]
4684A39j70n0L62k87k68M91p8l63M53j61j59J19O2l11K24P8j28K9J08l44J98J22
4706F6j01j06K94J86n07J40J34k47M08r2j74n6K20j54j14K75j81j02J56qk29L86
4728A94o2k96K11L9j64l4L45l43R6J48k36M9K18l07k5L32k11NL5J03k22Q4K34
4751A93l27l0L40l08J10J74j74j02K41m7j52J91j55r5J09K38m59K73Qj72J48Q2
4773H6j23k41L02r9n6Q7K04l77J46J50j10N6M4k68M6L73k73n4K29m0p4qO9q6L1
4798A4K22m51K25K46k32k2J84k48J1J42m0k14K55lk22K68k7k57J44Q4j01q5L84
4821B77l96L0K52j92q9K20p4k39M78l00qJ13%j06p2K27l8l95L77K8j67J26j2r6
4845e6K86j35k34J6L48k75K0P4j11K3K68k55j4J99q7k15K51Pk64J57J75j76j58
$$ y = [139, -31, -81, 281, -6, -274, 217, 139, -224, 229, 68, -91, 28, 90, -221, 3, 81, -47, -18, 90, -254, -56, 66, -35, -141, 153, 339, -168, -28, 106, -141, 267, 175, 1, -55, 165, 11, -103, 172, -9, -111, 45, 37, -192, 194, 132, -164, 47, 86, -78, -112, 233, -110, -14, 134, -102, -53, 165, -142, -167, 165, -46, -41, -6, 97, -125, -41, 193, -134, -164, 176, -132, -22, 152, -22, -124, 117, 70, -82, 109, -46, -141, -32, 206, -253, 20, 28, -144, 4, 86, -37, -278, 24, -75, -131, -44, 160, -217, -71, 79, -31, 25, 69, -199, -153, 220, -53, -107, 122, 82, 8, 0, 69, -17, 14, 236, -215, 10, 256, 24, 2, 186, -62, -51, 91, 51, -163, 92, 89, -133, 135, 108, -149, -5, 79, -22, -107, 277, -119, -89, 163, -29, -118, 102, 28, -211, 267, -33, -41, 72, 72, -34, -106, 121, 83, -312, 65, 93, -74, 52, 40, -56, 230, 95, -139, -123, 225, -50, -30, 44, -67, -44, 224, -31, -45, 154, 67, -148, 103, 110, -154, 3, 178, 2, -156]
4868a56J93j79K00n5O0k52M34j25k47L00k77L2J40J06k59K32j15j44J04P8k06
4889a36J70J70r0k54L12j42j33L27j11k71L52ll19R4K49k84m8J91L0j87J33L3
4911H3j21J54l7r7J43l0k5l2R0k70Q7R1n8k3O4J5j53K87n5l11L63n3l17J57K82
4936B34m04J14K60l82J70J21o5o5J22k7l70L33j18P4J7p2N9m1K76l45J03m0j53
4959a99J40J49L4j97J82Q5k77J05k4q3J37j0L3j02J8o8M2J99k44j80M47k39q3
4982a35K10j93nQ7J64q5l0Q8o4j86J08J7j40L52j47j01L5J36j45K2J57k88M4K71
5006A72j96j75K00q3k5J66r7j37J12J30q9J46K4j64j6R5j47R3J78k65J5P4J77
5029A88m02L76q2k90J48N5j24P9K82k97J11O4j70N0N5q3K7P1J43m45L39j57O2
$$ y = [-156, 37, -142, 58, 3, 63, -189, 245, 120, -127, 173, -104, -72, 68, 174, -85, 147, 32, -112, -8, 70, -136, 34, 204, 114, -140, 172, 30, -103, 224, 113, -158, 194, 191, -128, -34, 215, -69, -117, 74, 104, -83, 50, 83, -38, 116, 79, -18, 125, 95, 70, 38, 128, -142, -55, 36, -22, -45, 19, 34, -119, 168, 113, -198, 165, 112, -205, -48, 234, -170, -56, 204, -178, -8, 113, 48, -17, 105, 78, -292, 41, -77, -3, 14, -58, 1, -40, 236, -109, -6, -46, -199, -59, 90, 124, -73, 109, 194, -83, 22, -2, -85, 52, 42, 75, -27, -9, -77, -35, 164, -80, -260, 187, -52, -135, 75, -118, -123, -36, 128, 43, 13, 101, 37, -149, -41, -24, -164, 188, 41, -60, -25, 111, -34, -12, 145, -143, -99, 172, -24, -199, 1, -82, -107, 59, -38, -175, -63, 67, -22, 124, 148, -16, -32, 63, -84, 9, 187, -78, -63, 11, 188, -214, 162, 80, -210, -62, -7, -131, -52, 230, -67, 44, 108, -62, -12, 43, -40, -13, 58, 201, -244, 95, -62, 0]
5052@j25N5j6J39J14k92J00J31j90K4J13l19K82J05lk79k1K18j27r3K93k37J81
5075E3j04R9o8J73j21k32K84j58n3J77J42j85J2j09j2qK58k08k31L47k07J50m2
5098d3J69j73P7L53m96L03r2j61J25j43J35j30J19n4l8K08j30q2P4Q0k04J67j36
5121g2J06o8J44j66J08O7k38K9J55K4k98L26j64r3J18q2J38l8J98r4j03O9k03
5144a37J77K7M8j45j3J09j64J66n6j24NK17l11J90N8j43Q0J50k49Nk1K31k48K22
5168G4qk51K49R2k44J32%k19K00j05K69j90O4j36l8J72q7J04j91O7P8j05L3m3
5192h3j03J31J60j75ql7O2K39j56l08L59j9j40RJ7L1n6K16j71P2R5j29j08j21
5216b23J58PJ57j35j20R6n3K46k6l0j25j83M01j89J45O7k5j71l6k1n6Q9K79k99
$$ y = [0, -125, -70, -86, 53, 167, -125, -25, 106, -84, -60, 53, -266, 16, 121, 118, -161, -182, 36, -91, -184, 109, -128, 53, -51, 48, -20, 153, 32, -200, 84, -74, -127, 50, 192, 7, 19, -90, -102, -110, 148, -60, -291, 56, -151, -1, -43, 126, -47, 30, 383, -113, 190, 98, -63, 62, -81, 54, -76, 43, -11, -49, 159, 29, -53, 21, 101, -103, 64, -72, 34, -34, 110, -56, 52, 119, -119, -90, 65, 89, -209, 117, -47, -140, -22, -104, 34, -4, 194, 100, -3, 66, -137, 40, 67, 115, -30, -43, 66, -98, 68, 12, -112, -107, 110, -201, -11, 47, -96, -16, 134, -115, -110, -131, 100, -148, 74, 66, -185, 64, 156, -88, 44, 44, -175, 25, -80, 189, -1, 63, -73, -111, 61, -26, 78, -113, -46, 32, -73, -40, -83, -186, -55, 105, -70, -78, -115, -53, 186, 30, -278, 81, 62, -78, -69, -52, -21, -77, 139, -32, 40, 135, 6, -102, -223, -65, -58, 99, -36, -156, -60, -113, 133, 107, 77, -48, -231, 170, -19, 126, 193, 168, -3, -39, -60, -116, -27, 252, -47]
5240d7oM0j52J06J96k53jJ00k6o4J87q2q9K13l6j00J4L1j05K20j26j23J3J79l
5265H6k67J41J05l08J87J40r7q3J53np1O4p8n2J63r7j34M41l98j2J11N3p1j27
5289a56J33p9L7J22j35Q0J29j78k5J85j63r3pJ91r7j14K36j48J31j28Q5j43K07
5312G0j43j7K24j04l5J32k8p8O9j40l6J44p6J34m9rL5j29KR7n0L2QPq1J80n1m4
5340F4K9q1j08J75p5j39K07n4j21P6r2j8O6J07m7J69r1k01J60K3j88K62k18J27
5364C2j34L9J26l05K84o9O4j77K45k27J51L5o0k2J46j4j77R0K6p4Q9j05N4J45
5388A62j16l9R4k5o2m2J74r9k26K56n7Q1Mm8RK04l35K9K55j39l02J88J36ln9L3
5414G3j6n6J87j28k5l1K1j36M6J15k33L06l2j41P6J45j47N3r5n5m6N5J93k91J69
$$ y = [-47, -53, -13, -165, -59, 137, -116, -117, -17, -43, -107, 80, -2, -91, 122, 86, -14, 0, 31, -74, 146, 20, -103, -90, 89, 86, -181, -40, 65, -243, -56, 84, -13, -96, 57, 52, -19, 45, -33, -85, 78, -19, -153, 288, -110, -122, -11, 42, -29, -156, -23, -102, -65, 57, -78, 2, 131, -47, -72, 113, -50, -143, -150, 41, -56, -170, 66, -82, 49, -79, 6, -137, 70, -73, -90, 134, 30, -5, 127, 99, 21, 90, -50, -86, 58, -18, 116, 67, 58, 93, -36, -34, 63, 13, 45, 53, 60, -21, 159, 108, 64, 93, 12, -96, 79, 4, -135, 72, 18, -103, -27, -119, -137, -71, 36, -11, 158, 67, -134, 26, 49, -139, 123, -95, 32, -102, -63, 63, -242, 42, -27, 37, -140, 105, -122, 29, 64, 4, -18, 128, 114, -63, 27, 53, -21, 68, -37, 17, 162, 46, 7, 101, 76, 14, -28, 146, 47, -179, 77, 20, 101, 105, 57, 66, 270, -65, -36, 219, 80, -222, -34, 102, 99, 40, 73, 57, 1, 188, 60, 35, 4, 25, -111, -65, 50, -183, 123, 91, -50, 26, 171, 24, 77, -18, -73, -119, -64, 129, -162, 7]
5439GM7k65J40J43j14k5K98j71k49K17r3M9j4J4j67J79J12j87Q6M0kM4N2m6j14
5464a9j17J46km6J85j76l6O1O0k8o4L7O9p7l6N7J95k43n9Q2J74k41R7m8O7L8k0
5491E6K4k4j89K04j68J08J13q9K8pq1J49K4l56J63n4L5J68k18J27K4j66J27J13
5515A11k63K1J05K7p1J2L6P7J9j43M9K9q6j0J54j99J92l4L4J1n7P3k2o4l4R8j2
5542E3k1j5o7J05m7r2K22q0J0r7p9Q7P0K1l7j39N5Q1J0q2j68J87O1l0J75j65J66
5569A84j35j82K14L4n7M9k83J40M7J1q7J7Q9o6J32j14P0l2M7p3Pl25L14J11j46
5594c4K5P8pk4k9j14J85j1j31M9n2L0J09j00J02k46J90q5o4J29L2O0P1k09Q6m
5620C6o5q1K14j25j17K0M8R9Pk1l3J80nr8j32l6J25K9n3m5O2j33J58j22J25N1
$$ y = [7, 54, -211, -71, 72, -42, -67, 231, 60, -189, 28, -65, -16, -30, -16, -183, -4, 108, -79, 7, 47, 45, 89, 141, 95, -19, -136, 10, 8, -38, 147, -29, -65, -4, 56, 28, -36, 1, 70, -7, -43, 14, 209, -34, -93, -11, 163, -78, 19, -29, 38, 76, 56, 80, 56, -133, 71, -97, 11, 124, 35, 63, 56, -25, 124, 148, -208, -45, -99, -64, 104, -114, 13, 37, -129, -2, 111, -152, -131, -26, 1, -70, -58, -22, 55, 74, -69, -20, 9, -77, -87, 67, -132, 60, 26, 60, 71, 14, 87, 65, 1, -33, 65, 53, 32, 17, -50, 55, 8, -84, 138, 58, 68, -29, -108, -21, 49, 70, 33, -106, -51, 30, 40, -42, -210, -23, 38, 8, 183, 18, 184, 49, -133, 81, 115, 58, 107, -176, -36, 11, 22, -65, -48, 41, -25, 107, -7, 63, 31, 78, 5, 12, -313, 1, 112, -34, -9, 69, 62, 38, 9, -105, 80, 69, -62, -13, -65, -35, 74, -26, 76, -170, 20, -65, -129, 0, 32, 92, 163, -46, 40, 36, -29, -110, 104, -21, -138, -118, -70, 29, 36, 15, -18, 162, 157, 59, -73, -109, 16, 45, -8, -53, 9, -124, 34, -88, 37, 88]
5646H8l36J93J23n0k4N9o8r3K31j50n6J10j27o7J18m0J8J74k09J10J0J31Nj85
5670c5L1nm3k7j6M7p8J34q9J00J52j86k5M3n1m1M0K4J8p9K25j19l5lK9Q5k58K54
5698I2j82J47j26J07j5n7J27j66j1K7J6R8j29N3J9ok6K30j48q8J5R7n2p4L8lP8
5725F1J1j11P0o9R4k76K64qK0On8j27M4J47j22J83k76J61k05K03j82PK65k1j0
5750G1k7j60K51j16J29k01M8j00J13k44M16j50l0J23j76N1J14j32k6J52k36Q9
5772d1J31j07n4R5J04j93J16j5O2o1M0J52k97ON9j14J71j54K21o5rj16J58r2M9
5797D6j62J19M4j22qJ87o3P3o1J3M3q8L8j82J06q4J29N2q1j23K12qn9M4k7o9j0
5824d1L3j22Q3L85l35J9ln0j08K57j15n3l2J41l8P7M6j31j15O7m9J11M3q9O0K5
$$ y = [88, -248, -55, 68, 18, -6, 53, -15, -108, 123, -27, -83, 27, -100, -167, -49, -89, -71, 103, -106, 4, 14, 145, 150, -35, -4, -9, -52, -79, -95, -48, -126, 8, -81, 19, 171, -15, -40, 3, -48, -89, -49, -25, -7, -86, 139, 20, -15, -18, 11, 96, -162, 92, -90, 57, -69, 38, 23, -34, 93, -73, -84, -57, -41, 57, -72, -19, 0, -6, -32, 198, 50, -38, -23, 74, 22, -52, -14, -17, 61, 72, -39, 31, -38, 56, -220, 44, 36, 56, 62, 4, -123, -79, 68, -54, 129, -147, 14, -191, 12, -170, -163, 102, 81, 71, 44, -116, 135, 19, 148, -53, -5, -105, 8, -236, 180, 30, 0, 123, -53, -2, 112, -20, -46, 106, -130, -41, 90, -17, -71, 24, 128, -65, 51, 36, 98, 37, 77, 229, -68, -62, -3, -117, 54, -100, 121, 56, 47, -69, 89, -3, 46, -116, 3, 47, -75, -83, 104, 41, 114, 53, 66, 109, 21, 59, -123, -17, -101, 28, 80, -1, -124, 88, 80, 21, 65, 38, -31, -41, -8, -130, -47, 338, 3, 22, 19, -31, -139, 118, 3, -50, -82, 59, 21, 98, 144, 13, -102, -35, -84, 27, 70, -19, 41, 66]
5850F6r6j5JJ19k46K95j01O5j33Q3R2K1Nk09K17j21M6j34l0J11o1j9KK1J54k06
5876g3j19K09O0j65K21K6j41Q4j44mn5K62j71r0K03j19r4J9J69k09J38O8j83J05
5900cM2n3O5j09K3L4M9k4Q8k12J9J00J19o5j30k5N3o1p3K13j62J72j0o0j15J69
5926D4j04o4J08rJ86qq6j04P5J5N5M7n7j35l3n9J05j07J59L2m0K3R6l30K57j28
5952f2k8N7J4j03LJ54J20k52K9j8P8pL0j23J03N1j12m2j2J04L6J80k08J11n8O6
5978A11j60k2Q4n2n5K26k89K65q3j2j39J12Pj18J16lj29J62K3j4L6j01j25J38
6002b2J34mj00R2j75l4J12O3r5Q6N9k39K09q0M2q2J09j76J19%j23j0J38j28K6
6027g9K73k88J41j40P2nL0l0n7k6L8J0P6K6no7Q1p7P4Qn7J2o1k7q9J05K07k79
$$ y = [66, -30, -45, -44, 75, -171, 124, 23, 88, -45, 38, 130, 151, 156, -53, 164, 43, 89, -45, -75, 36, -25, -44, -42, -21, 133, -73, -192, 17, 77, -88, 133, 159, 18, 102, -42, -46, -101, 161, -10, -100, 103, -16, -110, -91, 78, -131, 7, 75, -108, -3, 39, -14, 51, -58, -35, -1, 48, 24, 112, -100, -81, 19, 138, 73, -57, -82, -29, -90, -163, 50, -112, 60, 50, -10, -125, 44, -60, -124, -16, -25, 161, 153, 67, -37, 38, 53, 108, 155, 98, -37, -70, -129, -24, -131, 28, 60, 20, 43, 139, -191, 66, -62, -90, -33, -19, -122, -119, 35, 155, -97, -68, -86, -8, -15, 15, -108, -5, 46, -66, -108, -120, -16, 20, 200, -8, 103, 45, 111, -49, -71, 13, -39, -94, 132, -157, 108, 25, 13, -126, -14, -7, -125, -9, -12, -141, 21, 44, 30, 66, -35, -160, -22, 112, 108, 8, 100, -75, -109, 3, 66, -29, 57, 116, -123, 86, 6, 48, -34, 75, -101, 18, 18, -105, -115, 23, -105, -79, 194, -94, 47, -93, -21, -26, 4, -26, -83, -109, -71, -61, 15, 41, 36, -31, 50, -27, 47, 55, -2, 10, -51, -78, -167, -62, 145, -134]
6055a34k4K24J4j95J69j1j91M7M2n1R9pN5j05N2j93J62J10m8l1L2J02k11K99r4
6080A12k10J03K19l52J17J67j87J2M5M4j98J84Lk83J85k2m3J59k4K0j62L49l85
6103a47J69j34MPJ14O9k0j28J64q9l8N4j77QK65p6j30J15j90J3J05n5K62k59Q2
6128a2k01K25Kj47J55p5k2R5J02j24k2J0j17p0J34J72j64J41j17j58K61k5j01
6151e8l1J24j69P5N%R2J39q3j51J76M1j58J15Lj49O5j27M9j9J72J6j35J02j20
6176b6N8Pj17M3J87j22j38J15r8j50K05N7L2j28oK11j51O2k65J87J54j06j61P6
6200g4K81k64K7Pl1L7rJ54j81Q6j07O6O2j2j84K78p0k06K58r4r1k8Q7J32k17K45
6226A52l28J4K52P0k68K74j03k30J70j35J37n5O8pK9k6L9l5j32O4p9K28o6m5J65
$$ y = [-134, -158, 66, 80, -115, 54, 43, -148, -101, -59, -110, -11, -18, 37, -68, -16, -209, -47, 63, 15, -16, 16, 118, -93, 206, 112, -98, 5, 224, -128, -11, 156, -31, -19, 26, 70, -128, 56, 59, -224, -39, -61, -104, 55, 31, 51, -111, 238, -147, 22, -112, -108, -101, 13, 82, 62, -66, 98, 9, -29, 25, -152, -144, 121, 45, -85, 30, -160, -147, -42, -97, 165, -94, -12, -213, 12, 14, -133, 22, -53, -75, 20, 122, -2, -24, -14, -131, -201, -67, 105, -59, 82, -35, -193, 68, 43, -58, -89, 35, -134, -59, -54, -54, 38, 177, 94, -57, 119, 160, 2, 117, 120, -29, 36, -91, -42, -61, 111, 127, -8, 94, -26, 32, 39, -78, -35, 152, 30, -108, 7, -91, -241, -36, 21, 53, -75, -81, 130, -21, 41, -224, -37, 117, 11, -150, -74, 207, -57, -30, -23, -54, -17, -26, 128, -53, 33, -74, -8, 54, 42, -142, 136, 66, -140, 118, 24, -67, -95, -8, 124, -93, 152, -176, -162, 90, 160, -108, 166, 63, -167, 3, -132, 5, -50, 18, 11, 40, 14, 53, 18, -114, -50, -129, 99, 33, -12, 153]
6251A53M1k69M3J99k42J65j42nk4Q6J36k63J56M1j06j8k2q7J93L0k34L1J81q7
6275d4l6J07o0m9l6K19j92J00K3p3j6J65j38N5P1k30J21j96J90J1R4j59m1J49
6299C5k7r9K36r6j64J45k3M3r7J7o1QJ46j07p4K6J70l8J26q4k30K71j93L1o1M1
6325e9J50j24P9p3m6K2LL4J66j72j20K30k7l9j7J70j67q4K00k1j02m8P1r9Q2n9
6351e0n6O3J81j40j47J34j87K74k25K18r1Q9J59k45O8k5o4n0m5N3N8J43j93m5
6375a23J17R5k03O8N5j10jJ57M9j16L0j39J70J26k37J67J6j93j4K66k18o3O7k4
6399e8M8l2J44k24J09J94k43q0K12P7j98q1p2J73M0Q8m0J4Qk36J67J24j84N6K3
6424B9j28J4k4J7K1R4M9n6l5J11j76M8J13j20l7L3K7k17M06j36j01J03P6r7K7
$$ y = [153, 194, -75, -32, 167, -75, 90, -52, -57, -81, 5, 141, -122, 34, 75, -31, -49, -71, -158, 35, 65, -169, -138, 43, -44, -80, 27, -33, -82, -118, 101, -91, 9, 32, -41, -57, 108, -30, 25, 96, -134, -13, -209, -19, -8, 86, -73, -114, 35, 8, -91, 145, 49, -115, 30, 7, 50, -47, -30, -91, -83, 63, -44, -118, -92, 78, 40, 166, 82, -148, 123, -70, -39, -100, -59, 91, -33, 46, -27, -73, -51, -48, -14, 152, -20, -140, 90, 63, 24, 7, 177, 10, -74, 126, 105, 3, -45, 26, -73, 9, -50, -106, -43, 138, -2, -149, -15, -202, 72, -153, 65, -26, 63, 222, -23, 45, 20, -44, -94, -139, -86, -28, 115, -78, -123, -6, 89, -114, -46, 9, -101, -102, 55, 104, -12, 18, -121, 49, 175, -62, 105, 121, -72, -86, 180, -38, -101, -34, -58, -10, -42, 102, -122, -13, 181, -62, -142, 70, 147, -51, -132, -204, -31, 9, 97, 57, 71, 79, -157, 10, 134, -50, 6, 29, -99, -85, -109, -92, -71, 23, 72, 16, -19, 92, -84, -36, 77, -43, -80, -47, -20, -237, 169, 33, -68, 35, 111, 14, 41]
6449D1K6k96K09J42j22j02L2K23o6J47j55Kj69L09l35J46P0j58J13oP3j55K0l9
6473e0P3K5m1MK8N3m4R7j84J2Op9J38R1l1j76P4P0j93R0kJ66k37J54k0j08K66
6500A82k13p9K3J52m9j5J46k32kj15K45k39J92o9JL2n0K2r7L68l20mK41l2o3J13
6526A38j40Nl1J46o2J4j14L1kK23k61J04J7k20K94r5K4j31J18M7k07J03L4j05
6550g0K2N7j36J93O0j59P7j4M4o5K4P7j06O4J2j8j12O5m2k2K88k39o0J04r7P5
6576B2lL7j16K61L9l51J46P8k84J62P1m9k22K09Kp5J82j29K06j18j04j9K26j02
6600F9o3n7J49l9n8J65k21j23P1J99q5Q7m5k67L12j17k25L13q1N2r6M7p4J48l1
6625C0j66J94J06k38M0K45k44j3l5J24k01J37R6q5qo0l6jJ00M2j93K57j5j61L3
$$ y = [41, 67, -229, -20, 122, 0, -102, -70, 153, 87, 234, 79, 81, -88, 221, -114, 32, 102, -56, 57, 51, 124, -31, -11, -50, 23, 48, 7, 11, 39, 92, 48, 145, -39, -27, -21, -100, 38, 129, 98, -78, -4, 66, -127, -37, -39, 127, -110, 44, 24, -84, 182, -31, -110, -87, 65, 16, 1, 147, -85, -87, -202, 43, -196, -4, -73, -72, -40, -90, -68, -165, 203, -117, -121, 120, 88, 25, 138, -2, 3, -28, 118, 56, 70, -44, -13, -15, 208, -53, 51, 68, -152, 142, 47, 71, -60, 58, 105, -102, 1, 35, -70, -48, 9, -127, 66, 126, -33, 44, 30, 74, 9, 33, 110, 4, 68, 80, 62, -50, 15, -27, -49, 239, 0, -60, 44, -53, 22, 19, 56, -60, 201, 240, -111, 35, 113, -171, -9, 62, 13, -209, 0, 2, -73, 109, -20, 186, 68, -36, -55, 171, 69, 6, -51, 98, 59, 1, 166, -55, -178, -107, 92, 7, 94, 49, -218, 94, -23, -248, 65, -16, 36, -60, -13, -87, 61, 30, -136, 58, 164, -74, -34, 211, -33, -46, -81, 43, -158, -21, 75, -10, -18, -78, -114, -115, -15, 27, -166, 91, 76, -85, -52]
6650e2j5J76L7p9j57J94j65P8q9K19j16%Q5j55m6J97J7l22J69R0k48J76%j2j14
6675a32K13j40p9J79j12lJ27J45l37J39j09mR5m7O6P8J5j20p2J76q0J2O6j14j50
6700a88J88J54k08Q9P4l22J65J33k18J39K0j41Q0J12q5k21L96o9k95K87L5k27
6722a02J53k6j32l5L94l24Q6j56J74k89M23j86KO2nj77K06J00k85J2K12p9k8K50
6746B50k64L3J33j43k5j53J58J8K4J04k56M1J43J25j19Rk1r5k7k0L0J79J52l75
6770i9O8k9j04R6L1OJ1K64l78Q3M3Q1j73K13J11m09J63J2Qm9o0n3K58J20k00k71
6796b57L53k21k3K69q5k66J76J58j22K05j63j75N7P9j07k1K61M1j67K16j68j12
6818g2L6N6M4k45J13R2j00K46j01o7m5L3j05J84o1j27J96n7j61J23k7k5j9J55
$$ y = [-52, -67, 109, 146, 67, -90, 104, -61, 17, -72, 147, 31, 31, 116, -39, -85, 112, 129, -193, -24, 66, -182, -6, -6, -18, -132, 81, -59, -138, 41, -71, -74, 53, 198, -139, 0, -109, -113, -18, -65, 1, 79, 94, -26, -98, 78, -2, 10, 76, -38, -188, 0, 154, -54, 35, 109, -213, -48, 85, -133, 6, 26, -115, -35, 77, -8, -229, 167, 98, -197, 90, 125, -102, 51, 25, -107, -142, 252, -72, 14, -142, 32, -257, 166, -20, -18, 44, 39, -138, 68, 168, -117, -105, 107, 28, 0, 250, -14, 19, 152, 9, -16, -169, -11, 7, 31, 135, -121, -80, 63, 188, 69, 78, 57, -38, -65, -85, -55, 124, 276, -99, -31, -60, -164, -68, -37, -31, -20, 244, -134, -51, -8, 73, -100, 113, 224, -185, -22, -10, -2, -51, -111, -164, 94, 214, 14, -257, 96, -125, -148, 121, 36, -230, -54, 104, -18, 187, 24, -151, -94, -15, -122, -143, 118, 159, -8, 208, 40, -72, -36, 20, 64, -181, -68, 24, -76, 170, 69, 2, -43, -10, -115, 69, 8, -119, 77, 20, -141, -18, -45, -70, -89, 66]
6842F6r3P1j2N8Rj02p1L5J94q3p5O6J82l70J58M8o4j7J48l8j57J35j54LN3P7j7
6869E0p5J62k66J98K0J6j69O6J34k84M04k79l4N5J02k52J77J5j37Q1k0l0J86p4
6893D6l4j47K53j47k4P6j4j39J60K7m6K0O6j74P8N2j27J56k3j91J40J16qr6O1
6918H1Qj43J84j44k22L98l2k25n7J73j23J54l7o0j20J93J51m05M21l00q4J85Q4
6941H0j46J3J80j53k69M23j93n3K95k11Om5R2L5j40K89k49J54J8j80n6J06l3o1
6965i8q9K31k25J77J33l11J62kj11K18j15Q4q1R3j24LJ00Q1n9M3j20j71J41J91
6989A51k94J70k5j08P9l5K1o2J84j56K08j52K02k79J70qj21J78k79R3j6J90K4
7012A35j52n1L5j1J07O3k52J21Qr2K11K5j65j8J56j45j17L21k30R4J3q1L7J25
$$ y = [66, -27, 44, 32, 90, 99, -3, -74, -39, 155, 72, -3, 63, 245, -125, 33, 81, 17, 0, 148, 110, -47, 88, -66, -63, -10, 67, 50, -25, 137, -129, 69, 89, 105, -64, 2, 136, -148, 256, -23, -57, -2, 100, -152, 25, 40, -97, -16, -36, -66, 120, 46, 12, -135, 118, -29, -53, 23, 9, -130, 30, 57, 11, 31, 97, -77, 1, 53, -74, 82, 59, -132, 8, 124, 116, 20, 81, 89, -54, 130, -14, -236, 162, 130, -95, -152, 21, -102, 52, 15, -45, -165, 28, 179, -226, 195, -105, -189, -4, 80, -66, -53, 127, -26, -295, 128, -65, -118, 177, -34, -28, -73, 19, 54, -86, 203, -46, 108, 126, -54, -110, -4, -37, -98, -187, 44, -181, -4, 129, -182, -20, -22, -133, 85, -30, 54, -27, 66, -58, -55, 45, 126, 67, 110, -10, -181, -40, 151, -143, 27, 2, -106, -27, -62, -41, -103, 81, -75, 133, -19, 183, -96, 74, 66, -55, 123, -156, -63, -79, 111, 135, -17, -68, -33, -44, 63, 126, -126, -5, 3, -89, 122, 147, -18, -36, 120, -25, -142, 179, -51, 43, 56, -25, 12, 137]
7036A37m7l4n8R0j89J84J47k97r5K77k09N8j7N0k21K08j7J27j8N1k19lL12k12
7060EJ37r4j11l7K33j16j36K50j94JQ1N6l2j9M6j54J05J29k98J8J36L3j35K95
7084A99k44j68K13K3j34K49q0p0M3n3Q6k63K78o5J24J39j93j23J49r5o2m4K07
7107A16p2J12j09o5j23K30j34O7J73l35j7J86M6j13J73o4k33K26j85R9N1J73l35
7130a33Q9K01j08m8J05o3k3k3l0j21J50J89k63J36J18l52K01r8J2j98K41M7r4
7153f5J90k53M0P9j5mL2J85k4k57R7q3n7J13mr0K0n2j8K20Q4k60J09o8J16j31
7179i6J57j10r2K52k64J41%P9k09J32J3J01l5N3k90J94J02j77j5N0R4k41K17o0
7203dj27O2N0n9J19Mj51m2J17p4k8K25j62Q0Q3j60O1L2j99J79r6J86j10p5O0J31
$$ y = [137, 90, 56, -2, 88, -101, 83, 230, -67, -162, 115, -94, -36, -53, -3, -224, -16, -33, 94, 76, 127, -92, -95, 217, 5, 142, 48, -63, -100, 133, 17, -119, 131, -63, -62, 19, 75, 43, 24, 70, -84, 21, 150, -148, -130, 6, 39, -96, 199, -45, -213, 0, 23, -111, 138, 58, -12, 31, -22, 64, -199, 79, 14, 138, 277, 84, -39, 110, 15, -47, -91, 116, 44, 156, 47, -18, -141, 89, -45, 22, 195, -140, -157, 29, 75, -38, 135, 71, -162, 64, -121, -22, 29, 202, -133, -44, 157, 49, 1, 106, 43, 20, -3, -33, -154, -4, 185, -78, 58, 176, -176, 25, -73, -61, -259, -18, 29, -65, 125, -128, -88, -9, -24, -28, 4, 189, 165, -92, 5, -78, -135, -22, -26, -116, -96, -148, -166, 54, 138, -122, -13, -81, 35, -96, 61, -49, -141, 111, -153, -12, -12, 67, -142, -10, 3, 104, 69, 122, -168, 26, 128, -49, -64, -14, 80, -161, 56, -4, -131, -69, -19, -78, 41, 45, -106, -148, -31, -105, -133, 92, -70, 10, 93, -67, -6, 26, -173, 6, -90, 96, -14, -89, -29, 102]
7229A02k12J51j22J1J06j3k46K84j24k11M92j17k04J20J06j50M4R6j78L7J44j08
7251Hk09J86o6j9P5M8q2j43L62j64n9J5R7n4K11j98l0Q9o0n8mQ5k44K26P9k47
7277a56J78j42j4J58O4J1j86M6J13j39N2k7L6j1J03j76J68J14j95p5K26j97K2
7300b7N1j55J03M6k39R8J05J92j83j9J47r7j58K32j80j6J38lk04J74J30r3o7j00
7324a25j4M7J11k28J89R0l0K0N3L4j53J09p8k9l7J13j51O4J36j91r4L09r6p5K0
7349fL1j01kOO8l2l9J53N7j72l9j1J58j29k3K31k14K0J18N6k73K61j79o8K56m6
7375H1j5k20K24r6P1J2j43J17L4m9l5N1o0L6P3j23N1m9J14o5KR5j18K9o8J29j54
7402g6Q8%j77K15q7k1rMj83L21J74j60Mm5j84J49J56k29K9j1P3k24L48j24m9m8
$$ y = [102, -110, 41, -81, -70, 36, 23, -223, 61, -63, -274, 218, 101, -103, 17, 123, -27, 17, 113, -65, -28, 116, 8, -201, -15, -81, -100, -25, 23, -59, -202, 160, -4, -63, -48, 49, -5, 206, 8, -22, 67, 7, -51, -55, 30, -214, 12, 91, -156, 22, -120, -134, 24, 88, 99, -87, -41, 72, -67, -15, -42, -6, -17, 86, -90, 78, 192, -3, -78, 148, -49, -27, 24, -131, -28, 18, -221, -123, -18, 174, -9, -28, 119, 22, -136, 96, -84, -100, 38, 35, -169, 5, 135, 42, -25, -125, -139, -92, 19, -209, -20, 70, 40, 60, 113, 147, -6, 103, 25, -4, -41, 72, -79, -15, 121, -70, -164, 145, 49, -26, -6, 25, -76, -78, -72, -4, -36, -75, 78, 135, -37, -76, -87, 71, -58, -81, 150, -64, -44, 74, 130, -143, 118, -61, -129, 127, 81, 66, -154, 70, -26, 45, 57, -86, 31, 65, 16, -19, 32, -28, 8, 81, -42, 9, -40, 74, 9, 11, 106, -12, 17, -51, 78, -76, 12, 12, -165, 50, -37, -58, -67, -63, -246, 75, 249, 89, 93, 48, -136, 13, 169, -60, -31, -42, 31, -193, 155, 31, -18, -66]
7428f6l1J63j25J42k03J87Nj37M6PJ35j18j25J19MJ1Rp8J69N3k33l4J84j52J15
7453D7J2j8J9q5R3j85J45q0P5J6n3N4j39K20k33J87M6n2k23J23k13K2J79J61k78
7478a60M2L55k51L2J5m5O7J4j15j7J36P7j78L5q8J40k13J26J5p4J96Qj32K49k25
7503Io1N3N5j6P7k2j31R3J51k46n3J75p7j51K16q3q9J77n2lJ4J12j15p5M9r2J94
7530A09O8k54N0J20j26j8J95l67M3QP5J46n5Q8j00jJ22j47O3P2j18P0j29J47Q0
7555A41Mj26j56K48p2j92J00M2rj36K13j35p1J78j07k0J71O0k36L3J88j16R3o8
7579B7j63J92j0p0M1K4j0N3j00o6q0K12J35l25J90K2l6N8j23J9J28M6j70j54J19
7604d1m5K3J88k8j70K02J0j43N4J38k77m8P3N2kK36m9k68K3M0qJ53k5j89P1J32
$$ y = [-66, -97, 66, -59, 83, -120, 67, 72, -65, -19, -12, 123, 5, -120, -1, 3, 14, 23, -55, 114, 167, -66, -100, 84, -68, 47, 59, 41, 60, -25, 68, -117, 28, -52, 23, 39, -14, 40, -99, 121, -112, 75, 121, 69, -154, -31, -244, -222, -43, 118, -160, -118, 237, -14, 18, 33, -12, 55, 69, -46, -63, 73, 150, -28, 7, -81, 59, -154, -28, -13, -87, 109, 117, -15, 234, 9, -52, 1, 56, 40, 117, 95, -36, 57, 208, -38, -91, 84, 7, -144, 72, -11, -100, 77, 25, 22, 36, 148, 33, -42, 7, -85, 109, 177, -77, -27, 93, -33, -51, 144, -223, -180, -172, -97, 49, -6, 82, -18, -19, 103, -44, 19, 91, -27, 43, -86, 61, 141, 145, 19, -137, 111, 39, -153, -53, -11, -20, -156, 57, -78, -149, 29, -78, -98, 73, 133, -103, -70, 118, 2, 95, 27, -136, 56, 46, -24, 17, 41, 31, 84, -16, -82, -162, 50, 185, -140, 50, 72, 36, 94, -29, -10, 118, 164, -6, -160, -41, -86, -63, 125, 97, -73, 129, 139, -4, 50, 188, -89, -137, -64, -12, -14, 222, 173, -95, -72, -32, -40, 113, 88, -101, -30, 102]
7630A02j37j47K48j48J79j38P1j30J76L7k19J00%m3J33j41P8M3l5j00K07l7m6
7653E3r1J68l2o0P5j9j06K2m1r0lJ36j88L8K47l8k7Q0k91L5K8K05j01MP9j6N3
7680A20q2jm9J23j62J49n2J8k39K63j01j91K79n5K8Mq1J6L7k5k0q0K12o5j39J17
7706B4J19l20L18j73Kn3K56k39o1K16p2m2%O9j43J80M7l20K44Qj96K14j15q7K39
7731A15pp0k74M86j99j88L58k29q8Q9k1j79L63j58Q2k10K15q4J16j20o8J3J03
7754D5j31O7O4j0n5J56J20k98K8J56j81l9l2J50m3KJ98p9j33K2Q1j54K34j29R2
7779A31j28j14K19j53J40k02R1o1M9J34K5j36l1j2l5N5M0o0J96j64L5r2J4m2K
7804i9K43j60n5J57q1p5L52k70LK7l8j45P6J59j24j43J73N7p5L3m8k4O2K6M3L8
$$ y = [102, -35, -182, 66, -82, 97, -41, 30, -100, 76, 113, -106, -6, -6, -49, 84, -57, 21, 64, 29, -71, 136, 99, 53, -38, 130, 98, 38, 113, 94, -12, 10, -31, -121, -124, 12, -176, -138, 109, 71, 44, 124, -167, -132, -104, 101, 0, 4, 83, 67, 120, 38, 37, -12, 111, -51, 98, 46, 64, -175, 88, -13, -204, 75, 20, 48, 52, -29, -13, 24, -1, -21, -101, 111, 46, -93, 24, 143, -177, 141, -32, -30, -83, 173, -66, -127, 89, 17, -25, -25, 44, -99, 81, 128, -192, 52, 60, -136, 78, -37, -124, 115, 108, 38, -236, 250, 51, -137, 221, -8, -96, -7, -28, -207, 156, -2, 80, -130, 85, 1, 117, -3, -71, -58, 45, -86, -19, 45, 35, -20, 136, 256, -42, -14, 142, -39, -78, -110, 40, -3, -1, 197, 118, -15, 7, 88, -66, 168, 39, 131, 3, -111, 108, -45, 95, -107, -16, -77, -28, 106, 131, -5, -36, -48, -83, -28, 12, -48, 148, -16, 19, -73, -59, -101, -99, 144, -16, -71, 86, 5, -70, 282, 12, 15, 42, 4, -141, -65, 94, -30, -173, 0, 57, -18, 15, -33, -57, 5, 31, 74, 112]
7830A12q2K4QR0k72QK12N8Mp0j08Q3j4j70k1N0J61n6K8Q1j18P2j7O6n1m0j3m0
7858a5R4k29m5K54R3k78J23j16P0J35Lj49j11P7J70j40KJ32j53L0L1o5J62j39
7882f4J65j51K43k91j6M00j98k02O8N1r7R4M1j27P3j7lq9K75j37J11L3j99J8K8
7907IK8l3n9J38mp1J74k66N5Q9k00M4K39m6j54L3r1K3Q1J11l4J6J32k85J39J18
7933A86j44j77J72j03q6K77k53K04k8M5k24J45J8L7k61J02L9j02J51oQ4j15P7
7956C8ml2J18o2P5j03j11J4Q2q4L8J18L9k16J57j19MN8l3Q5J4k8j17J05J92k95
7982f7R4m2J9r3L59j70j88J85q7j25L1k4k2K27j66m5R0J52k05K7N5n8P8J6o7j01
8008a27K96j08o6L6j11j9J26qO8j57J26l19J65J9R2n7Q4Mj66J71n8P2P4j11q7
$$ y = [112, 30, 54, 62, 152, -120, -112, 100, 158, 162, 92, -16, 67, 53, -117, -138, -88, 73, 17, 45, 126, 8, 80, 63, 129, 78, 38, 25, -15, 79, -150, -195, 59, 152, -126, -3, -119, -49, 86, 89, -60, -171, -94, 76, -64, -62, 70, -83, -53, -22, -87, 75, -64, 101, -50, 193, -98, -114, 286, 88, -114, -46, 5, -92, 2, 43, -84, -11, -28, -31, -120, 155, 18, 129, 162, -37, -19, 9, 37, 4, -55, 83, 79, 8, 182, -84, -29, 60, -140, -96, 143, 97, -57, -24, -115, -92, -11, 100, 66, 82, 214, -71, 68, 186, 42, -135, 37, -66, -152, 125, -128, 76, 48, 93, -131, 14, 32, 69, -192, -90, -51, -153, -2, -8, 76, -39, 38, 34, 2, 120, 58, 133, 30, -81, -67, 15, -69, -31, 87, 126, -90, 67, -52, -48, 10, -23, 62, 76, 48, -69, 36, 228, -67, 27, -15, 4, -89, 270, 100, -88, 97, 10, -115, -84, -108, -130, 97, -69, -114, -24, 128, -77, -50, 5, -53, 25, 41, -26, -127, 169, 61, -5, 31, -80, -99, 27, 19, 87, -70, 56, -263, -98, -79, 13, -44, 40, 44, -122, 49, -9, 63, 137, 26, -61]
8033f1J95m0j21L1J47j74K93j57m8k00J66K8l7O8q1NO8p6k6Q4J6m4k65L44k38
8058a23O1K30q4o6QO3j64R4R4k05J26M9r2J38j38Qn4J18j29R6q0L9j03N5Q6j08
8084h1O4k5N6l3R3k09P6K6k9k9J11Q3k76J68n6N6P3j34m9O4J37k2j16N6L7o8K8
8111Am4n4K43j30P0p2mL9q0K16k75N6J18o8L4j4J54j44Qj90J41J9Om6Q0k0j58
8138a14J56P5p9j69K51Kjr4K1p0O3J19l15Q4J80j19K3J48j76n6J28l2k4K8J64
8163A93l50J40M0j12J2P2k2QJ74Q5k69o3J12m6J21lk11J04J14O4m5q0o8l8N9L
8189fq7R4
$$ y = [-61, 134, 94, -27, 4, 151, -23, 270, 113, 65, -135, 31, 59, 22, 90, 9, 14, 82, 6, -20, 64, 80, 36, -229, 115, -123, -62, 168, 84, 18, 26, 89, -75, 19, 113, -92, 34, 83, -9, 129, -9, -1, -55, 63, -66, 30, -50, -11, -114, -59, 27, -81, -17, -42, 14, -19, 74, -135, -59, -33, -62, -91, 20, 103, -173, -5, -61, -5, 68, -66, -115, -51, 86, 64, -52, 4, 41, -27, 1, -43, -97, 146, 16, 86, 14, 10, 49, -31, 185, -90, -34, 84, 16, 50, 36, 190, 46, 54, -136, 5, 24, 30, -16, 64, 44, -114, 42, 117, 38, -131, 120, 122, 121, 27, 48, -22, 41, 160, -155, -71, 109, -10, 13, 161, -15, -71, 57, 25, 1, 29, 193, -157, -17, 23, -89, -77, -5, -27, -19, 155, 240, -29, -92, 20, -26, 95, 92, -119, -15, 99, 163, 118, 38, -30, -68, -9, -6, -93, 1]
8191A
$$ Imaginary data points
##PAGE= N=2
##DATA TABLE= (X++(I..I)), XYDATA
0@%%%%%%%%%%%%%%qJ6j6J6j7K5l2M0m8N6o5P3q8J04j20J37j57J81k07K34k65L01
36A60l39L80m25M77n34N93o59P33q12Q97r91J094j207J330j465J615j781J961
54A027k160K385k639K927l256L635m079M611n258O065p110Q519j0545J3758j9964
69a2084N5438j13556O0935P5958j08806N9700J68k5153p255K3398k673j4784J4416
82E702J3721n7696M8576j219m5024M4468L804k0462j7578M6577j9186l7426O3181
95B7438l0423k3932L0724P075k7123J1318J8684k3581o082L8798l1618k1859P0055
108C9474n9392L006M9132n1593J2297J6401j20k5767J2520K3179l4248O762K8377
121B0028l2510K429L4100m0494J0209J7730q774j6306J7026J8972n4161M6045
$$ y = [0, 0, 0, 0, 0, 0, 0, 0, 0, 0, 0, 0, 0, 0, 0, -8, 8, -8, 8, -9, 16, -16, 24, -24, 32, -33, 40, -48, 56, -64, 73, -84, 97, -110, 124, -141, 160, -179, 201, -224, 253, -281, 312, -347, 386, -426, 471, -520, 574, -633, 697, -768, 847, -934, 1027, -1133, 1252, -1387, 1540, -1716, 1919, -2160, 2451, -2807, 3258, -3852, 4667, -5878, 7880, -12084, 43354, -70202, -9267, 66691, -42115, 17585, 17753, -7400, -14655, 8743, 6070, -8714, 5702, 19423, -38273, 10303, 9084, -35940, 8528, 12332, -8130, -25708, 20869, 1683, -35743, 27438, -2985, -26917, 3807, 10882, -16241, -4923, 13761, -9820, -15902, 22896, -8722, -30581, 39474, -19918, -16912, 32220, -19373, -7076, 9325, 9205, -16562, -4042, 19137, -15111, -8349, 20028, -12482, -10053, 24047, -16447, -6238, 11492, 2718, -13588, 3438, 22410, -31751, 14294]
133A4294N770m7714L9078K666k9249J7560J2503k2666N659J0389j475k2743K7800
146A1872j81l5890M4868j7984j5883K0597J217j5010p54K4705k6573J041K3679
159A5704j8424j2372L0118j4519j5626K5172q271r315K613K1901l1713Q341K9212
172B2821m3616K0912J2505k1605L298J5307j0040j0369J7449k87j8509J0687J8615
185A7168l7909K3683J1222l1287K0182K769p748q187K1143j1165j4007K6105j0681
198A288j3438J7881K956k3767K0835J647j6287O996J0968r837j2853L1768k2695
211d538n350K3687j5580m896J1859K968k0241J7038M548j8915P935J5157k1025
224g353n46K6510k8393N841J2763q755p210R876P399k5303K1087J781j9091J2467
$$ y = [14294, 20064, -27650, 11428, 14094, -15155, 2405, 14908, -7758, -2099, 8290, 6815, -15928, 11872, 11691, -24199, 20669, 2685, -13198, 7399, 8616, -6394, -7148, 17557, -9016, -7975, 15704, -2720, -15092, 15026, 507, -15119, 10053, 1782, -7533, -4920, 16981, -14732, -6391, 22821, -20795, 117, 12622, -8983, -5685, 9622, -418, -10787, 6662, 6375, -12134, -1447, 17168, -20741, 2942, 14164, -17123, 3059, 5828, -1920, -10107, 11036, -129, -14136, 11969, 1288, -12150, 5731, 8687, -15080, 5755, 7402, -8885, -1889, 9079, -758, -13611, 18157, -4538, -9888, 13799, -1781, -6677, 5182, 8150, -12091, 4947, 9495, -9420, -1485, 13672, -7353, -7899, 18611, -9782, -3941, 8822, 67, -7143, 2733, 10132, -15171, 5916, 7697, -11394, 1073]
238A073Q352j8175M517J6004j9595L136J0337k418j6924K0268J509k6780K8276
251I580n852j4261J0864P594j5930L115J6068j9166K898J3461r136j1119K2834
264A0950j0345j2432K0657p757o735L362J3350j9568M245J7973k2921O995J0557
277H331r599o507J6985q039r576J4462q93j2508P160J4022k6659J4747R456k0334
291h952R331N837n261r185J7826p837j0524J5953k955j2421J0675P159k1284J4977
305C339L595j2495K637J0236p335j1106K3711j5062o189J6736p069r128J0614
318B484M490j7785J2962L668j2563K848J2980j4062l085J9829j8584K450R154
331D786l952q092Q475N960j8521J3800L522j3162M627J1370j4896J253J4170j3845
$$ y = [1073, 9425, -8750, -4233, 11771, -7824, -4688, 5649, 3231, -13693, 6575, 8084, -18696, 9580, 3728, -10533, 331, 7925, -8005, -4890, 11178, -7988, -5090, 8371, -765, -11884, 10950, 605, -11827, 8830, 1073, -5662, -2300, 11050, -8518, -4273, 13700, -9221, -2226, 8331, -1268, -7775, 9210, 1171, -8405, 6057, 5164, -7344, -184, 13838, -12821, 1926, 11382, -8952, 379, 6216, 955, -8230, 9596, 1759, -8765, 7188, 4233, -8188, 2487, 9646, -11638, 3339, 6934, -5561, -2924, 7312, -23, -11129, 12582, -2480, -8669, 8067, 998, -8130, 2484, 6974, -10811, 2151, 5819, -6744, -3896, 9084, -4978, -8063, 11766, -6818, -4368, 4786, 834, -7258, 1217, 7177, -11344, 2456, 5978, -7184, -2557, 8813, -6083, -4830, 9340, -4505]
345d505P17P644K53j3792J4653J587j8397J8172k330r630N062Q818j2922Q72J3583
360I785j2858j339J1242l790j3138J9114o415j1083J4963l690o273J352J1875
373I745j5586K521J3770j5616J546J0866o851q422J6185p426p313J0390L47r941
387e785L822J2128j9713R356P771j3619L488P293m314r249J5856o549q804J2261
401C942P9j2432R040P019j7788J1531K964q242k48R214m846r660J8281j0248n621
416g015J1702k089r908R025M458j4129R112L886q025j793J3334j0512n034J6983
430I995j2717j133Q201r69r826R116M321j4936J0426L647j0297J431J1777j2955
444c919N57J1513j0444n28N958J498j2601J1865J832j3960J1519R90q425J869
$$ y = [-4505, -3788, 3856, 4109, -9683, 4970, 6557, -11840, 6332, 4002, -5628, -566, 8252, -4670, -3798, 9785, -3073, -4412, 6830, 3040, -10098, 9016, 2601, -8482, 6481, 2791, -3482, -2130, 9745, -5841, -3320, 10450, -5166, -3620, 7246, 395, -8027, 8158, 732, -6581, 3809, 4156, -5785, -1963, 10165, -9548, -192, 7579, -6040, -2552, 4741, 427, -8822, 7034, 485, -8319, 3942, 4021, -8411, 629, 7648, -10140, 1391, 4355, -3887, -4135, 5079, 233, -9427, 8854, -1394, -7015, 4687, 2598, -7310, 1715, 6173, -7956, 1156, 5042, -2983, -4776, 8558, -1954, -6988, 9995, -2722, -3855, 4346, 3377, -6449, 2667, 6988, -7948, 2478, 6125, -4172, -2741, 9036, -3919, -3362, 8151, -2293, -2821, 3137, 4635, -7966, 3899, 5731, -8229, 3290, 4280, -4145, -2276]
458b276R799j1966Q54J0202q472l072Q843p47j2648J5174l581r559J0196k77o414
473c944N53J0709j2904J867J0165r621j676R618m025q904J3971n504n853O920
487A372K174q328K260J0993j5579N887P074r249k54Q675m336p650J2928n229n964
502e226P651K454j0934O524O826j4283Q229L351o458j269Q791m867p055J3247
516F981o709m622P375J257j0178P693L981j1416O901K770n401k900J1298q158
530a128m694J3120q441k765O680N97r853Q387K691j0803O583L898p131j301J1290
545G130j0732o66J0141p953j810N990J201j0773J0057Q66j0024P459K773p330
559c671L71R791j0669J192P689n844l230P054L26j0708J1930k337p337O950J819
$$ y = [-2276, 7523, -4443, -3589, 6613, -1859, -4931, 3912, 3165, -9483, 5691, 2110, -7449, 2747, 2470, -3944, -3391, 7318, -5586, -3719, 6446, -3175, -4851, 4767, 742, -8162, 5809, 305, -5548, 1372, 3546, -4782, -2522, 8471, -7108, -1221, 5853, -3396, -3650, 5025, 689, -6961, 5967, 738, -5226, 2425, 4879, -6055, 469, 7295, -6988, 1241, 4592, -1866, -3135, 5656, 789, -6266, 6981, 272, -4350, 3025, 4282, -5896, 1797, 5778, -5638, 1263, 4033, -1368, -4268, 7030, -1128, -5822, 7298, -1143, -3908, 2772, 3369, -6484, 1903, 4594, -6209, 374, 4272, -2859, -4160, 7130, -3602, -4268, 5873, -2080, -3890, 2100, 3301, -7472, 2585, 3451, -6573, 886, 3659, -3671, -3300, 6491, -4178, -2986, 4703, -1141, -4371, 2683, 3009, -7699, 4231, 1894, -5443, 1507, 3326]
574C326o385N29R254j0933K296O767n652l298Q436k127q625J1730l922n041N036
589A391K977p841K024Q655j1894M060N653n889k769Q507l591o794J0806m239m763
604c707M667L618r408M515O450j1557N453L554m693k910Q842m858n485J0176m524
619A33m303N150K785r322O057L591r169M722L257m429l256R917o426l823R557
634D441m929l414M830K465r291P091K387q218M318L988n443k298J0180q524j063
649c480P915m643l275N291J862r511Q413Q96p665M471L845o184q26Q945q668O32
665a982O118l687m049O346P49r093R055q41n995L842L546o253Q6Q018q554Q33
681a861N615l465m292P297j234p585R253k208m676K837M266p381J406P337r152
$$ y = [3326, -3059, -2530, 6724, -4209, -1913, 4854, -798, -4096, 4340, 2213, -6412, 5318, 1396, -3645, 1391, 4368, -3473, -1449, 7206, -4688, -628, 5025, -864, -3633, 4874, 1283, -5511, 5295, 1056, -3707, 960, 4578, -4830, -315, 6135, -5422, 31, 3585, -1108, -4018, 4824, -34, -5519, 4657, 133, -4170, 980, 3765, -5557, 500, 4091, -5078, -356, 2901, -1528, -4784, 5133, -1293, -5116, 4441, -488, -3902, 928, 3393, -5898, 1193, 3580, -4638, -320, 3668, -1775, -4073, 6107, -2417, -3480, 4435, -208, -3483, 1808, 3670, -5841, 2572, 3468, -4197, 274, 4119, -2065, -2891, 6054, -2614, -1982, 4136, 449, -3600, 2746, 3495, -5598, 3457, 2616, -3379, 463, 4009, -2244, -2158, 5860, -2694, -1861, 3754, 289, -4003, 3294, 2060, -5525, 3728, 1520, -3156, -319, 3947, -3434, -2028, 5309, -3843]
696c843K234M853l886l734P764k686n875Q054k032m157K899M427q603L288N904
711D607q629K619M187l219l975Q246l685m939Q058k310m412L665M012q958N081
726C48L351p009K583L850l207l891Q738n030l336P088k572l709L697L124q265
741d240N330K357n784J862M204m172k948Q719o526j342N886k143m263M403K432
756C775q394O373J208n692J852M516n112j414P664o938J47M443j590m518N044
771A364J339p795O876M4m892K017M291n525l93O736o362K48L906j205m824O161
787A986k42o555O747o81l725J510M361o083Q75N740o289P82L764j558m337O607
803B902j696m793N793q97l181J187M766p045K360M583o186J070L814j997m124
$$ y = [-3843, -1609, 3244, -642, -4376, 3388, 702, -5173, 2881, 849, -3308, -409, 4018, -4585, -1297, 4607, -4022, -1403, 2784, -435, -4410, 3836, 151, -4788, 3270, 960, -3452, 213, 4225, -4733, 348, 3699, -3310, -727, 3123, -84, -3975, 4763, -267, -3603, 3485, 913, -2796, 901, 4025, -4240, 1090, 3447, -2337, -475, 3729, -443, -3391, 5328, -1198, -2540, 3346, 1203, -3060, 1343, 3775, -4619, 1754, 2962, -2730, -878, 3638, -1474, -2888, 4776, -2162, -2015, 2428, 838, -3680, 1364, 2703, -5092, 1784, 1828, -3064, -1047, 3244, -2281, -2674, 4062, -2300, -2052, 1854, 649, -4175, 1986, 1744, -4811, 1936, 1255, -2470, -960, 3401, -2682, -1807, 3933, -2356, -1574, 2190, 632, -3705, 2902, 1206, -3587, 2206, 1309, -1872, -685, 4081, -2964, -604, 3979, -2207, -1137, 2677, 680, -3444]
818c444P068k987l610N187m78l896K060M388p847M088K823n293J004L469k117
833D15l872P348l950k675M686n60m014K716L270p197M527J562m117M46M013l101
849e03l028P227m695j585M159p34l935L553K184o798M742J207l908N23M614m384
865a361j572O481n068l38L269k88m281M167J232o036M761P86l413M41M765n183
881a638j60N488m960j35L125k75m670N233O1n317M894J46l177L00M652n349P47
898a035M335m446l6L105n14m575O002j644l976M241J31l157Q63M268n910J805
914e43L174l994p2L326j302l924O140k704k666L568K74l242J366L791o245K741
930c12K258l523n6L646k021l300N821k919j923L268K46l756K297K873n835L258
$$ y = [-3444, 3624, 637, -2973, 2214, 1736, -2160, -100, 4288, -3559, 529, 3352, -1941, -937, 2532, 415, -3457, 3891, -59, -2734, 1952, 1392, -2622, 94, 3364, -3833, 694, 2256, -1861, -1415, 2598, -503, -3531, 3696, -999, -2584, 1575, 841, -3094, 459, 2643, -4155, 587, 1794, -2114, -1591, 3023, -1361, -2933, 3548, -1520, -1858, 1411, 1123, -3158, 1009, 2241, -3795, 966, 1752, -1661, -1220, 3545, -1638, -1798, 3690, -1270, -1405, 1720, 1445, -3225, 2008, 2069, -3248, 1646, 1792, -1385, -1085, 3567, -1782, -1035, 3300, -1146, -1182, 1923, 1409, -3166, 2836, 1192, -2784, 1457, 1588, -1569, -706, 3562, -2348, -543, 2631, -1363, -1435, 1891, 589, -3335, 2805, 101, -2565, 1003, 1277, -1965, -599, 3192, -3053, -312, 1946, -1577, -1633, 2013, -8, -3308, 2513, -406, -2329, 939, 1185, -2571, -274, 2599, -3236, 22]
946B2J606k922l30L967k750k419N754l359j474K887M82l919L194J814n267L557
962H43R94k683m62M326l602j353N064l608o49K684J51m176L923O59m613L315P49
979A562k379n01M480m299j75M232l497o28K463R5m165M311r6l827L210O45k737
996a306p3M349m666N66L348l198n94K561K7m169M878j077l107K874Q36l069P97
1013a023L723n060J553K586k560r95L266r39l443M910j838k208K727Q46l394J211
1029f38L356n023K203J863k227j047L504j594k906M899k053j768K019J347l848
1044a913J846K738m753K412J426k227j063L946k373k088M524k555r65J717J098
1059A770l895K466J758m177K315J176j956j025L930k987j188L804k339j092K040
$$ y = [22, 1628, -1294, -1624, 2343, -407, -2826, 2928, -431, -1905, 982, 1464, -2455, 739, 2553, -2714, 843, 1837, -846, -1308, 3018, -584, -1937, 3127, -481, -1130, 1554, 1705, -2471, 1452, 2111, -2502, 813, 1562, -817, -1318, 3162, -1137, -1312, 2920, -577, -1205, 1258, 1353, -2812, 1499, 1403, -2424, 786, 1431, -1306, -1379, 2970, -1696, -1130, 2218, -980, -1574, 987, 1014, -3155, 1723, 646, -2461, 413, 1249, -1820, -1023, 2700, -2360, -807, 1779, -781, -1776, 1490, 551, -2892, 2018, 180, -2028, 699, 1545, -1849, -638, 2718, -2305, -102, 1761, -466, -1513, 1991, 397, -2509, 2390, 337, -1431, 588, 1935, -1913, -67, 2671, -2082, 330, 1756, -471, -1534, 2412, 39, -2049, 2475, -80, -1045, 672, 1770, -2125, 341, 2099, -2078, 237, 1413, -543, -1568, 2362, -625, -1813, 1991, -348, -1440, 600]
1074F00Q48m145L420O85l699K389R83j931q63L911l398l36L351k274j252K384
1090F73N72m085L735j37k748K080J141k273l35L860l786K37K649j769j244K418
1106I88J97l604M005o76k315J497J448k563K32L396l992R97K153j648j489K857
1122A483l94l173M035j172j891J365J504l051Q10K995l881J120J668j514j463
1137a559L206j065k556L633j187j829J565J229l104J505K159l762J505J280j355
1152c35j487L406j700j815L377j562j114J283J262l517K357J220l029J387J370
1167A103j548j269L607k344j299K982j130j443J425J369l575K458Q75k820J585
1182b4J305j651r64L439k650l77K206j016j308J671Q58l340K710J39k036J098
$$ y = [600, 1448, -2697, 723, 1408, -2291, 98, 1081, -850, -1713, 2198, -1200, -1536, 1815, -459, -1711, 673, 1245, -2840, 895, 758, -1990, 90, 1231, -1042, -1377, 2483, -1303, -1066, 1583, -186, -1430, 988, 1185, -2419, 1586, 910, -1405, 92, 1540, -1023, -791, 2605, -1387, -390, 1763, 115, -1374, 1483, 1089, -2084, 1951, 779, -1112, 253, 1757, -1294, -484, 2511, -1370, -250, 1418, -96, -1559, 1647, 582, -1974, 1659, 472, -1357, 208, 1437, -1667, -162, 1997, -1765, -260, 1020, -335, -1822, 1584, -116, -1931, 1446, -116, -1230, 53, 1315, -2202, 155, 1375, -1654, -267, 1103, -445, -1714, 1893, -451, -1750, 1232, 102, -1341, 84, 1453, -2122, 336, 1211, -1609, -24, 1281, -370, -1334, 2105, -545, -922, 1284, 268, -1040, 631, 1489, -1851, 859, 998, -1038, 60]
1198F0J501j980o20L291k816J39J742q42j611K023J38l003K882o6j691P13J664
1215A524k278j31K715k932M07J645n14j956K372j21k638K956p03j447Q22J476
1231A197k476N31K217k774P59J478r43j624K549o26j935K402m41j471Q54J637
1247A334k836J287J554k559Q28J298q40j604K863j140j373K254p30r75P23J323
1263A407k610J448J139k225O66J183q40j398K746j507p58J705m52j336J170J025
1279A363k584J852M00j671M48J240j108j018K721k022l71J652m73j353J391N25
1295I92k393J824J76j311L57J545j857l74K505k187n0J262m03j232J500L16k308
1312a638J936R2j238N03J438j838l46K171j852J58J109k87j566J957Jj902J951
$$ y = [60, 1561, -419, -1039, 2252, -564, -425, 1317, 475, -1136, 887, 1025, -1978, 904, 838, -853, -140, 1524, -754, -885, 1830, -1102, -695, 950, 436, -1520, 852, 731, -1907, 1049, 346, -1101, -279, 1197, -1279, -748, 1469, -1305, -546, 932, -11, -1635, 914, 288, -1647, 755, 314, -1157, -303, 1334, -1502, -215, 1339, -1220, -392, 906, 66, -1538, 1325, 185, -1188, 1066, 336, -639, 84, 1407, -1203, 245, 1384, -841, -175, 1008, 168, -1230, 1516, 9, -749, 956, 504, -832, 338, 1363, -1221, 631, 1031, -640, -192, 1048, -60, -1078, 1643, -379, -750, 902, 429, -924, 467, 992, -1401, 423, 599, -712, -355, 1190, -667, -1041, 1464, -723, -773, 489, 86, -1146, 354, 670, -1638, 298, 390, -848, -345, 1093, -745, -1091, 1080, -772, -614, 495, 208, -1358, 599, 600, -1302, 649]
1329F49j82r42J78J498j937K80J569j703K60Q88o1j594K024m38j480J726m27q56
1347e48K81J621k239R78J217j766K88R30l82j431K349j030r35J360j43j029L70
1364a09J463k295R24Q68j306J71R58o34q73J888j224n70J174r9j183N15J252k123
1382a203J194O25j346K32R96q96o63K005j383j37P45J66j318R36O99j711J134
1399G5K66o55j41J183j120l77J783j300k14R18p0j231J409n3j431J428Q6q21n3
1418c18J311j338o3J443j282O4O84J55j343J311o7j199J157Kp35j11J350j627
1436f06K73J141j118J65M50Q6j196J387l42q40Q49O5o25J61J075j688Q12M42q60
1455c69p4P52k01r98J302m99n48Q15J33p58J32P70j320O21P39r99J43N17j37p65
$$ y = [649, 467, -475, -297, 1201, -736, -456, 1113, -590, -330, 558, 497, -1097, 927, 489, -991, 735, 308, -548, -267, 1354, -885, 93, 1310, -456, -168, 762, 380, -1051, 1298, 268, -667, 693, 550, -479, -109, 1354, -941, -17, 851, -455, -284, 674, 40, -833, 1055, -169, -739, 435, 336, -847, -332, 920, -1203, -9, 616, -730, -498, 498, -398, -1061, 944, -439, -576, 169, 335, -983, -47, 652, -1059, 75, 341, -314, -455, 728, -392, -769, 1014, -286, -500, 418, 348, -883, 526, 473, -958, 470, 556, -265, -318, 993, -345, -408, 1035, -247, -183, 501, 656, -687, 624, 557, -642, 515, 517, -218, -329, 1021, -606, -333, 808, -310, -145, 305, 391, -805, 582, 240, -600, 249, 314, -311, -150, 925, -763, 49, 491, -369, -443, 309, 108, -890, 412, -87, -635, 180, 313, -445, -313, 457, -863, -242, 497, -502, -359, 158, 21, -744]
1475g44J424r37k60O20K27p96M04Q18j571Q56K85n64R8O90n76m07J167q31q9L85
1495A99K05r32O54M23j101P95J4l49k56J033p95l09J192q54L4K00L25q79O75J82
1515D56j040Q80J02m08k33Q42p98P7O66q07n8M90K53q62O84Lq01P39l1k77k35
1536c58P81r13J93N42o09K04L40r5p91Q53k62m23N39J75n39J08P53r30L57L37
1556B62l99j1M21l2q29J207n99l27M12J68m74J70N65j050P17K5j80p2N04k80o63
1577d65J191p46j07M10J37n37J87L92q00N26R8l60P2L21m90j92R03n00j00J77
1597A17K58p66L55K28n26M10Q8k71k29O83n08r4N08m87O0J90J48n25L57J18o75
1618e61N62pj72j99O66m53j3L78n13J75J97j30k29N59n4n00L65jj57k86R12q82
$$ y = [-744, 680, -257, -517, 103, 330, -466, -62, 756, -815, 41, 326, -238, -140, 550, -26, -433, 734, -97, -186, 199, 404, -528, 126, 549, -552, 243, 257, -92, -348, 685, -110, -419, 773, -81, -47, 153, 478, -401, 274, 456, -584, 296, 398, -10, -243, 599, -199, -122, 544, -263, -321, 169, 422, -440, 244, 247, -554, 185, 154, -123, -358, 423, -490, -297, 245, -364, -160, 180, 85, -706, 147, -115, -538, 1, 176, -363, -255, 498, -432, -75, 262, -137, -148, 273, 241, -588, 619, 20, -307, 105, 273, -201, -31, 534, -516, 201, 226, 46, -26, 478, 198, -465, 726, -20, -127, 283, 420, -117, 70, 462, -338, 188, 286, -74, -2, 319, -171, -363, 540, 40, -60, 117, 375, -391, -36, 192, -334, 76, 164, -107, -336, 347, -161, -255, 253, -234, -174, 16, 164, -361, -4, 114, -561, 1, -6, -178, -377, 289, -164, -177, 201, -312, -137, 60, -70, -299, 260, 206, -294, 71, 70, -87, -373, 539, -343]
1640c43L73L94l91q9Q7L31p12L99Q3k45J75K19k25j21N28n86J82L02j86K7M7J1
1662B60m45N38l29j72L46j0m11K81K50o35M35J9j30l0K06j67l54N87l81n1K31
1683C8%k48K86j15l86O66m09J40j09K32k14j10L97l53K0L65k85j73K22k2k71L63
1705C4o1j15K4J38j87J09K44l70K25Q7m1k33L58j36j99L03l21L16k8L6k33K26
1727A76l4k91L51O3m0l46L47j00j20K49k27M6k82L79k45J70P7l69K04L2M5k26
1749a41M70m81MK00j43M5K0O6k92L97k07Q4P4k62J17j49M44m20N4K56j92m3O6
1772c3P2l50N52k94j97K01R6j38L3K38n19L18L2l2r2n1J57l77O04k21M8J69q8
1795A28j43J91J32m61M21r4k79J31K16k17k18L30k49K28L8O7j88K43o3m36L40
$$ y = [-343, 30, 424, 33, -56, 31, 362, -350, 49, 132, -113, 62, 281, 56, -65, 463, -123, 59, 361, 175, 202, 249, 260, -185, 353, 24, -148, 198, 188, -223, 58, 308, -327, 108, 127, -3, -33, 173, 6, -348, 239, -142, -193, 38, 38, -210, 76, -39, -425, 241, -168, -28, -137, 95, -119, -229, 168, -185, -165, 200, -85, -258, -36, -58, -329, 34, -27, -142, -118, 20, -167, -58, 186, -184, 41, 128, 87, -146, 212, 76, -123, 180, -141, 175, 147, 183, -50, 176, 142, -149, 202, 265, 225, -121, 226, 126, 6, 255, 28, 74, -208, 171, -74, 96, 173, -196, 8, 40, 85, -141, 329, -152, -148, 52, -91, -46, -26, 40, -252, 145, -62, 22, 96, -166, -49, -198, 246, -174, -120, 136, -56, -99, -33, 39, -311, 241, -53, -250, -49, 47, -91, -58, 180, -339, -21, 11, -21, -113, -164, -7, -384, 220, -1, 47, 216, 128, -15, 176, 308, -153, 268, 174, -105, 26, 242, 25, -193, 137, -112, 116, 154, 221, 33, 276, 213, -223, 117]
1816A17l6k2j19M13m49rK96k00LJ24j88j97L67L9l95K88k1l4j2Q8k34N2J46k77
1840b60L66j19J52l16L34j95k57O54m97O7J8J09m59K95L42m67J98L8J06k66M28
1861B71m12P5L31j79j78J01J23m63N29k3k73J20J51m2l17O46m63o5M17k14r3Q5
1883A27J11l86L94nk75M4K79l94L1N21n97K42J11j93k11M05j81l39O65m90o6J28
1905g9J02j38L4L22o45M17J53k61k50M28lm14O92l00k82J97J44k59K08P8l72K86
1927E8K0K6m01M51j90k93N74l70QJ95K85o89K22N53o22K38O9j19k47N94k07m07
1949b52M79l13N2K62p8l63M28j6m39L44J11k59j00N35m85r4N21j60l38L41J07
1970B83n73M13J08m31K61J67j66k54N46o64M7N39l29J0O1K71p63N43m2l55M29
$$ y = [117, 81, 59, -60, 353, -96, -105, 191, -9, -6, 118, -70, -267, 100, 139, -256, 32, 11, -23, -35, 53, -181, -129, 17, -260, 106, -13, 139, -177, 157, -38, -295, 359, -138, -71, -53, 56, -403, -108, 234, -233, -35, 3, 109, -157, 271, -141, -66, 265, 86, -92, 9, 132, -331, 198, 175, -98, 22, 173, 131, -186, 460, -3, -68, 349, 135, 42, 127, 238, -148, 246, 241, -34, 10, 289, -105, -74, 447, -150, 92, 203, 10, -201, 204, 23, -316, 349, -141, -207, -79, 23, -115, -81, 241, -404, 13, 166, -95, -345, 83, 80, -334, 358, 58, -224, -27, 117, -142, 66, 144, -228, 58, 78, 104, -297, 154, -36, -329, 245, -125, -117, 78, 363, -326, -104, 449, -173, 65, 134, 15, -232, 362, 155, -252, 227, -86, -34, 228, 150, -213, 215, 199, -240, 104, 215, -44, -144, 391, -94, -188, 333, 173, -165, 176, 283, -290, 123, 231, -200, 61, 228, 62, -192, 354, -310, -263, 276, -53, -43, 18, 289, -474, 69, 27, -328, 101]
1991A01r0k90M3M88n93K01L12l67p9L68P3n67O71j28l82J53K83m93P4O36p36L41
2013A9K29k87j29M39l01m91Q95l39j90L48n0k48K16L92q00K68L31l66k48N99k73
2034A4k30O35l45l29M25J29n18L91K45o21K34J91k68j11N36n54k14Q51l89k82
2054b10J89L10o23L26J72m01K23J78k75k09O93o11M5M25k87l23M34L53p55O85
2074C39j64n55M41J81o01M5P07o87K50L22k37m05N67r2m43O12j14l88K21K23m50
2095b28JO47p72L11K97k50j73M35J22q98R27l01l55L15L04n71J49M82o82L4L13
2116A07j56j70L14on33Q91m46k55L24K08o73M91N05q52J35K97k31k38Q09n69k40
2137b88P73m80k84L26K92p36N38K1n48M30K28l12m86J028o40l02O47k45j63K99
$$ y = [101, 11, -279, -236, 252, -341, -140, 172, -195, -274, 94, 167, -400, 271, 143, -239, -86, 197, -296, -222, 414, -322, 19, 248, -39, -168, 271, -30, -521, 374, 35, -155, 193, 143, -105, 111, 503, -297, -29, 302, -64, -312, 287, 14, -216, 419, 74, -255, 170, 299, -219, 172, 417, -204, 30, 221, -47, -158, 378, -176, -390, 461, 72, -210, -21, 289, -334, -8, 164, -237, -14, 164, -111, -320, 373, -238, -193, 232, -55, -378, 56, 409, -346, 339, 175, -380, 61, 242, -359, -314, 393, -294, -44, 278, 41, -364, 203, 111, -332, 280, 166, -222, -1, 222, -228, -227, 420, -352, -41, 256, 6, -167, 268, 390, -508, 419, 118, -237, 78, 382, -189, -40, 442, -240, -206, 107, -49, -219, 95, 89, -444, 447, 1, -254, 70, 278, -395, 96, 601, -251, -116, 181, -50, -288, 521, -48, -288, 485, 5, -279, 47, 339, -397, 141, 162, -386, 44, 272, -40, -526, 502, -138, -440, 207, -38, -201, 98]
2157I8K44p59O38pn66L98J52j63l62P58n94M5P12n16k63K29L64q58Q12j93m64
2178b95N20L0l53j29P49o69j2M67m28k28M38J85q48R13j4o56L26L34n25l3P09
2199D81o86J00L85l97j80N70j45n67P58m32k63K79M96p80J90O53r93M57M57l91
2219hl69Q02m31n15P37j20n03M27L03r12N68L51o85M49K29l78m24P86l86l12P56
2240C65l87l01L06N11j001P24J65o94L67L54l34m55R08n66k46O55l57l37N60P2
2260C09p44N30K39n87K58K99n43k07R69p97KO79m98j87L54K04p99P51J3o03L19
2281c9L69n86j81R93p78RM81l03m34P74n1q21R16l35j56K00K19o43l8R26q12N3
2303b37N60l63n35R83r2j120J161k63m13K56M13p50K20P05j024M89L18l36l04
$$ y = [98, 342, -417, 221, 214, -352, 46, 198, 35, -327, 431, -163, -118, 594, 78, -185, 44, 408, -450, 362, 169, -295, 225, 255, -98, -227, 522, -147, -159, 308, -120, -348, 90, 275, -573, 340, 326, -330, -4, 330, -195, -228, 481, -205, -105, 280, -117, -297, 273, 128, -439, 319, -113, -376, -97, 399, -381, -191, 462, -531, -74, 383, -8, -377, 425, -6, -521, 216, 96, -407, 20, 323, -589, -21, 330, -355, 94, 323, -55, -479, 307, -79, -391, 365, -22, -323, -17, 494, -507, 217, 382, -312, 55, 409, 75, -380, 528, -38, -284, 371, 14, -323, 237, 309, -435, 95, 334, -253, 5, 304, -239, -446, 523, -274, -272, 407, -91, -278, 76, 280, -519, 232, 245, -358, -39, 330, -256, -437, 556, -222, -213, 268, -35, -469, 305, 254, -567, 349, 14, -142, 58, 277, -366, -404, 522, -290, -237, 323, -40, -575, 408, 316, -804, 357, 94, -319, -63, 350, -400, -180, 525, -499, -10, 308, -28, -332]
2322c32Q28n94m38R57l99l68L69N29r75M31L73p44J87N64l86m57J144p65l26O62
2342B60j75n00M84N21j155O87K44o65J63N00n75j93R67p60j48N39q4m00L44L55
2362D09r58P33J63o30J91M41l64m20Q77o96o3M73k6n10M59L08r99Q33Mo03K08
2383a70N71o01l6P40q87N0O29r1o53O81J0q31R11j57m45L69L97r54K45O60q28
2404c90K04N60k11o20R86l48q24J107k67n79K64P10q02nO73p09M9N67l93o47J139
2425D64l54n28O98k39n13K97P31q72L80N07q54O9O08m03p37J284n35m99O94o2
2445A36m69N51J55q85O72K14n89J43N77n73n56J195n60l98O79j44n61M04L35q52
2465e26P20O4m24nN23n65j67R98p37j3K63K01q19P63J70r86P22ok72j71Q64p81
$$ y = [-332, 496, -98, -536, 421, 22, -346, 23, 552, -423, 8, 381, -363, -176, 388, 2, -455, 689, -76, -402, 260, 85, -415, 69, 590, -565, 122, 366, -299, -136, 364, -211, -404, 563, -197, -345, 194, 110, -290, 54, 409, -549, 184, 347, -283, -92, 349, -15, -435, 442, -254, -317, 156, 130, -380, 79, 387, -612, 221, 225, -378, -170, 401, -200, -236, 504, -383, -333, 296, 205, -448, 233, 243, -588, 323, 166, -279, 90, 487, -467, -222, 438, -390, -186, 374, 163, -457, 529, 181, -643, 464, 197, -382, -118, 592, -210, -215, 458, -251, -202, 365, -28, -675, 464, 110, -418, 280, 41, -472, -175, 556, -316, 64, 571, -283, -214, 394, -9, -746, 538, 3, -496, 198, 136, -333, 218, 373, -512, 160, 374, -215, -72, 505, -68, -624, 571, 11, -387, 292, 148, -413, -9, 326, -526, 194, 258, -166, -171, 352, -213, -380, 618, -119, -132, 131, 332, -487, 276, 446, -540, 182, 176, -96, -267, 597, -184]
2487a84m3Q78q51p3N48o5o48N91J35q85Q60N2n36k7P99r33J56P71r57K80K51J3
2509A32p92J032l91o84Q70R9p66L65Q30j298L87O84p23m0O25m66m28J056m78l27
2529c13N61nm19J06O54j218P27K94n50k11N77j48o28J059n14l60O08M3q58N43
2549e2O27j169O26L73o56J5O65n31l30J063o24m51O81J87p56M44K62p30M76J50
2569B70m89k04R20m85m76J054o39k68M82L3p89Q14J15r81P60P7l40k08R74r92
2589c72K5R26p56j81N82j8q38R16L6q03N26J36m65J06Q00r12J06N28m32l11P41
2610C40j68q29J131k73o43N79J14o32M7J043j221L69N92o58j59Q01j73r11J094
2629D43m62l67P47j66n78K10Q23j062L06J83j11k21M90m8o62R48m55l00M84J36
$$ y = [-184, -227, 651, -200, -273, 275, 210, -438, 153, 288, -597, 263, 315, -221, -248, 551, -382, -226, 545, -412, -132, 119, 132, -660, 372, -19, -703, 167, 266, -500, -135, 695, -603, -216, 468, -255, -295, 330, -136, -564, 492, 14, -313, 248, 243, -176, -70, 584, -634, 93, 387, -163, -374, 203, 55, -573, 486, -28, -388, 220, 263, -595, -52, 575, -594, 32, 405, -251, -236, 429, -102, -432, 631, 7, -444, 237, 424, -332, 112, 374, -356, 120, 270, -219, -423, 497, 12, -464, 590, -49, -317, 165, 198, -591, 223, 338, -643, 117, 194, -146, -354, 620, -372, -347, 579, -177, -358, 224, 206, -632, 284, 320, -483, 43, 179, -286, -180, 620, -292, -186, 342, -90, -401, 340, 172, -657, 474, 201, -442, 137, 251, -381, -334, 709, -512, -143, 449, -209, -368, 433, 260, -651, 443, -19, -386, 361, 195, -383, -173, 650, -412, -106, 77, -34, -255, 235, 187, -475, 473, 18, -282, 202, 338]
2649C38r90P88N73j148K69O54n67k93R72o04l39R26o11l56M46J89p03N20L03j037
2669f70P05L40n45k95R25o88j59R39o61j35N07N6j003Q66K66q70N71J73n31j69
2689c78Q54n90j76P35n14l21M37L64r84P03J07o85M02M91p25N5Q30j047K22N00
2709B80k88l14P03n4q91R57k22m59L60M09q45Q7R86j158J76O62n44j86O77k22
2729A14p11J140m97l97M48L16q21K70P41r68K80L34k77l63Q31m94m82Q24j04n82
2749c98N01L61j058N78N55j042M81M03m66l94J073o71m02Q42l66l54M96K32q99
2768e28O16M66p97K67K13k71m38J043o94j93O59k04m54M05L82j036P84J2o90N02
2788D4M10n70k09P82o11j79P37l25k98L65K69j011J100k41p06M15L85m65j19Q48
$$ y = [338, -652, 136, 709, -439, -170, 484, -83, -376, 596, -8, -347, 579, -32, -388, 58, 247, -456, 64, 367, -670, 35, 375, -170, -465, 460, -228, -387, 552, -109, -244, 263, 319, -684, 182, 448, -422, 149, 322, -209, -378, 476, -114, -290, 445, -69, -390, 47, 411, -573, 130, 237, -448, -46, 445, -280, -225, 605, -442, -220, 280, -8, -322, 381, 327, -564, 393, 171, -288, 72, 481, -364, -277, 709, -449, -273, 389, -155, -341, 336, 114, -597, 543, 46, -351, 97, 413, -408, -138, 603, -365, -85, 249, -28, -391, 440, -54, -536, 288, 184, -398, 103, 464, -594, -16, 539, -503, -22, 381, -85, -479, 594, -77, -479, 363, -3, -357, 139, 371, -528, 88, 554, -243, 24, 237, -34, -472, 571, -123, -316, 343, 139, -315, 90, 472, -564, 220, 232, -458, 44, 454, -116, -325, 457, -154, -333, 404, 79, -219, 146, 415, -596, 504, 263, -443, -28, 357, -108, -227, 621]
2808F21q69k77J022m76l89N87O2r64R00j15m18K18L94p13J86P39r14J85N33k00
2828A12o21Q42j13r35J084k39m37K18P69j094L15N92r93L66M53k51n81J011l71
2847A27p10R94j14q39N16L99q21L97N37q32J71M52j12n15Q13n38k95P23k07m49
2867c03L15N29j225Q31K65p47J54M87l04m76J074r10j52P43j85m29N07K01q30
2886d55Q13k5p55J93O98o25j02Q17r13J68O87l95n58N63K30j005R26j13m32J59
2906a24M65m95j66R78r14L5N15j47m65N67r1r30J010N5n38M2O72q91J10Q86q84
2927c10J60M75j81p37R62p7q59Q51j27l69K63M17r22M03M87o40J41L52p4o47Q43
2948D11k70n37P62j07n92L07O12r40N55P9p28K02N45k17n29J002m90l58N79lo74
$$ y = [621, -248, -525, 497, 21, -368, 219, 281, -683, 217, 102, -316, -98, 296, -417, -231, 508, -406, -221, 312, 112, -509, 333, 220, -715, 369, 130, -307, -89, 680, -414, -99, 493, -500, -134, 319, 68, -513, 498, 127, -583, 411, 297, -542, -26, 373, -448, -51, 486, -346, -175, 277, 165, -350, 463, -75, -370, 353, 146, -303, 12, 541, -684, 147, 412, -335, -181, 306, 2, -474, 600, -310, -462, 281, 96, -333, 174, 375, -455, 358, 333, -422, -229, 469, -156, -258, 559, -354, -186, 501, 106, -452, 111, 341, -664, 262, 149, -283, -124, 341, -154, -320, 658, -256, -221, 294, 147, -318, 249, 158, -772, 238, 293, -245, -203, 469, -422, -312, 574, -310, -150, 325, 144, -593, 369, 292, -567, 284, 157, -212, 51, 468, -454, -51, 436, -204, -63, 289, 215, -432, 411, 141, -396, 366, 259, -333, -26, 586, -354, 201, 280, -448, -246, 299, 82, -447, 555, 65, -293, 286, 283, -391]
2969c91N15M36j053P54M9n20n7N58k21n83R97p34j82P55j84o13N63K69j051P11
2989A8R5l38m0P51o75l11J133q20m5M78j6n73M30K14o50O12j21m64K91M70p39
3010c00j7R15q59J31M22j03o97Q22P0r70Q72j33l58M1P11j047K56O53o74l0L65
3031G0R4o13P70k05n06O17n5m56J11O64r77L23N80n90o5O86l26p64J082k70m15
3052b45M63P6m41P2N78r36N07K45o01J54L09k04m27P77m89k37O50r9n03M17K77
3073C43r91O98J17m71J00O27o65j11R30p38L4L97j1o90N01K85r53Q11J21n91j79
3094d36R13n51k53P71n80J02K59P1p18O09J90p70N21R9m74l4O76o53j13O96m94
3115a69r8N05L6p66Q11k73o48P25J28n04o1Q54r54J67P52p61J91K13Mo74P24K9
$$ y = [-391, 124, 560, -493, 261, 310, -210, -267, 291, 70, -513, 484, -250, -432, 323, 139, -474, 89, 358, -693, 18, 113, -225, -265, 486, -189, -500, 633, -187, -232, 246, 230, -343, 87, 301, -349, 263, 142, -322, -31, 439, -300, -317, 598, -261, -130, 292, 189, -508, 314, 384, -586, 286, 153, -205, -164, 547, -500, -244, 409, -265, -295, 70, 164, -449, 321, 116, -390, 227, 172, -284, -173, 491, -486, -163, 417, -173, -238, 448, 122, -642, 440, 170, -245, 218, 294, -147, -75, 503, -433, 74, 319, -282, -128, 181, -23, -450, 327, -162, -399, 251, 152, -351, 66, 343, -648, 50, 167, -304, -204, 423, -242, -353, 577, -161, -127, 270, 259, -431, 70, 355, -598, 213, 334, -257, -436, 477, -74, -327, 444, -136, -34, 225, 296, -422, 187, 377, -393, 128, 227, -247, -281, 395, -258, -371, 325, -169, -267, 238, 274, -492, 319, 46, -602, 123, 251, -253, -314, 540, -414, -247, 505, -256, -65, 148, 152, -522, 202, 231]
3137B31o29M06J48n54K97O15r81L92M54o16K7M92j71n90J010n06l39K92K03n66
3157c85K87O13r45L47M65n05k09O36k69o69J157o13m05N77J36n43N78K39r24L84
3177d8J24k18k04P48l35m90Q70n35j32L27J38p93Q00K65r48O08J05l21l74R75
3197E62q31m1Q17n44k45M58P6q56Q60J6o49M71P1k14l32R93p18j12O34m88j63
3218b35N92o3p46Q45j28o08N24Q4n97J39O43p25K54M62o63p1M90r2o71R24k17
3239A41m92L32L54p52J69Q36r32K36L86m23k39P67l55m65Q16l76j45K26M69r19
$$ y = [231, -398, 8, 156, -398, -101, 514, -467, -75, 379, -237, -210, 282, 111, -479, 531, 25, -314, -22, 181, -385, -98, 515, -430, -83, 382, -123, -332, 304, 35, -634, 523, -90, -495, 82, 218, -325, 253, 492, -432, -48, 76, -142, -346, 402, 67, -423, 447, -88, -220, 107, 245, -548, 252, 517, -431, 177, 282, -39, -413, 562, -269, -310, 507, -37, -282, 176, 252, -604, 256, 272, -377, 94, 165, -49, -381, 612, -106, -218, 416, -72, -235, 357, 294, -452, 393, 265, -343, 181, 265, -332, -193, 450, -275, -21, 441, -222, -293, 197, 105, -566, 358, 141, -351, -19, 335, -417, -248, 588, -344, -108, 278, -145, -384, 383, 28, -437, 379, 3, -142, 84, 553, -366]
$$ [...]
8191B0
##END NTUPLES=NMR FID
##END=
