##TITLE=1H_CG-1146-x4
 DMSO, 8 sc, 
 12.05.2021
##JCAMPDX= 6.0         $$ Bruker NMR JCAMP-DX V2.0
##DATA TYPE= NMR SPECTRUM
##DATA CLASS= NTUPLES
##ORIGIN= UXNMR, Bruker Analytische Messtechnik GmbH
##OWNER= root
$$ XWIN-NMR		Version 3.5
$$ Wed May 12 10:02:33 2021 Russian Standard Time (UT+4h)  she@DPX200
##.OBSERVE FREQUENCY= 200.131506
##.OBSERVE NUCLEUS= ^1H
##.ACQUISITION MODE= SIMULTANEOUS
##.ACQUISITION SCHEME= undefined
##.AVERAGES= 8
##.DIGITISER RES= 18
##SPECTROMETER/DATA SYSTEM= spect
##.PULSE SEQUENCE= zg30
##.SOLVENT NAME= CDCl3
##.SHIFT REFERENCE= (INTERNAL, CDCl3, 0, 15.9927)
##AUDIT TRAIL= $$ (NUMBER, WHEN, WHO, WHERE, WHAT)
$$ ##TITLE= Audit trail, XWIN-NMR		Version 3.5
$$ ##JCAMPDX= 5.01
$$ ##ORIGIN= Bruker BioSpin GmbH
$$ ##OWNER= she
$$ F:/spectra/data/she/nmr/H-F/1/pdata/1/auditp.txt
$$ ##AUDIT TRAIL=  $$ (NUMBER, WHEN, WHO, WHERE, WHAT)
(   1,<2021-05-12 10:01:21.59 +0400>,<she>,<DPX200>,
      <created by zg, POWCHK disabled, PULCHK disabled
       configuration hash MD5:
       00 E9 B6 7A A2 85 ED C7 34 08 36 98 17 FE 4E 26
       data hash MD5: 16K
       48 32 78 8F 8E F0 6D 77 69 85 E4 DF 28 CB F9 CB>)
(   2,<2021-05-12 10:01:23.76 +0400>,<she>,<DPX200>,
      <Start of raw data processing
       efp BC_mod = 2 LB = 0.24 FT_mod = 6 PKNL = 1 PHC0 = -11126.21 PHC1 = 16.001 SI = 16K 
       data hash MD5: 16K
       52 51 B0 B8 C4 5B 7C F3 00 C2 F4 0B 84 80 5B 22>)
(   3,<2021-05-12 10:01:43.32 +0400>,<she>,<DPX200>,
      <pk PHC0 = -9.743937 PHC1 = -2.2 
       data hash MD5: 16K
       CE 00 03 0E 6B 16 5A 1A F7 F9 23 DC 7E 20 29 26>)
(   4,<2021-05-12 10:01:46.90 +0400>,<she>,<DPX200>,
      <abs ABSG = 5 
       data hash MD5: 16K
       E4 A1 5A D9 8B 7A 46 2C 9B 61 B2 C3 A0 ED 7F F1>)
$$ ##END=
$$ 
$$ hash MD5
$$ 9F A6 4A 05 F8 D2 AC 9A DD 40 D9 65 40 8D 8F D1
##$RELAX= 
##$RELAX= 
##$RELAX= 
##$RELAX= 
##$RELAX= 
##$RELAX= 
$$ Bruker specific parameters
$$ --------------------------
##$DU= <F:/spectra>
##$EXPNO= 1
##$NAME= <H-F>
##$PROCNO= 1
##$TYPE= <nmr>
##$USER= <she>
##$AMP= (0..31)
100 100 100 100 100 100 100 100 100 100 100 100 100 100 100 100 100 100 
100 100 100 100 100 100 100 100 100 100 100 100 100 100 
##$AQSEQ= 0
##$AQ_mod= 1
##$AUNM= <au_zg>
##$AUTOPOS= <>
##$BF1= 200.13
##$BF2= 200.13
##$BF3= 200.13
##$BF4= 200.13
##$BF5= 200.13
##$BF6= 200.13
##$BF7= 200.13
##$BF8= 200.13
##$BYTORDA= 1
##$CFDGTYP= 0
##$CFRGTYP= 5
##$CHEMSTR= <none>
##$CNST= (0..31)
1 1 145 1 1 1 1 1 1 1 1 1 1 1 1 1 1 1 1 1 1 1 1 1 1 1 1 1 1 1 1 1 
##$CPDPRG= <>
##$CPDPRG1= <>
##$CPDPRG2= <>
##$CPDPRG3= <>
##$CPDPRG4= <mlev>
##$CPDPRG5= <mlev>
##$CPDPRG6= <mlev>
##$CPDPRG7= <mlev>
##$CPDPRG8= <mlev>
##$CPDPRGB= <>
##$CPDPRGT= <>
##$D= (0..31)
0 1.2 0 0 0 0 0 0 0 0.06 0 0.03 0 0 0 0 0.0002 0 0 0 0 0 0 0 0 0 0 0 0 
0 0 0 
##$DATE= 1620799281
##$DBL= (0..7)
120 120 120 120 120 120 120 120 
##$DBP= (0..7)
150 150 150 150 150 150 150 150 
##$DBP07= 0
##$DBPNAM0= <>
##$DBPNAM1= <>
##$DBPNAM2= <>
##$DBPNAM3= <>
##$DBPNAM4= <>
$$ [...]
##$SUBNAM3= <"">
##$SUBNAM4= <"">
##$SUBNAM5= <"">
##$SUBNAM6= <"">
##$SUBNAM7= <"">
##$SUBNAM8= <"">
##$SUBNAM9= <"">
##$SW= 16.9725357007746
##$SWIBOX= (0..15)
0 0 2 0 0 0 0 0 0 0 0 0 0 0 0 0 
##$SW_h= 3396.73913043478
##$TD= 16384
##$TD0= 1
##$TE= 0
##$TE2= 300
##$TE3= 300
##$TEG= 300
##$TL= (0..7)
0 120 120 120 120 120 120 120 
##$TP= (0..7)
150 150 150 150 150 150 150 150 
##$TP07= 0
##$TPNAME0= <>
##$TPNAME1= <>
##$TPNAME2= <>
##$TPNAME3= <>
##$TPNAME4= <>
##$TPNAME5= <>
##$TPNAME6= <>
##$TPNAME7= <>
##$TPOAL= (0..7)
0.5 0.5 0.5 0.5 0.5 0.5 0.5 0.5 
##$TPOFFS= (0..7)
0 0 0 0 0 0 0 0 
##$TUNHIN= 0
##$TUNHOUT= 0
##$TUNXOUT= 0
##$USERA1= <user>
##$USERA2= <user>
##$USERA3= <user>
##$USERA4= <user>
##$USERA5= <user>
##$V9= 5
##$VALIST= <valist>
##$VCLIST= <CCCCCCCCCCCCCCC>
##$VD= 0
##$VDLIST= <DDDDDDDDDDDDDDD>
##$VPLIST= <PPPPPPPPPPPPPPP>
##$VTLIST= <TTTTTTTTTTTTTTT>
##$WBST= 1024
##$WBSW= 4
##$XGAIN= (0..3)
0 0 0 0 
##$XL= 0
##$YL= 0
##$YMAX_a= 125549
##$YMIN_a= -155591
##$ZGOPTNS= <>
##$ZL1= 120
##$ZL2= 120
##$ZL3= 120
##$ZL4= 120
##$ABSF1= 15.99371
##$ABSF2= -0.9789543
##$ABSG= 5
##$ABSL= 3
##$ALPHA= 0
##$AQORDER= 0
##$ASSFAC= 0
##$ASSFACI= 0
##$ASSFACX= 0
##$ASSWID= 0
##$AUNMP= <proc_1d>
##$AZFE= 0.1
##$AZFW= 0.1
##$BCFW= 0
##$BC_mod= 2
##$BYTORDP= 0
##$COROFFS= 0
##$CY= -3
##$DATMOD= 1
##$DC= 0
##$DFILT= <>
##$DTYPP= 0
##$F1P= 0
##$F2P= 0
##$FCOR= 1
##$FTSIZE= 16384
##$FT_mod= 6
##$GAMMA= 0
##$GB= 0
##$INTBC= 1
##$INTSCL= 1.334414e-10
##$ISEN= 128
##$LB= 0.24
##$LEV0= 0
##$LPBIN= 0
##$MAXI= 10000
##$MC2= 0
##$MEAN= 0
##$ME_mod= 0
##$MI= 1.114404
##$NCOEF= 0
##$NC_proc= -8
##$NLEV= 6
##$NOISF1= 3.799351
##$NOISF2= 2.8
##$NSP= 0
##$NTH_PI= 0
##$NZP= 0
##$OFFSET= 15.99267
##$PC= 1
##$PHC0= -11135.95
##$PHC1= 13.801
##$PH_mod= 1
##$PKNL= yes
##$PPARMOD= 0
##$PSCAL= 0
##$PSIGN= 0
##$REVERSE= no
##$SF= 200.130003755146
##$SI= 16384
##$SIGF1= 3
##$SIGF2= 2
##$SINO= 5.538805
##$SIOLD= 16384
##$SREGLST= <1H.CDCl3>
##$SSB= 0
##$STSI= 16384
##$STSR= 0
##$SW_p= 3396.73913043479
##$SYMM= 0
##$S_DEV= 0
##$TDeff= 16384
##$TDoff= 0
##$TI= <>
##$TILT= no
##$TM1= 0
##$TM2= 0
##$TOPLEV= 0
##$USERP1= <user>
##$USERP2= <user>
##$USERP3= <user>
##$USERP4= <user>
##$USERP5= <user>
##$WDW= 1
##$XDIM= 16384
##$YMAX_p= 291390867
##$YMIN_p= -904061
$$ End of Bruker specific parameters
$$ ---------------------------------
##NTUPLES= NMR SPECTRUM
##VAR_NAME=  FREQUENCY,     SPECTRUM/REAL,   SPECTRUM/IMAG
##SYMBOL=    X,             R,               I
##VAR_TYPE=  INDEPENDENT,   DEPENDENT,       DEPENDENT
##VAR_FORM=  AFFN,          ASDF,            ASDF
##VAR_DIM=   16384,         16384,           16384
##UNITS=     HZ,            ARBITRARY UNITS, ARBITRARY UNITS
##FACTOR=    0.207333158178282, 1,           1
##FIRST=     3200.61311900333, 0,            0
##LAST=      -196.126011431462, 0,           0
##MIN=       -196.126011431462, -904061,     0
##MAX=       3200.61311900333, 291390867,    0
$$ Real data points
##PAGE= N=1
##DATA TABLE= (X++(R..R)), XYDATA
$$ [...]
$$ plain form
4461 7161760 6836933 6817706 6854082 6777236 7098900 7318435 7070517 7098612 7230229 6767576
4451 6767576 6475169 6534220 6705717 6672335 6584040 6714398 6792441 6913868 7172384 6944599
4441 6944599 6720920 6590247 6553441 6884345 6967354 7143237 7299145 7400527 7419826 7293833
4431 7293833 7293794 6838690 6996165 7077526 6898252 7274090 7371380 7774967 7614574 7634936 7510280
4420 7510280 7557507 7705664 7978865 7903220 7790154 7874783 7712864 7641750 7867694 7921023
4410 7921023 7840649 8222653 8413117 8502396 8307606 8243955 8597604 8704424 8648857 8831954
4400 8831954 8847544 8816454 8936573 9231518 9070549 9144033 9333566 9350394 9489791 9499943
4390 9499943 9715471 9604834 9810338 9946216 10269691 10361557 10614917 10938606 10787489 11142048
$$ packed form
4461G161760l24827j9227L6376p6846L21664K19535k47918K8095J31617m62653
4451F767576k92407N9051J71497l3382q8295J30358P8043J21427K58516k27785
4441F944599k23679j30673l6806L30904Q3009J75883J55908J01382J9299j25993
4431G293833l9m55104J57475Q1361j79274L75838R7290M03587j60393K0362j24656
4420G510280M7227J48157K73201p5645j13066Q4629j61919p1114K25944N3329
4410G921023q0374L82004J90464Q9279j94790o3651L53649J06820n5567J83097
4400H831954J5590l1090J20119K94945j60969P3484J89533J6828J39397J0152
4390I499943K15528j10637K05504J35878L23475R1866K53360L23689j51117L54559
$$ plain form
4380 11142048 11306838 11524858 11512676 11368598 11273946 11678178 12085467 12078097 12444494 12571537
4370 12571537 12725219 12687695 12425314 12468186 12928400 13315319 13562664 13911955 14171188 14127705
4360 14127705 13891109 13983555 14226222 14576575 14425628 14884365 15332676 15287411 15345046 15709772
4350 15709772 15913221 15791191 16308720 16866408 17016454 17090006 17283550 17587116 17893780 17637124
4340 17637124 17696144 17963182 18100951 18179548 18627238 18819689 18745780 19366526 19656806 19849894
4330 19849894 20209740 20179410 20209729 20303599 20553924 21085203 21143777 21502282 21724587 21804445
4320 21804445 21906893 22169238 22597558 22801829 22873932 22867683 22982872 23243145 23372575 23580736
4310 23580736 23928498 24262151 24253279 24395094 24703985 24729455 25140610 25420150 25447845 25643318
$$ packed form
4380A1142048J64790K18020j2182j44078r4652M04232M07289p370L66397J27043
4370A2571537J53682l7524k62381M2872M60214L86919K47345L49291K59233m3483
4360A4127705k36596R2446K42667L50353j50947M58737M48311m5265N7635L64726
4350A5709772K03449j22030N17529N57688J50046P3552J93544L03566L06664k56656
4340A7637124N9020K67038J37769P8597M47690J92451p3909O20746K90280J93088
4330A9849894L59846l0330L0319R3870K50325N31279N8574L58505K22305P9858
4320B1804445J02448K62345M28320K04271P2103o249J15189K60273J29430K08161
4310B3580736L47762L33653q872J41815L08891K5470M11155K79540K7695J95473
$$ plain form
4300 25643318 25951983 26185072 26176280 26755464 27045702 27342057 27912795 28089964 28398475 28366500
4290 28366500 28430694 28864146 29064325 29183360 29440560 29724519 30060570 30435691 30646923 30401487
4280 30401487 30382650 31021472 31215267 32041108 32300964 32361013 32993631 33422738 33507026 33791268
4270 33791268 34462344 34567107 35161747 35555411 35931470 36028427 36665036 37342729 37803123 38571123
4260 38571123 39128145 39421570 40246192 41227626 41789748 42072621 43110489 44220947 45194401
4251 45194401 46034243 47002356 48222871 49472038 50825935 52094815 53392857 55002359
4243 55002359 56631679 58098637 59899902 61963757 64252964 66615659 69282406 71938136
4235 71938136 74497902 77694369 80860601 84732070 89116749 93043808 98020531 103201030
$$ packed form
4300B5643318L08665K33089q792N79184K90238K96355N70738J77169L08511l1975
4290B8366500O4194M33452K00179J19035K57200K83959L36051L75121K11232k45436
4280C0401487j8837O38822J93795Q25841K59856O0049O32618M29107Q4288K84242
4270C3791268O71076J04763N94640L93664L76059R6957O36609O77693M60394P68000
4260C8571123N57022K93425Q24622R81434N62122K82873J037868J110458R73454
4251D5194401Q39842R68113J220515J249167J353897J268880J298042J609502
4243E5002359J629320J466958J801265K063855K289207K362695K666747K655730
4235G1938136K559766L196467L166232L871469M384679L927059M976723N180499
$$ plain form
4227 103201030 108776192 114584493 120787550 127959195 135830593 144631404 154654677 165660996
4219 165660996 177898565 191519798 206523145 222898877 239943540 256784972 271824693
4212 271824693 283538209 290463116 291390867 286868164 277729852 265528953 250910870 234505765
4204 234505765 217880150 201676214 186494152 172704028 160260572 148822628 138499521
4197 138499521 129360861 121209202 114064553 107321057 101786697 96508015 91642052 87209418
4189 87209418 83303039 79382246 75751242 72938650 70013409 67390512 65014102 62954135
4181 62954135 60778294 59308953 57631863 55581511 53780195 51988895 50505712 49134592
4173 49134592 48269370 47021736 45533754 44593952 43420528 42330745 41443875 40253414 39336809
$$ packed form
4227A03201030N575162N808301O203057P171645P871398Q800811J0023273J1006319
4219A65660996J2237569J3621233J5003347J6375732J7044663J6841432J5039721
4212B71824693J1713516O924907R27751m522703r138312j2200899j4618083j6405105
4204B34505765j6625615j6203936j5182062j3790124j2443456j1437944j0323107
4197A38499521r138660q151659p144649o743496n534360n278682m865963m432634
4189H7209418l906379l920793l631004k812592k925241k622897k376410k059967
4181F2954135k175841j469341j677090k050352j801316j791300j483183j371120
4173D9134592q65222j247634j487982r39802j173424j089783q86870j190461r16605
$$ plain form
4164 39336809 38596374 38026459 37247963 36261681 35707581 35350424 34767151 33879491 33203665
4155 33203665 32566001 32135656 31322507 31008751 30450041 30018559 29517095 28873181 28219085
4146 28219085 28007486 27669598 27378000 27426364 27316271 27119640 26910806 26456074 26135883 25915052
4136 25915052 25711743 25701198 25478668 25397980 25469892 25374169 24892970 24878948 25168493 25358464
4126 25358464 25206114 25227932 25364691 25513169 25623826 25186925 25379872 25309072 25342996 25758360
4116 25758360 25771430 26051810 25780322 25769458 25796514 26046384 25946048 25981918 26444540 26490482
4106 26490482 26589105 26672238 26717394 26810840 26671925 27068606 27192084 27614828 27595645 27476506
4096 27476506 27857276 27746099 27756895 28009837 28090422 28255661 28321679 28582517 28428091 28663153
$$ packed form
4164C9336809p40435n69915p78496r86282n54100l57157n83273q87660o75826
4155C3203665o37664m30345q13149l13756n58710m31482n01464o43914o54096
4146B8219085k11599l37888k91598M8364j10093j96631k08834m54732l20191k20831
4136B5915052k03309j0545k22530q0688P1912r5723m81199j4022K89545J89971
4126B5358464j52350K1818J36759J48478J10657m36901J92947p0800L3924M15364
4116B5758360J3070K80380k71488j0864K7056K49870j00336L5870M62622M5942
4106B6490482R8623Q3133M5156R3446j38915L96681J23478M22744j9183j19139
4096B7476506L80770j11177J0796K52942Q0585J65239O6018K60838j54426K35062
$$ plain form
4086 28663153 28954347 29011002 29229775 29259833 29791853 29927440 30107730 30137388 29968922 30078696
4076 30078696 30520198 30381097 30810210 30891047 31038138 31233945 31366231 31579308 31811411 31846510
4066 31846510 32152814 32643644 32806728 33029877 32897754 33131005 33103024 33104585 33323641 33473627
4056 33473627 33387167 33975902 34257845 34071396 33831623 34138409 34347206 34608147 34673341 34815172
4046 34815172 35058278 35339487 35663375 35747870 35710793 35644822 35722939 36434476 36710434 36562537
4036 36562537 36517958 36353081 36619040 36298441 36290187 36284197 36527195 36752579 36916712 36547989
4026 36547989 36242736 36152123 35650700 35272558 35177122 34782178 34675153 34242498 33455388 33290396
4016 33290396 33266373 33041404 32457974 31481223 31014840 30721081 30664681 30162000 29481496 29176476
$$ packed form
4086B8663153K91194N6655K18773L0058N32020J35587J80290K9658j68466J09774
4076C0078696M41502j39101M29113Q0837J47091J95807J32286K13077K32103L5099
4066C1846510L06304M90830J63084K23149j32123K33251k7981J561K19056J49986
4056C3473627q6460N88735K81943j86449k39773L06786K08797K60941O5194J41831
4046C4815172K43106K81209L23888Q4495l7077o5971P8117P11537K75958j47897
4036C6562537m4579j64877K65959l20599q254n990K42998K25384J64133l68723
4026C6547989l05253r0613n01423l78142r5436l94944j07025m32655p87110j64992
4016C3290396k4023k24969n83430r76751m66383k93759n6400n02681o80504l05020
$$ plain form
4006 29176476 28493159 28020485 28053729 27385990 26893913 26848199 26248633 25720716 25332278 24942924
3996 24942924 24107745 23697551 23326833 23107077 22622660 22147923 21686525 21253062 21102426
3987 21102426 21053457 20625686 20075017 19563262 19388083 19073188 18854348 18652527 18240508 17992215
3977 17992215 17712746 17254461 17021944 17089963 16746297 16601184 16642314 16451221 16263225 16380219
3967 16380219 15944066 15760283 15486847 15366035 15447940 15686448 15470712 15257372 15156844 15026128
3957 15026128 14757023 14779896 14658562 14547498 14749058 14835001 14872223 14705081 14768899 14559255
3947 14559255 14325651 14242547 14123795 14284105 13974603 13892030 13986259 14215688 14148909 14028996
3937 14028996 13999514 13745812 13728705 13720095 13872253 13702528 13990652 13892317 13863209 13962598 13885434
$$ packed form
4006B9176476o83317m72674L3244o67739m92077m5714n99566n27917l88438l89354
3996B4942924q35179m10194l70718k19756m84417m74737m61398m33463j50636
3987B1102426m8969m27771n50669n11755j75179l14895k18840k01821m12019k48293
3977A7992215k79469m58285k32517O8019l43666j45113M1130j91093j87996J16994
3967A6380219m36153j83783k73436j20812Q1905K38508k15736k13340j00528j30716
3957A5026128k69105K2873j21334j11064K01560Q5943L7222j67142O3818k09644
3947A4559255k33604q3104j18752J60310l09502q2573R4229K29429o6779j19913
3937A4028996k9482k53702j7107q610J52158j69725K88124r8335k9108R9389p7164
$$ plain form
3926 13885434 13870115 13877668 13969817 14160851 14136058 14053732 14244636 14170657 13819728 13729003 13973454
3915 13973454 13698090 13898417 14094338 14171056 14101169 14015269 13794118 13486525 13785333 14005009
3905 14005009 14378297 14296525 14481153 14397515 14735819 14922416 15141243 15254090 15517464 15725148
3895 15725148 15836522 15959620 16037267 16234474 16484678 16609781 16757739 16869287 16768166 17149887
3885 17149887 17242017 17925854 18177213 18328716 18673644 18434255 18849401 19412653 19675951 19829058
3875 19829058 20312700 20468431 20460008 20512617 20994857 21473625 22183967 22342584 22269868 22606642
3865 22606642 22845776 22921318 23013112 23706973 24265194 24122731 24593478 24906289 25286095 25696452
3855 25696452 26039270 26356194 26953899 27504678 27638639 27868758 27955970 28713757 29192167 29846418
$$ packed form
3926A3885434j5319P553R2149J91034k4793q2326J90904p3979l50929r0725K44451
3915A3973454k75364K00327J95921P6718o9887q5900k21151l07593K98808K19676
3905A4005009L73288q1772J84628q3638L38304J86597K18827J12847K63374K07684
3895A5725148J11374J23098P7647J97207K50204J25103J47958J11548j01121L81721
3885A7149887R2130O83837K51359J51503L44928k39389M15146N63252K63298J53107
3875A9829058M83642J55731q423N2609M82240M78768P10342J58617p2716L36774
3865B2606642K39134P5542R1794O93861N58221j42463M70747L12811L79806M10357
3855B5696452L42818L16924N97705N50779J33961K30119Q7212P57787M78410O54251
$$ plain form
3845 29846418 30516185 31257758 31687351 32167063 32867234 33467642 33959992 34414847 34823638
3836 34823638 35940261 37036901 38072495 38923924 39757017 40294847 41013408 41928272 43167201
3827 43167201 44603817 46154223 47148733 48127529 49348308 50847853 52143853 53463314
3819 53463314 55333966 57103028 58804972 60709205 62704355 64661506 66453541 69066614
3811 69066614 71407026 73974727 76951924 79750098 82623335 85252400 88376356 91937157
3803 91937157 95351123 98653779 101940746 105334655 109075110 112884892 116704949 120066031
3795 120066031 123241723 125896867 128370146 130817329 133167776 134982593 136412711 137244393
3787 137244393 137646297 137559619 136878832 135736581 134468874 133005580 130876925 128475246 125946319
$$ packed form
3845B9846418O69767P41573M29593M79712P00171O00408M92350M54855M08791
3836C4823638J116623J096640J035594Q51429Q33093N37830P18561R14864J238929
3827D3167201J436616J550406R94510R78796J220779J499545J296000J319461
3819E3463314J870652J769062J701944J904233J995150J957151J792035K613073
3811F9066614K340412K567701K977197K798174K873237K629065L123956L560801
3803I1937157L413966L302656L286967L393909L740455L809782L820057L361082
3795A20066031L175692K655144K473279K447183K350447J814817J430118Q31682
3787A37244393M01904q6678o80787j142251j267707j463294k128655k401679k528927
$$ plain form
3778 125946319 122940805 120141730 117016215 113742818 110071715 106750561 103628304 100437701
3770 100437701 97443058 94624715 91541219 88964721 86547890 84094435 81569298 79336947
3762 79336947 77497792 75327849 73248272 71541642 69487143 67955969 66383006 64944819
3754 64944819 63756426 62054163 60757312 59518674 58520759 57530387 56698082 55575463 54401611
3745 54401611 53428334 52255656 51367905 50823029 50066642 49377592 48621636 47814823 47122181
3736 47122181 46681626 45869370 45131029 44237773 43713930 43009144 42302296 41921636 41687027
3727 41687027 41179777 40584360 39730152 38999261 38631126 38199091 37737281 37491370 36926769
3718 36926769 36649081 36021355 35476429 35352162 34834630 34590794 34103201 33784846 33260053
$$ packed form
3778A25946319l005514k799075l125515l273397l671103l321154l122257l190603
3770A00437701k994643k818343l083496k576498k416831k453455k525137k232351
3762G9336947j839155k169943k079577j706630k054499j531174j572963j438187
3754F4944819j188393j702263j296851j238638r97915r90372q32305j122619j173852
3745E4401611r73277j172678q87751n44876p56387o89050p55956q06813o92642
3736D7122181m40555q12256p38341q93256n23843p04786p06848l80660k34609
3727D1687027n07250n95417q54208p30891l68135m32035m61810k45911n64601
3718C6926769k77688o27726n44926j24267n17532k43836m87593l18355n24793
$$ plain form
3709 33260053 32883226 32578096 31861879 31639970 31129342 30857574 30659560 29927454 29399688
3700 29399688 29093224 29154792 28581759 28259402 27817103 27816155 27510369 26959913 26818508 26378950
3690 26378950 26203453 25677494 25125885 24772029 24348332 23938471 23508576 23326540 22802105
3681 22802105 22441289 22329339 22058605 21615142 21342707 21280317 20918931 20620590 20811095 20225812
3671 20225812 19441693 19170694 18937897 18668530 18688662 18844385 18285360 17703965 17493447 17033391
3661 17033391 16550415 16645027 16579550 16339199 16215203 15661768 15207188 14991935 14803466 14649154
3651 14649154 14724396 14651118 14265611 13984980 13745714 13611981 13287132 13047202 12832366 12611616
3641 12611616 12611225 12562126 12513251 12803872 12501307 11923957 11234519 11153111 11309034 11242185 11116506
$$ packed form
3709C3260053l76827l05130p16217k21909n10628k71768j98014p32106n27766
3700B9399688l06464O1568n73033l22357m42299r48l05786n50456j41405m39558
3690B6378950j75497n25959n51609l53856m23697m09861m29895j82036n24435
3681B2802105l60816j11950k70734m43463k72435o2390l61386k98341J90505n85283
3671B0225812p84119k70999k32797k69367K0132J55723n59025n81395k10518m60056
3661A7033391m82976R4612o5477k40351j23996n53435m54580k15253j88469j54312
3651A4649154P5242p3278l85507k80631k39266j33733l24849k39930k14836k20750
3641A2611616l91m9099m8875K90621l02565n77350o89438q1408J55923o6849j25679
$$ plain form
3630 11116506 10694567 10064411 10188812 10293798 10085248 10254645 10352852 10027442 9859261 9756484
3620 9756484 9520775 9666096 9424134 9381106 9559756 9388749 8957878 9054972 8697746 8512978
3610 8512978 8422671 8536583 8560802 8649106 8500219 8241226 8202587 8168210 7864613 7878561 8059788
3599 8059788 7773421 7837007 7917344 7735824 7632441 7701336 7516653 7375260 7474650 7712643
3589 7712643 7585877 7324765 7215085 7348785 7604161 7625834 7280036 7015913 6952324 6859923
3579 6859923 6873981 6739564 6749695 6806234 6789208 6697072 6416690 6452943 6299531 6214439 6043010
3568 6043010 6314395 6501999 6268164 6049213 6133562 6345445 5953806 5773543 5693891 5829725
3558 5829725 5653467 5694307 5899741 5825634 5452392 5282999 5530090 5333546 5334051 5372996 5405154
$$ packed form
3630A1116506m21939o30156J24401J04986k08550J69397R8207l25410j68181j02777
3620I756484k35709J45321k41962m3028J78650j71007m30871R7094l57226j84768
3610H512978r0307J13912K4219Q8304j48887k58993l8639l4377l03597J3948J81227
3599H059788k86367O3586Q0337j81520j03383O8895j84683j41393R9390K37993
3589G712643j26766k61112j09680J33700K55376K1673l45798k64123o3589r2401
3579F859923J4058j34417J0131N6539j7026r2136k80382L6253j53412q5092j71429
3568F043010K71385J87604k33835k18951Q4349K11883l91639j80263p9652J35834
3558E829725j76258M0840K05434p4107l73242j69393K47091j96544N05L8945L2158
$$ plain form
3547 5405154 5553593 5630793 5424767 5344300 5462555 5458512 5227520 5077487 4782063 4921021
3537 4921021 5108878 5615188 5702409 5430363 5296294 5227511 5015237 4836568 4664890 4802786
3527 4802786 4867216 4933675 4875673 4792510 4774165 4893957 5069714 5156420 5072862 5192653 5268052
3516 5268052 5014903 4740803 4790196 4687287 4517293 4878491 5136788 5261385 5303546 5070950
3506 5070950 4898731 5058010 5076983 5093768 5112790 5271701 5244081 5238108 5244617 5168084 4894487
3495 4894487 5119489 5193805 5327563 5870519 5860315 5393774 5527500 5590702 5838253 6154846
3485 6154846 6244519 6151594 6202380 5943643 6228607 6404147 6478044 6139469 5929822 6031987
3475 6031987 6387273 6707106 6708508 7040803 7237925 7628739 7152459 7341003 7843496 7849966
$$ packed form
3547E405154J48439P7200k06026q0467J18255m043k30992j50033k95424J38958
3537D921021J87857N06310Q7221k72046j34069o8783k12274j78669j71678J37896
3527D802786O4430O6459n8002q3163j8345J19792J75757Q6706q3558J19791P5399
3516E268052k53149k74100M9393j02909j69994L61198K58297J24597M2161k32596
3506E070950j72219J59279J8973J6785J9022J58911k7620n973O509p6533k73597
3495D894487K25002P4316J33758N42956j0204m66541J33726O3202K47551L16593
3485F154846Q9673r2925N0786k58737K84964J75540P3897l38575k09647J02165
3475F031987L55286L19833J402L32295J97122L90814m76280J88544N02493O470
$$ plain form
3465 7849966 7857061 8217031 8453376 8605263 8530900 8495401 8504028 8950494 8968265 9432514 9646900
3454 9646900 9581229 9937480 9796732 9886533 9807384 10524790 10892289 11130897 11298529 11631683
3444 11631683 11524244 11651416 12062237 12064202 12264179 12565174 12828543 12993847 13174139 13302254
3434 13302254 13462867 13855765 14060573 14085176 13825454 14299721 14314865 14785663 15285329 15404933
3424 15404933 15429696 15441722 15777459 15582397 15897356 16277722 16591513 17322253 17842577 17830303
3414 17830303 18081058 18418929 18562210 18967699 19831417 20326623 20949155 21414391 21910728
3405 21910728 22736856 23548131 24141004 25156050 26233247 26907730 27936408 29470381 30742525
3396 30742525 32062457 33388113 35020514 36974465 38804582 41031577 43496249 46068658
$$ packed form
3465G849966P095L59970K36345J51887p4363l5499Q627M46466J7771M64249K14386
3454I646900o5671L56251j40748Q9801p9149P17406L67499K38608J67632L33154
3444A1631683j07439J27172M10821J965J99977L00995K63369J65304J80292J28115
3434A3302254J60613L92898K04808K4603k59722M74267J5144M70798M99666J19604
3424A5404933K4763J2026L35737j95062L14959L80366L13791P30740N20324j2274
3414A7830303K50755L37871J43281M05489Q63718M95206O22532M65236M96337
3405B1910728Q26128Q11275N92873J015046J077197O74483J028678J533973J272144
3396C0742525J319932J325656J632401J953951J830117K226995K464672K572409
$$ plain form
3388 46068658 48873910 51994274 55265702 58868230 62664589 66682729 70781453 74850993
3380 74850993 78994729 83065923 86871772 90903351 95343108 99905588 104133827 108124483
3372 108124483 111742052 114723991 117515950 120395514 123115296 125154659 127363475 129471524
3364 129471524 130524681 130743994 130344530 129059642 127406385 125361451 123081116 120533812
3356 120533812 117998213 115107399 112034894 108321289 104349823 100240591 95945445 91483545
3348 91483545 87363652 83056533 78840888 74999946 71104906 67099151 62817087 59062831
3340 59062831 55612133 52175085 49197483 46283031 43656871 41447100 39188508 37160807
3332 37160807 35333427 33871021 32445314 30860971 29892397 28710546 27708332 26567192
$$ packed form
3388D6068658K805252L120364L271428L602528L796359M018140M098724M069540
3380G4850993M143736M071194L805849M031579M439757M562480M228239L990656
3372A08124483L617569K981939K791959K879564K719782K039363K208816K108049
3364A29471524J053157K19313l99464j284888j653257k044934k280335k547304
3356A20533812k535599k890814l072505l713605l971466m109232m295146m461900
3348I1483545m119893m307119m215645l840942l895040m005755m282064l754256
3340E9062831l450698l437048k977602k914452k626160k209771k258592k027701
3332C7160807j827380j462406j425707j584343r68574j181851j002214j141140
$$ plain form
3324 26567192 25332553 24505240 23666959 22790441 22066538 21301721 20638686 20364261 19395429
3315 19395429 18815367 18569137 17712317 17180839 16935436 16560139 16113836 15727975 15483624
3306 15483624 14841828 14527908 14426596 13961271 13507391 13560211 13213355 12890818 12762216 12497057
3296 12497057 11857887 11612013 11509137 11130841 11315639 11151737 10696185 10095221 9978048
3287 9978048 9760162 9674992 9383426 9453704 9365938 9118211 9389417 9356926 8912588 8537485
3277 8537485 8312602 8036064 8150579 7966655 7947502 8017746 7980178 7687481 7933992 7703724
3267 7703724 7387864 7321670 7621990 7774133 7781843 7332167 7245038 6951763 6714576 6516556
3257 6516556 6662669 6463118 6483441 6745765 6726060 6320142 6138496 6252179 6061737 5971592
$$ packed form
3324B6567192j234639q27313q38281q76518p23903p64817o63035k74425r68832
3315A9395429n80062k46230q56820n31478k45403l75297m46303l85861k44351
3306A5483624o41796l13920j01312m65325m53880N2820l46856l22537j28602k65159
3296A2497057o39170k45874j02876l78296J84798j63902m55552o00964j17173
3287I978048k17886q5170k91566P0278q7766k47727K71206l2491m44338l75103
3277H537485k24883k76538J14515j83924j9153P0244l7568k92697K46511k30268
3267G703724l15860o6194L00320J52143P710m49676q7129k93275k37187j98020
3257F516556J46113j99551K0323K62324j9705m05918j81646J13683j90442r0145
$$ plain form
3247 5971592 6227955 6173522 5547337 6024338 5857295 5542892 5487937 5652332 5485539 5407599
3237 5407599 5206037 4889609 5070874 5087181 4736691 4775815 4968211 4882836 5133513 4827004
3227 4827004 4781450 4922748 4980489 4632610 4518075 4750338 4665557 4722692 4989748 4892834
3217 4892834 4782662 4336433 4271817 4726821 4539436 4638126 4798070 4884248 4941414 4893626
3207 4893626 4607827 4373349 4534648 4811246 4885132 5039618 4945871 4585074 4710690 4708710
3197 4708710 4380683 4775483 4926174 4911526 5036106 5308683 5279635 4746418 4574534 4615875
3187 4615875 4556774 4782772 4833791 5068595 4697068 4675379 4725071 4825172 4943326 4598991
3177 4598991 4356235 4793386 5284780 4983306 4784814 4781428 4877614 4758421 4290381 4613403
$$ packed form
3247E971592K56363n4433o26185M77001j67043l14403n4955J64395j66793p7940
3237E407599k01562l16428J81265J6307l50490L9124J92396q5375K50677l06509
3227D827004m5554J41298N7741l47879j14535K32263q4781N7135K67056r6914
3217D892834j10172m46229o4616M55004j87385R8690J59944Q6178N7166m7788
3207D893626k85799k34478J61299K76598P3886J54486r3747l60797J25616j980
3197D708710l28027L94800J50691j4648J24580K72577k9048n33217j71884M1341
3187D615875n9101K25998N1019K34804l71527k1689M9692J00101J18154l44335
3177D598991k42756M37151M91394l01474j98492l386R6186j19193m68040L23022
$$ plain form
3167 4613403 5019286 5397654 5234476 4932325 4739019 4852121 5364157 5193397 4714697 4995384
3157 4995384 5182668 5072345 5105612 4998830 5391217 5479820 5629275 5780569 5866419 5713935
3147 5713935 5733878 5630363 5472115 5464791 5791055 6231295 6195833 6347532 6592934 6484960
3137 6484960 6062485 6246716 6626255 6565215 6818858 7008042 6801546 6978899 7005083 7050201
3127 7050201 7577584 7833811 7497483 7611399 7965551 8009811 8036423 7830549 8123992 8694292
3117 8694292 8578821 8423241 8588934 8964761 9010420 9150351 9305535 9649737 9584818 9630880
3107 9630880 10029832 10486347 10885688 10612899 10527291 10526767 10802650 10880274 11023734 11495100
3097 11495100 11741805 11782089 11954917 12405824 12507267 12148996 12228390 12782017 13384392 13835070
$$ packed form
3167D613403M05883L78368j63178l02151j93306J13102N12036j70760m78700K80687
3157D995384J87284j10323L3267j06782L92387Q8603J49455J51294Q5850j52484
3147E713935J9943j03515j58248p324L26264M40240l5462J51699K45402j07974
3137F484960m22475J84231L79539o1040K53643J89184k06496J77353K6184M5118
3127G050201N27383K56227l36328J13916L54152M4260K6612k05874K93443N70300
3117H694292j15471j55580J65693L75827M5659J39931J55184L44202o4919M6062
3107I630880L98952M56515L99341k72789q5608n24K75883P7624J43460M71366
3097A1495100K46705M0284J72828M50907J01443l58271P9394N53627O02375M50678
$$ plain form
3087 13835070 14308825 14214543 14912087 15158697 15216425 15587210 15985754 16644431 17092096 17237278
3077 17237278 17583560 18011969 18805436 19130933 19463200 20164324 20778382 21518600 22327583
3068 22327583 23115672 23795334 24364513 25089484 25839564 26685203 27710572 28132768 28929943
3059 28929943 29738743 30364688 31148015 32487351 33247151 34122827 35306394 35954786 37073565
3050 37073565 38149859 38974635 40062304 40964137 41573998 42524739 43477611 44687829 46019617
3041 46019617 46858277 47233164 48049050 48903822 49681225 50563772 51175267 51807587 52527163
3032 52527163 53197847 53578538 53666791 53747721 54311002 54886738 55435285 55825304 56094803 56489733
3022 56489733 56648568 56764465 56775847 57033593 57431472 57868747 57934764 57923018 57971792 58059211
$$ packed form
3087A3835070M73755r4282O97544K46610N7728L70785L98544O58677M47665J45182
3077A7237278L46282M28409P93467L25497L32267P01124O14058P40218Q08983
3068B2327583P88089O79662N69179P24971P50080Q45639J025369M22196P97175
3059B8929943Q08800O25945P83327J339336P59800Q75676J183567O48392J118779
3050C7073565J076294Q24776J087669R01833O09861R50741R52872J210218J331788
3041D6019617Q38660L74887Q15886Q54772P77403Q82547O11495O32320P19576
3032E2527163O70684L80691Q8253Q0930N63281N75736N48547L90019K69499L94930
3022E6489733J58835J15897J1382K57746L97879M37275O6017j1746M8774Q7419
$$ plain form
3012 58059211 57778977 57831732 57784495 57832405 58180678 58231155 58075687 57742154 57419823 57067047
3002 57067047 57157162 56841498 56582610 56659818 56790819 56381460 55906134 55669782 55878796 56023006
2992 56023006 56157259 56239078 56463356 56742425 57400206 57671320 57988265 58528704 59196614 59955030
2982 59955030 61137834 62008252 63002860 64113326 65533976 66757840 67916011 69413811
2974 69413811 71425525 73792074 76075883 78207752 80331665 83431193 86492826 90800081
2966 90800081 95938193 101939872 108991522 116455447 122695632 127768041 130843527 129446267
2958 129446267 125310655 120216554 114751309 108765663 101322352 93931501 87792546 82110387
2950 82110387 77137536 73291865 70057792 66996408 64260340 61932530 59626328 57716410
$$ packed form
3012E8059211k80234N2755m7237M7910L48273N0477j55468l33533l22331l52776
3002E7067047R0115l15664k58888P7208J31001m09359m75326k36352K09014J44210
2992E6023006J34253Q1819K24278K79069O57781K71114L16945N40439O67910P58416
2982E9955030J182804Q70418R94608J110466J420650J223864J158171J497800
2974F9413811K011714K366549K283809K131869K123913L099528L061633M307255
2966I0800081N138112O001679P051650P463925O240185N072409L075486j397260
2958A29446267m135612n094101n465245n985646p443311p390851o138955n682159
2950H2110387m972851l845671l234073l061384k736068k327810k306202j909918
$$ plain form
2942 57716410 55657018 54189291 52783788 51327407 50071039 49218355 47990361 46692313
2934 46692313 45725486 44309343 43562093 42605870 41505398 40294610 39169992 38309264 37650089
2925 37650089 36293237 35387443 34645175 33942895 33272034 32408024 31770580 31008756 30240674
2916 30240674 29569439 28728465 27818006 27078111 26545337 26334197 26145498 25198228 24287375
2907 24287375 23823888 23528293 23386377 22784107 22136500 21643869 21312433 20934580 20214044
2898 20214044 19834693 19655543 19149055 18711391 18485978 18530838 17903245 17422157 17086272 16794294
2888 16794294 16490553 15931056 15505976 15339727 15254566 14857420 14040746 13761325 13487520 13272714
2878 13272714 12998981 13012393 12551508 12229704 12369649 12034125 11747652 11477813 10967562 10707884
$$ packed form
2942E7716410k059392j467727j405503j456381j256368q52684j227994j298048
2934D6692313r66827j416143p47250r56223j100472j210788j124618q60728o59175
2925C7650089j356852r05794p42268p02280o70861q64010o37444p61824p68082
2916C0240674o71235q40974r10459p39895n32774k11140j88699r47270r10853
2907B4287375m63487k95595j41916o02270o47607m92631l31436l77853p20536
2898B0214044l79351j79150n06488m37664k25413M4860o27593m81088l35885k91978
2888A6794294l03741n59497m25080j66249q5161l97146q16674k79421k73805k14806
2878A3272714k73733J3412m60885l21804J39945l35524k86473k69839n10251k59678
$$ plain form
2868 10707884 10917729 10986766 10864377 10495015 10156156 9925665 9698955 9453592 9265434 9300734
2858 9300734 9213791 9207723 9137891 8783488 8590008 8629333 8645193 8283601 7992074 8104959 8107198
2847 8107198 8107113 7603667 7518115 7570701 7294912 7051420 7700726 7773372 7398001 7550417 7297904
2836 7297904 7595388 7360454 7062625 6672160 6731626 6963315 6837922 6835559 6769341 6314089
2826 6314089 6272145 6361741 6380768 6252641 6203382 6337081 5895243 5794838 5887630 5858422 5597422
2815 5597422 5640605 6035624 6021941 5977244 5771976 6067049 6031552 6007882 5958459 5654161 5691464
2804 5691464 5825543 6014073 5910821 5619292 5551873 5277621 5226127 5473456 5437996 5830537
2794 5830537 6036287 5989783 5421651 5154413 5309790 5425009 5475470 5439490 5497985 5452022
$$ packed form
2868A0707884K09845O9037j22389l69362l38859k30491k26710k45363j88158L5300
2858I300734q6943o068o9832l54403j93480L9325J5860l61592k91527J12885K239
2847H107198q5n03446q5552N2586k75789k43492O49306P2646l75371J52416k52513
2836G297904K97484k34934k97829l90465N9466K31689j25393k363o6218m55252
2826F314089m1944Q9596J9027j28127m9259J33699m41838j00405R2792k9208k61000
2815E597422M3183L95019j3683m4697k05268K95073l5497k3670m9423l04298L7303
2804E691464J34079J88530j03252k91529o7419k74252n1494K47329l5460L92541
2794E830537K05750m6504n68132k67238J55377J15219N0461l5980N8495m5963
$$ plain form
2784 5452022 5671040 5562009 5541971 5476893 5115541 5584289 5864017 5788174 6006075 5886956
2774 5886956 5647114 5743800 5650642 5758916 6159298 5853594 5805657 5894679 6218448 6093399
2764 6093399 5969411 5906631 6135681 6318901 6667192 6834679 6779133 6435418 6078390 6320909
2754 6320909 6342929 6078541 6224267 6390989 6733513 6711342 6684091 6990187 6978926 7125042
2744 7125042 7291785 7221737 7169387 7326562 7180871 6986641 6561395 6925128 6944053 7122990
2734 7122990 7061528 7319904 7541360 7299022 7108018 7179321 7190587 7534279 7690846 7590229
2724 7590229 7822002 8074239 8200227 8282314 8348169 8207248 8451921 8619751 8572684 9001379
2714 9001379 9119737 9106170 9068975 8894913 9400174 9627449 9593660 9627761 10068581 10400010
$$ packed form
2784E452022K19018j09031k0038o5078l61352M68748K79728p5843K17901j19119
2774E886956k39842R6686r3158J08274M00382l05704m7937Q9022L23769j25049
2764F093399j23988o2780K29050J83220L48291J67487n5546l43715l57028K42519
2754F320909K2020k64388J45726J66722L42524k2171k7251L06096j1261J46116
2744G125042J66743p0048n2350J57175j45691j94230m25246L63733J8925J78937
2734G122990o1462K58376K21456k42338j91004P1303J1266L43692J56567j00617
2724G590229K31773K52237J25988Q2087O5855j40921K44673J67830m7067M28695
2714I001379J18358j3567l7195j74062N05261K27275l3789L4101M40820L31429
$$ plain form
2704 10400010 10320417 10532153 10532534 10458787 10956206 11320101 11150598 11405706 11756249 12010052
2694 12010052 12152519 12465301 12715931 12695572 12560935 12937317 13134547 13083383 13464978 13835618
2684 13835618 14038651 14311726 14674310 14772761 14997943 15347366 15472007 15910784 16193025 16525120
2674 16525120 16912872 17030762 17531420 17720969 18339251 19008837 19163815 19239530 19594987 20087967
2664 20087967 20876855 21311975 22081100 22619316 23305688 24075359 24663720 25426468 26165622
2655 26165622 26873966 27810216 28751243 29976182 30913869 31511405 32710543 33990037 34984507
2646 34984507 36072459 37549350 38877162 40097877 41961356 43488950 44988998 46737247
2638 46737247 48380190 50183474 51972832 53846487 55654465 57139739 58583074 60130766
$$ packed form
2704A0400010p9593K11736L81p3747M97419L63895j69503K55108L50543K53803
2694A2010052J42467L12782K50630k0359j34637L76382J97230n1164L81595L70640
2684A3835618K03033K73075L62584R8451K25182L49423J24641M38777K82241L32095
2674A6525120L87752J17890N00658J89549O18282O69586J54978P5715L55457M92980
2664B0087967P88888M35120P69125N38216O86372P69671N88361P62748P39154
2655B6165622P08344R36250R41027J224939R37687N97536J199138J279494R94470
2646C4984507J087952J476891J327812J220715J863479J527594J500048J748249
2638D6737247J642943J803284J789358J873655J807978J485274J443335J547692
$$ plain form
2630 60130766 61712919 63372750 65025645 66189426 66841935 67512121 68275085 68832798 68934575
2621 68934575 69045686 69148869 69291873 69064106 68809498 68476348 67855338 66937225 66027132
2612 66027132 65359905 64499081 63192928 61932892 60342588 58766954 57302707 55629367
2604 55629367 53672505 51887902 50564601 49042067 47381161 45734364 44234595 42559007
2596 42559007 40962893 39847150 38791165 37809511 36545522 35312564 33883922 32994354
2588 32994354 32061858 31186847 30407030 29833615 29361002 28592059 27991396 27202932 26433355
2579 26433355 26019479 25443883 24909327 24295629 24253042 24117172 23816778 23598596 23191659 22552457
2569 22552457 22339969 22211203 21894717 22041314 21684834 21198604 20831515 20874715 21045861 20601462
$$ packed form
2630F0130766J582153J659831J652895J163781O52509O70186P62964N57713J01777
2621F8934575J11111J03183J43004k27767k54608l33150o21010r18113r10093
2612F6027132o67227q60824j306153j260036j590304j575634j464247j673340
2604E5629367j956862j784603j323301j522534j660906j646797j499769j675588
2596D2559007j596114j115743j055985r81654j263989j232958j428642q89568
2588C2994354r32496q75011p79817n73415m72613p68943o00663p88464p69577
2579B6433355m13876n75596n34556o13698m2587j35870l00394k18182m06937o39202
2569B2552457k12488j28766l16486J46597l56480m86230l67089M3200J71146m44399
$$ plain form
2559 20601462 20466130 20762755 20633072 20652191 20337617 20385269 20307833 20012460 20207027 20493855
2549 20493855 20456092 20469901 20204657 20153052 20296514 20363217 20433065 20828389 21136205 21180703
2539 21180703 21296897 21302710 21224846 21346468 21488328 21740518 22016262 22306841 22575039 22806256
2529 22806256 23166467 23891215 23977377 24160778 24634625 25178731 25839221 25991685 26483757 26831042
2519 26831042 26862045 27337962 28272249 28922644 29047423 29587485 30043194 30206266 30669024 30908066
2509 30908066 31354548 31789196 32533729 33005452 33214445 33463888 33932879 34594456 34602019 34633866
2499 34633866 34804568 35070167 35689313 36123195 36998320 37046495 37354135 37946351 38460054 39440866
2489 39440866 40016159 40797107 41424654 42500794 43335434 43915001 45029636 46073646 47251603
$$ packed form
2559B0601462j35332K96625j29683J9119l14574M7652p7436k95373J94567K86828
2549B0493855l7763J3809k65244n1605J43462O6703O9848L95324L07816M4498
2539B1180703J16194N813p7864J21622J41860K52190K75744K90579K68198K31217
2529B2806256L60211P24748Q6162J83401M73847N44106O60490J52464M92072L47285
2519B6831042L1003M75917R34287O50395J24779N40062M55709J63072M62758K39042
2509C0908066M46482M34648P44533M71723K08993K49443M68991O61577P563L1847
2499C4633866J70702K65599O19146M33882Q75125M8175L07640N92216N13703R80812
2489C9440866N75293P80948O27547J076140Q34640N79567J114635J044010J177957
$$ plain form
2480 47251603 48340345 49604533 51282546 52537719 54156469 55864191 57415701 59234531
2472 59234531 61003557 63097962 65025601 66857882 69394596 71608694 74270510 76553584
2464 76553584 79055607 81953280 84683176 87508364 90315633 93242906 95889595 98705922
2456 98705922 100907179 103595038 106079807 108329937 110154070 112043017 113906920 115011315
2448 115011315 115965208 116686055 117755857 118218786 118115265 117731111 117567463 116717515 115776698
2439 115776698 114773243 113708192 112301178 110651722 109211208 107282065 105357189 102762240
2431 102762240 100242500 97855354 95298149 92892186 90368054 87661519 85027496 82246298
2423 82246298 79812916 77046906 74248976 71812069 69675862 67608522 65605432 63421069
$$ packed form
2480D7251603J088742J264188J678013J255173J618750J707722J551510J818830
2472E9234531J769026K094405J927639J832281K536714K214098K661816K283074
2464G6553584K502023K897673K729896K825188K807269K927273K646689K816327
2456I8705922K201257K687859K484769K250130J824133J888947J863903J104395
2448A15011315R53893P20847J069802M62929j03521l84154j63648q49948r40817
2439A15776698j003455j065051j407014j649456j440514j929143j924876k594949
2431A02762240k519740k387146k557205k405963k524132k706535k634023k781198
2423H2246298k433382k766010k797930k436907k136207k067340k003090k184363
$$ plain form
2415 63421069 61594993 59392381 57093853 55484105 53562010 51808511 50486723 49210133
2407 49210133 47940275 46656428 45287214 43793785 42818621 41798406 41153471 40437632 39236375
2398 39236375 38220164 37476101 36894079 35895526 34919447 34296259 33948024 33819368 33588937
2389 33588937 33100399 32781255 32595177 32397711 31677191 31041615 30846285 30715819 30474319
2380 30474319 30234105 29763056 29390226 28953671 28649969 28276280 28112344 27757285 27259483
2371 27259483 26707613 26383548 26290649 25668723 24880594 24324180 24111685 24106399 23424753 22981572
2361 22981572 22346089 21912952 21764967 21533901 21319747 20872736 20560887 20294977 19990710
2352 19990710 19676267 19507087 19247802 19159934 18939214 18429717 18067009 17862736 17942960 17951947
$$ packed form
2415F3421069j826076k202612k298528j609748j922095j753499j321788j276590
2407D9210133j269858j283847j369214j493429r75164j020215o44935p15839j201257
2398C9236375j016211p44063n82022r98553r76079o23188l48235j28656k30431
2389C3588937m88538l19144j86078j97466p20520o35576j95330j30466k41500
2380C0474319k40214m71049l72830m36555l03702l73689j63936l55059m97802
2371B7259483n51870l24065r2899o21926p88129n56414k12495n286o81646m43181
2361B2981572o35483m33137j47985k31066k14154m47011l11849k65910l04267
2352A9990710l14443j69180k59285q7868k20720n09497l62708k04273Q0224Q987
$$ plain form
2342 17951947 17361375 16926922 16760271 16666414 16639312 16472218 16138788 16087022 15923314 15869263
2332 15869263 15444828 15626818 15522015 15368103 15338201 15236100 14985658 14800678 14748854 14942701
2322 14942701 15168941 14729399 14725918 14693824 14685083 14749367 14645221 14406463 14175217 14364708
2312 14364708 14353171 14310614 14447457 14414382 14329417 14421641 14556379 14770035 14816391 14905076 15033653
2301 15033653 15329615 15521106 15211066 15286307 15078285 15415090 15588999 15673112 15806766 15911426
2291 15911426 15805248 15792331 16188208 16516076 16920147 17420585 17679496 17954530 17856244 17727464
2281 17727464 18052418 18429845 18729690 19052583 19462011 19717502 20303889 21074427 21062151 20998945
2271 20998945 21561622 21906504 22388887 22519152 22793761 23442021 23359152 23809977 24305758 24491956
$$ packed form
2342A7951947n90572m34453j66651r3857k7102j67094l33430n1766j63708n4051
2332A5869263m24435J81990j04803j53912k9902j02101k50442j84980n1824J93847
2322A4942701K26240m39542l481l2094q741O4284j04146k38758k31246J89491
2312A4364708j1537m2557J36843l3075q4965R2224J34738K13656M6356Q8685J28577
2301A5033653K95962J91491l10040P5241k08022L36805J73909Q4113J33654J04660
2291A5911426j06178j2917L95877L27868M04071N00438K58911K75034r8286j28780
2281A7727464L24954L77427K99845L22893M09428K55491N86387P70538j2276o3206
2271B0998945N62677L44882M82383J30265K74609O48260q2869M50825M95781J86198
$$ plain form
2261 24491956 25037745 25600148 26065498 26197603 26644511 27354401 27964378 28118915 28508261
2252 28508261 28787354 29142119 29982331 30746349 31486929 32005956 32490409 32919045 33454454
2243 33454454 34367641 35293847 35980114 36919275 38019614 38632558 39452568 40870988 41894306
2234 41894306 43296019 44673210 46050768 47713411 49112494 50706712 52609500 54054228
2226 54054228 56331229 58813603 60757652 62927371 65094236 68238203 70791741 73255808
2218 73255808 76158447 79197220 82601216 86256513 89779497 93026838 96647933 100112400
2210 100112400 103579147 107334408 110709552 113642151 116565599 119359873 122088698 124559600
2202 124559600 126744416 128464503 129605991 131160757 132200873 132627364 132962456 132812166
$$ packed form
2261B4491956N45789N62403M65350J32105M46908P09890O09977J54537L89346
2252B8508261K79093L54765Q40212P64018P40580N19027M84453M28636N35409
2243C3454454R13187R26206O86267R39161J100339O12944Q20010J418420J023318
2234D1894306J401713J377191J377558J662643J399083J594218J902788J444728
2226E4054228K277001K482374J944049K169719K166865L143967K553538K464067
2218G3255808K902639L038773L403996L655297L522984L247341L621095L464467
2210A00112400L466747L755261L375144K932599K923448K794274K728825K470902
2202A24559600K184816J720087J141488J554766J040116M26491L35092j50290
$$ plain form
2194 132812166 132645555 132351530 131603176 130842887 129101028 127283347 125784340 123451651 120910703
2185 120910703 118605379 115843028 112870109 109347382 106063817 103301885 99702638 96642294
2177 96642294 93812460 90316851 86842782 83724423 80432068 77568405 74706837 72122437
2169 72122437 69262035 67024729 64895098 62610932 60907065 58904579 56874155 54844741
2161 54844741 53156240 51351806 50087357 48978509 47717849 46585745 45189305 43937131
2153 43937131 43048607 42346758 41284424 40149098 39345910 38574791 38009836 37643851 36994588
2144 36994588 36545267 36377565 35617975 35284628 34537854 33775847 33198028 32597533 32261149
2135 32261149 31893079 31286332 31247223 30975589 30630397 30226946 29836906 29295487 28753925 28546430
$$ packed form
2194A32812166j66611k94025p48354p60289j741859j817681j499007k332689k540948
2185A20910703k305324k762351k972919l522727l283565k761932l599247l060344
2177I6642294k829834l495609l474069l118359l292355k863663k861568k584400
2169G2122437k860402k237306k129631k284166j703867k002486k030424k029414
2161E4844741j688501j804434j264449j108848j260660j132104j396440j252174
2153D3937131q88524p01849j062334j135326q03188p71119n64955l65985o49263
2144C6994588m49321j67702p59590l33347p46774p62007n77819o00495l36384
2135C2261149l68070o06747l9109k71634l45192m03451l90040n41419n41562k07495
$$ plain form
2125 28546430 28235778 27834546 27193602 27033348 26892910 26537015 26461315 26195915 25912839 25800393
2115 25800393 25570198 25221549 24913874 24840220 24470530 24330717 24748727 24607073 24492178 24633699
2105 24633699 24709815 24825623 24875268 24966745 24741081 24746357 24380645 23982898 24195804 24513146
2095 24513146 24448772 24512770 24641404 24497502 24332504 24355286 24544541 24730667 24679301 24829642
2085 24829642 24823547 24951933 25300555 25591000 25945928 26162062 26122754 26412349 26485323 27221257
2075 27221257 27941650 28478997 29135741 29552401 30301918 31038918 31402467 31836531 32635473
2066 32635473 33771453 34594409 35516732 36399702 37667367 38670661 39778184 41095782 42373111
2057 42373111 43571581 44905350 46236307 48079581 49972087 51474425 53295649 55151996
$$ packed form
2125B8546430l10652m01232o40944j60254j40438l55895p5700k65400k83076j12446
2115B5800393k30195l48649l07675p3654l69690j39813M18010j41654j14895J41521
2105B4633699P6116J15808M9645R1477k25664N276l65712l97747K12906L17342
2095B4513146o4374O3998J28634j43902j64998K2782J89255J86126n1366J50341
2085B4829642o095J28386L48622K90445L54928K16134l9308K89595P2974P35934
2075B7221257P20393N37347O56744M16660P49517P37000L63549M34064P98942
2066C2635473J135980Q22956R22323Q82970J267665J003294J107523J317598J277329
2057D2373111J198470J333769J330957J843274J892506J502338J821224J856347
$$ plain form
2049 55151996 57090923 59253527 61612446 63408920 65132539 66967096 68778538 70238468
2041 70238468 71828531 73176350 74310864 75351202 76116447 76505589 76832831 76886212 76246249
2032 76246249 75335523 74445220 73297929 71920077 70471386 68843307 66967731 64850312
2024 64850312 62912541 61164574 58642967 56549877 54815728 53031302 51046721 48962483
2016 48962483 46854844 44747389 43108794 41562619 39998731 38777683 37457280 36122320
2008 36122320 34747268 33558108 32750294 31744094 30647910 29756070 29163795 28698023 27601924
1999 27601924 26895946 26322467 25555581 24339943 23725504 23200059 22703351 22459076 22285611
1990 22285611 21746031 21159847 20968226 20490705 20188929 19803141 19456854 19239127 19028632
$$ packed form
2049E5151996J938927K162604K358919J796474J723619J834557J811442J459930
2041G0238468J590063J347819J134514J040338P65245L89142L27242N3381o39963
2032G6246249r10726q90303j147291j377852j448691j628079j875576k117419
2024F4850312j937771j747967k521607k093090j734149j784426j984581k084238
2016D8962483k107639k107455j638595j546175j563888j221048j320403j334960
2008C6122320j375052j189160q07814j006200j096184q91840n92275m65772j096099
1999B7601924p05978n73479p66886j215638o14439n25445m96708k44275j73465
1990B2285611n39580n86184j91621m77521l01776l85788l46287k17727k10495
$$ plain form
1981 19028632 18972056 18679060 18212645 17725714 17547639 17611320 17239028 17132234 17501889 17155775
1971 17155775 16867708 16802709 16578442 16183877 16090532 15836748 15684760 15714440 15508909 15417239
1961 15417239 14996736 14737016 14048772 13871652 13703383 13551545 13233209 12906539 12701099
1952 12701099 12267523 12149244 12350837 12231603 12100486 12080437 11739303 11834908 11645339 11560841
1942 11560841 11130787 11126068 11292087 11167904 11164537 11161697 10938126 10713650 10858152 10697299
1932 10697299 11009355 10958036 10984951 10965187 11127318 10935779 10757689 10735067 10875715 10513538
1922 10513538 10154542 10417089 10425057 10214958 10294237 10097993 10130022 9934584 10194189 10431457
1912 10431457 10393888 10193560 10160169 10562451 10453083 10082258 10263553 10622531 10404428 10589022
$$ packed form
1981A9028632n6576k92996m66415m86931j78075O3681l72292j06794L69655l46114
1971A7155775k88067o4999k24267l94565r3345k53784j51988K9680k05531r1670
1961A5417239m20503k59720o88244j77120j68269j51838l18336l26670k05440
1952A2701099m33576j18279K01593j19234j31117k0049l41134R5605j89569q4498
1942A1560841m30054m719J66019j24183l367k840k23571k24476J44502j60853
1932A0697299L12056n1319K6915j9764J62131j91539j78090k2622J40648l62177
1922A0513538l58996K62547P968k10099P9279j96244L2029j95438K59605K37268
1912A0431457l7569k00328l3391M02282j09368l70825J81295L58978k18103J84594
$$ plain form
1902 10589022 10628805 10437230 10679660 10549659 10431923 10400973 10810775 11042010 11263526 11321166
1892 11321166 11280349 11244599 11085517 11203983 11314940 11605429 11813844 11836063 11741649 11922471
1882 11922471 12037169 12112311 12139903 12522620 12363746 12615317 12764881 12913445 13170659 13349358
1872 13349358 13119271 12931474 12915018 13502833 13550724 13673647 13888276 14197292 14253386 14579709
1862 14579709 15011088 15235158 15817756 16304283 16362074 16587054 16824656 17173884 17484899 17415560
1852 17415560 17640791 17929475 18567861 19160124 19509965 19735664 19977380 20558781 21098718
1843 21098718 21109517 21400431 21897646 22324231 22622404 23113990 23809178 24297087 24561511 25134555
1833 25134555 25619598 26364004 26746872 27247988 27894758 28535936 28990961 29661893 30696862
$$ packed form
1902A0589022L9783j91575K42430j30001j17736l0950M09802K31235K21516N7640
1892A1321166m0817l5750j59082J18466J10957K90489K08415K2219r4414J80822
1882A1922471J14698P5142K7592L82717j58874K51571J49564J48564K57214J78699
1872A3349358k30087j87797j6456N87815M7891J22923K14629L09016N6094L26323
1862A4579709M31379K24070N82598M86527N7791K24980K37602L49228L11015o9339
1852A7415560K25231K88684O38386N92263L49841K25699K41716N81401N39937
1843B1098718J0799K90914M97215M26585K98173M91586O95188M87909K64424N73044
1833B5134555M85043P44406L82868N01116O46770O41178M55025O70932J034969
$$ plain form
1824 30696862 31756282 32663989 33410408 33997156 34693781 35774445 36530267 37377054 38734909
1815 38734909 39888473 40892158 41706097 43001488 44293915 45722419 47193073 49013149
1807 49013149 50542079 52257382 53800852 55451446 57956280 60327385 62778889 65270409
1799 65270409 67970838 70356821 73009847 76123921 79230406 82873757 86829426 90777007
1791 90777007 95083398 99313345 103878682 108868478 114422473 120233997 126211678 132459516
1783 132459516 139368900 146767439 154634588 162792163 171170980 180678052 190615181 200518183
1775 200518183 211464823 222726543 234029038 245470912 256298113 266231428 274809937
1768 274809937 281559629 285503802 286324937 284931159 280639434 274063365 265589493 255172675
$$ packed form
1824C0696862J059420R07707P46419N86748O96625J080664P55822Q46787J357855
1815C8734909J153564J003685Q13939J295391J292427J428504J470654J820076
1807D9013149J528930J715303J543470J650594K504834K371105K451504K491520
1799F5270409K700429K385983K653026L114074L106485L643351L955669L947581
1791I0777007M306391M229947M565337M989796N553995N811524N977681O247838
1783A32459516O909384P398539P867149Q157575Q378817R507072R937129R903002
1775B00518183J0946640J1261720J1302495J1441874J0827201R933315Q578509
1768B74809937O749692L944173Q21135j393778m291725o576069q473872j0416818
$$ plain form
1760 255172675 244050754 232439845 220342386 208378044 197317833 186554971 175970656
1753 175970656 166532695 157557324 148942166 141008409 134125759 127900556 121429473 115461558
1745 115461558 110221480 105070340 100417168 95910287 91834530 87993876 84557723 81369030
1737 81369030 78123537 75246985 72381042 69598693 67284419 65118658 63021199 60961745
1729 60961745 59009189 56958720 55325331 53469215 51912154 50343587 49218533 47735977
1721 47735977 46061154 44568907 42986974 41991703 40680413 39762200 38781947 37586108 36402253
1712 36402253 35787353 34908765 34041787 32990950 32178375 31577691 30770821 30123234 29068473
1703 29068473 28319039 27823056 27159822 26747706 26245656 25725987 24769111 24519565 24071383
$$ packed form
1760B55172675j1121921j1610909j2097459j1964342j1060211j0762862j0584315
1753A75970656r437961q975371q615158p933757o882650o225203o471083n967915
1745A15461558n240078n151140m653172m506881m075757l840654l436153l188693
1737H1369030l245493k876552k865943k782349k314274k165761k097459k059454
1729F0961745j952556k050469j633389j856116j557061j568567j125054j482556
1721D7735977j674823j492247j581933r95271j311290r18213r80253j195839j183855
1712C6402253o14900q78588q66978j050837q12575o00684q06870o47587j054761
1703B9068473p49434m95983o63234m12116n02050n19669r56876k49546m48182
$$ plain form
1694 24071383 23539166 22702026 22109612 21714037 21510215 20998222 20444866 19968628 19437724
1685 19437724 19503402 19173213 18868995 18463304 18046413 18019721 17526537 16947786 16890216 16239159
1675 16239159 16012562 15328412 14962492 15215806 15368995 14994743 14967500 14738447 14223710 13998442
1665 13998442 13655410 13451290 13233070 13356257 12947304 12659378 12327903 11775906 11297452
1656 11297452 11533358 11321228 10924410 10904865 10686684 10529944 10554412 10198334 10015241 9590986
1646 9590986 9317798 9417449 9530833 9344500 9310138 9096848 9015120 8786294 8452699 8346226
1636 8346226 8081794 8239401 8090661 7978475 7789916 7512595 7273296 7586010 7224134 6860029
1626 6860029 7161983 6792363 6298323 6326054 6325053 6404969 6203904 6200959 6106955 6043603 6067008
$$ packed form
1694B4071383n32217q37140n92414l95575k03822n11993n53356m76238n30904
1685A9437724O5678l30189l04218m05691m16891k6692m93184n78751n7570o51057
1675A6239159k26597o84150l65920K53314J53189l74252k7243k29053n14737k25268
1665A3998442l43032k04120k18220J23187m08953k87926l31475n51997m78454
1656A1297452K35906k12130l96818j9545k18181j56740K4468l56078j83093m24255
1646I590986k73188R9651J13384j86333l4362k13290q1728k28826l33595j06473
1636H346226k64432J57607j48740j12186j88559k77321k39299L12714l61876l64105
1626F860029L01954l69620m94040K7731j001P9916k01065k945r4004o3352K3405
$$ plain form
1615 6067008 5882581 5633327 5652625 5381108 5096499 5142869 5217103 5416147 5831734 5649216
1605 5649216 5129753 5122862 5106998 5045995 4900369 4770548 4687662 4657912 4504148 4633864 4863394
1594 4863394 4343953 4095563 4279374 4553605 4677436 4323261 4233758 4268918 4116186 4225746
1584 4225746 3970080 3622588 3871217 3740786 3529385 3527499 3302354 3487737 3406904 3543413
1574 3543413 3556214 3572620 3450061 3343924 3346557 3305954 3019246 3018762 3336354 3246080 3280457
1563 3280457 3249075 3190717 3163551 2872428 2421543 2599994 2984391 3390239 3148800 3115402
1553 3115402 2997130 2917168 2889315 2990866 2697162 2532394 2614413 2919132 2849813 2531890
1543 2531890 2531900 2419096 2310772 2251389 2253929 2371009 2702022 2798916 2756514 2396237 2304456
$$ packed form
1615F067008j84427k49254J9298k71517k84609M6370P4234J99044M15587j82518
1605E649216n19463o891j5864o1003j45626j29821q2886k9750j53764J29716K29530
1594D863394n19441k48390J83811K74231J23831l54175q9503L5160j52732J09560
1584D225746k55666l47492K48629j30431k11401j886k25145J85383q0833J36509
1574C543413J2801J6406j22559j06137K633m0603k86708m84L17592r0274L4377
1563C280457l1382n8358k7166k91123m50885J78451L84397M05848k41439l3398
1553C115402j18272p9962k7853J01551k93704j64768Q2019L04719o9319l17923
1543B531890J0j12804j08324n9383K540J17080L31013R6894m2402l60277r1781
$$ plain form
1532 2304456 2467434 2386474 2388122 2292940 2595305 2477277 2179284 2331136 2301984 2170910
1522 2170910 2072601 2254260 2094670 2417250 2294626 2227038 2186909 2171082 1861969 1631576
1512 1631576 1837593 1918343 2015752 1738645 1933526 2115640 2216629 2030170 1614420 1953434
1502 1953434 1868389 1695652 1969366 2288688 2022989 1850402 2032698 2006370 1817140 1791558
1492 1791558 1989288 2053623 1896851 1494356 1676436 1655594 1834537 2070745 2009969 1945794
1482 1945794 1758907 1686964 1953729 2326180 2518418 2233170 2358536 2255470 2167384 2222711
1472 2222711 2320646 2599611 2283343 2545953 2734578 2658870 2740939 2991297 2936277 2744937
1462 2744937 2491935 2719883 2952051 2810005 2634677 2525541 2554607 2085043 2197348 2272018
$$ packed form
1532B304456J62978q0960J648r5182L02365j18028k97993J51852k9152j31074
1522B170910r8309J81659j59590L22580j22624o7588m0129j5827l09113k30393
1512A631576K06017Q0750R7409k77107J94881J82114J00989j86459m15750L39014
1502A953434q5045j72737K73714L19322k65699j72587J82296k6328j89230k5582
1492A791558J97730O4335j56772m02495J82080k0842J78943K36208o0776o4175
1482A945794j86887p1943K66765L72451J92238k85248J25366j03066q8086N5327
1472B222711R7935K78965l16268K62610J88625p5708Q2069K50358n5020j91340
1462B744937k53002K27948K32168j42046j75328j09136K9066m69564J12305P4670
$$ plain form
1452 2272018 2290364 1967359 1848048 1835768 1606754 1815182 1864526 1589316 1379554 1289183
1442 1289183 1327421 1538030 1698162 1677861 1535489 1592011 1596047 1118126 1257846 1010207
1432 1010207 1156826 1268978 1226529 1385602 1131558 927767 876297 1046519 1033251 1253280
1422 1253280 1345865 1655983 1574281 1362165 1038733 1075889 1245901 1187838 1186443 1235112 1147376
1411 1147376 1144026 1055252 1041022 987175 1210936 1466584 1471029 1387779 900136 973325 1323862
1400 1323862 1059118 1093449 824526 653743 916529 1008414 1088472 960794 883995 881757 728898
1389 728898 749713 984894 1080403 1184990 1190006 1013397 868258 1130866 977454 897379 912223
1378 912223 718192 480882 610197 716128 667615 326605 374799 600882 826293 686944
$$ packed form
1452B272018J8346l23005j19311j2280k29014K08428M9344k75210k09762r0371
1442A289183L8238K10609J60132k0301j42372N6522M036m77921J39720k47639
1432A010207J46619J12152m2449J59073k54044k03791n1470J70222j3268K20029
1422A253280R2585L10118q1702k12116l23432L7156J70012n8063j395M8669q7736
1411A147376l350q8774j4230n3847K23761K55648M445q3250m87643P3189L50537
1400A323862k64744L4331k68923j70783K62786R1885Q0058j27678p6799k238j52859
1389G28898K0815K35181R5509J04587N016j76609j45139K62608j53412q0075J4844
1378I12223j94031k37310J29315J05931m8513l41010M8194K26083K25411j39349
$$ plain form
1368 686944 586818 199274 695542 1125046 763729 344486 422975 891523 835660 887696
1358 887696 1024594 951029 806651 607621 417359 803970 886531 994904 1002067 860151
1348 860151 552473 721801 347146 365506 479562 555454 421402 445700 606734 716659
1338 716659 628419 714404 976501 607741 558786 820700 692544 757193 797958 710609 549166
1327 549166 659070 412865 428016 643250 599953 572665 452372 238551 423757 296447
1317 296447 6249 -118980 -20819 433415 550971 431049 395749 123254 155196 461008
1307 461008 472266 729013 530535 428761 582631 122690 -75731 -60639 -218300 232356
1297 232356 149351 541343 748496 604207 577983 572860 352162 697218 633175 154736 48164
$$ packed form
1368F86944j00126l87544M96268M29504l61317m19243P8489M68548n5863N2036
1358H87696J36898p3565j44378j99030j90262L86611Q2561J08373P163j41916
1348H60151l07678J69328l74655J8360J14056P5892j34052K4298J61034J09925
1338G16659q8240Q5985K62097l68760m8955K61914j28156O4649M0765q7349j61443
1327E49166J09904k46205J5151K15234m3297k7288j20293k13821J85206j27310
1317B96447k90198j25229R8161M54234J17556j19922l5300k72495L1942L05812
1307D61008J1258K56747j98478j01774J53870m59941j98421J5092j57661M50656
1297B32356q3005L91992K07153j44289k6224n123k20698L45056o4043m78439j06572
$$ plain form
1286 48164 75960 248270 394197 546751 529004 152304 396007 698133 766761 461577
1276 461577 258427 331998 463094 756263 864728 435357 272529 471238 483077 94155
1266 94155 77770 106869 261507 529843 774898 832492 247742 614160 409966 37222
1256 37222 397893 380282 367883 612975 186704 -165429 -90478 -22252 70589 -55644 197212
1245 197212 667225 292758 75567 -188261 -370137 -537883 -202450 511095 556721 552159
1235 552159 380049 454662 557882 511173 316931 18579 -8424 347888 271574 277607 631380
1224 631380 500859 159128 332954 294500 360870 569616 553657 419947 173210 21963
1214 21963 -84210 196243 272712 551550 667982 562379 344916 279811 286525 -135628 -170932
$$ packed form
1286D8164K7796J72310J45927J52554j7747l76700K43703L02126O8628l05184
1276D61577k03150P3571J31096K93169J08465m29371j62828J98709J1839l88922
1266I4155j6385K9099J54638K68336K45055N7594n84750L66418k04194l72744
1256C7222L60671j7611j2399K45092m26271l52133P4951O8226R2841j26233K52856
1245A97212M70013l74467k17191k63828j81876j67746L35433P13545M5626m562
1235E52159j72110P4613J03220m6709j94242k98352k7003L56312p6314O033L53773
1224F31380j30521l41731J73826l8454O6370K08746j5959j33710k46737j51247
1214B1963j06173K80453P6469K78838J16432j05603k17463o5105O714m22153l5304
$$ plain form
1203 -170932 294611 351401 122618 246301 188205 -124972 -61576 268422 458566 543584
1193 543584 920369 922777 453322 321132 458276 459368 100319 -58421 81053 175040 177314
1182 177314 197268 184432 54000 94755 309396 577 -17296 218964 200154 292182 470324
1171 470324 288207 91507 -130069 -37427 267957 205472 555811 593669 545106 261586
1161 261586 243495 324450 182184 403299 675705 484618 286111 415413 435621 312272
1151 312272 308337 80155 43000 -34604 1062 349459 455344 285816 208990 138477 136539
1140 136539 -230323 -123007 186045 199329 416080 420998 277680 233573 192478 -28388 71781
1129 71781 323853 428888 557268 418229 574328 816786 620135 336756 305141 469756
$$ packed form
1203a70932M65543N6790k28783J23683n8096l13177O3396L29998J90144Q5018
1193E43584L76785K408m69455j32190J37144J092l59049j58740J39474R3987K274
1182A77314J9954j2836j30432M0755K14641l08819j7873K36260j8810R2028J78142
1171D70324j82117j96700k21576R2642L05384o2485L50339L7858m8563k83520
1161B61586j8091Q0955j42266K21115K72406j91087j98507J29302K0208j23349
1151C12272l935k28182l7155p7604L5666L48397J05885j69528p6826p0513j938
1140A36539l66862J07316L09052J3284K16751M918j43318m4107m1095k20866J00169
1129G1781K52072J05035J28380j39039J56099K42458j96651k83379l1615J64615
$$ plain form
1119 469756 479352 308160 155581 -94831 -214331 -190194 300185 279458 457712 424653 201013
1108 201013 64359 -55832 236647 420110 457716 461458 383916 153017 97343 26970 170730
1097 170730 -60569 -20862 104139 472027 118761 -33430 -329555 -195610 -180256 -70520
1087 -70520 46745 414529 558983 239061 69040 -504602 -466240 -113016 -83328 -14154
1077 -14154 -156144 63031 155370 -269372 -114523 -262521 -231890 132968 45390 79594 32922
1066 32922 -80959 -245528 -48347 66914 94450 202348 93821 -85989 -147381 -88055
1056 -88055 -195186 -241350 -9722 19427 13163 178102 67423 364779 351862 452051 412794
1045 412794 474591 223479 3938 379139 466202 183147 173359 -142486 -75018 247277 323306
$$ packed form
1119D69756R596j71192j52579k50412j19500K4137M90379k0727J78254l3059k23640
1108B01013j36654j20191K92479J83463L7606L742p7542k30899n5674p0373J43760
1097A70730k31299L9707J25001L67888l53266j52191k96125J33945J5354J09736
1087g0520J17265L67784J44454l19922j70021n73642L8362L53224K9688O9174
1077a4154j41990K19175R2339m24742J54849j47998L0631L64858q7578L4204m6672
1066C2922j13881j64569J97181J15261K7536J07898j08527j79810o1392N9326
1056h8055j07131m6164K31628K9149o264J64939j10679K97356j2917J00189l9257
1045D12794O1797k51112k19541L75201Q7063k83055r788l15845O7468L22295P6029
$$ plain form
1034 323306 335762 -95128 -227106 67679 229394 249302 540439 47246 52945 206969
1024 206969 398947 469075 655757 660448 446041 304198 127559 300447 176227 78119
1014 78119 -2606 10166 270023 509359 60304 -22793 -17132 72750 94865 80225 340657
1003 340657 232478 312622 240698 277962 214596 401434 352207 424361 660722 601317 507998
992 507998 254917 607847 760669 436355 282660 202140 331344 589471 198768 667020
982 667020 662122 917834 915060 617345 573145 675168 711818 716625 940673 873804 634936
971 634936 773300 776641 916300 1253463 1347955 1572928 1364761 1383205 1524007 1709832 1968707
960 1968707 2151019 2004386 2001296 2207598 2368905 2498212 2887749 3165776 3456161 3883510
$$ packed form
1034C23306J2456m30890j31978K94785J61715J9908K91137m93193N699J54024
1024B06969J91978P0128J86682M691k14407j41843j76639J72888j24220r8108
1014G8119q0725J2772K59857K39336m49055q3097N661Q9882K2115j4640K60432
1003C40657j08179Q0144p1924L7264o3366J86838m9227P2154K36361n9405r3319
992E07998k53081L52930J52822l24314j53695q0520J29204K58127l90703M68252
982F67020m898K55712k774k97715m4200J02023L6650M807K24048o6869k38868
971F34936J38364L341J39659L37163R4492K24973k08167J8444J40802J85825K58875
960A968707J82312j46633l090K06302J61307J29307L89537K78027K90385M27349
$$ plain form
950 3883510 4495453 4912604 5126249 5463054 5776335 5989358 5835655 5682937 5129835 4972872
940 4972872 4544080 4020078 3682531 3276149 2964998 2687314 2494039 2291082 2181343 2228842
930 2228842 2104655 1605774 1686342 1740148 1581028 1216493 979880 971519 938375 993531 938861
919 938861 735115 1133154 987565 699891 648662 456623 335932 514693 454178 811921
909 811921 882221 955446 711241 493508 585721 450148 556625 509987 462451 516659 662784
898 662784 511457 560462 432704 436449 234280 -11737 -86542 189085 221178 -119469 -24860
887 -24860 16713 -160327 -182308 -72717 -82213 -5480 314248 200577 90084 25390 153337
876 153337 -27957 101385 431510 426455 438789 445841 32957 -293428 -403958 -47399 80457
$$ packed form
950C883510O11943M17151K13645L36805L13281K13023j53703j52718n53102j56963
940D972872m28792n24002l37547m06382l11151k77684j93275k02957j09739M7499
930B228842j24187m98881Q0568N3806j59120l64535k36613q361l3144N5156n4670
919I38861k03746L98039j45589k87674n1229j92039j20691J78761o0515L57743
909H11921P0300P3225k44205k17733R2213j35573J06477m6638m7536N4208J46125
898F62784j51327M9005j27758L745k02169k46017p4805K75627L2093l40647R4609
887b4860M1573j77040k1981J09591r496P6733L19728j13671j10493o4694J27947
876A53337j81294J29342L30125n055J2334P052m12884l26385j10530L56559J27856
$$ plain form
865 80457 -18202 -76963 -158804 -362640 -381972 -101542 -141868 149045 187491 236259 -8359
854 -8359 98267 95417 135436 -63108 120561 -67275 81318 145504 31667 185047 125299
843 125299 -247382 -111535 -110024 37065 375450 404677 582805 247302 17212 92261 226254
832 226254 215126 84686 140719 281974 57914 195965 -133306 -361888 -343228 69276
822 69276 78389 -75573 25468 -334365 -434767 -431415 -309030 -157489 -126837 -46475 75530
811 75530 -113495 -360616 -102560 230514 103202 -68338 -246008 -108124 20210 87343
801 87343 150736 -138745 -242647 -306213 -33707 -156545 -135683 279438 330905 309605 152352
790 152352 15148 47461 -117922 -15516 -5560 -74933 -286172 -22422 45344 404454 438511
$$ packed form
865H0457r8659n8761q1841k03836j9332K80430m0326K90913L8446M8768k44618
854h359J06626k850M0019j98544J83669j87836J48593O4186j13837J53380n9748
843A25299l72681J35847J511J47089L38385K9227J78128l35503k30090P5049J33993
832B26254j1128j30440N6033J41255k24060J38051l29271k28582J8660M12504
822F9276R113j53962J01041l59833j00402L352J22385J51541L0652Q0362J22005
811G5530j89025k47121K58056L33074j27312j71540j77670J37884J28334O7133
801H7343O3393k89481j03902o3566K72506j22838K0862M15121N1467k1300j57253
790A52352j37204L2313j65383J02406R956o9373k11239K63750O7766L59110L4057
$$ plain form
779 438511 220233 95876 -97972 219189 11956 -294932 -133544 -38614 189069 36817
769 36817 -393418 -173044 188627 237241 145150 67539 -73035 104338 140689 295131 409566
758 409566 55169 -130449 -520092 -409623 -142711 -223920 -222465 -342500 -82621 -109585 -12916
747 -12916 -204628 -256369 -391014 -575195 -248055 -215971 -237155 -336849 -261522 -90325 -149500
736 -149500 -234042 -349903 -164693 -117437 -357264 -289781 -50804 38770 -85502 -320355 -472976
725 -472976 -406467 -208020 4928 55396 22209 -207682 -105320 -76450 -443302 -465584 -307315
714 -307315 -207003 -192789 -90707 -295636 -288206 -201393 -340180 104422 362809 70113 72152
703 72152 -231076 -512397 -506919 -244648 4928 293123 17602 -239949 61425 -22413 -209423
$$ packed form
779D38511k18278j24357j93848L17161k07233l06888J61388R4930K27683j52252
769C6817m30235K20374L61671M8614r2091p7611j40574J77373L6351J54442J14435
758D09566l54397j85618l89643J10469K66912q1209J455j20035K59879k6964R6669
747a2916j91712n1741j34645j84181L27140L2084k1184r9694P5327J71197n9175
736a49500q4542j15861J85210M7256k39827O7483K38977Q9574j24272k34853j52621
725d72976O6509J98447K12948N0468l3187k29891J02362K8870l66852k2282J58269
714c07315J00312J4214J02082k04929P430Q6813j38787M44602K58387k92696K039
703G2152l03228k81321N478K62271K49576K88195k75521k57551L01374q3838j87010
$$ plain form
692 -209423 -205918 -142130 -2535 97399 -34720 -187616 -183783 -270263 -665290 -440534 59779
681 59779 -111333 -261226 -187478 132923 64067 -248198 -317490 -295821 80506 160001 105426
670 105426 -192703 -59495 -152813 -336478 -468722 -398577 -167003 -157763 -128672 72959 -47111
659 -47111 -39567 -178870 -280906 127919 -12185 182200 34594 -16311 468298 233654 -204966
648 -204966 -719504 -638691 -457061 -222734 -94696 -5731 -71344 -234524 -314898 -117361 123021
637 123021 -290689 -386932 -241375 -310418 -408275 -209340 -216896 21429 -141048 -167896 -189045
626 -189045 -139237 -300871 -545965 -491812 -362651 -403716 -202748 29019 -187312 -330675
616 -330675 -585 -7418 -174260 -137570 -231358 -34190 176760 145422 121431 -143326 -208501
$$ packed form
692b09423L505O3788J39595R9934j32119j52896L833q6480l95027K24756N00313
681E9779j71112j49893P3748L20401o8856l12265o9292K1669L76327P9495n4575
670A05426k98129J33208r3318j83665j32244P0145K31574R240K9091K01631j20070
659d7111P544j39303j02036M08825j40104J94385j47606n0905M84609k34644m38620
648b04966n14538Q0813J81630K34327J28038Q8965o5613j63180q0374J97537K40382
637A23021m13710r6243J45557o9043r7857J98935p556K38325j62477k6848k1149
626a89045M9808j61634k45094N4153J29161m1065K00968K31767k16331j43363
616c30675L30090o833j66842L6690r3788J97168K10950l1338k3991k64757o5175
$$ plain form
605 -208501 -239079 -312488 -144269 -415909 -98725 77763 167432 325261 61644 -339542
595 -339542 -646927 -344697 -445749 -404129 -411724 -23465 155830 -347605 -812040 -803636 -639763
584 -639763 -441298 -305589 51439 -135026 -444552 -419529 -197249 180840 80322 125015
574 125015 -35496 54510 -161664 -471132 -655420 -595683 -313121 -426384 -461690 -315669
564 -315669 -360223 111366 -31472 -385908 -307264 -282747 -213594 149606 45682 -84527 -232763
553 -232763 -32359 125680 -137857 -216460 -154650 -256414 -160644 -193390 -5888 -123777 -371319
542 -371319 -157274 -238080 -258955 -12648 -38519 26627 -9575 -288961 -230607 -508205 -804675
531 -804675 -463309 -181037 -64176 125153 73099 26582 -67967 -231422 -33924 -103187 -295981
$$ packed form
605b08501l0578p3409J68219k71640L17184J76488Q9669J57829k63617m01186
595c39542l07385L02230j01052M1620p595L88259J79295n03435m64435Q404J63873
584f39763J98465J35709L57028j86465l09526K5023K22280L78089j00518M4693
574A25015j60511R0006k16174l09468j84288N9737K82562j13263l5306J46021
564c15669m4554M71589j42838l54436P8644K4517O9153L63200j03924j30209j48236
553b32763K00404J58039k63537p8603O1810j01764R5770l2746J87502j17889k47542
542c71319K14045q0806k0875K46307k5871O5146l6202k79386N8354k77598k96470
531h04675L41366K82272J16861J89329n2054m6517r4549j63455J97498o9263j92794
$$ plain form
520 -295981 -50146 -196888 149752 -120575 -518462 -581788 -433036 -439301 -305650 234961
510 234961 53157 -4363 -373774 -472285 -317541 -180381 97931 207769 402301 39958
500 39958 -43294 4179 -46385 -330905 -343599 162024 -110480 -162388 -256867 -211565 -336551
489 -336551 147587 107323 79021 39271 -17250 -122674 36679 -176557 -329911 -133263 -487068
478 -487068 -529848 -53634 333737 -5650 -113287 -496835 -569168 -183200 -14359 -327180
468 -327180 -45600 10548 245416 88874 -240786 -384593 -363830 -249146 -356828 -274056
458 -274056 -301315 -296704 -206020 -405297 -195574 -42699 -27924 90341 11876 -122569 -165647
447 -165647 -328441 -243248 -318132 -388309 -339152 -395688 -282500 -370255 -324185 3249 149070
$$ packed form
520b95981K45835j46742L46640k70327l97887o3326J48752o265J33651N40611
510B34961j81804n7520l69411r8511J54744J37160K78312J09838J94532l62343
500C9958q3252M7473n0564k84520j2694N05623k72504n1908r4479M5302j24986
489c36551M84138m0264k8302l9750n6521j05424J59353k13236j53354J96648l53805
478d87068m2780M76214L87371l39387j07637l83548p2333L85968J68841l12821
468c27180K81580N6148K34868j56542l29660j43807K0763J14684j07682Q2772
458b74056k7259M611R0684j99277K09723J52875J4775J18265p8465j34445m3078
447a65647j62794Q5193p4884p0177M9157n6536J13188q7755M6070L27434J45821
$$ plain form
436 149070 46392 -235950 -240315 -172797 -181025 -71433 -2702 -89554 -203795 -190820 -60028
425 -60028 -251058 -321091 -395428 -261679 -328752 -305835 -400517 -417663 -359844 -172749 -138850
414 -138850 38042 -166134 -273805 -309760 -385115 -293374 -625516 -553873 -288153 -36525 -171548
403 -171548 -617453 -376524 -203885 -504929 -330185 -220045 -362457 -182926 -311810 -250312
393 -250312 -512849 -768447 -481891 -489748 -671004 -622766 -299463 -291693 -486608 -827053 -758050
382 -758050 -892941 -809793 -343539 -200953 -296588 -388922 -634560 -375357 -576890 -315847
372 -315847 -218579 -330905 -613520 -408897 -353352 -501286 -785333 -855483 -860925 -346221 -378233
361 -378233 -584870 -501418 -602327 -538822 -652680 -652801 -869205 -735310 -498250 -336330 -539190
$$ packed form
436A49070j02678k82342m365O7518q228J09592O8731q6852j14241J2975J30792
425f0028j91030p0033p4337J33749o7073K2917r4682j7146N7819J87095L3899
414a38850J76892k04176j07671l5955p5355R1741l32142P1643K65720K51628j35023
403a71548m45905K40929J72639l01044J74744J10140j42412J79531j28884O1498
393b50312k62537k55598K86556p857j81256M8238L23303P770j94915l40445O9003
382g58050j34891Q3148M66254J42586r5635r2334k45638K59203k01533K61043
372c15847R7268j12326k82615K04623N5545j47934k84047p0150n442N14704l2012
361c78233k06637Q3452j00909O3505j13858j21k16404J33895K37060J61920k02860
$$ plain form
350 -539190 -661852 -617926 -698019 -571181 -630581 -310724 -140259 -433982 -138984 -199062 -591202
339 -591202 -581194 -443634 -404730 -482671 -542378 -719682 -643814 -592461 -588699 -604279 -400640
328 -400640 -591034 -673606 -577195 -411048 -284096 -260286 -525467 -814285 -747728 -692356 -858837
317 -858837 -627281 -379293 -306692 -668444 -356250 -384031 -340415 -157722 -325120 -549410
307 -549410 -805685 -311258 -604831 -494897 -553934 -322846 -121133 -211083 -712262 -537988
297 -537988 -296629 -209412 -54662 -167203 -200643 -523898 -451305 -90720 98114 -99042
287 -99042 -429195 -591398 -532263 -51061 -183057 -301683 -125960 104474 -9010 -92497
277 -92497 -264602 -519388 -641201 -511407 -592156 -353219 -527862 -809087 -755502 -682208 -718631
$$ packed form
350e39190j22662M3926q0093J26838n9400L19857J70465k93723K94998o0078l92140
339e91202J0008J37560L8904p7941n9707j77304P5868N1353L762j5580K03639
328d00640j90394q2572R6411J66147J26952K3810k65181k88818O6557N5372j66481
317h58837K31556K47988P2601l61752L12194k7781M3616J82693j67398k24290
307e49410k56275M94427k93573J09934n9037K31088K01713q9950n01179J74274
297e37988K41359Q7217J54750j12541l3440l23255P2593L60585J88834j97156
287i9042l30153j62203N9135M81202j31996j18626J75723K30434j13484q3487
277i2497j72105k54786j21813J29794q0749K38937j74643k81225N3585P3294l6423
$$ plain form
266 -718631 -962983 -897526 -619372 -741302 -774769 -575634 -412382 -670253 -914596 -920393 -477356
255 -477356 -22328 -206105 -468952 -236082 -311864 -585317 -728036 -707666 -770809 -187388
245 -187388 -423008 -574543 -313542 -197476 -328341 -701513 -482074 -219740 121836 -59669
235 -59669 -57992 -126114 -646750 -542665 -572174 -685192 -377687 -554821 -534464 -700055 -728459
224 -728459 -855712 -715181 -533804 -563753 -338935 -115736 -165527 -597121 -797622 -779373
214 -779373 -551589 -330082 -684989 -792015 -917604 -632614 -510896 -411986 -252798 -15959
204 -15959 -282156 -425530 -705981 -672202 -764830 -1038377 -591561 -753283 -1070933 -800098
194 -800098 -676206 -718472 -655576 -491931 -526708 -469502 -486339 -630442 -611232 -426136 -493844
$$ packed form
266g18631k44352O5457K78154j21930l3467J99135J63252k57871k44343n797M43037
255d77356M55028j83777k62847K32870p5782k73453j42719K0370o3143N83421
245a87388k35620j51535K61001J16066j30865l73172K19439K62334L41576j81505
235e9669J677o8122n20636J04085k9509j13018L07505j77134K0357j65591k8404
224g28459j27253J40531J81377k9949K24818K23199m9791m31594k00501J8249
214g79373K27784K21507l54907j07026j25589K84990J21718R8910J59188K36839
204a5959k66197j43374k80451L3779r2628k73547M46816j61722l17650K70835
194h00098J23892m2266O2896J63645l4777N7206j6837j44103J9210J85096o7708
$$ plain form
183 -493844 -933864 -840396 -514714 -443468 -324972 -446209 -843920 -760253 -457044 -562858
173 -562858 -509539 -600423 -747232 -672507 -447062 -459110 -466712 -351241 -217069 -299891 -308014
162 -308014 -628950 -788347 -724492 -549928 -203859 -148913 -201848 -445322 -743194 -772748 -741738
151 -741738 -706053 -567742 -618498 -340158 -389822 -563879 -670482 -806094 -664645 -509721
141 -509721 -702874 -606245 -480962 -789769 -734184 -369478 -321596 -329682 -445508 -186684 -259663
130 -259663 -479937 -374521 -730143 -975924 -881780 -495657 -391411 -614950 -646706 -601100
120 -601100 -343705 -375110 -505937 -542173 -510904 -573486 -512116 -402329 -485986 -347961 -508854
109 -508854 -601043 -517726 -440370 -559058 -582762 -574215 -795382 -774116 -577368 -453954 -548593
$$ packed form
183d93844m40020R3468L25682P1246J18496j21237l97711Q3667L03209j05814
173e62858N3319r0884j46809P4725K25445j2048p602J15471J34172q2822q123
162c08014l20936j59397O3855J74564L46069N4946n2935k43474k97872k9554L1010
151g41738L5685J38311n0756K78340m9664j74057j06603j35612J41449J54924
141e09721j93153R6629J25283l08807N5585L64706M7882q086j15826K58824p2979
130b59663k20274J05416l55622k45781R4144L86123J04246k23539l1756M5606
120f01100K57395l1405j30827l6236L1269o2582O1370J09787q3657J38025j60893
109e08854r2189Q3317P7356j18688k3704Q547k21167K1266J96748J23414r4639
$$ plain form
98 -548593 -621461 -664952 -615941 -820303 -748024 -759584 -764398 -724371 -589557 -452534 -357077 -229171
86 -229171 -183372 -313324 -472712 -517378 -425267 -335710 -321563 -329086 -341158 -454394 -537133 -660905
74 -660905 -717841 -780983 -892821 -471964 -612601 -725665 -624104 -672703 -472564 -477248 -340409
63 -340409 -432728 -646591 -424448 -503219 -570732 -472017 -489528 -386936 -599008 -622841 -586419
52 -586419 -443799 -537754 -566296 -832150 -718940 -304476 -426165 -471099 -552728 -579499 -797813
41 -797813 -665533 -530011 -968581 -683214 -530060 -458382 -491452 -317814 -142795 -470202
31 -470202 -613332 -730026 -561161 -865710 -837796 -818507 -674819 -628793 -606938 -500711 -711716
20 -711716 -668650 -611189 -667840 -366055 -457530 -745382 -665545 -403394 -511690 -547907 -536286
$$ packed form
98e48593p2868m3491M9011k04362P2279j1560m814M0027J34814J37023R5457J27906
86b29171M5799j29952j59388m4666R2111Q9557J4147p523j2072j13236q2739j23772
74f60905n6936o3142j11838M20857j40637j13064J01561m8599K00139m684J36839
63c40409r2319k13863K22143p8771o7513R8715j7511J02592k12072k3833L6422
52e86419J42620r3955k8542k65854J13210M14464j21689m4934q1629k6771k18314
41g97813J32280J35522m38570K85367J53154P1678l3070J73638J75019l27407
31d70202j43130j16694J68865l04549K7914J9289J43688M6026K1855J06227k11005
20g11716M3066N7461n6651L01785r1475k87852P9837K62151j08296l6217J1621
$$ plain form
9 -536286 -619522 -460250 -595121 -436293 -464114 -668182 -675960 -734169 -631290
0 -631290
$$ packed form
9e36286q3236J59272j34871J58828k7821k04068p778n8209J02879
0f31290
$$ Imaginary data points
##PAGE= N=2
##DATA TABLE= (X++(I..I)), XYDATA
$$ plain form
16383 -4749027 -4547249 -4414829 -4570178 -4473785 -4504522 -4555513 -4357644 -3976779 -4193144 -4452598
16373 -4452598 -4151551 -4046372 -3903318 -3938724 -4005569 -3842031 -3731020 -3563273 -3612374 -3443164
16363 -3443164 -3446107 -3275620 -3252942 -3504032 -3323302 -3104691 -3151382 -3293595 -3192212 -3071704
16353 -3071704 -2768368 -2807142 -2842255 -2929699 -2756048 -2649247 -2739013 -2453240 -2184816 -2504598
16343 -2504598 -2351972 -2100282 -2243429 -1989404 -1906987 -1903659 -2052747 -1986354 -1884515 -1690837
16333 -1690837 -2029474 -2004267 -1960478 -2085811 -2151510 -1849521 -1740500 -1759095 -1403727 -1566744
16323 -1566744 -1406903 -1265164 -1412241 -1525865 -1554621 -1432459 -1006173 -744893 -827112 -1030961
16313 -1030961 -1075965 -1100764 -932350 -1064240 -1000547 -909592 -866092 -725290 -837895 -776820
$$ packed form
16383d749027K01778J32420j55349R6393l0737n0991J97869L80865k16365k59454
16373d452598L01047J05179J43054l5406o6845J63538J11011J67747m9101J69210
16363c443164k943J70487K2678k51090J80730K18611m6691j42213J01383J20508
16353c071704L03336l8774l5113q7444J73651J06801q9766K85773K68424l19782
16343b504598J52626K51690j43147K54025Q2417L328j49088O6393J01839J93678
16333a690837l38637K5207M3789j25333o5699L01989J09021j8595L55368j63017
16323a566744J59841J41739j47077j13624k8756J22162M26286K61280q2219k03849
16313a030961m5004k4799J68414j31890O3693R0955M3500J40802j12605O1075
$$ plain form
16303 -776820 -638311 -570896 -399700 -268068 -245500 -199995 -56339 -44770 -327541 -9862
16293 -9862 213379 107811 15707 177646 -76202 -267773 131542 -43266 199930 352433
16283 352433 469263 306723 328353 361758 424238 253962 242447 383594 425155 590378
16273 590378 699058 829744 985317 1072599 860908 721274 1045496 889183 893474 1050482
16263 1050482 1247675 1041840 1176614 1238087 1273229 1300521 1290351 1483040 1418850 1352485
16253 1352485 1402339 1737073 1718126 1804827 2012888 2037507 1870128 1755637 1590035 1495943
16243 1495943 1577448 1795446 2000362 2071827 1863111 2074406 2291375 2325160 1804261 1478189
16233 1478189 1640382 2009899 2332364 2357224 2352424 2392049 2066736 2273503 2270889 2351964 2456293
$$ packed form
16303g76820J38509O7415J71196J31632K2568M5505J43656J1569k82771L17679
16293i862K23241j05568r2104J61939k53848j91571L99315j74808K43196J52503
16283C52433J16830j62540K1630L3405O2480j70276j1515J41147M1561J65223
16273E90378J08680J30686J55573Q7282k11691j39634L24222j56313M291J57008
16263A050482J97193k05835J34774O1473L5142K7292j0170J92689o4190o6365
16253A352485M9854L34734j8947Q6701K08061K4619j67379j14491j65602r4092
16243A495943Q1505K17998K04916P1465k08716K11295K16969L3785n20899l26072
16233A478189J62193L69517L22465K4860m800L9625l25313K06767k614Q1075J04329
$$ plain form
16222 2456293 2693041 2724935 2813046 2707216 2379430 2344133 2162275 2073998 2246407 2367706
16212 2367706 2485113 2596606 2617380 2422308 2439004 2589153 2668132 2663837 2628555 2324296
16202 2324296 2608071 2909274 2743544 2725268 2568862 2603428 2836266 3117352 3110492 2886839
16192 2886839 3100917 3207156 2940340 2741821 2873555 3284045 3502719 3329404 3206627
16183 3206627 3235797 3014754 2941876 2667808 2585054 2680162 2987423 3059729 3093497 2938594
16173 2938594 3046338 2995426 3021908 3282754 3650764 3485200 3403947 3452506 3343882 3469495
16163 3469495 3411227 3175374 3208955 3429869 3588057 3459914 3526314 3477088 3109396 3202382
16153 3202382 3559484 3552259 3428656 3407754 3742297 3789438 3635385 3547706 3259403 3313428
$$ packed form
16222B456293K36748L1894Q8111j05830l27786l5297j81858q8277J72409J21299
16212B367706J17407J11493K0774j95072J6696J50149P8979m295l5282l04259
16202B324296K83775L01203j65730j8276j56406L4566K32838K81086o860k23653
16192B886839K14078J06239k66816j98519J31734M10490K18674j73315j22777
16183C206627K9170k21043p2878k74068q2754R5108L07261P2306L3768j54903
16173B938594J07744n0912K6482K60846L68010j65564q1253M8559j08624J25613
16163C469495n8268k35853L3581K20914J58188j28143O6400m9226l67692R2986
16153C202382L57102p225j23603k0902L34543M7141j54053q7679k88303N4025
$$ plain form
16143 3313428 3441355 3537803 3435233 3557458 3700720 3626967 3495061 3658800 3662908 3575946
16133 3575946 3638504 3618426 3729626 4109463 3879658 3881279 3613036 3771705 3858908 3471991
16123 3471991 3941453 3751818 3765656 3901406 3583076 3563183 3637007 3845412 3751366 4078119
16113 4078119 4057404 3776981 4109502 3564814 3412102 3922119 4098880 4183433 4069376 3954829
16103 3954829 4038998 4081199 4289725 4073534 3632950 3635186 3983579 4514537 4406369 3959332
16093 3959332 4104113 3998311 3994124 4030288 4084951 4082497 4071207 3744302 3747479 3949153 3964245
16082 3964245 3930036 3509408 3777273 3824993 3666314 3530721 3572080 3695360 3675426 3881547
16072 3881547 3891923 3821006 3850130 3738352 4188131 3961008 3873046 3734622 3680638 3854150
$$ packed form
16143C313428J27927R6448j02570J22225J43262p3753j31906J63739M108q6962
16133C575946O2558k0078J11200L79837k29805J621k68243J58669Q7203l86917
16123C471991M69462j89635J3838J35750l18330j9893P3824K08405r4046L26753
16113D078119k0715k80423L32521n44688j52712N10017J76761Q4553j14057j14547
16103C954829Q4169M2201K08526k16191m40584K236L48393N30958j08168m47037
16093C959332J44781j05802m187L6164N4663k454j1290l26905L177K01674J5092
16082C964245l4209m20628K67865M7720j58679j35593M1359J23280j9934K06121
16072C881547J0376p0917K9124j11778M49779k27123q7962j38424n3984J73512
$$ plain form
16062 3854150 3843877 3785356 4113725 4094048 3826264 3852669 4021772 4146772 3890336 3900488
16052 3900488 4048159 4172562 4426650 4363642 4043770 4012574 3781760 4132436 4051348 3804870
16042 3804870 3800993 3998959 3738955 4199700 3996404 3702609 4222002 4377987 4078922 3885026
16032 3885026 4227726 4235377 4197997 4353912 3813605 3831081 4298642 4341469 4076412 3822735
16022 3822735 3956675 3845179 3586971 3619933 3825003 3750394 3846549 4168777 3872786 3845754
16012 3845754 3835314 3779461 3816599 3782102 3842259 3697798 3758844 3718617 3733210 3901657 3926197
16001 3926197 3534971 3741120 3534016 3473076 3756159 3940082 3848192 3886156 3842659 3746416
15991 3746416 3932930 3863204 3827141 4195269 4080173 3877306 3799934 3839706 4078064 3987976
$$ packed form
16062C854150j0273n8521L28369j9677k67784K6405J69103J25000k56436J0152
16052C900488J47671J24403K54088o3008l19872l1196k30814L50676q1088k46478
16042C804870l877J97966k60004M60745k03296k93795N19393J55985k99065j93896
16032C885026L42700P651l7380J55915n40307J7476M67561M2827k65057k53677
16022C822735J33940j11496k58208L2962K05070p4609R6155L22228k95991k7032
16012C845754j0440n5853L7138l4497O0157j44461O1046m0227J4593J68447K4540
16001C926197l91226K06149k07104o0940K83083J83923r1890L7964m3497r6243
15991C746416J86514o9726l6063L68128j15096k02867p7372L9772K38358r0088
$$ plain form
15981 3987976 3877641 3943626 3814654 3655205 3713182 4179376 4193822 4136864 4141100 4115950 4116830
15970 4116830 4320239 4298522 3921226 3839585 3881156 3918689 3777709 3978729 4286792 4238789
15960 4238789 4379634 4140169 4181592 4005866 3930226 4186708 4121581 4177760 3984439 4015501
15950 4015501 4177488 4272516 3810542 3940370 3992213 3929333 4009977 4056121 3897437 3822584
15940 3822584 4072088 4229547 4101168 4145645 4098890 4159011 4456653 4120759 3976251 4210723
15930 4210723 4122136 4088317 4132389 4209771 3927138 3858925 3591527 3783489 3938295 3750586
15920 3750586 3704339 3855300 4002352 3878831 3826570 3810952 3875846 3710664 3657392 4008900
15910 4008900 3973601 3801673 3912225 4016500 4356591 4267462 4264369 4239895 4216864 3865872
$$ packed form
15981C987976j10335O5985j28972j59449N7977M66194J4446n6958M236k5150Q80
15970D116830K03409k1717l77296q1641M1571L7533j40980K01020L08063m8003
15960D238789J40845k39465M1423j75726p5640K56482o5127N6179j93321L1062
15950D015501J61987R5028m61974J29828N1843o2880Q0644M6144j58684p4853
15940C822584K49504J57459j28379M4477m6755O0121K97642l35894j44508K34472
15930D210723q8587l3819M4072P7382k82633o8213k67398J91962J54806j87709
15920C750586m6247J50961J47052j23521n2261j5618O4894j65182n3272L51508
15910D008900l5299j71928J10552J04275L40091q9129l093k4474k3031l50992
$$ plain form
15900 3865872 3864310 3870542 3929161 3953700 3913821 4112872 4114119 3973676 4210015 4475957 4536069
15889 4536069 4462296 3937949 3919116 4105522 4043319 4183362 4212944 3993493 3865769 4136657
15879 4136657 4215313 3979849 3891856 3760280 3909429 3747891 4080982 4265033 4182261 4352552
15869 4352552 4304858 3976860 3738718 3529900 3535085 3840272 3739659 3640801 3662686 3812977
15859 3812977 3963247 3954628 4035159 3962093 4060949 4172858 4244716 4441105 4493982 4183119 4175499
15848 4175499 4478507 4260938 3957250 4083983 4010894 3903728 3944891 4021664 4313321 4244112
15838 4244112 4030175 3737576 4016816 3953317 3884059 3923820 4088914 4534638 4234954 3879930
15828 3879930 4150333 3690799 3756747 4287458 4107060 3784277 4059788 4121045 3951934 4107030
$$ packed form
15900C865872j562O232N8619K4539l9879J99051J247j40443K36339K65942O0112
15889D536069p3773n24347j8833J86406o2203J40043K9582k19451j27724K70888
15879D136657P8656k35464q7993j31576J49149j61538L33091J84051q2772J70291
15869D352552m7694l27998k38142k08818N185L05187j00613r8858K1885J50291
15859C812977J50270q619Q0531p3066R8856J11909P1858J96389N2877l10863p620
15848D175499L03008k17569l03688J26733p3089j07166M1163P6773K91657o9209
15838D244112k13937k92599K79240o3499o9258L9761J65094M45724k99684l55024
15828C879930K70403m59534O5948N30711j80398l22783K75511O1257j69111J55096
$$ plain form
15818 4107030 4190902 4217423 4133475 4020626 4101826 4019963 4131874 4197028 4059283 4248919
15808 4248919 4124458 3932562 4158109 4174240 4120041 4403392 4034167 4126349 4244554 4054059
15798 4054059 4151861 4067796 4032664 4424894 4414385 4008339 3827865 4113085 4106641 4120363 3971911
15787 3971911 3781484 3793076 3786713 3859802 3743340 3682516 3949434 3853957 4027481 3947499 4184687
15776 4184687 3935054 3748974 4086118 3853242 3731509 4029935 4351041 4331104 4172961 4141115
15766 4141115 4158678 4199259 4139975 4082891 4016040 4263204 4348199 3884317 3796648 3865013 4078982
15755 4078982 4457881 4524761 4229056 4659410 4668730 4219659 3940991 4345642 4460192 4681081
15745 4681081 4593964 4593245 4226103 4085456 3895800 3811074 3863966 3781893 3997104 3999205 4110219
$$ packed form
15818D107030Q3872K6521q3948j12849Q1200q1863J11911O5154j37745J89636
15808D248919j24461j91896K25547J6131n4199K83351l69225R2182J18205j90495
15798D054059R7802q4065l5132L92230j0509m06046j80474K85220o444J3722j48452
15787C971911j90427J1592o363P3089j16462o0824K66918r5477J73524p9982K37188
15776D184687k49633j86080L37144k32876j21733K98426L21106j9937j58143l1846
15766D141115J7563M0581n9284n7084o6851K47164Q4995m63882q7669O8365K13969
15755D078982L78899O6880k95705M30354R320m49071k78668M04651J14550K20889
15745D681081q7117p19l67142j40647j89656q4726N2892q2073K15211K101J11014
$$ plain form
15734 4110219 4256962 4283671 4316914 3883929 3848461 3875703 3735022 3851783 3858403 4199578
15724 4199578 4012660 3819522 3844038 3852279 4026204 4012278 4089698 3907717 3656129 3529474
15714 3529474 3808507 3764733 3624277 3916729 4157776 4337147 4113595 4051221 3860103 4170353
15704 4170353 4378136 4275870 4221788 4430064 4461923 4167411 4111134 4098308 3871160 3928371
15694 3928371 3851726 3706996 3694989 3633400 3732232 4030450 4076734 4164568 4060417 4271637
15684 4271637 4289890 4303590 4389270 4373642 4169320 3940180 3888328 3964761 3835344 4093259
15674 4093259 4107345 4296034 4319065 3937004 3861534 3888921 3914637 4201468 3850447 3728457
15664 3728457 4125731 3996422 4341547 4276700 3853329 4019115 4169216 4311916 3993152 3346237
$$ packed form
15734D110219J46743K6709L3243m32985l5468K7242j40681J16761O620L41175
15724D199578j86918j93138K4516Q241J73925j3926P7420j81981k51588j26655
15714C529474K79033m3774j40456K92452K41047J79371k23552o2374j91118L10250
15704D170353K07783j02266n4082K08276L1859k94512n6277j2826k27148N7211
15694C928371p6645j44730j2007o1589R8832K98218M6284Q7834j04151K11220
15684D271637J8253J3700Q5680j5628k04322k29140n1852P6433j29417K57915
15674D093259J4086J88689K3031l82061p5470K7387K5716K86831l51021j21990
15664C728457L97274j29309L45125o4847m23371J65786J50101J42700l18764o46915
$$ plain form
15654 3346237 3531334 3713568 3902550 3702131 3626226 3630036 4070395 4088996 3949623 3483076
15644 3483076 3716406 4060429 4226961 4327855 4478587 4343319 4075305 3885214 4130556
15635 4130556 4606595 4170599 3975561 3993673 4146578 4358974 4309038 4130155 4279795 4212314
15625 4212314 3862077 3857973 3980400 4031823 3845195 3655364 3782228 4109975 3943790 4139735
15615 4139735 4157260 4290916 4297632 4193374 4053026 3905081 4239344 4389962 4274670 3700897
15605 3700897 3491812 4081732 4409872 3826500 3767347 4028705 4134243 4014601 4024691 3958252
15595 3958252 4029696 3897731 4054708 4220971 4179506 4062861 4035707 4025001 4438341 4538279
15585 4538279 4457914 4562272 4437029 4541052 4464184 4284873 4433748 4522673 4854213 4724095
$$ packed form
15654C346237J85097J82234J88982k00419p5905L810M40359J8601j39373m66547
15644C483076K33330L44023J66532J00894J50732j35268k68014j90091K45342
15635D130556M76039m35996j95038J8112J52905K12396m9936j78883J49640o7481
15625D212314l50237m104J22427N1423j86628j89831J26864L27747j66185J95945
15615D139735J7525J33656O716j04258j40348j47945L34263J50618j15292n73773
15605C700897k09085N89920L28140n83372n9153K61358J05538j19642J0090o6439
15595C958252P1444j31965J56977J66263m1465j16645k7154j0706M13340R9938
15585D538279q0365J04358j25243J04023p6868j79311J48875Q8925L31540j30118
$$ plain form
15575 4724095 4699227 4389489 4407322 4371180 4085991 4081518 4218519 4364602 4173079 4016644
15565 4016644 4045837 4162093 3974437 3934956 3770649 3848885 4190495 4568356 4509631 4220942
15555 4220942 4125052 4339780 4167408 4368614 4161204 4264889 4534055 4240106 3903359 4010637
15545 4010637 4192368 4200373 4132373 4035037 4090801 3995559 3953583 4217355 4370368 4144972 4187385
15534 4187385 4531270 4226012 4350138 4241114 4087276 4344616 4414861 4498305 4584016 4566371
15524 4566371 4275737 4469434 4659526 4574535 4236023 3935945 4076411 4464058 4334212 4430194
15514 4430194 4605641 4219952 3783535 3639136 3713990 3927333 4185671 3955943 3814123 4049673
15504 4049673 4372527 4271631 4105676 4211555 4238963 4368515 4319080 4297087 4291458 4337505
$$ packed form
15575D724095k4868l09738J7833l6142k85189m473J37001J46083j91523j56435
15565D016644K9193J16256j87656l9481j64307P8236L41610L77861n8725k88689
15555D220942r5890K14728j72372K01206k07410J03685K69166k93949l36747J07278
15545D010637J81731Q005o8000r7336N5764r5242m1976K63772J53013k25396M2413
15534D187385L43885l05258J24126j09024j53838K57340P0245Q3444Q5711j7645
15524D566371k90634J93697J90092q4991l38512l00078J40466L87647j29846R5982
15514D430194J75447l85689m36417j44399P4854K13343K58338k29728j41820K35550
15504D049673L22854j00896j65955J05879K7408J29552m9435k1993n629M6047
$$ plain form
15494 4337505 4255860 4326815 4280097 4104475 4278724 4274649 4228990 4132091 4166758 4204963 4175892
15483 4175892 3863127 3894936 3795964 3922315 4473179 4219489 4509213 4307032 3861571 3803713
15473 3803713 3852476 3933400 4282383 4519716 4265652 4167210 4247156 4524503 4717813 4321053
15463 4321053 4384491 4506444 4530498 4499406 4566961 4614468 4349688 4166662 4182806 4076512
15453 4076512 4292390 4545802 4260015 4447369 4185830 3847559 3941071 4228950 4442521 4447178
15443 4447178 4392868 4474646 4419608 4036678 4018885 4197043 4373884 4591879 4333665 4432140
15433 4432140 4302017 4309972 3999910 3741780 4106284 4437323 4545968 4665965 5033187 4608562
15423 4608562 4411757 4266141 4258009 4127133 3713841 4256021 4593938 4654963 4632817 4087597
$$ packed form
15494D337505q1645P0955m6718j75622J74249m075m5659r6899L4667L8205k9071
15483D175892l12765L1809r8972J26351N50864k53690K89724k02181m45461n7858
15473C803713M8763Q0924L48983K37333k54064r8442P9946K77347J93310l96760
15463D321053O3438J21953K4054l1092O7555M7507k64780j83026J6144j06294
15453D076512K15878K53412k85787J87354k61539l38271R3512K87879K13571M657
15443D447178n4310Q1778n5038l82930j7793J78158J76841K17995k58214R8475
15433D432140j30123P955l10062k58130L64504L31039J08645J19997L67222m24625
15423D608562j96805j45616q132j30876m13292N42180L37917O1025k2146n45220
$$ plain form
15413 4087597 3926818 4008795 3748577 4045831 4289548 4271249 4256125 4165286 4144869 4420853
15403 4420853 4319545 4276189 4384351 4144971 4035674 3918876 4009405 4096281 4014159 3906234
15393 3906234 4176824 4100058 3890157 4123808 4406544 4379991 4370161 4319412 4256777 4266765 4235941
15382 4235941 4359053 4592957 4807626 4564367 4485487 4396681 4270359 4228801 4326226 4373042
15372 4373042 4173898 4414934 4374493 4249735 4327017 4405547 4083665 4151306 4284684 4371163
15362 4371163 3975152 4140402 4321691 4443186 4413098 4463278 4376834 4275506 4177230 4265297
15352 4265297 4579628 4570791 4434257 4547674 4721733 4606596 5018349 4987860 4822868 4509695
15342 4509695 4423681 4049464 4004842 4330752 4243341 4481218 4559113 4181308 4155692 4429268
$$ packed form
15413D087597j60779Q1977k60218K97254K43717j8299j5124r0839k0417K75984
15403D420853j01308m3356J08162k39380j09297j16798R0529Q6876q2122j07925
15393C906234K70590p6766k09901K33651K82736k6553r830n0749o2635R988l0824
15382D235941J23112K33904K14669k43259p8880q8806j26322m1558R7425M6816
15372D373042j99144K41036m0441j24758P7282P8530l21882O7641J33378Q6479
15362D371163l96011J65250J81289J21495l0088N0180q6444j01328r8276Q8067
15352D265297L14331q837j36534J13417J74059j15137M11753l0489j64992l13173
15342D509695q6014l74217m4622L25910q7411K37877P7895l77805k5616K73576
$$ plain form
15332 4429268 4275294 4032610 4413687 4563503 4745180 4799019 4733480 4191589 4035991 4167640
15322 4167640 3951358 3903289 4197544 4157872 4436384 4382702 3923701 4196136 4288186 4511301
15312 4511301 4419426 4404692 4745621 4673633 4793865 4597693 4143837 4268493 4333656 4417970
15302 4417970 4350992 4094107 4353675 4318659 4227671 4065439 3924131 4091571 4112970 4201932
15292 4201932 4406168 4301871 4393330 4284689 4309940 4242901 4182416 4169447 4086606 4220110
15282 4220110 4206489 4198945 4178586 3973898 4176561 4048399 4502281 4730245 4304090 4008420
15272 4008420 4117670 4334753 4356555 4551775 4285804 4383384 4442348 4265475 4368560 4249057
15262 4249057 3965324 3860940 3910292 4032910 4291374 4398521 4391167 4484550 4247105 4288130
$$ packed form
15332D429268j53974k42684L81077J49816J81677N3839o5539n41891j55598J31649
15322D167640k16282m8069K94255l9672K78512n3682m59001K72435R2050K23115
15312D511301r1875j4734L40929p1988J20232j96172m53856J24656O5163Q4314
15302D417970o6978k56885K59568l5016r0988j62232j41308J67440K1399Q8962
15292D201932K04236j04297R1459j08641K5251o7039o0485j2969q2841J33504
15282D220110j3621p544k0359k04688K02663j28162M53882K27964m26155k95670
15272D008420J09250K17083K1802J95220k65971R7580N8964j76873J03085j19503
15262D249057k83733j04384M9352J22618K58464J07147p354R3383k37445M1025
$$ plain form
15252 4288130 3760276 3829968 3974224 4444119 4470944 4370991 4470298 4158779 3914509 3957633
15242 3957633 3933365 4101783 4258922 4574614 4672640 4578948 4576665 4370839 4372509 4453395 4480519
15231 4480519 4551509 4431960 4686267 4484143 4276791 4181239 4214166 4115486 4054425 4370789
$$ packed form
15252D288130n27854O9692J44256M69895K6825r9953R9307l11519k44270M3124
15242C957633k4268J68418J57139L15692R8026r3692k283k05826J670Q0886K7124
15231D480519P0990j19549K54307k02124k07352r5552L2927r8680o1061L16364
$$ [...]
##END NTUPLES=NMR SPECTRUM
##END=
