##TITLE=1H_CG-1146-X2
 DMSO, 8 sc, 
 11.05.2021
##JCAMPDX= 6.0         $$ Bruker NMR JCAMP-DX V2.0
##DATA TYPE= NMR SPECTRUM
##DATA CLASS= NTUPLES
##ORIGIN= UXNMR, Bruker Analytische Messtechnik GmbH
##OWNER= root
$$ XWIN-NMR		Version 3.5
$$ Tue May 11 10:17:52 2021 Russian Standard Time (UT+4h)  she@DPX200
##.OBSERVE FREQUENCY= 200.131506
##.OBSERVE NUCLEUS= ^1H
##.ACQUISITION MODE= SIMULTANEOUS
##.ACQUISITION SCHEME= undefined
##.AVERAGES= 8
##.DIGITISER RES= 18
##SPECTROMETER/DATA SYSTEM= spect
##.PULSE SEQUENCE= zg30
##.SOLVENT NAME= DMSO
##.SHIFT REFERENCE= (INTERNAL, DMSO, 0, 15.9937)
##AUDIT TRAIL= $$ (NUMBER, WHEN, WHO, WHERE, WHAT)
$$ ##TITLE= Audit trail, XWIN-NMR		Version 3.5
$$ ##JCAMPDX= 5.01
$$ ##ORIGIN= Bruker BioSpin GmbH
$$ ##OWNER= she
$$ F:/spectra/data/she/nmr/H-F/1/pdata/1/auditp.txt
$$ ##AUDIT TRAIL=  $$ (NUMBER, WHEN, WHO, WHERE, WHAT)
(   1,<2021-05-11 10:16:32.23 +0400>,<she>,<DPX200>,
      <created by zg, POWCHK disabled, PULCHK disabled
       configuration hash MD5:
       00 E9 B6 7A A2 85 ED C7 34 08 36 98 17 FE 4E 26
       data hash MD5: 16K
       40 FE 48 D2 96 B9 D7 CF BF 43 8A 2E 71 61 42 A9>)
(   2,<2021-05-11 10:16:34.57 +0400>,<she>,<DPX200>,
      <Start of raw data processing
       efp BC_mod = 2 LB = 0.24 FT_mod = 6 PKNL = 1 PHC0 = -11120.57 PHC1 = 12.601 SI = 16K 
       data hash MD5: 16K
       D3 DC 99 18 61 DF AF C7 32 35 42 09 AA BC 67 9E>)
(   3,<2021-05-11 10:16:56.48 +0400>,<she>,<DPX200>,
      <pk PHC0 = -6.00834 PHC1 = 3.200001 
       data hash MD5: 16K
       49 85 D6 E3 E9 9E C5 03 8F EC FD 7B F9 74 59 23>)
(   4,<2021-05-11 10:17:00.18 +0400>,<she>,<DPX200>,
      <abs ABSG = 5 
       data hash MD5: 16K
       8A 1B 37 92 39 F3 0D 1B D2 B3 41 59 6D 09 46 61>)
$$ ##END=
$$ 
$$ hash MD5
$$ 7E A2 88 85 AF F3 7F 65 2C 1C 62 07 A2 0F 5A F8
##$RELAX= 
##$RELAX= 
##$RELAX= 
##$RELAX= 
##$RELAX= 
##$RELAX= 
$$ Bruker specific parameters
$$ --------------------------
##$DU= <F:/spectra>
##$EXPNO= 1
##$NAME= <H-F>
##$PROCNO= 1
##$TYPE= <nmr>
##$USER= <she>
##$AMP= (0..31)
100 100 100 100 100 100 100 100 100 100 100 100 100 100 100 100 100 100 
100 100 100 100 100 100 100 100 100 100 100 100 100 100 
##$AQSEQ= 0
##$AQ_mod= 1
##$AUNM= <au_zg>
##$AUTOPOS= <>
##$BF1= 200.13
##$BF2= 200.13
##$BF3= 200.13
##$BF4= 200.13
##$BF5= 200.13
##$BF6= 200.13
##$BF7= 200.13
##$BF8= 200.13
##$BYTORDA= 1
##$CFDGTYP= 0
##$CFRGTYP= 5
##$CHEMSTR= <none>
##$CNST= (0..31)
1 1 145 1 1 1 1 1 1 1 1 1 1 1 1 1 1 1 1 1 1 1 1 1 1 1 1 1 1 1 1 1 
##$CPDPRG= <>
##$CPDPRG1= <>
##$CPDPRG2= <>
##$CPDPRG3= <>
##$CPDPRG4= <mlev>
##$CPDPRG5= <mlev>
##$CPDPRG6= <mlev>
##$CPDPRG7= <mlev>
##$CPDPRG8= <mlev>
##$CPDPRGB= <>
##$CPDPRGT= <>
##$D= (0..31)
0 1.2 0 0 0 0 0 0 0 0.06 0 0.03 0 0 0 0 0.0002 0 0 0 0 0 0 0 0 0 0 0 0 
0 0 0 
##$DATE= 1620713791
##$DBL= (0..7)
120 120 120 120 120 120 120 120 
##$DBP= (0..7)
150 150 150 150 150 150 150 150 
##$DBP07= 0
##$DBPNAM0= <>
##$DBPNAM1= <>
##$DBPNAM2= <>
##$DBPNAM3= <>
##$DBPNAM4= <>
$$ [...]
##$SUBNAM3= <"">
##$SUBNAM4= <"">
##$SUBNAM5= <"">
##$SUBNAM6= <"">
##$SUBNAM7= <"">
##$SUBNAM8= <"">
##$SUBNAM9= <"">
##$SW= 16.9725357007746
##$SWIBOX= (0..15)
0 0 2 0 0 0 0 0 0 0 0 0 0 0 0 0 
##$SW_h= 3396.73913043478
##$TD= 16384
##$TD0= 1
##$TE= 0
##$TE2= 300
##$TE3= 300
##$TEG= 300
##$TL= (0..7)
0 120 120 120 120 120 120 120 
##$TP= (0..7)
150 150 150 150 150 150 150 150 
##$TP07= 0
##$TPNAME0= <>
##$TPNAME1= <>
##$TPNAME2= <>
##$TPNAME3= <>
##$TPNAME4= <>
##$TPNAME5= <>
##$TPNAME6= <>
##$TPNAME7= <>
##$TPOAL= (0..7)
0.5 0.5 0.5 0.5 0.5 0.5 0.5 0.5 
##$TPOFFS= (0..7)
0 0 0 0 0 0 0 0 
##$TUNHIN= 0
##$TUNHOUT= 0
##$TUNXOUT= 0
##$USERA1= <user>
##$USERA2= <user>
##$USERA3= <user>
##$USERA4= <user>
##$USERA5= <user>
##$V9= 5
##$VALIST= <valist>
##$VCLIST= <CCCCCCCCCCCCCCC>
##$VD= 0
##$VDLIST= <DDDDDDDDDDDDDDD>
##$VPLIST= <PPPPPPPPPPPPPPP>
##$VTLIST= <TTTTTTTTTTTTTTT>
##$WBST= 1024
##$WBSW= 4
##$XGAIN= (0..3)
0 0 0 0 
##$XL= 0
##$YL= 0
##$YMAX_a= 195104
##$YMIN_a= -217486
##$ZGOPTNS= <>
##$ZL1= 120
##$ZL2= 120
##$ZL3= 120
##$ZL4= 120
##$ABSF1= 15.98128
##$ABSF2= -0.9913816
##$ABSG= 5
##$ABSL= 3
##$ALPHA= 0
##$AQORDER= 0
##$ASSFAC= 0
##$ASSFACI= 0
##$ASSFACX= 0
##$ASSWID= 0
##$AUNMP= <proc_1d>
##$AZFE= 0.1
##$AZFW= 0.1
##$BCFW= 0
##$BC_mod= 2
##$BYTORDP= 0
##$COROFFS= 0
##$CY= -3
##$DATMOD= 1
##$DC= 0
##$DFILT= <>
##$DTYPP= 0
##$F1P= 0
##$F2P= 0
##$FCOR= 1
##$FTSIZE= 16384
##$FT_mod= 6
##$GAMMA= 0
##$GB= 0
##$INTBC= 1
##$INTSCL= 1.334414e-10
##$ISEN= 128
##$LB= 0.24
##$LEV0= 0
##$LPBIN= 0
##$MAXI= 10000
##$MC2= 0
##$MEAN= 0
##$ME_mod= 0
##$MI= 1.114404
##$NCOEF= 0
##$NC_proc= -7
##$NLEV= 6
##$NOISF1= 3.799351
##$NOISF2= 2.8
##$NSP= 0
##$NTH_PI= 0
##$NZP= 0
##$OFFSET= 15.99371
##$PC= 1
##$PHC0= -11126.58
##$PHC1= 15.801
##$PH_mod= 1
##$PKNL= yes
##$PPARMOD= 0
##$PSCAL= 0
##$PSIGN= 0
##$REVERSE= no
##$SF= 200.130003547928
##$SI= 16384
##$SIGF1= 3
##$SIGF2= 2
##$SINO= 5.538805
##$SIOLD= 16384
##$SREGLST= <1H.CDCl3>
##$SSB= 0
##$STSI= 16384
##$STSR= 0
##$SW_p= 3396.73913043479
##$SYMM= 0
##$S_DEV= 0
##$TDeff= 16384
##$TDoff= 0
##$TI= <>
##$TILT= no
##$TM1= 0
##$TM2= 0
##$TOPLEV= 0
##$USERP1= <user>
##$USERP2= <user>
##$USERP3= <user>
##$USERP4= <user>
##$USERP5= <user>
##$WDW= 1
##$XDIM= 16384
##$YMAX_p= 277357772
##$YMIN_p= -854613
$$ End of Bruker specific parameters
$$ ---------------------------------
##NTUPLES= NMR SPECTRUM
##VAR_NAME=  FREQUENCY,     SPECTRUM/REAL,   SPECTRUM/IMAG
##SYMBOL=    X,             R,               I
##VAR_TYPE=  INDEPENDENT,   DEPENDENT,       DEPENDENT
##VAR_FORM=  AFFN,          ASDF,            ASDF
##VAR_DIM=   16384,         16384,           16384
##UNITS=     HZ,            ARBITRARY UNITS, ARBITRARY UNITS
##FACTOR=    0.207333158178282, 1,           1
##FIRST=     3200.82115182967, 0,            0
##LAST=      -195.917978605116, 0,           0
##MIN=       -195.917978605116, -854613,     0
##MAX=       3200.82115182967, 277357772,    0
$$ Real data points
##PAGE= N=1
##DATA TABLE= (X++(R..R)), XYDATA
$$ [...]
9383 -65571 126094 87251 -8900 134516 49898 -146697 -95767 -270650 -121246 57016 21432
9372 21432 26187 -54328 -265192 -87885 94266 260572 165638 219905 104483 -63844 -39688
9361 -39688 -175375 -236252 -375898 -348563 -173268 168524 -16557 -39287 -32302 -7469 340124
9350 340124 278290 175746 251989 37013 -97285 -234775 -186990 -220923 127035 110955 133213
9339 133213 -169580 -339987 -117908 -68281 135501 171101 85173 108496 -92601 72394
9329 72394 92049 154533 371447 -24838 -122532 -254058 -145222 -64687 113219 278575 374553
9318 374553 103190 225556 379029 162341 -2856 113307 93797 80387 165155 27500
9308 27500 10249 -292137 -156551 -76477 46503 299815 379159 -13989 -86032 29431 -10082
9297 -10082 3209 -196022 50369 332002 170056 156173 98360 3122 139313 115168 58259
9286 58259 206888 -184366 -263760 -298388 -186267 -82549 -434942 -267150 170689 189549
9276 189549 -83019 178233 101945 14745 127484 205450 7883 -15321 266438 453892
9266 453892 366168 35550 -49661 121315 234016 206728 215345 203493 84283 119572 126364
9255 126364 10222 -11378 -250338 -176432 25606 119270 137525 193117 514519 399985 73731
9244 73731 -114984 83680 137827 92571 152415 206021 162249 219717 139706 7876 319406
9233 319406 564732 717724 418501 27678 361588 197445 -25445 -17543 116795 -154233
9223 -154233 47213 12510 142293 457482 320089 342367 169413 139751 271083 32225
9213 32225 133124 476978 413193 317255 434681 197604 139983 245104 637527 624317 378358
9202 378358 425941 458800 558754 457788 235914 111648 333018 89671 -87869 160568
9192 160568 302271 372545 212893 77125 291409 191271 198613 286256 124713 288730
9182 288730 577493 645200 591662 444916 997853 722994 720031 555191 663959 596862 500657
9171 500657 701805 516414 497264 653420 773003 888600 743238 460736 647092 820065
9161 820065 730235 846601 631358 670362 877989 997701 867394 494378 722140 869878
9151 869878 644501 618269 502695 561081 540505 863102 985983 742388 789497 1016565
9141 1016565 872235 944983 1110096 960770 1073379 1193071 1271179 1306745 1385349 1283043
9131 1283043 1175204 930452 943042 811268 911960 908606 857827 1097952 1168302 937379
9121 937379 1075103 1150070 1184697 1179711 1056002 1345406 1558821 1649490 1554741 1476673 1750523
9110 1750523 1510123 1579266 1871106 2005532 1861051 1989281 1965511 1855892 1809495 2076241
9100 2076241 2202594 2390199 2370014 2691697 2410278 2327734 2182248 2080281 2429087 2583295
9090 2583295 2736437 2611379 2672534 2587622 2866172 2837445 2964708 3069897 3061871 3303920
9080 3303920 3631535 3556098 3339291 3575454 3852920 3772973 3943423 4067236 4054546 4100940
9070 4100940 4122506 4388953 4928194 4931815 5075896 5364577 5469455 5652355 5843186 5658434
9060 5658434 5912268 5711763 5814927 6125638 6398859 6738297 6720407 7042118 7162890 7284876
9050 7284876 7656337 8078247 8223775 8574394 8908976 9309394 9751740 10427773 11101834 11674364
9040 11674364 12053999 12724749 13616559 14287219 14921104 15784285 17051618 18104376 19403541
9031 19403541 20633439 21935745 23869369 25715625 27418650 29683838 32629375 35985061
9023 35985061 39707871 44112597 49864027 57397840 66743684 77800033 89212749 103132748
9015 103132748 116936418 126603370 131122192 126685462 111323566 92342700 75799594
9008 75799594 62104704 51874178 44147245 38462709 33736666 30123689 26954262 24339912
9000 24339912 21941477 20318012 18669409 17273942 16443558 15323465 14208033 13539344
8992 13539344 12900538 12102374 11667182 11269635 10622732 10143453 9886476 9458840 9129785
8983 9129785 8463115 8023308 7362629 7035901 7066332 6811203 6813366 6899116 6419003 6150884
8973 6150884 6017855 5672535 5572117 5411331 5313687 5132250 5031578 4848957 4933426 4718529
8963 4718529 4400961 4211583 3851681 3705597 3548605 3392911 3287826 3096287 3073252 3061840
8953 3061840 2900918 2901826 2614580 2620796 2624322 2414679 2506410 2495297 2420775 2461122 2408578 2580102
8941 2580102 2241420 2121756 2317002 2067693 2152163 2216419 2218326 1775895 1588163 1488441
8931 1488441 1751476 1748451 2006794 2019066 1692910 1841234 1907494 1634501 1608600 1827713
8921 1827713 1641345 1498305 1732566 1809721 1649187 1862530 1944912 1715429 1525064 1336582
8911 1336582 1213825 1246496 1310994 1232854 1227286 1455915 1179308 983021 1134669 1165237 1276812
8900 1276812 1733620 1644362 1466526 1450894 1433241 1353347 1323441 1149943 924325 1383609
8890 1383609 1751939 1445038 1380113 1235438 1386754 1425061 1717561 1641303 1431693 1058059
8880 1058059 1188608 1283669 1041143 1215080 1153048 1014482 784354 778241 1015517 897930
8870 897930 1017588 1168700 1232674 1092767 607486 436572 541940 829975 1063387 1014020
8860 1014020 827368 626445 394897 478065 369421 269929 285374 408563 274257 379502
8850 379502 532424 612030 345620 429121 567064 428834 755370 977193 568484 169920
8840 169920 -48209 304814 647324 791896 762890 466308 342478 303422 -24926 359481
8830 359481 632305 593659 323570 290760 180018 -37945 156575 -254434 -138057 -309188
8820 -309188 -48228 244303 228555 400715 290182 109188 227282 -36681 -165980 23214
8810 23214 -129296 129677 7639 206635 180945 218754 118321 203732 42751 -461359
8800 -461359 -577564 -337154 64882 175151 107481 168510 96971 556866 267449 43913
8790 43913 232573 -85716 11524 131231 115243 9911 29448 142410 17606 -84241
8780 -84241 85926 -43192 46828 94074 9536 -183051 -162388 103590 435588 11730 9420
8769 9420 83648 -48626 -153329 -2595 121701 20199 -69157 -86685 -345678 -197890 -38571
8758 -38571 -158550 -52349 -191880 -189405 -139299 34941 52018 39985 9083 -277692 -81348
8747 -81348 37198 143242 -86263 -136654 -309109 -266484 -297618 -215864 -327256 -338973 89987
8736 89987 111055 -37276 117594 139976 74508 14892 116181 145848 44322 53122 214833
8725 214833 -67653 -182746 64867 -132494 -137654 -56348 230565 44100 -164826 -452720
8715 -452720 -232995 -147242 -17143 -72560 103942 73514 -86829 15475 18188 -43499 -272280
8704 -272280 -141113 -113149 -80316 -17125 154198 -4410 47529 101372 151550 80129 -242005
8693 -242005 115919 97007 187100 301103 -70322 -325732 -128975 28730 23443 183534
8683 183534 126173 -32231 69970 -145286 84101 254244 -29854 -260790 -67061 -64704
8673 -64704 120432 345671 44817 81481 100545 437 60367 90663 -143295 -242771 -67888
8662 -67888 56356 185716 240223 102894 -76778 9928 74917 -24157 -159329 -74569 125058
8651 125058 67222 112689 220506 90799 -142358 -70268 -123943 -177958 -185724 -50532 -140134
8640 -140134 -117517 4094 -97113 -59674 63342 156090 7929 10383 19853 -31990 94800
8629 94800 109364 296339 345472 17371 -132582 88926 194108 26004 130487 27779
8619 27779 297275 284566 45975 -152821 61559 -65525 69203 394185 210631 207888
8609 207888 382486 516929 262021 165708 74298 265316 396190 606689 492265 -64364
8599 -64364 -180475 -88533 177087 162002 -18407 35238 255577 331523 309909 -23350 -64448
8588 -64448 -65939 158638 151691 211240 380196 90096 74739 190872 341633 221107 488756
8577 488756 410419 388841 353179 213168 205422 190752 -57328 -94455 -42309 181109 220770
8566 220770 88802 276261 150175 262934 392003 337509 410859 529724 579909 542742
8556 542742 521007 225385 192386 233607 444519 189900 218629 326562 447122 444548 579354
8545 579354 560599 540005 679252 768138 599468 609473 793489 731241 606160 645765 541301
8534 541301 476094 579483 847682 914388 681459 461497 849298 974559 725594 855619
8524 855619 779743 415698 551251 516771 526598 373290 560788 835872 639124 511171
8514 511171 583661 795800 771136 922957 771934 539169 740188 789890 772467 905659
8504 905659 574730 833728 895125 1106648 926321 651873 651773 473418 560665 915701 888698
8493 888698 863839 784818 1074371 908578 952100 1048683 900389 910730 900203 1048448 993533
8482 993533 1034017 894658 853679 1069684 929802 965594 834036 746075 538822 386754
8472 386754 448210 730928 718482 582844 512439 615434 726852 643451 545830 814429 636028
8461 636028 489759 299617 338712 538594 842229 811943 609247 531630 648100 463464
8451 463464 192833 440766 646025 725340 633516 565364 528337 600393 730308 659311 779780
8440 779780 893399 776898 780787 794347 1023771 775777 505498 585397 690010 762147 791836
8429 791836 893947 687633 758289 785576 644274 918065 745715 616076 626772 873878
8419 873878 1054964 1067556 832326 772360 1071016 1152999 873097 1062794 1233985 1092256
8409 1092256 975469 928227 821694 878704 1229478 1134383 1029057 1363121 1520828 1290397
8399 1290397 936629 1115860 1339857 1660102 1516255 1347520 1441035 1540731 1361650 1296277
8389 1296277 1175468 1194227 1179224 1163068 1399081 1335994 1301808 1451314 1697186 1728726 1439973
8378 1439973 1773902 1566883 1474617 1349262 1258388 1477155 1436035 1328087 1340305 1507605
8368 1507605 1760362 1711156 1636428 1764320 2246909 2375010 2262087 2443369 2513687 2516829
8358 2516829 2344450 2458294 2391814 2456851 2862439 2752394 2641178 3074827 3303229 3133705
8348 3133705 3151645 3358797 3362788 3755438 3935653 3911994 3934851 3992854 3915677 3846656 4104625
8337 4104625 4254757 4333704 4330494 4422832 4418064 4550058 4704186 4901192 5139384 5083244 5263443
8326 5263443 5391895 5259650 5559971 5623321 5681333 6026824 6234013 6948588 6962282 6948991
8316 6948991 7710220 8303512 8690165 9156043 9516441 10060335 10748784 11517079 12490226 13178249
8306 13178249 14324744 15445984 16280162 18053444 19304711 20530931 21828733 23048983
8298 23048983 23837444 24093041 24563020 24654283 24089682 23177405 21986397 20869672 19269709
8289 19269709 18205583 17518580 16293640 15133596 14371478 13745535 13443416 12993656 12517422
8280 12517422 12416522 12319599 12260647 12218745 12216492 12869515 13078018 13440623 14078643 14514458
8270 14514458 15056433 15727201 16735741 17848517 19025620 20138009 21415745 22703445
8262 22703445 24020040 25220769 26260461 26959245 27506638 27475117 26934985 26287512 25190696
8253 25190696 23823983 22204119 20366067 18638304 17128174 15518044 13974317 12985960
8245 12985960 12051472 11252608 10846674 10236069 9489821 8984873 8582140 8205285 7813119
8236 7813119 7610201 7325309 6927459 6480510 6439308 6077141 6025612 6017523 6094533 6022158 5744696
8225 5744696 5817621 5627644 5635444 5678660 5607814 5331279 5237167 5018610 5150353 5132952 5004525
8214 5004525 4741529 4650918 4917249 4658593 4470642 4565341 4834273 4736258 5110435 4980873
8204 4980873 4986405 5040889 4913636 5178570 4930224 5011107 5000604 5115660 5128566 5337092 5422662
8193 5422662 5798765 6669754 5975307 5971222 5847195 6013366 6393195 5943323 6125394 6591861
8183 6591861 6723383 6604705 7176504 7418643 7793009 8123727 8382727 8748873 8833348 9194848
8173 9194848 9704801 10403568 11011898 11576163 12289267 13013939 14073129 15358230 16407336
8164 16407336 17633982 19214829 20474450 21916240 23198903 24176764 25078051 25388679 25701483
8155 25701483 25520243 24849990 24423384 23460756 22262235 21247873 20234752 18858200 17457100
8146 17457100 16802955 15684062 14865712 14430992 13953994 13816913 13369008 13007065 13360876
8137 13360876 13749198 13807029 13644144 14060171 14794584 15390393 16120327 17235909 18145242
8128 18145242 19382612 20674729 22265025 24257597 25749695 26905505 27924551 28629486
8120 28629486 29004786 29108795 28741073 28175493 27113439 25529354 23807665 22076772 20237254
8111 20237254 18292562 16538328 15110867 13926477 12738814 11526398 10622190 9558743
8103 9558743 9083689 8562129 8040283 7727239 7042943 6731349 6309560 5775305 5705721 5395979
8093 5395979 5173718 5283927 5132415 4718506 4540931 4496231 4145427 3876685 3905855 3857422
8083 3857422 3820740 3979273 4045527 4133477 4041835 3641859 3338941 3250138 3256426 3050543 3019249
8072 3019249 3017789 3117167 3005202 2564694 2393486 2557184 2729429 2653655 2195532 2280134
8062 2280134 2360872 2460077 2233325 1880202 2008342 2045928 2206017 2181404 2038174 1999324
8052 1999324 1765911 1646464 2032749 2037429 1894248 1672711 1876227 1976590 1983026 1815280
8042 1815280 1747590 2054745 2047188 1917329 1859265 1637812 1601094 1803843 1612839 1472658
8032 1472658 1345399 1695503 1638818 1486047 1507635 1580955 1615934 1777076 1695431 1545272
8022 1545272 1536138 1653298 1718057 1801735 1580302 1461589 1721685 1611830 1484400 1270001
8012 1270001 1322396 1323524 1587111 1547276 1497094 1521993 1533790 1784911 1755438 1710021 1666213
8001 1666213 1629266 1605713 1489648 1372409 1400514 1552388 1764761 1831556 1681237 1432489
7991 1432489 1565431 1540509 1437044 1522764 1666110 1562207 1586929 1862128 1964074 2063410
7981 2063410 2192026 2256267 2237053 2225642 2136172 2024198 2113915 2476271 2478406 2423198 2494598
7970 2494598 2609376 2495355 2305278 2284943 2151669 2213036 2466633 2287532 2612665 2642885
7960 2642885 2631659 2799691 2843702 2970121 3059213 2917037 2827558 2976536 3304197 3285884
7950 3285884 3343617 3618584 3571009 3689226 3762331 3901422 4086048 4119898 4079245 4358603
7940 4358603 4351785 4509785 4886434 5005507 5188847 5330641 5444254 5715022 5800821 5966562
7930 5966562 6284651 6402199 6751573 6912173 7563575 8094555 8334692 9034637 9874091 10505926
7920 10505926 11115478 11604314 12202238 12814307 13278114 13680758 13536469 13716917 13690279 13386378
7910 13386378 13283614 12898991 12554989 12201895 11775932 11230901 11079094 11074670 10792841 10698803
7900 10698803 10821693 10862338 10933366 11695682 12228230 12352822 12685702 13151793 14223881 14862778
7890 14862778 15566372 16822232 18064212 18979109 20348828 21495561 22357129 23634964 24453209
7881 24453209 24700570 24875412 25054758 24621844 24356539 23457316 22478405 21515397 20854523
7872 20854523 20074706 18654265 17762466 16713863 15849070 14978873 14169383 13868112 13516128
7863 13516128 13261708 12738960 12544042 12468380 12504673 12626199 12863751 12971393 13198908 13448681
7853 13448681 13672775 13933443 14877864 15814819 16708471 17475396 17974327 18619066 19476432
7844 19476432 19999169 20009182 19918197 19562555 19236706 18781396 18418632 17894470 17405509 16509474
7834 16509474 15595817 14702809 13956666 13326107 12903397 12124625 11747584 11713352 11657946 11591669
7824 11591669 11398817 11638623 11775544 11899670 12047325 12251689 12787444 13063631 13334600
7815 13334600 14065783 14805241 15708628 17045327 17872365 19098909 20440163 21557005 22605240
7806 22605240 23378980 24132707 23842110 23746678 23349110 22604697 21554746 20627696 19303062
7797 19303062 17927197 17008738 16006923 15007256 14199753 13783354 13454101 13460166 13138208
7788 13138208 12833155 12792870 12429865 12779844 12535611 13302715 14054526 14395785 15245266 15747383
7778 15747383 17063872 18054811 19018391 20155700 21477236 22844627 24139439 25187551
7770 25187551 25816086 26503871 26623149 26159273 25723408 24766538 23561949 21994305 20388915
7761 20388915 18491274 16704162 15413569 14347774 13253498 12378268 11656062 11050222 10409014
7752 10409014 10166042 10018878 9740234 9723257 9498701 9110910 8917313 9068217 9244010 9189493
7742 9189493 9453424 9996224 10430929 10405315 10959861 11656774 11865492 11992583 12022753 12025761
7732 12025761 11520073 11079533 10599808 10008251 9303025 8314908 7719172 7022042 6393993
7723 6393993 6054185 5658917 5242159 4676936 4654161 4347693 4106039 4089584 3618348 3383031
7713 3383031 3627266 4001452 3843380 3378880 3058442 2900887 3188279 2970963 2604262 2693682
7703 2693682 2514859 2358960 2359081 2191266 1970789 2092195 2051727 1745249 1797148 1957170
7693 1957170 1707645 1620989 1462647 1412046 1265572 1189090 1423351 1324574 1338970 1246191 1191962
7682 1191962 1211062 1204347 1272866 1209824 1017520 1077787 1204133 1085210 1091966 1123045 973918
7671 973918 1123634 906051 1022569 897137 699921 859505 984889 695790 607421 752670
7661 752670 775561 697275 478062 594435 391522 628887 609436 481088 551788 433824
7651 433824 570316 622319 678933 446637 317909 391721 347750 352893 163949 158132 247959
7640 247959 463070 422771 115402 -25378 -90803 -287018 -129047 33950 256868 22175
7630 22175 330167 510135 330122 215052 458494 661383 654520 549435 288814 410355
7620 410355 318300 200083 189627 153069 127443 148357 296869 293338 19863 -54942 -5133
7609 -5133 53661 -104117 -20568 99591 -60555 -32119 100993 -94054 -52018 -154380 7370
7598 7370 143964 -20344 -44792 33078 -204044 -169605 -163871 -252868 -228316 -123868 -41378
7587 -41378 -68933 95653 363596 130842 144502 76025 -280760 -393386 -128786 -199847 -346563
7576 -346563 -119435 -335461 -19116 -25407 111361 -80784 -235925 -195169 -144207 -82356 -130172
7565 -130172 -280535 -351414 -239464 -76656 -21278 -602841 -535931 -329110 -356860 -148035
7555 -148035 -98240 -60165 81994 62952 -180368 -412116 -181789 -136842 -219500 -41646 -284918
7544 -284918 -105145 173742 -65211 153089 114922 -222766 -328035 -186510 -226363 -151163
7534 -151163 -370059 -235659 -7287 82075 7472 -97168 -160247 -91173 -176283 -188973 -229594
7523 -229594 -145534 55360 252451 12841 -309457 -290344 21795 -27933 -343009 -266226
7513 -266226 -54893 -18338 83185 192700 234280 205882 -14444 -115315 -263087 -273081 -208502
7502 -208502 -254344 -462245 -394948 -70129 150252 -39813 248484 68222 132920 -61406
7492 -61406 -313067 -137935 -117426 -290121 -197934 -109422 -300970 -276595 -218167 -173645 13639
7481 13639 161172 146002 22587 -49338 -107008 16160 83460 44459 -168630 -174740 -393515
7470 -393515 -273285 -350784 -204927 284 -212517 -300757 -290049 -166466 207632 67016
7460 67016 -20709 -93401 -201004 -34642 -52094 -58293 -166126 -153747 -54694 -348002 -210213
7449 -210213 109598 83795 -66341 -345130 -319144 -458254 -483900 -440081 -130628 -161770 -163937
7438 -163937 -322912 -196386 -39916 -4869 -184926 -221959 -210195 -193776 24584 -31204 7871
7427 7871 -29718 186572 56761 -113493 -202308 -234230 -277253 -258977 -82397 -63076 -291937
7416 -291937 -288493 -333107 -97602 -110663 -179524 -265195 -298538 -128436 -163836 -176642 -153007
7405 -153007 -189821 -11013 129737 337005 389410 243605 122190 91894 259322 137413
7395 137413 -195222 -237947 -73724 -173555 63172 6478 -61943 -228768 -515893 -572746 -431362
7384 -431362 -203039 -155951 -156235 -173475 -201614 -228662 -164126 79706 -289787 -205381 -266947
7373 -266947 -17167 -200412 -200283 -248223 -206132 -221044 -205276 -242927 -54848 -197850 -323011
7362 -323011 -218038 -184469 -24946 32385 -339059 -443292 -115985 -58224 -113875 -326495
7352 -326495 -227093 -191659 -136213 -268162 -359453 -276765 -438505 -418030 -398826 -413378 -201970
7341 -201970 58123 -79586 -310159 -171669 -287531 -379950 -166237 -343797 -514397 -531560
7331 -531560 -605218 -630151 -418929 -249444 -314586 -129087 -10705 -155845 -258926 -307853
7321 -307853 -466446 -148046 -103219 -428049 -485555 -737244 -669962 -246505 -500539 -356427
7311 -356427 3128 140487 -94942 -251747 -396410 -570555 -265850 1667 -104238 -160836
7301 -160836 -187343 -105517 -306695 -463668 -360187 -317302 -212088 88126 -295495 -187074
7291 -187074 -57369 -32560 250021 322079 7301 18659 -221726 -384495 -500246 -373350
7281 -373350 -160487 -280648 -476678 -77678 42366 210459 45283 -33066 28233 -139993
7271 -139993 -105708 -255400 -347553 -436763 -161267 -226529 -172673 -58236 -16944 -48394 -97850
7260 -97850 70022 84195 66788 116746 -13114 88374 -58072 -416937 -270832 -95890
7250 -95890 -33971 282980 76463 -315458 -367530 -81006 -161476 -221879 -74785 -160738 -301117
7239 -301117 -319379 -538321 -311710 -130755 -258413 -198708 -602358 -655464 -477367 -147423
7229 -147423 -26640 -234965 -345967 -74537 9504 20603 89962 164115 183637 140376 89886
7218 89886 -221315 -312342 85045 219974 113014 -76797 -238030 -238970 -332679 -462458 -413663
7207 -413663 -278248 -142876 113193 -45376 -10999 -281741 -338652 -356203 -150942 -9520
7197 -9520 -51168 -129090 -271562 -403592 -159705 -99545 187719 -118812 -242267 -220385 -372635
7186 -372635 -380534 -267378 -298006 -381028 -215787 -12562 184725 58536 -79656 -78222 -168455
7175 -168455 -4095 -73672 -129751 -95092 -9405 20130 190186 -16280 -135686 -90586 -74599
7164 -74599 -170197 -204910 -127186 -194260 -201341 -590533 -245604 -138989 -217390 -109907 -135145
7153 -135145 -215029 59735 357562 223146 -22119 75119 271120 6938 -242636 -348122
7143 -348122 -253219 19997 30819 -6989 -63641 -30736 -52061 241897 116790 -198458 -192172
7132 -192172 -239203 -364422 -85141 -16011 147184 162846 339612 354483 77321 -34236
7122 -34236 -169622 -1320 396878 199844 -28417 -34721 -19240 107763 225679 175639 415219
7111 415219 599871 305622 -5806 -40491 136333 383233 134615 -50045 52785 423514
7101 423514 348099 -98878 -249379 -187670 163540 197355 -69485 -108022 -275718 -241454 -295512
7090 -295512 -343816 2001 -34572 -147422 -96861 -113270 -409666 -30043 -117811 -288515 -262537
7079 -262537 -140171 117840 119225 33090 25248 -249911 -353037 -207660 -169764 -180021 -100153
7068 -100153 27384 -63088 -229895 -109583 104530 93758 -104520 16592 56194 112751
7058 112751 -33735 -228390 -415789 -402634 -326824 -399575 -453160 -348272 -114013 -172328 -167449
7047 -167449 -100662 -252633 -604759 -176358 -154258 -208232 43678 137701 252319 316743 319231
7036 319231 38957 56432 -158297 -299421 -132915 -90169 -18725 -211072 -355975 -332948
7026 -332948 -45530 134716 24321 29717 176371 -108363 -200715 -441602 -311454 -291061
7016 -291061 -467611 -316588 -69229 -215409 -202977 -201984 -405369 -519601 -603239 -276612 -272935
7005 -272935 -407844 -344898 -221539 -402408 -376914 -363399 -306482 -247271 -79526 -41813 -290864
6994 -290864 -306825 -225954 -102633 -166158 -331637 -263244 -13143 -195665 -212371 -209548 -347571
6983 -347571 -145560 -356673 -587661 -337134 31494 -161523 -221917 -282432 -253708 2929
6973 2929 -34066 -268828 -194862 -85511 -202409 -111155 -75383 -174047 -86270 -155021 -309528
6962 -309528 -603071 -286241 -184298 -385280 -254492 -206971 -166870 -210400 -233114 -15462
6952 -15462 -172474 -225739 -246821 -150505 111408 118154 72434 -30607 -190892 -158225 162784
6941 162784 -176767 -263859 -26986 -6325 109452 -56716 -55199 -180722 -258071 97011 67151
6930 67151 202124 -11556 -33372 101848 -187756 -251534 -70603 -143119 -237085 -153402 -365852
6919 -365852 -478358 -396413 -302029 -201836 43593 -136206 -148529 -136276 -380857 -237127
6909 -237127 -118696 -142488 -159713 -155357 -331878 -91069 -136377 -189309 -339245 -283809 25839
6898 25839 -48053 -277073 -188558 -11275 -56126 -271748 -110236 151715 -99462 -119812 -9116
6887 -9116 27268 -111112 -423061 -238890 -217510 -276126 -214022 -174492 -415456 -605231 -358213
6876 -358213 -92294 62623 -132002 -210282 -368867 -359859 -28900 -35036 -192196 2171 226123
6865 226123 306415 268024 228666 136433 -260024 -460159 -291533 -111271 -104612 -304857 -63564
6854 -63564 -232622 -299943 -155521 -65807 -200195 5906 31786 -225820 -296503 -479556 -145276
6843 -145276 -155412 -284490 -367015 -397364 -48510 97765 86519 100473 151649 -18594 -278382
6832 -278382 -360681 -477641 -715144 -670436 -303214 -373228 -691156 -665301 -221226 -17031
6822 -17031 -79696 -166163 -260536 81852 91262 121927 -71770 -81328 33754 -120925 86478
6811 86478 -16254 -74554 42175 -81826 -428215 -477170 -391755 -203013 -291076 -134442 -196591
6800 -196591 26979 -94420 -100735 -102817 -144808 -174203 -266537 -30204 -45166 -200020 -93674
6789 -93674 -255018 -168997 23712 -30822 150715 11003 -340 17693 81763 146724 -114287
6778 -114287 -341568 -152449 -51468 -241308 -149703 137653 -183415 -325255 -199073 -116533
6768 -116533 -82644 -316995 -373628 79719 191432 91664 -251107 -106693 43841 -190933
6758 -190933 -374007 -76676 -53075 41027 53438 -3799 -74889 -212245 -89719 41109 179439
6747 179439 -34066 -272482 -53508 14509 123687 -135646 -497878 -168433 -103054 -184584
6737 -184584 -325362 -206797 -319 60627 49580 247886 26339 3872 -172891 -90956
6727 -90956 52312 -321357 -342082 -21984 -17503 -226520 -178724 -33175 229206 63450 74744
6716 74744 -37893 -107646 100442 -130894 -397642 -205641 -125601 -332111 -220174 -234333
6706 -234333 -297737 -199839 34496 124441 209397 141578 94940 -151391 -292010 -248037 -194114
6695 -194114 95030 -273892 -402308 -121908 -106978 -132237 -93714 -111596 71958 -3619 -8383
6684 -8383 199764 95050 -206627 -203856 -81823 -74159 -155597 -401165 -476054 -117111 22631
6673 22631 -272371 -281977 -40127 177934 169999 167192 66968 -13468 19035 218821 469528
6662 469528 434240 106209 40754 260958 406058 259728 190625 -28052 -8620 11720 -68858
6651 -68858 -194689 -344150 -391314 -94690 -64305 -149328 -116256 -311011 -233568 -56872 -381287
6640 -381287 -299432 -126736 -167944 -104435 -32517 -109296 -46541 -174869 -132493 -11477 -339062
6629 -339062 -34973 -94253 -174163 -141528 114767 79218 -144880 -471863 -377838 -70696 115795
6618 115795 168384 335413 152118 8504 -13921 136876 147581 317785 239706 -12859
6608 -12859 53633 48545 -155 -26017 55995 357520 108618 -70060 30885 78576 -85456
6597 -85456 -310368 -202842 -190149 -48829 -4019 6886 25972 286206 96452 -57784 -140382
6586 -140382 -271248 -128982 56760 42276 -126279 -90231 -109128 1711 205916 187550
6576 187550 248224 164265 64473 455441 465599 218288 81848 -262046 -170038 -148249 -165951
6565 -165951 -101695 28589 53623 123374 -33261 -13805 -104529 -4554 247361 281185 95832
6554 95832 -169476 -431124 -176164 -297658 -208377 -114156 -28959 -185642 -525423 -391128
6544 -391128 -54042 -92752 33032 479593 574353 521480 186267 48971 37013 722 8973
6533 8973 220415 53178 205212 275844 78816 267708 112119 -25850 308381 -63741
6523 -63741 -126938 142550 179709 -148388 -182409 -115533 -48803 7712 -251590 -268850 -255526
6512 -255526 -20152 98096 117539 312599 -3255 37760 318736 138624 160689 335174
6502 335174 220973 46824 45605 -141411 -124104 -179108 -97482 -176078 -74951 10157 -123607
6491 -123607 16667 -375565 -451520 -71209 90062 -261569 -184105 -124079 15113 -34830
6481 -34830 -391971 -344561 -196919 -180957 -201924 -56988 -59064 118228 -245317 -22983 123362
6470 123362 -112334 -119399 -142054 122170 293902 -46150 -156613 -302946 -203182 112503
6460 112503 -111139 -47565 236892 123888 52617 147446 281134 141530 -24705 100495
6450 100495 215638 336797 17131 -5110 169370 460993 263960 -125863 -119488 -185426
6440 -185426 -299384 -269256 -82110 236524 131195 95488 5778 -25756 -72361 370982 316960
6429 316960 243284 519926 303408 34172 135671 278530 269531 307458 123394 3289
6419 3289 314088 4784 135701 285158 165094 -19724 -32736 111716 17150 389742
6409 389742 175205 -162302 -204617 -110633 122188 70888 208516 230181 21795 146847
6399 146847 117302 -10454 -203024 -139214 296485 108566 241400 78651 -17278 333995
6389 333995 -72084 -261918 -342034 -187929 -235615 -52801 132418 247038 -5766 42010
6379 42010 -132294 -15383 -20503 -6446 295397 362007 180746 473272 384196 269095 -281991
6368 -281991 -232759 315510 122774 153101 320071 310559 -12362 60928 84367 -3918 -120544
6357 -120544 -230346 -51110 -12988 146708 73066 -19804 63364 -147192 -66780 -181157 -142602
6346 -142602 -23470 -27107 -1549 -385199 -320340 -31673 -149164 -406407 -506099 -298115 -157305
6335 -157305 -45097 5194 218634 136182 251796 121496 113886 -113252 -87114 -169253 -224530
6324 -224530 100799 -9371 23785 -94474 -66128 114245 -228319 -288878 81673 140610
6314 140610 183053 46218 85413 105323 57352 -18526 -65731 -110186 -105700 -135068 -110571 -113827
6302 -113827 -97788 -204243 -355595 -98279 72870 -179500 -207924 -58715 34042 -13684
6292 -13684 -73348 22165 -195753 -100503 -7034 -77709 135973 87690 73931 111055 187973
6281 187973 312275 245081 53691 -12327 85389 290358 357782 -4795 -155917 -143410 -76220
6270 -76220 -84280 86800 -47063 -89839 96987 96788 125993 -146615 -238901 -51616 207461
6259 207461 8115 -150470 24584 -124775 87259 134216 128517 38425 -141136 -63912 346402
6248 346402 368882 373198 231190 231406 -25080 -74116 130612 263944 191274 -75946 175087
6237 175087 230344 123918 88245 -14686 -76564 14847 314181 289155 -124698 12206 44677
6226 44677 -43930 -84565 -57152 8414 101309 192211 257984 170381 -124712 92143 144782
6215 144782 297517 303511 305307 490565 233122 -2004 -61889 -211614 -55413 -90470 -129113
6204 -129113 94190 172631 435616 526751 373667 121887 281261 152461 210091 105429
6194 105429 222511 450936 228389 321593 184060 144569 358592 32946 -130001 44164
6184 44164 80981 172172 108687 -98883 -193959 38288 211912 107501 257460 -7908 153009
6173 153009 144539 31186 61350 -40392 84732 185027 24402 20057 -35164 -114715 -8996
6162 -8996 57877 81477 154047 138968 -15044 20796 316343 468989 365087 172856 177761
6151 177761 201121 321185 564532 468068 184666 162418 252070 158555 285781 98044 274711
6140 274711 40391 77743 323050 468226 276577 330237 131187 28821 265128 260005
6130 260005 217298 -70885 181648 92993 247512 324011 279392 343744 284780 114636 -16590
6119 -16590 -58104 67418 -157443 -9707 20160 40940 188984 251749 113170 156301 274896
6108 274896 189208 -15575 9684 275539 247607 914 69452 152183 127460 55500 -8637
6097 -8637 -52990 103987 457470 461242 557073 438057 456228 529961 510623 509396 551473 169022
6085 169022 -85582 93528 -59965 -128430 180282 254197 619371 481278 195949 265109
6075 265109 402140 358123 204474 278925 477883 589819 435366 190860 321962 157785
6065 157785 201214 148575 83789 318815 430396 353173 318175 -7649 -223864 -6258 82185
6054 82185 240723 242207 318511 585893 613917 365719 225085 26454 140810 363438 582458
6043 582458 269031 177669 377710 407539 624022 214425 -15373 372623 465600 395616
6033 395616 226404 312294 390346 347339 525029 466097 557021 377633 118041 -137863 213666
6022 213666 304855 263172 366447 219914 337038 332695 389469 386551 374820 429799 491528
6011 491528 504715 209516 245294 435508 231875 133599 43653 214705 292442 340751 168489
6000 168489 34908 443697 488351 332111 419929 147193 2758 140780 551646 728277
5990 728277 558071 589248 485477 447566 154500 273622 513130 426680 471594 481234 402138
5979 402138 372688 332971 533447 389909 565490 675413 233481 350748 334136 244824
5969 244824 304064 745669 694561 626210 713212 624324 559675 493180 447328 864693 629059
5958 629059 476553 500962 347094 516030 549545 514466 458865 479355 443969 340019 322148
5947 322148 395598 749568 772480 544497 360791 370337 591124 757347 737840 573416 428588
5936 428588 371904 458519 322469 551500 539139 416123 383282 320069 458787 536591 455168
5925 455168 510922 463153 331115 264390 270395 135986 132637 156654 194730 132015 81754 269451
5913 269451 543803 639161 514648 418602 435034 575163 549345 209281 -41989 123791
5903 123791 133335 261728 -43679 -204141 12431 271743 334173 574488 216961 167949
5893 167949 400820 163985 373271 155593 338331 295178 203942 429258 94148 225093
5883 225093 546128 335655 287078 285060 421721 492281 80866 137776 518357 472248 364875
5872 364875 274577 193659 251897 298219 241140 405997 640080 677568 339458 172245 389931
5861 389931 480742 434825 358810 436041 364007 335308 705224 699778 441411 167894 31784
5850 31784 258417 366117 501226 276315 458562 654424 388209 376134 208046 234797
5840 234797 394128 364081 180674 287657 290810 508103 405605 295342 473927 496924
5830 496924 396777 353495 206008 324731 472638 490527 546591 421130 354947 360656 694177
5819 694177 568111 376525 331441 187246 294969 317253 258823 27711 -45439 269065
5809 269065 -110884 -38233 349924 224656 494941 409393 435897 251630 59215 70253
5799 70253 110526 75521 92833 359887 551461 549937 359367 285748 143747 39555 -39710
5788 -39710 29268 414852 526939 239196 155206 309039 288212 40789 -25452 125171 519380
5777 519380 557692 481521 298238 420829 355808 204036 124717 342156 182786 323852
5767 323852 262478 -26365 -6705 478972 563733 186789 100687 -44575 294501 127528
5757 127528 220809 305017 280570 533063 564889 455322 476361 414382 502384 376667 324028
5746 324028 222295 374525 564827 666759 521438 587344 509323 199905 355915 647301
5736 647301 803864 587217 362540 298157 567335 504457 403782 158515 299773 130402
5726 130402 -13959 194598 106543 458493 603642 546369 322836 209877 345031 550431
5716 550431 668944 437565 322639 344245 360218 283458 318844 426669 425367 546829 631520
5705 631520 653955 488639 559387 701364 576087 741330 659754 457203 747201 900564
5695 900564 832264 645045 512645 286168 614686 531956 524629 607958 619719 769031 727425
5684 727425 531171 254423 141019 172544 450715 532847 586937 479878 605493 729806
5674 729806 658077 652983 739474 671328 587960 699993 423972 74515 135484 132355 334908
5663 334908 396982 635232 499444 431756 851832 800229 617227 796165 837976 800647 614768
5652 614768 579537 684126 804953 401567 59144 252727 420411 625955 709381 692120
5642 692120 711404 607958 816035 1015123 643090 432652 355632 344861 695276 710552
5632 710552 497641 528629 528976 419455 624027 387149 195478 354130 322350 421924 583079
5621 583079 743815 971332 901012 699890 748614 793307 810777 1089205 1074861 559875 370599
5610 370599 670749 1073871 874245 703310 589079 468657 782642 915366 774748 1054480
5600 1054480 1015510 637435 650639 570572 534131 895792 917851 794084 673067 661522 914483
5589 914483 857003 934811 945385 905775 595219 730677 788814 769166 918884 692593 707631
5578 707631 681406 747628 810792 1083163 864624 976116 1028541 992152 807652 734389 731999
5567 731999 890891 550306 882891 905216 908743 963836 685755 889517 1298580 1308516 1036920
5556 1036920 743307 983881 1002898 885621 752809 881368 1045215 893745 963647 880339
5546 880339 957166 829074 624030 709240 622691 696987 756603 986251 1192205 966153 996616
5535 996616 895373 931650 888808 1079921 1208101 1192133 1385893 1404417 1219601 1427479
5525 1427479 1384881 1421324 1441142 1404972 1360996 1499586 1271940 1299550 1456127 1217820 1130438
5514 1130438 1298614 1182635 964828 1214909 1512491 1147025 1435356 1647036 1670457 1384985
5504 1384985 1316851 1288891 1292611 1472136 1205168 1317948 1384107 1197602 1381646 1395289 1377532
5493 1377532 1355143 1448794 1502635 1571100 1674514 1855943 1748298 1411775 1455529 1765274
5483 1765274 1863132 1889154 2026241 2031406 2077394 2092023 2054747 1924322 2060188 2203498 2206656
5472 2206656 2147725 1838292 1871241 1945500 2203392 2155434 2165032 2117176 2291388 2693226 2627887
5461 2627887 2237985 2257051 2497871 2486997 2403266 2522161 2817383 2820376 2681030 2635284 2935536
5450 2935536 2867108 2963732 2654526 2800790 2853676 2642255 2424584 2939496 3209224 3136632
5440 3136632 3056072 2821272 3067414 3270678 3309226 3393763 3512096 3292169 3388839 3805634
5430 3805634 3595266 3465992 3320501 3337546 3532743 3653660 3694480 3670987 3790760 3773870
5420 3773870 3757378 3974229 4070544 4039332 3868097 3701263 3847815 4262639 4246844 4415565
5410 4415565 4445732 4286626 4337198 4594564 4632107 4416067 4327339 4524539 4499290 4574659 4747706
5399 4747706 4765187 5096117 5213479 5086932 5141657 5126863 5247155 5464829 5220475 5343363
5389 5343363 5606216 5524672 5287105 5278049 5275415 5536383 5672472 5702822 5702932 5890599 5895349
5378 5895349 5939906 6125189 6207806 6070439 6601003 6553054 6422013 6599939 6325602 6341837
5368 6341837 6554004 6809034 6626088 6416559 6681978 6948948 6974253 6919236 6801658 7107830
5358 7107830 7232317 7206123 7185048 7162107 7306581 7347974 7680601 7902354 7836313 7605992
5348 7605992 7744319 7865020 7844316 7922045 8309676 8587716 8564941 8692247 8519349 8331823
5338 8331823 8486412 8500561 8754324 9157744 8826242 8870781 8638771 8745186 9164434 9347586
5328 9347586 9303888 9670266 9678140 9479482 9530262 9420071 9735943 9892298 9946161 10137181
5318 10137181 9831771 9963127 10156214 10328538 10362906 10414207 10554818 10355659 10370376 10471129
5308 10471129 10374446 10474503 10677777 10822763 10838687 10667024 10924016 10973423 11056445 11002105
5298 11002105 11379923 11543891 11430670 11169612 11122979 11334991 11128244 10994025 10899860 10991421
5288 10991421 10858738 10844327 11037673 11152480 10876653 10811488 10723691 10812204 10980209 10829958
5278 10829958 10658498 10457022 10425391 10468700 10595011 10478528 10343192 10297117 10261552 10180685
5268 10180685 10596841 10325541 10041873 10042752 9956447 10161962 10070880 9886333 10101897 9708490
5258 9708490 9449286 9492903 9432653 9296449 9617891 9782995 9486088 9559704 9576583 9480294
5248 9480294 9322770 9331696 9375860 9338773 9303523 9369942 9290131 8863467 8883444 8903117 8999025
5237 8999025 9093950 9238885 9304603 9213599 9115174 9265239 9321584 9031333 8784973 8779860 9066648
5226 9066648 9227463 9197245 9161957 9449311 9409873 9241321 9267828 9147556 8754920 8927770
5216 8927770 9269654 9490852 9544779 9277883 9273968 9345219 9336862 9400705 9518817 9387637 9336305
5205 9336305 9800224 9704257 9435676 9374092 9480512 9667718 9732676 9601657 9686624 9810050
5195 9810050 9797294 9859068 9855866 9743227 9678140 9993911 10367444 10295099 10156953 10163141 10123006
5184 10123006 9924012 10065563 10291830 10308315 10623142 10651440 10422832 10640962 10955420 11011396
5174 11011396 11117636 11277324 11229542 11284038 11341918 11296364 11521540 11400933 11475864 11761748
5164 11761748 11661246 11575814 11694513 11748637 11913193 12247527 12069808 12031458 12223160 12394109
5154 12394109 12350092 12456911 12832294 12837936 13004271 13126195 13162075 13205703 13131988 13406497
5144 13406497 13775779 13864246 13911450 14309229 14303046 14468176 14556192 14397251 14798827 14975559
5134 14975559 15174025 15491258 15654109 15906177 15969429 16218605 16490632 16737075 16829901 17030071
5124 17030071 17182715 17570357 17824385 17978148 18385660 18856629 18962838 19282978 19493083
5115 19493083 19947543 20723907 21022661 21385027 21389960 21664517 22139247 22558030 22970111 23178073
5105 23178073 23518278 24267058 24748354 25005211 25326370 25899759 26200988 26638931 26737297 27103536
5095 27103536 27959478 28393058 28603788 29099125 29253722 29369875 29936574 30048505 30207307
5086 30207307 30150752 30608223 30810235 30934766 31066413 31262847 31558933 31737890 31856273 32173991
5076 32173991 32825086 32881443 32843885 33088354 33317664 33443389 33660095 33795893 34109721 34619817
5066 34619817 34587063 34867078 35282247 35703395 36005501 36175355 36424877 36410747 36269678 36089499
5056 36089499 36294153 36151941 36124415 36272464 36150688 35390250 35404521 35409183 35094389 34575523
5046 34575523 34484258 34331451 33967516 33543510 33179983 32825758 32418907 31925845 31473045 30982684
5036 30982684 30233507 30217848 30317054 29867720 29203268 28602876 28380940 28231629 27768915 27271036
5026 27271036 27078901 26734866 26368088 26146723 25859687 25368130 24999292 24644425 24097334
5017 24097334 23645546 23196438 22812925 22539617 21835737 21578534 21238593 20694969 20397541
5008 20397541 19739399 19163671 19042244 18739534 18024087 17373404 16874712 16594017 16179069
4999 16179069 15630793 15317415 15045203 14468469 14457523 14121491 13828243 13543280 13030715 12913188
4989 12913188 12897265 12504344 12122872 11979480 11646437 11295817 10712312 10508510 10398059 10165287
4979 10165287 10271891 10087427 9727186 9641111 9717690 9560996 9240220 9009254 8519846 8188904
4969 8188904 8235657 8272196 8129036 7623508 7627130 7650302 7590092 7379608 7275708 7011775 6966029
4958 6966029 6648983 6392857 6326918 6405970 6348887 5996005 5954090 5945700 6166697 6265124 5901045
4947 5901045 5874720 5935032 5854319 5622081 5569546 5719288 5835567 5457896 5194692 5123996
4937 5123996 4996733 5013542 4965254 4906506 4894452 4563371 4622072 4568233 4347882 4436621 4457484
4926 4457484 4310631 4248869 4148145 4011833 4118545 4257504 4326682 4010854 3927357 3979358
4916 3979358 4067649 3955524 3754809 3609445 3654639 3618598 3745957 3819289 3742118 3462231
4906 3462231 3606733 3600479 3317723 3369310 3279620 3367619 3311444 3365148 3166207 3168531 2999566
4895 2999566 3053252 3250844 3126802 3296710 3258064 2912405 3118461 3142107 2969862 3269276
4885 3269276 3169558 2837465 2843473 2839622 2684670 2708445 2545424 2536139 2683580 2952017 2717492
4874 2717492 3026978 3090817 2717824 2527574 2339820 2400170 2408301 2476459 2213373 2125881 2082489
4863 2082489 2140584 2382613 2436777 2484474 2205621 2361627 2275932 2166555 2097087 1918137
4853 1918137 1756070 2002758 2169622 2089914 1880430 1729463 1755303 1849861 1961154 2102322
4843 2102322 2025026 1819724 1672854 1530616 1376143 1553634 1702481 1942524 2023102 1859667
4833 1859667 1917832 1767750 1938000 1710935 1627225 1595344 1639468 1857396 1896048 1990213 1915550
4822 1915550 2040203 1813054 1832281 1819614 1777086 1905356 1949111 1898223 1800434 1858840 2056347
4811 2056347 1783197 1744498 1653777 1370338 1512481 1640666 1708822 1899717 1950487 1792681
4801 1792681 1614164 1424607 1610966 1775250 1763467 1662285 1691551 1769162 1921068 1781707
4791 1781707 1603371 1625387 1567147 1507469 1740025 1792957 1871761 2122980 1738133 1832423 1865497
4780 1865497 1720589 1704384 1618015 1786649 1673650 1789870 1557988 1586030 1418905 1482622
4770 1482622 1797681 1595861 1366648 1553352 1818549 1927263 2185582 2090185 1981679 1909058
4760 1909058 1721049 2003979 1893546 1759609 1884074 2084634 2016544 2179101 2206152 1932547
4750 1932547 1880874 1879637 2086821 2028462 1959416 1981699 2049841 2315918 2101108 2037251 1963068
4739 1963068 2039270 2057857 1801351 1686198 1990969 1990204 1920308 2000784 2053167 2103261 2154310
4728 2154310 2306669 2184579 2333107 2085862 1874667 1944015 1965189 1863283 2098101 2166029
4718 2166029 1993169 2146032 2176401 2141238 1986273 2048908 2067632 2051116 2301927 2450709
4708 2450709 2097185 2038607 2128947 1921282 1964796 2347609 2200347 2225855 2422355 2278218
4698 2278218 2266388 2348113 2454882 2217016 1924519 2127488 2453755 2551969 2413002 2321017
4688 2321017 2313528 2671986 2968893 2877278 2710327 2525732 2708904 2715608 2815885 2745276 2849454
4677 2849454 2820884 2960163 3084710 3057819 2932891 3052405 3023538 2970597 3335225 3438550
4667 3438550 3090766 2959550 3029495 3239269 3395419 3387853 3223937 3232199 3346975 3033244
4657 3033244 3293363 3597023 3577207 3594203 3633244 3746255 3659499 3677010 3704869 3769736 3661356
4646 3661356 3675093 3787529 3962944 4110641 4156178 4077058 3818424 3900619 4144565 4130169
4636 4130169 4164645 4375375 4612155 4689372 4638974 4597226 4492227 4627168 4761829 4714138
4626 4714138 4762239 4640281 4649858 4782674 4921487 5089971 5250181 5328877 5354006 5453642 5800671
4615 5800671 5777308 5733132 5742763 5743666 5812455 5848525 5928928 5738027 5929367 6133626 6145370
4604 6145370 5955009 5992147 6327065 6428553 6538622 6491334 6492173 6746843 6632181 6837065
4594 6837065 6629423 6722655 6860198 6815368 7081951 6941917 6937098 7285916 7511600 7383532
4584 7383532 7666590 7708802 7851905 8049290 7762946 7776400 7893500 8139920 8215479 8180083
4574 8180083 8534994 8904974 8855296 8876373 8863287 9194194 9382473 9344607 9411664 9505029 9615077
4563 9615077 9273289 9249868 9629074 9908063 9718214 9865649 9908496 10039791 10243113 10150329
4553 10150329 10269232 10322585 10540174 10677070 10569387 10745988 10641439 10789506 10698754 10640335
4543 10640335 10613782 10648486 10782177 10842550 11106224 11134200 10969968 10936770 11049468 11250098
4533 11250098 11220216 10979504 10903741 11158249 11448080 11219756 11260628 11220729 11245189 11200512
4523 11200512 10891267 11028103 11301839 11232486 11150773 11013837 11170211 11086915 10929336 10854338
4513 10854338 10871147 10792770 10828667 10599324 10650398 10460973 10331714 10267592 10396391 10347470
4503 10347470 10328382 10459889 10391323 10202821 10171123 10123457 9939797 9926910 9838838 9662445
4493 9662445 9876363 9746909 9864517 10008192 9809709 9735907 9658492 9544768 9507502 9590776
4483 9590776 9727436 9755343 9513075 9596186 9246421 9088168 9243271 9262597 9081623 9428114
4473 9428114 9486888 9318340 9024531 8749504 8945912 8946069 8950906 9029258 9015191 8969873 8709806
4462 8709806 8601630 8614700 8757364 8559157 8599344 8641106 8804457 8945870 9135345 9145505
4452 9145505 9109846 9137153 9025337 8812043 8707560 8849843 8861835 9154768 9114128 8875320
4442 8875320 8816174 8885468 8806827 8706999 8469654 8726845 8954653 8729331 8688288 8724553 8769655
4431 8769655 8789839 8922563 9305468 9450472 9406648 9473258 9686239 9674465 9515429 9662315
4421 9662315 9480986 9461767 9702609 9696687 9679391 9867401 9893879 9881515 9661830 9778938 9978530
4410 9978530 10105870 9851205 10130694 10298218 10147321 10221435 10269453 10039589 10118690 10170004
4400 10170004 10090028 10168641 10037645 10064059 10246730 10356996 10551884 10437733 10249162 10317481
4390 10317481 10492396 10465334 10263022 10215230 10312874 10682637 10860704 11040923 11110742 11149877
4380 11149877 11086147 10944481 11037928 11134357 10985681 11142131 11350645 11268134 11186263 11488492
4370 11488492 11745137 11779668 11761603 11677980 11697760 11733952 11509364 11548957 11700482 11954985
4360 11954985 12138886 12137123 12262918 12404980 12368080 12462043 12460975 12391198 12648985 12642048 12528658
4349 12528658 12610939 12687767 12693897 12979662 12945208 12948978 13334931 13292316 13361524 13304679 13257092
4338 13257092 13529939 13402138 13435755 13762883 13877673 13966865 13842198 13941630 14115277 14038909
4328 14038909 14183775 14478657 14383276 14443624 14393776 14592623 14682007 14695346 14513528 14556708
4318 14556708 14833920 14787328 14887657 15066511 15078184 15024526 15174644 15238926 15518909 15740308
4308 15740308 15835940 15615026 15880418 15874489 15997334 16036715 16094151 16549287 16786738 16965164
4298 16965164 16885260 17155003 17304917 17212915 16984178 17051419 17288901 17849316 18018889 17935054
4288 17935054 18289286 18674237 18922897 19234521 19446963 19985683 19997036 20245597 20539235 20921537
4278 20921537 21295731 21603584 21644215 21665395 21734664 22042528 22932626 23418878 23659256 23887173
4268 23887173 23993006 24415920 24705806 25114883 25794205 26171158 26726948 27244610 27612731
4259 27612731 28235038 28751991 28942227 29388175 29992957 30779404 31862626 32627438 33156344
4250 33156344 34217821 34949119 35790895 36650349 37915274 39406189 40897116 42300636 43600531
4241 43600531 45337854 47056101 48642007 50845874 53113665 55616499 58229533 60855870
4233 60855870 63773905 67244372 70880520 74817420 78843975 83440162 88569434 93979755
4225 93979755 100014670 106875486 114778478 123430458 132867682 143707365 155655970 168539317
4217 168539317 183097486 199166580 215530019 232016290 247902897 261837347 271910951
4210 271910951 277357772 277188857 270862335 258920323 242980287 224716744 206353761 188539442
4202 188539442 171855772 156939971 143711720 131896986 121351528 112108974 103975364
4195 103975364 96917086 90568446 85191589 80248226 75666223 71527449 68378279 65002631
4187 65002631 61632595 58726947 56190543 54077488 51745163 49456506 47702872 46015789
4179 46015789 44539307 42925882 41516759 40304126 38743390 37638230 36744898 35610588
4171 35610588 34617928 33803390 33056127 32334380 31189787 30381884 29404688 28786432 28366697
4162 28366697 27478865 27077311 26338245 25747128 25228399 24974058 24492712 23569981 23177554
4153 23177554 22712347 22553641 21904104 21303113 21165289 21132483 20823070 20541742 20638079 20545844
4143 20545844 20436149 19915143 19773712 19275938 19274831 19401209 19120063 19056999 19092262 18835670
4133 18835670 18766287 18707316 18784291 18813825 18311095 18031831 18045714 18073052 18076255 18055298 17935031
4122 17935031 17838996 18011906 17835173 18060328 17973309 18006713 18073510 17942893 18120976 18316153
4112 18316153 18335860 18227461 18388086 18401709 18368693 18422013 18717459 18850291 19005829 19115141
4102 19115141 19339977 19678713 19646185 19531083 19705352 20176003 20144972 19885950 20157860 20326045
4092 20326045 20883903 21079105 21143464 21395046 21887042 21983557 21613636 21758548 22009613 22171182
4082 22171182 22389056 22675120 23123400 23377884 23587032 23797553 23760564 23631286 24320308 24710864
4072 24710864 24805426 25222938 25467889 25764752 25828079 26113221 26475454 26785347 26589208 26967441
4062 26967441 27317266 27352175 27782991 28075185 28107771 28553645 28608613 28795362 28949220 28814029
4052 28814029 29329249 29384261 28959821 28932245 29061782 29251041 29435538 29528543 29755714 29465531
4042 29465531 29523917 29551350 29532624 29402296 29358252 29414659 29217485 29130778 29114818 28918367 28615364
4031 28615364 28364816 28427919 28176801 27869441 27430188 27276954 26875133 26832093 26525476 25962273
4021 25962273 25525801 25228111 25190459 24923349 24624946 24122528 23834095 23413727 23135650 22692399
4011 22692399 22240046 21838450 21548254 21204197 20658416 20315878 20169012 19586659 19243024
4002 19243024 18684295 18332514 18216110 17954606 17380011 16894887 16660690 16373603 16217260
3993 16217260 15896080 15463443 15360685 15284130 14620406 14044408 13668412 13389487 13317671 13012404
3983 13012404 12790877 12449362 12276969 12119760 11735323 11483122 11524597 11631483 11476169 11125517
3973 11125517 10983531 10754007 10536774 10625645 10430794 10060618 9830460 9829919 9756342 9528864
3963 9528864 9250855 9161945 9252142 9354213 9100288 9100795 9162895 9006085 8665264 8947725 8645959
3952 8645959 8374445 8149581 8023092 8180952 8328912 8440864 8181596 8128329 8019607 8127624
3942 8127624 8305225 8349763 8244241 8195508 8093438 8025957 7994320 8019226 8142817 8305799
3932 8305799 8393352 8353308 8255772 8106293 7923323 8026170 8033474 8107796 8080793 8064799 8284143
3921 8284143 8114407 8393295 8293406 7917992 7880677 8010958 8086678 8132205 8200660 8005777
3911 8005777 8343065 8605558 8489817 8743595 8631393 8351901 8617125 8641018 8839521 8804454
3901 8804454 8798957 8973685 8974902 9117695 9158544 8990166 9034772 9285681 9537358 9424877 9617139
3890 9617139 9887490 10170967 9918784 9966526 10444923 10427913 10256870 10561887 10858333 11003763
3880 11003763 11320312 11491810 11463094 11645561 11877390 11717815 12031720 12257085 12289846 12528100
3870 12528100 12779801 13042284 13433637 13730814 14012094 14213599 14396839 14751137 15031705
3861 15031705 14953034 15116311 15554952 15857833 15976883 16207699 16449287 16695570 17196614 17547631
3851 17547631 17672053 17989980 18127431 18627951 18964582 18992152 19214496 19341030 19829603 20364627
3841 20364627 20728648 21210807 21290849 21828318 22269730 22580086 23203603 23718749 24294179 24738196
3831 24738196 25244255 26287712 26916477 27283153 27720088 28395067 29446314 30147238 31055199
3822 31055199 31823304 32905790 34092573 35135276 36498756 37631116 38990209 40288486
3814 40288486 41627884 43264875 44524006 46695838 48822337 50668262 52606869 55048560
3806 55048560 57466073 60158455 63154976 66395758 69928922 73954290 78042011 82217539
3798 82217539 86885726 92023542 97340348 102887340 108669926 114205102 119466403 124060819
3790 124060819 128382732 131110392 132203810 131981191 130481244 127156126 122820090 117369200
3782 117369200 111771255 106245726 100785400 95582445 90501254 85960347 81855498 78024076
3774 78024076 74250950 70937358 67945298 65564280 63486014 61121033 59005194 57295761
3766 57295761 55864729 54256936 52856232 51544856 49779250 48795640 47843782 47116837 46341012
3757 46341012 45359204 44779486 43887631 43028311 42281330 41740728 41062121 40399826 39862292
3748 39862292 39328081 39051965 38548809 37795045 37271990 36652171 36091862 35599152 35181412
3739 35181412 34694298 33959489 33308298 32792954 32564315 32108609 31440080 30825203 30521675
3730 30521675 29891031 29539817 29494885 29018606 28527767 28132878 27610891 27299576 26876676 26385805
3720 26385805 25918123 25429719 25306770 25008068 24407974 23989040 23689034 23251852 23205469 23178632
3710 23178632 22718416 22070988 21765410 21361210 21297681 21449486 21049596 20641291 20266190 20011331
3700 20011331 19770769 19740818 19394373 19253732 18703790 17882607 17837985 17566030 17113715 16966731
3690 16966731 16858837 16710698 16605148 16291293 16093416 15566317 15313043 15212615 15028687
3681 15028687 14601020 14075451 14059705 13865703 13587215 13195077 12907919 12822852 12464623 12342968
3671 12342968 12056033 11682383 11500012 11396835 11128954 10862473 10767475 10558502 10212990 9991268
3661 9991268 10000500 10069483 9943304 9824049 9610347 9330468 9182360 9032392 8946089 8781381
3651 8781381 8798487 8591350 8351996 8490092 8348677 8336297 8551329 8183053 8107043 8222790
3641 8222790 7980545 7565070 7504580 7523428 7517145 7429043 7309698 7022502 7021567 7055188 7186336
3630 7186336 7145695 6792680 6816451 6537250 6481104 6206739 6238391 6275524 6297862 6179128 5911993
3619 5911993 6051032 5974386 5814347 5808503 5767863 5609161 5660461 5895849 5910108 5595412 5705789
3608 5705789 5775235 5719853 5723095 5328027 5211233 5245040 5213825 5157000 5281442 5631013 5518172
3597 5518172 5243086 5194954 5380483 5235369 5200944 5019816 5130878 5349839 5116010 5260571
3587 5260571 5071108 5074031 5171300 4923760 4915357 5364371 5417899 5351933 5231844 5242181 5127380
3576 5127380 4832830 4992706 4672917 4605537 4530117 4622417 4760315 4774869 4799499 4381371
3566 4381371 4572083 4630494 4281530 4344509 4045766 4045036 4105559 3881353 4124029 4272198 4341214
3555 4341214 4521343 4018554 3816437 3874544 3826179 3769708 3880170 3904687 3957389 3619251
3545 3619251 3630626 3786951 3671796 3648749 3424994 3473667 3362374 3436913 3521594 3167175
3535 3167175 3020942 3099879 3278687 3064370 3026752 3062296 3083647 3261088 3427864 3391892
3525 3391892 3013575 3220255 3282678 3490143 3592434 3201201 2893832 2919909 3213725 3307564
3515 3307564 3242003 3453180 3583535 3925511 3546763 3316855 3245081 3503656 3687871 3529063
3505 3529063 3516668 3268635 3335648 3635027 3288801 3374525 3385021 3346166 3693265 3673866 3491851
3494 3491851 3473614 3499998 3466303 3467378 3327021 3705016 3529211 3485599 3814571 3839731 3945276
3483 3945276 3847727 3912257 4148524 4244900 4077924 4052229 3894927 3877738 3886420 4227424 4767005
3472 4767005 4716665 4569319 4602695 4651852 4659019 4930626 4853473 4616710 5102087 5206929 5257166
3461 5257166 5252261 5291561 5492146 5763751 5922117 6090075 6396488 6726387 6644214 6577551
3451 6577551 6790553 6907661 7138407 7388556 7697311 7720237 7669794 7813912 7894254 8091585
3441 8091585 8573994 8389897 8542487 8606941 8734710 8475250 8514933 8760236 9027952 9051086
3431 9051086 9098621 9170099 9306520 9601472 9856090 9993967 10290284 10594338 10949422 10580260
3421 10580260 10758525 11178891 11138532 11610357 11686310 11786681 11639230 11577547 11708375 12308310
3411 12308310 12735073 13018431 13072269 13295173 13777500 14266864 14563463 15227235 15994428 16143425
3401 16143425 16532121 17559139 18284234 19045070 20340965 21293001 22490427 23960738 24917852
3392 24917852 26474954 28507225 30395317 32512913 35077712 37834328 41181232 44897031
3384 44897031 48475341 52751621 56751143 60805043 64569235 68376664 71779515 75626639
3376 75626639 79792124 84453064 89317645 94154524 98292999 101530520 103920673 105264858
3368 105264858 106614054 108292935 111085787 114044901 116559814 118206095 118020268 116049885
3360 116049885 112817772 108635086 105555739 103142808 100790670 98569015 96123977 92699863
3352 92699863 88237337 82879670 77820737 73199793 68691893 64887999 61720062 58363487
3344 58363487 54610667 50736681 46805403 42752675 39279700 36250457 33371750 31143926
3336 31143926 29245274 27418514 25953904 24461038 22778756 21520537 20477184 19770678
3328 19770678 18891512 18364077 17554554 16972866 16239555 15622486 15322117 14747300 14308026
3319 14308026 13665821 13223367 12781379 12132393 12023759 12054991 11411661 11095571 10544497 10083865
3309 10083865 10004106 9710933 9345545 9249835 9159278 8858781 8708072 8827926 8731937 8482292
3299 8482292 8060681 7738009 7516359 7607500 7479545 7260344 7018043 6847008 6731234 6831430
3289 6831430 6812273 6440827 6110391 6397900 6296841 6171346 5892004 5566695 5464735 5465161
3279 5465161 5300744 5163047 5299865 5382431 5128894 4870640 4922181 4997761 4770921 4888320
3269 4888320 4989407 4817429 4723286 4366992 4509373 4396624 4312598 4374634 4341483 4142697
3259 4142697 4176713 3900953 3901748 3686351 3650732 4008152 3949618 3785934 3797228 3878044 3878788
3248 3878788 3700261 3824275 3616199 3700290 3590893 3565476 3602928 3437863 3455149 3504694
3238 3504694 3500343 3423877 3350922 3361687 3222770 3179366 3461090 3349759 3142731 3095386 3167287
3227 3167287 3412606 2873536 2663573 2864129 3036277 3112732 3011659 3118603 2962614 3046890
3217 3046890 3147144 3185475 2931156 2854323 2621035 2390237 2600722 2783087 2732587 2735740
3207 2735740 2921263 2812400 2875353 2808923 2685978 3041259 3030914 2936524 3242815 3434969
3197 3434969 3509861 3523372 3652430 3708781 3539130 3771611 3635392 3645503 3518568 3162336
3187 3162336 3081379 2978476 2802942 2665978 2677725 2668550 2661778 2625489 2834032 2975075 2732604
3176 2732604 2870671 3069376 3161062 2847514 2576847 2475873 2684425 2617239 2168414 2443100
3166 2443100 2620771 2884091 3132035 2901330 2875945 2757838 2725443 2832427 2765462 2899949
3156 2899949 2884212 2789166 2937760 3104185 3267402 3567894 3272390 3376861 3275736 3198016
3146 3198016 3395687 3411882 3434355 3194405 2929568 3014517 3346343 3348623 3128685 3174068 3620259
3135 3620259 3945915 3969763 4024215 3898047 3835110 4050688 4155294 4051055 4253881 4198739
3125 4198739 4520559 4663234 4475394 4486953 4927925 5195778 5232365 5576392 5556931 5590129
3115 5590129 5883600 6114293 6035557 6022434 5966391 6414296 6412340 6525566 6551143 6314713 6391680
3104 6391680 6641801 6563281 6532812 6665571 6919969 7116159 7034902 7186100 7410706 7605383
3094 7605383 7722473 7765860 7754816 7993594 8379833 8430003 8494679 8856062 9017909 8923017
3084 8923017 9597092 9932643 10311467 10563862 10615444 10849272 11151648 11317919 11809195 12315766
3074 12315766 12317673 12597515 13076648 13330074 13614873 14143276 14367778 14704103 15493933 16364654
3064 16364654 16868316 17409551 18035885 18681384 19565764 20117923 20726282 21371890 21955521
3055 21955521 22658274 23187608 23886545 24523518 25598961 26477452 27237746 27690981 28263968
3046 28263968 29020851 29856250 30543674 31390654 32147151 32780644 33331275 33702537 34018752
3037 34018752 34591724 35159464 35618807 36279164 36877197 37281839 37360823 37539459 37678405 37621498
3027 37621498 37430521 37795961 38018769 38136606 38237465 38292265 38144371 37979511 38064916 37823848
3017 37823848 37960258 38269000 37922686 37601957 37674949 37826057 37650607 37484921 37255535 36796892
3007 36796892 36605875 36303497 36250567 36215539 35560634 35399189 35170992 34487543 34400352 34181507
2997 34181507 33686876 33251580 32809845 32201930 32220320 31753286 31143451 31091146 30845364 30640564
2987 30640564 30772162 30575150 30376239 30626139 30427362 30384902 30496398 30413980 30395461 30666294
2977 30666294 30788839 30832776 30620644 30656777 30670671 30572357 30681983 30677019 30806576 30886121 30962621
2966 30962621 30416249 29987151 29698902 29524409 29345312 28942765 28533324 28128477 27776713
2957 27776713 27464820 27090824 26594718 26175821 25882578 25656983 25227631 24953572 24865812 24508040
2947 24508040 24282597 24312131 24237500 23794437 23408837 23506548 23418059 23501299 23418959 23135886
2937 23135886 23014409 22764506 22489057 22263933 21879908 21347246 21217257 21032814 20490864
2928 20490864 20335323 20060813 19656062 19448804 19003427 18415181 17879643 17357050 16936718
2919 16936718 16816223 16449771 15920569 15482793 15138610 14918027 14465649 14213003 13728124
2910 13728124 13432901 13410849 13194026 12881118 12542770 12345340 12020793 11798650 11849439 11690291
2900 11690291 11513477 10985436 10668038 10592457 10469197 10157428 9738416 9635054 9495278 9254562
2890 9254562 9138363 9170395 9062233 8703489 8486037 8517911 8342904 8032762 7978945 7818850
2880 7818850 7691142 7428014 7077246 6708223 6563396 6308842 6138784 6240094 6122051 6166480
2870 6166480 6098679 6029041 6189880 6196274 5900171 5826640 5471002 5407918 5226563 5205995 5276580
2859 5276580 5088575 4894227 4869747 4755841 4540299 4428154 4470202 4532770 4612920 4405823
2849 4405823 4579373 4673478 4415639 4454064 4304471 4095442 3965297 4043028 4060852 4088354
2839 4088354 4056144 3944967 3556692 3735467 3647848 3752339 3797176 3758201 3603418 3409251
2829 3409251 3668555 3853358 3808193 3504423 3527028 3568533 3587796 3552640 3285463 3294743 3374095
2818 3374095 3259474 3112097 3118014 3441655 3289051 3380585 3490584 3333716 3393329 3573158
2808 3573158 3728946 3593324 3416525 3245011 3335916 3346909 3384157 3411086 3351500 3534685
2798 3534685 3657901 3388451 3257962 3659123 3370721 3397322 3403621 3143055 2929584 3228525
2788 3228525 3650163 3385675 3478730 3353695 3469201 3486128 3307800 3358115 3247279 3172815
2778 3172815 3169271 3300432 3394066 3607346 3554664 3410161 3438069 3448532 3604789 3880577 3650051
2767 3650051 3717738 3996203 3960164 3531901 3536534 3406649 3333295 3627238 3776906 3827983 3628387
2756 3628387 3764828 4019540 3932031 3747281 3592163 3698990 3660398 3882423 4280157 4055825
2746 4055825 4096856 4275379 4805635 4425962 4310024 4426464 4237487 4456642 4526761 4527041
2736 4527041 4358564 4312691 4523276 4680150 5114128 4886957 4703610 4701933 4754879 4823435
2726 4823435 4866089 4936084 4749188 4647232 4715696 4914966 5227480 5496664 5214394 5010636
2716 5010636 5235986 5518671 5690562 5668897 5663705 5773541 5979543 6158249 6037516 5965681
2706 5965681 5962648 6088812 6363147 6336960 6601742 6631275 6550442 7012107 7116152 7256212
2696 7256212 6969148 7093325 7414091 7552718 7831471 7934455 8062413 8246778 8132675 8213374
2686 8213374 8287283 8507359 8769967 9152179 9151815 9446502 9707084 9863321 10204395 10304437
2676 10304437 10424536 10571273 10708136 11011090 11345356 11703963 12186028 12146405 12556600 12522857
2666 12522857 12755550 13115396 13257636 13544155 14051258 14493109 15156726 15459791 15746057
2657 15746057 16171518 16805703 17254441 17760856 18602385 19125551 19657693 20581286 21277939
2648 21277939 21755122 22431151 23609867 24540437 25482131 26573466 27655313 28964945 30360432
2639 30360432 31696179 32788877 34296080 35809772 37380789 38982271 40506689 42305477
2631 42305477 44241801 45352640 46842577 48300008 49515095 50392032 51275022 52188085 52784607
2622 52784607 52996587 53135258 53471136 53738224 53605309 53289510 53243604 52716730 52394726 51907064
2612 51907064 50964874 50123427 49356998 48452952 47272932 45985757 44548441 43047332 41398553
2603 41398553 40185882 38834538 37181630 35428160 34344648 32878541 31354951 30217024
2595 30217024 28949144 27834935 26604279 25555018 24751322 24097967 23457069 22678350 21883469
2586 21883469 21180133 20595357 20256411 19531295 19095686 18314491 17725593 17567410 17267066
2577 17267066 17099234 16906076 16703779 16202406 15954780 15686662 15891823 15485554 14964384
2568 14964384 14896735 14823553 14562444 14459977 14336162 14124311 14324612 14233974 14251367 14130540
2558 14130540 13843881 13576242 13674481 13733736 13852591 13800020 14099304 13880242 13917338 14059654
2548 14059654 14007400 13990252 14121397 14335932 14388216 14372846 14554736 14742416 14690795 14484317
2538 14484317 14574299 14867608 15186971 15403944 15353669 15499975 15371119 15326286 15385359 15622726
2528 15622726 15836064 15993901 15893975 16127856 16551308 16799883 17001704 17310543 17565723 17995533
2518 17995533 18172205 18410304 18781846 19315415 19846469 19913371 20367794 20977023 21470985 21984240
2508 21984240 22551966 22927776 23133124 23043437 23710190 24262015 24173167 24571898 24955498 24927335
2498 24927335 24987356 24900836 25264407 25430442 25319857 25551261 25832784 26549275 26631331 26895368
2488 26895368 27191086 27632001 28073812 28789984 29120041 29642035 30195431 30802987 31643478
2479 31643478 32113506 32965333 33899470 34801887 35588271 36841626 38327289 39416498 40610976
2470 40610976 41821131 43392956 45051186 46654839 48493880 50387991 52735866 54767161
2462 54767161 57078019 59480510 61956255 64490212 67075931 69697317 72563999 75599465
2454 75599465 78446061 80881976 83198608 85561859 87975678 89470614 90915875 92253813
2446 92253813 93244172 94519289 95157869 95381781 95338375 95301865 94930680 93995536 93042814 91675564
2436 91675564 90286858 88780887 87236878 85664677 83759363 81448309 78924655 76509439
2428 76509439 73976698 71331454 68672297 65937821 63210237 60873843 58501616 56077179
2420 56077179 53701059 51653911 49428428 47388219 45660216 43768982 42053871 41070112
2412 41070112 39406974 38031067 36735824 35598260 34646421 33498736 32637190 31537432
2404 31537432 30551696 29696869 29302705 28528713 27797619 27121868 26657586 26351492 25633198
2395 25633198 25128501 24793030 24547104 24036884 23789592 23488124 22919102 22635174 22583201 22456223
2385 22456223 22133885 22239491 22353117 22163205 22026127 22008901 21763050 21307434 21302784 20778534
2375 20778534 20567706 20634914 20443015 19822777 19386788 19009662 18382781 18189519 17976272 17779781
2365 17779781 17521412 17415625 17360145 16847443 16273585 16129887 16181593 16293047 15789934 15535909
2355 15535909 15266006 15240977 15043638 14967180 15024711 14680997 14414443 14557250 14244986 13808088
2345 13808088 13753139 13901404 13505527 13254154 13271092 13125548 12958897 12860153 12711023 12434153
2335 12434153 12338858 12077110 11772421 11824859 11933810 11466587 11175359 11101148 10971574 10653288
2325 10653288 10444034 10258125 10369405 10205054 9878595 9984256 10322034 10336434 10154372 10148820
2315 10148820 10179095 10177355 10002985 10040959 9967258 9742860 9792004 9660684 9634177 9550648 9577044
2304 9577044 9830158 9721506 9827156 9843624 9685270 9770526 9798488 9806193 10136408 10315048
2294 10315048 10339204 10304163 10333672 10564580 10588020 10685337 11012754 11222212 11201378 11361518
2284 11361518 11248184 11131222 11494210 11978666 12122779 12518107 12601220 12497909 12727237 12856339
2274 12856339 13257846 13762501 14136153 14418298 14513890 14798971 15325079 15305955 15368791 15624907
2264 15624907 16056017 16757240 17078026 17196330 17355653 17348656 17601381 17984612 18407524 18680034
2254 18680034 18834155 19426177 19724057 19849867 20375835 20838420 21243101 21261833 21596480 22186071
2244 22186071 22574106 23217745 23523056 24280076 24744273 25262134 25846427 26804718 27811246
2235 27811246 28633876 29324694 30372394 31648725 32822489 33954733 35015800 36580381
2227 36580381 38136309 39735038 41273869 43175883 45261999 47164091 49103942 51346650
2219 51346650 54170613 56573970 59355467 62615723 65361165 68664425 71843331 75231963
2211 75231963 78390188 81550599 84741325 87863912 90725904 93372917 96107706 98627478
2203 98627478 101051692 102864922 104417293 105333213 106111664 106951812 107136478 107377355 107414984
2194 107414984 107054779 106367679 105695861 104522820 102894502 101262217 99500095 97441416
2186 97441416 94914181 92243233 89390569 86483958 83442319 80489997 77280206 74339326
2178 74339326 71423618 68507875 65526494 62645685 60062987 57811834 55407238 52875705
2170 52875705 50864721 48942708 46938530 44861717 43359408 41614603 40160712 38868889
2162 38868889 37498127 35949971 34805329 33890880 33232356 32170737 31065313 30182158 29546341
2153 29546341 28987934 28690110 27954914 27255145 27006890 26435067 25921594 25371379 25030824
2144 25030824 25082443 24841313 24437474 24087098 23743260 23545111 23172272 22983264 22928061 22353850
2134 22353850 21932085 21707272 21379351 21268951 20903171 20183114 20086221 20037901 19722098 19559732
2124 19559732 19135846 19047564 18464629 18216533 18216437 18116887 17723290 17507455 17456465 17692373 17732703
2113 17732703 17532988 17188006 17117148 17088609 17258926 17234626 17233058 16986484 16982828 17310201 17100294
2102 17100294 16849423 17075221 17438857 17255365 16960882 16865660 16881565 17000411 16917146 17000649
2092 17000649 16922491 16827809 16891961 16596496 16521135 16569211 16738369 16963401 16838687 17170738
2082 17170738 17330248 17371134 17496920 17689204 18219206 18598299 18789600 19156216 19541356 19619723
2072 19619723 20153307 20457289 20887583 21341298 21879446 22758775 23472402 24339550 25021332
2063 25021332 25822789 26565486 27152871 28275803 29588156 30741798 31743355 33152066 34872078
2054 34872078 36190844 37470705 39092495 40523990 42162207 44160207 46082910 47860980
2046 47860980 49822085 51769295 53628057 55430794 57078297 58611119 59874017 60687181
2038 60687181 61565250 62157290 62396649 62270954 62243899 61789471 60589171 59388441 58102815
2029 58102815 56352471 54594818 52789593 51012376 49220507 47424621 45204303 43255546
2021 43255546 41297211 39432807 37310109 35462858 34063218 32612798 31496306 30235447
2013 30235447 29110886 27778116 26530865 25519152 24846546 24144957 23222210 22513384 21936525
2004 21936525 21571472 21116211 20261849 19746373 19369402 18765855 18288695 18070012 17462457
1995 17462457 17315711 16710990 16075700 15750340 15411505 15224216 14588577 14105607 14078404 14093685
1985 14093685 13692570 13353740 13336521 13379695 12947644 12920974 12852354 12681779 12611147 12429855
1975 12429855 12588377 12621647 12444876 12551376 12685116 12586034 12391107 11982630 11952716 12380326
1965 12380326 12463853 12691824 12486491 12120882 11897546 11527468 10840408 10301375 9993912 9727825
1955 9727825 9700548 9304289 8948079 8838372 8849400 8668718 8731051 8402611 8016296 8224831
1945 8224831 8248234 7983472 7881862 7623170 7693696 7554897 7631556 7671274 7995655 7859778
1935 7859778 7540200 7455899 7609216 7935662 8014498 7884489 7978599 8005087 7706723 7525996
1925 7525996 7217959 7153608 6886299 6748673 6417075 6493790 6485643 6630887 6528170 6543913
1915 6543913 6475546 6303176 6453561 6745395 6529855 6493310 6493293 6608074 6705982 6503409 6731371
1904 6731371 6632940 6869978 6859936 6815421 6794690 6891002 7032060 7059434 7031506 7131635 7414088
1893 7414088 7490233 7354116 7183339 7233884 7494037 7533323 7578822 7691473 7694536 7564856 7702731
1882 7702731 7928076 7587565 7467602 7489355 7722606 7951013 7981068 8320241 8388740 8600444
1872 8600444 8565503 8490861 8491086 8461706 8604602 8731828 9131691 9429222 9681010 9583845 9796240
1861 9796240 9945112 9808819 10162459 10505480 10784103 10964580 10973979 10977274 11497906 11270633
1851 11270633 11363735 11669451 11580599 11714454 11868354 12053233 12403244 12561245 12720552 13046101
1841 13046101 13500488 14101420 14574375 14789995 15232237 15392058 15780114 16172154 16717448
1832 16717448 17224876 17469945 17899509 18064442 18596775 18960450 19642822 20446745 20630183
1823 20630183 21444825 22250509 22933345 23559348 23981695 24529466 24692151 25467214 25851860
1814 25851860 26727095 27260757 28010600 29167893 30097065 31018231 31947419 32945291 34171831
1805 34171831 35394212 36845632 38157401 39792241 41627703 43528890 45433294 47377787
1797 47377787 49434396 51756161 54368010 57231117 60425928 63769316 67075731 70896724
1789 70896724 74997835 79407700 83681928 88539965 93819876 99626149 105656023 112319466
1781 112319466 119076764 126342587 134567767 142898947 152396693 162542473 173422204 185129847
1773 185129847 197557379 209754701 221586338 232109534 241389193 247847055 251462950
1766 251462950 251437606 247419766 239920362 229877734 218236917 205316802 192182362 179271953
1758 179271953 167041260 155698112 144955964 134921548 125699432 117219608 109740018
1751 109740018 103178518 96839344 91057202 86076757 81380273 77083096 73049528 69602782
1743 69602782 66145265 63075892 60418380 57729352 55266330 52923646 50864579 49001712
1735 49001712 47273780 45906559 44311514 42564095 41032278 39620471 38519883 37213805
1727 37213805 36318685 35162324 34476081 33146273 32235032 31195069 30269132 29506166 28718172
1718 28718172 27898998 27064131 26380094 25764075 25183021 24197176 23614303 23226445 22579865
1709 22579865 21785600 21440701 20680088 20112662 19746731 19267140 18830135 18680772 18360433
1700 18360433 18093340 17849337 17090695 16989351 16716751 16473911 16386627 15828415 15497851 15129782
1690 15129782 14575605 14059840 14093541 13975951 13714959 13263194 13149339 12872045 12429649 12285696
1680 12285696 11885693 11851385 11653509 11494992 11565199 11219205 10859251 10333098 10404996 10436044
1670 10436044 10127411 10056588 9868121 9556084 9074037 9013966 8976678 8509710 8442998 8415354
1660 8415354 8036678 8239459 7990345 7737191 7843163 7762024 7302089 6974219 6823020 6512348
1650 6512348 6627081 6661044 6414764 6333775 6138083 6061809 6205667 5985573 5862140 5819249
1640 5819249 5709817 5562577 5714920 5680114 5578370 5311339 5200431 5129484 5141588 5019340
1630 5019340 5123306 4935465 4836729 4723182 4703183 4861231 4870841 4415989 4232150 4334371
1620 4334371 4686925 4462117 4305674 4290919 4360334 4210515 4019459 3794953 3394144 3608945
1610 3608945 3691030 3728687 3587259 3299385 3377294 3412589 3536661 3737117 3392614 3403182
1600 3403182 3366740 3164172 3041956 3412556 3506687 3318457 3037261 3173114 2961992 2967144
1590 2967144 3128251 3139412 2992329 2977319 2645751 2386381 2625836 2681427 2670254 2400526
1580 2400526 2485050 2422678 2151251 2327504 2553432 2106807 2059029 2343493 2087428 2148646
1570 2148646 2278821 2445071 2188541 2337836 2044423 1855278 1945700 1638740 1609507 1816429
1560 1816429 1888816 2022805 1998488 2136363 2401046 2185121 1868415 1830106 1892552 2118813
1550 2118813 2212360 2226738 1830307 1744152 1973959 1672909 1664054 1548335 1655813 1638282 1563972
1539 1563972 1573813 1503081 1618657 1806346 1901622 1862864 1770631 1761783 1888082 1917016 2077413
1528 2077413 1929522 1588200 1403239 1570546 1495069 1293056 1457492 1395152 1455365 1540502
1518 1540502 1751123 1595837 1754600 1608388 1639048 1291221 1301290 1464338 1522290 1394998
1508 1394998 1419402 1560890 1422553 1517301 1550167 1642210 1801371 1701195 1433022 1463867
1498 1463867 1690586 1830815 1631004 1670304 1494100 1144332 1088425 1334292 1723257 1720488
1488 1720488 1731775 1831526 1764463 1582898 1537875 1402122 1430686 1602003 1640320 1629762 1741682
1477 1741682 1662828 1754544 1762095 1513789 1766187 1860920 1853935 1906174 1749832 1942989 2272780
1466 2272780 2101159 2284241 2452111 2324522 2131948 2069317 2184969 2362143 2224509 2017176
1456 2017176 1875624 1832209 1612409 1453911 1428642 1537824 1450552 1410555 1468682 1425819 1420088
1445 1420088 1852088 1595223 1467122 1434645 1212395 1394250 1213930 1098545 1139431 1095068
1435 1095068 1041481 891842 884139 1051004 776713 977750 1272026 949220 977009 1010331
1425 1010331 635202 419802 795105 938579 1018267 1020258 1048300 789563 835938 751538 828226
1414 828226 846570 878973 642382 456378 600156 330372 422808 874955 1073093 892407
1404 892407 918867 1005757 827751 679879 959517 935464 883105 544735 475481 481844 498440
1393 498440 580070 655382 787007 983920 853869 735392 722927 726240 643584 720067 765542
1382 765542 755990 290607 565274 650353 762891 705294 456950 818366 852776 945966 952424
1371 952424 724017 898331 890463 589454 670407 865308 705315 602846 270877 272339 564510
1360 564510 561418 564407 780657 997604 1044963 978473 740167 652110 624829 821759 836436
1349 836436 420970 376299 185263 385700 571167 432652 298648 309226 399074 413746
1339 413746 536892 636582 539631 761433 1214865 866460 631369 298604 420701 486695
1329 486695 554556 490133 424597 552711 501072 274449 318538 557848 575740 588126 664010
1318 664010 344748 271313 355020 416292 398470 401614 273239 473926 478535 366673 353801
1307 353801 238302 218481 356085 612129 510897 616662 677213 551072 492743 700400
1297 700400 686091 701539 784209 535357 384930 303063 351143 558815 630180 397089 335235
1286 335235 559432 564633 693479 816666 514594 606055 668812 699543 535758 286332 359130
1275 359130 525309 534877 634898 537269 626786 566436 442801 410710 580789 510779 439838
1264 439838 393751 -45887 212969 370381 126566 121134 146781 264904 87494 178395 223703
1253 223703 70388 314221 240614 265949 403602 471082 612276 406158 273516 365124
1243 365124 453411 693857 570631 444414 -82838 76236 517554 726860 687006 448246
1233 448246 251197 605296 832527 603756 491020 520228 504471 551189 436572 524205
1223 524205 352928 134384 229803 334238 317463 458798 366635 235880 328417 116693
1213 116693 178802 115099 52382 101147 52080 -31723 222139 407485 310715 98040 -159103
1202 -159103 58097 -16800 174335 136648 99546 160290 307489 450906 300828 311807 126204
1191 126204 -11741 -11857 47235 82017 271513 264262 271399 150746 221632 432170 409569 171314
1179 171314 263782 162502 544259 716115 43593 -18928 -7887 -104277 200823 -168093
1169 -168093 -191802 -103276 -297413 158899 39262 266616 262000 222439 428990 450304 375276
1158 375276 151522 151854 66163 47064 247030 406018 113702 380299 430824 119415 268542
1147 268542 265858 149575 71032 -75776 -142627 140007 290909 -4330 -62237 288483 241340
1136 241340 241081 673862 438425 252319 138202 57688 29824 86384 -46425 -30262 -31313
1125 -31313 73353 -162986 -351815 -113808 66947 125206 188313 192117 -40065 197951 98401
1114 98401 20300 47581 210769 319233 21544 30831 98147 -160255 -169614 118458 55603
1103 55603 -96350 228243 197632 519957 240319 -6040 312645 399746 134528 -21616
1093 -21616 -148154 15161 215991 288304 229330 136306 110993 120921 264624 140391 169902
1082 169902 -381 -17994 -133045 262075 377726 372422 128852 -9514 97718 334157
1072 334157 408750 188848 183392 145264 37770 -2903 75312 212658 -36603 -70925 160517
1061 160517 -40735 49376 -88284 66169 16404 170285 316618 147573 128752 107325
1051 107325 -6192 68252 443646 341478 177313 406204 135969 59654 191022 385763
1041 385763 464526 180156 4638 -189152 77606 134903 263457 331297 159619 261750
1031 261750 360466 110658 -235749 -2780 61721 185113 124234 -21761 79889 -8847
1021 -8847 152454 257421 23254 -45647 379898 623767 392254 294041 317532 479533 577182
1010 577182 477563 73026 -169225 -245592 -102896 139649 -51146 105970 193297 174622
1000 174622 253887 313125 446917 197497 217441 371715 329745 135283 101566 340057 602180
989 602180 633278 514743 460476 209717 208452 806405 907921 626881 412306 273062 347690
978 347690 374625 501730 394023 483547 344670 516737 426527 501168 527396 647881 901590
967 901590 1111868 907371 1273908 1460028 1320836 1523148 1576845 1697292 1643638 1587936
957 1587936 1762338 1843149 1827857 2146061 2693856 2734576 3196496 3891886 4246584 5333906
947 5333906 6048074 6622413 7280561 7249192 6508669 5643040 4673774 3844091 3250498 2974486
937 2974486 2569337 2325877 2107281 2005716 1781703 1217589 1049630 1391454 1483458 1459238
927 1459238 1350436 1250511 1241121 1266269 953779 859799 848054 797920 869579 638486 703983
916 703983 765870 534427 458585 595178 565181 518034 552916 461267 278265 523543 388964
905 388964 341615 663573 764187 753900 585112 348579 329328 496094 696547 885999
895 885999 527489 489152 256556 305866 344169 183626 183944 302524 260154 169008 74850
884 74850 35790 53227 20844 105573 -114868 -199561 -211234 -207096 111585 133280 18913 384257
872 384257 769661 621681 453518 650275 224828 38219 388 211696 279618 296864
862 296864 234553 67878 125676 -86355 -47241 222191 -52515 -86283 180553 355182 372561
851 372561 210631 305817 244066 187631 261925 86678 -148341 -85739 -57217 -153984 -267247
840 -267247 -104434 -169437 199809 185417 178077 113764 100073 358669 176198 -7716 -238273
829 -238273 -502757 -329428 -298725 31877 131649 -175054 -217041 -141119 91331 88077 -151266
818 -151266 -72863 -894 108425 -50911 -1496 349674 -111108 -85001 -484 62987 38387
807 38387 -95286 -27205 82 -10328 -49623 -61332 -1751 232477 431633 175826 -113500
796 -113500 -220735 -134748 46944 -82158 -236426 205196 -34167 -63522 -154313 11882
786 11882 414901 139833 -115441 -4756 -30965 28095 193555 -79562 -41257 216039 -95365
775 -95365 -254893 -273314 -34244 -160856 -343816 -87683 117484 165198 -81426 -382995
765 -382995 -308904 -328342 -326208 -181436 -27471 -156831 -266473 -105456 40713 129241 120499
754 120499 206585 119940 -38470 -101165 -290303 -287824 -120520 -103394 -1695 -29886 -82382
743 -82382 80120 213910 -136141 -36800 47890 -306367 -206869 141582 156304 152088 273038
732 273038 70828 6214 -102877 114293 27648 -108227 -72149 -335575 -320725 -122712 77888
721 77888 -149258 -211468 -208944 52344 -127558 -199733 -25326 -33609 -241082 303 246676
710 246676 -139950 -219583 -210625 -209687 -239314 -51367 -190873 -138696 190201 183026 196399 44033
698 44033 -27210 -319196 -279056 -110462 62710 -99783 -248984 -225604 -31091 -23967 -121598
687 -121598 -8048 -286075 -429398 -322251 -321805 8165 12195 -122642 -104990 -232767 -266443
676 -266443 -516340 -496482 -364805 -403569 -434598 -190451 179979 -63846 338797 416341 -77859
665 -77859 -130430 -95108 -138577 -159547 -291444 -154417 4511 -60253 -429561 -382972 -402472
654 -402472 -491130 -416666 -484999 -329145 -318963 -41379 97539 -101578 19736 352792 41994
643 41994 -62065 65532 -254111 -177363 -94111 -15171 143405 77751 261861 -7292 -276714
632 -276714 -310409 -152044 -47260 3757 144629 70931 109177 -3947 34896 57058 -17632
621 -17632 -196710 -219312 -429098 -168521 -85558 -403488 -255749 -293309 -405437 -320570 -89763
610 -89763 -221103 -462625 -264426 36565 -42896 112499 154311 56700 -109236 -136581 -395852
599 -395852 -368122 -437021 -295048 -100443 396424 282290 296460 33742 -226845 -210141 -348744
588 -348744 -291618 -111204 -128956 -27076 161490 -10935 -467098 -401020 -379921 -210492 -198373
577 -198373 -498628 -379563 -357424 -109910 -88309 -462733 -442443 -332078 -300283 92453 -136250
566 -136250 -32820 13233 72602 -14889 -313051 -558858 -376359 -201790 200585 239684 115914
555 115914 -37431 -346717 -438658 -558775 -618139 -458187 -283520 -421495 -330237 -223076
545 -223076 -192376 -221105 -69251 -88622 -135589 -430899 -398661 -337714 -387476 -352786 -89719
534 -89719 -246788 -654036 -360650 -246940 16407 40244 -107255 6297 -47973 -70137 -309833
523 -309833 -248282 -222073 -323028 -156872 -176146 -280522 -438136 -621464 -276115 -366802 -27476
512 -27476 -66238 -240962 -28905 -84375 -294639 -347579 -21233 -50185 -156203 -262761 -299180
501 -299180 -541708 -564224 -854613 -789494 -514233 -318040 -118167 -122204 -459674 -377460 -319065
490 -319065 -178926 -230270 -446487 -350345 -168728 -228821 -211659 120811 173635 39677 326409
479 326409 244573 162962 -205778 -302724 -370508 -298820 -229312 5156 -20356 -349787 -305337
468 -305337 -98843 -113934 -151912 -450951 -445920 -453516 -477351 -417786 -491592 -358933 -282359 -96594
456 -96594 -224998 -372964 -304062 -282900 -309658 -299303 -309679 -36524 -96994 -126166 2687
445 2687 176133 275322 58791 -2113 -214441 -223672 -245292 -189905 -39061 -319251 -80004
434 -80004 -248810 -449079 -199563 -208452 -188979 -101511 -83817 14360 -106730 -332433 -319891
423 -319891 -193595 -195082 6987 46669 -179717 -438893 -271695 -108186 -221817 -349425
413 -349425 -562933 -731593 -576472 -518243 -367599 -485457 -513712 -560192 -347432 -205373
403 -205373 -425025 -142078 -113025 -232001 -474852 -543095 -462985 -342266 -403124 -556985 -287381
392 -287381 -155349 -302911 -390451 -285369 20928 -165944 -229464 -118121 -168835 -122967 -62438
381 -62438 -196207 -512522 -426627 -224511 -107630 -441711 -471041 -548120 -552311 -493737 -553948
370 -553948 -370680 -344381 -531677 -199355 -288210 -230323 73837 19705 -789 -22577 -236560
359 -236560 -437037 -397812 -234636 -328531 -266645 -472973 -394961 -334105 -337758 -262671 -264757 -75221
347 -75221 -152446 -551264 -575977 -350721 -288702 -232276 -218124 -380998 -382144 -361350 -518700
336 -518700 -219748 -189655 -365297 -439727 -561138 -215081 -177209 -348173 -290660 -663155 -823088
325 -823088 -773638 -325127 -225923 -65320 -240739 -368196 -365221 -428631 -453571 -603521 -465954
314 -465954 -550170 -729098 -636450 -569079 -563432 -294457 -214261 -170489 -216914 -388951 -157350
303 -157350 -596737 -608618 -501309 -349214 -123286 -559690 -520859 -538109 -400914 -519995
293 -519995 -536352 -543182 -403927 -318912 -344251 -403417 -494747 -480253 -518002 -527038 -289445 -258466
281 -258466 -451643 -400771 -461041 -341854 -496294 -208236 113327 -1166 -247341 -122926
271 -122926 -692168 -425194 -305548 -328182 -325617 -330967 -353899 -290946 -270511 -77338 -116821
260 -116821 -527770 -422150 -127215 -372094 -505409 -280016 -341126 -351666 -495066 -746633
250 -746633 -746256 -342299 -150033 -364968 -398181 -550501 -505275 -530791 -447689 -543365 -693051
239 -693051 -405917 -329718 -406935 -531532 -557221 -740138 -769231 -708314 -710898 -466600 -90695
228 -90695 -196442 -227353 -310130 -593742 -640980 -437072 -200438 -153399 -247720 -239697 -256376
217 -256376 -444335 -595869 -615304 -576675 -495903 -510897 -228991 -504046 -759811 -579550 -522638
206 -522638 -361770 -47039 -440883 -622379 -178155 -45830 -200392 -243710 -227682 -87603
196 -87603 -585233 -502445 -322647 -235460 -329051 -311834 -635754 -794085 -846461 -711460 -461830
185 -461830 -228440 -255578 -194928 -124755 -220372 -339236 -388978 -488910 -436543 -362494 -539296
174 -539296 -423060 -590264 -656269 -880478 -907432 -899819 -550970 -168146 -335278 -241997 -331660
163 -331660 -497114 -410401 -272936 -405088 -488264 -333425 -440846 -132550 -366004 -514447
153 -514447 -280288 -219372 -430624 -490040 -378488 -332452 -543438 -788690 -720715 -368747 -474847
142 -474847 -712647 -625752 -670432 -791181 -551287 -497493 -698625 -550047 -467662 -312372 -208027
131 -208027 -332906 -412575 -517776 -379876 -402533 -489727 -559037 -526459 -329292 -416342 -403805
120 -403805 -455394 -868997 -762148 -538604 -620872 -357002 -519093 -472915 -480020 -586679 -513162
109 -513162 -381521 -589882 -594825 -494055 -637128 -498999 -577197 -675611 -650488 -665200 -520390
98 -520390 -561275 -539835 -631968 -716591 -443922 -276067 -454813 -530650 -255551 -335722 -452333
87 -452333 -532315 -508030 -577729 -480372 -310874 -326761 -585360 -565597 -449546 -380123 -340857
76 -340857 -439391 -534457 -607846 -589544 -315767 -343252 -571439 -738983 -643198 -616589 -649831
65 -649831 -749629 -649482 -563226 -397781 -479096 -385526 -497851 -543625 -513338 -362337 -451328
54 -451328 -740172 -762242 -681517 -504186 -331755 -224630 -303858 -525416 -588691 -575033 -549548
43 -549548 -439005 -456250 -285771 -527064 -582421 -549733 -512292 -561057 -559944 -568364 -460594 -538939
31 -538939 -526544 -582369 -649612 -511200 -606294 -638036 -470626 -588703 -671762 -510675 -481089
20 -481089 -538892 -519444 -562645 -499273 -594487 -606952 -675862 -778046 -692574 -599425 -587467 -345012
8 -345012 -395423 -622343 -641418 -374433 -348304 -675828 -650306 -483180
0 -483180
$$ Imaginary data points
##PAGE= N=2
##DATA TABLE= (X++(I..I)), XYDATA
16383 -3387428 -3155878 -3177204 -3222839 -3269871 -3354714 -3402423 -3099005 -2794003 -2985859 -2825875
16373 -2825875 -2799353 -2847474 -2788421 -2816122 -2699936 -2689525 -2657903 -2524647 -2628478 -2569649 -2590667
16362 -2590667 -2430370 -2279602 -2324424 -2399060 -2213123 -2222613 -2140791 -2076398 -2201800 -2201162 -2194884
16351 -2194884 -1979036 -2052299 -2107932 -2026732 -1978618 -2041118 -1903075 -2023818 -2010918 -1877842
16341 -1877842 -1839189 -1725459 -1694811 -1722246 -1576790 -1545724 -1386034 -1283004 -1363318 -1434425
16331 -1434425 -1334302 -1098567 -1276755 -1357121 -1076637 -1124148 -1041136 -1045359 -971494 -725801
16321 -725801 -857912 -785309 -669143 -476026 -471293 -521348 -605946 -675433 -599799 -558268 -482951
16310 -482951 -305512 -330337 -189118 -207620 -277062 -221809 -222822 -312080 -223089 -184983 119
16299 119 22316 -102097 -15136 97065 326867 135907 281859 393904 125430 165787 157112
16288 157112 51820 98838 106665 106598 -166261 -43341 260807 367162 488105 495619 480975
16277 480975 626842 602797 272462 393561 502848 491448 544798 445685 614343 813847
16267 813847 852453 935787 909673 881309 964200 1076163 953740 936806 1029411 923503 1027938
16256 1027938 1300956 1226375 1065563 1168292 1101552 978583 1263811 1202289 1074058 1190648
16246 1190648 1423355 1650438 1538801 1526689 1351800 1512957 1455149 1487343 1697289 1320601
16236 1320601 1176709 1682779 1544537 1600820 1560377 1611951 1693428 1903869 1966776 1628400
16226 1628400 1662829 1848496 1727613 1724656 1514283 1410466 1569477 1483733 1784718 1784280 1785927
16215 1785927 1834534 2054489 2217961 1912999 1853757 1983701 1837932 1946059 1986781 2204715
16205 2204715 2168302 1979687 1863658 1694905 2145684 2534158 2188998 2181144 2200556 2186300
16195 2186300 1969770 1539432 1637714 2009496 2120136 2249369 2211589 2367739 2515695 2181136
16185 2181136 1896436 2233169 2440896 2549723 2279586 2084306 2184680 2383058 2690390
16176 2690390 2550060 2602725 2699898 2739626 2692649 2684074 2556981 2426347 2235551 2199616 2277770
16165 2277770 2331148 2390908 2350331 2334242 2706586 2826715 2800502 2708643 2753130 2617233 2464817
16154 2464817 2431912 2308157 2522703 2295570 2268013 2625814 2787033 2528172 2347992 2442963
16144 2442963 2626388 2476372 2586263 2502335 2590084 2563466 2503651 2442484 2527891 2814573
16134 2814573 2990308 2849054 2797252 3018310 3107294 2976270 2709428 2623850 2594491 2658358
16124 2658358 2541152 2701446 2634345 2904252 2762312 2621883 2795442 2881582 2803062 2892724
16114 2892724 2846027 2952396 2955802 2909896 2835799 3047474 2890422 2795095 3043126 2970484 2931458
16103 2931458 2746698 2894050 2815850 2642869 2704707 2701828 2587608 2486372 2570012 2662582
16093 2662582 2637595 2687045 2766174 3028226 3206154 3353217 3118604 2930481 2742850 2767365
16083 2767365 2715966 2668199 2738836 2787867 2615551 2559003 2632934 2602467 2952419 2831262 2834994
16072 2834994 3026334 3085940 2691928 2254080 2918440 2828469 2792161 2913025 2833856 2840910
16062 2840910 2739564 3088556 3121784 3063231 3073932 3006276 2999045 3155203 2965354 2858563
16052 2858563 2926455 2973893 3119836 3017368 3076170 3015123 2948678 3057315 3316387 3289656
16042 3289656 2932893 3059185 2966823 2898281 3071214 3114209 3211814 3156435 2786313 2721976
16032 2721976 2565528 2910747 2826292 2628244 2830080 3115422 3175936 2942768 2931270 2838248
16022 2838248 3002082 3181093 3336040 2949397 2956324 3040351 2954418 3031627 3074850 3066084 2839356
16011 2839356 2698738 2720093 2837798 3133639 3344417 3325232 3151532 3022453 3017975 3023947
16001 3023947 3097100 3116479 2986802 2895613 3158047 3069296 2797267 2795209 2957498 2736081
15991 2736081 2878396 3098892 2907110 2814736 2843653 2970622 2889324 2886148 3182371 3033997
15981 3033997 2744004 2870994 3003413 3187021 3247018 2990954 2619466 3151820 3335014 3092188
15971 3092188 2981023 3192335 3165191 3051486 3132378 3035630 2892681 2801349 2846486 2831148
15961 2831148 3032174 3194863 2903520 2634875 2775940 3110587 3163542 3276812 3137719 3072910
15951 3072910 3003604 2866419 3128735 2876869 3122261 3317043 3268047 3386485 3033363 2755665
15941 2755665 2905867 2874551 2929142 2939683 3234884 3187338 3071348 3154705 3036902 3094103
15931 3094103 3049646 2770057 2755052 2810975 3144612 3069524 3119212 3209776 2963406 2893749 3081137
15920 3081137 3133474 3094745 3086053 3120118 3031156 2866139 3033628 2912399 2706761 2786009 3055706
15909 3055706 3250479 3413277 3165628 3015086 3015463 3073665 3145235 2989965 2865130 2641217
15899 2641217 2757640 2881981 2716295 2765190 3069786 3108916 2928428 3021573 3009385 3202262
15889 3202262 2964580 2942343 2785009 2919123 3229655 3329782 3033003 2913373 3090937 3119303
15879 3119303 3108568 3252586 3328659 3240129 3229989 2883496 2867404 3099116 3010866 2796316
15869 2796316 2665032 2588371 2707243 2627608 2627038 2942707 2766410 2668614 2845410 3078285
15859 3078285 2968680 2839275 2963390 3036304 3109218 3252510 2990891 3143768 3153193 3121402
15849 3121402 3075795 2925697 2969007 3136329 3081134 3188239 3202720 3047005 2962219 3072695
15839 3072695 3133900 3093728 3192643 3113125 3132961 3056328 3275104 3353436 3412090 3294237 3262067
15828 3262067 3447449 3067850 2791505 2937418 2766099 2930213 3196549 3183688 3040610 3272482
15818 3272482 3084167 3060106 3093238 3093704 2929228 3039930 3007172 2963620 3072098 2966421 2847967
15807 2847967 3056828 3199149 3173482 2894246 2986859 3094421 3048470 3049535 3138103 3280134
15797 3280134 3246846 3065648 3068906 3061822 3159291 3458630 3292219 3014550 2957110 2945740 3151313
15786 3151313 3117689 3049091 3040689 3216178 3016782 2962262 2943804 2896515 3107267 3318537 3252178
15775 3252178 3063040 3044354 2806361 2770006 2726277 2656024 2734163 2997489 3143541 3287041
15765 3287041 3252429 3177210 3138996 3158375 2869511 2622187 2577933 2836070 3029127 2885984
15755 2885984 2921940 2870186 2522004 2785809 2934385 2940111 2932642 2694307 2407031 2868090
15745 2868090 2948691 2899766 2890930 3235455 3216475 3328517 3013805 2799927 2957355 3015757
15735 3015757 2920906 3057983 3169886 2846138 2775475 2705754 2862843 3072301 2990702 3069877
15725 3069877 3199994 3207686 3030701 3034513 3064149 3014902 3225642 2996686 2954178 2978649 3010873
15714 3010873 2977876 2685632 2797743 2732719 2296253 2613233 2566375 2890102 3090501 3045592
15704 3045592 3113947 3069174 2950915 2860142 3079564 2959280 2820770 2813871 2934692 3093024
15694 3093024 2921612 2935252 2931853 2957940 3011681 3288948 3185334 3178749 3063283 3026106 2821025
15683 2821025 2643635 2730761 2639615 2755765 2781992 2848010 2691211 2926776 3121034 2927712
15673 2927712 2829053 2710243 2782858 2802219 2894970 2966215 2875892 2967339 3173496 3142772 3311999
15662 3311999 3282367 3051978 2932246 2820142 2874815 2892454 3248095 3157388 3170110 3073363
15652 3073363 2909982 2827619 2853605 3011319 3220946 3229538 3156802 2854131 2851061 3138070 3176910
15641 3176910 2982234 2961932 3017930 2935542 3001566 2758562 2867049 2902334 2787256 2981295
15631 2981295 3252249 3051922 3150791 3170923 3084191 2914324 3000073 3085125 3114171 3109465 3110597
15620 3110597 2972316 3076325 3005138 2753330 2817189 2953689 3045220 3113211 3222636 3000114
15610 3000114 2743933 2520419 2814436 3138514 3227620 3253558 3147583 3102027 3203444 3341847
15600 3341847 3291614 3262690 3150533 3180511 3292299 3147928 3058257 2990863 2977495 2912815 2981075
15589 2981075 3227148 3054043 3034831 3156501 2956317 2875999 2740705 3111952 2920911 2625540
15579 2625540 2802667 2860580 2666734 2896749 3166654 3240613 3114310 3049106 2866533 3074487
$$ [...]
##END NTUPLES=NMR SPECTRUM
##END=
