##TITLE=1H_CG-1146-X1F
 DMSO, 8 sc, 
 27.04.2021
##JCAMPDX= 6.0         $$ Bruker NMR JCAMP-DX V2.0
##DATA TYPE= NMR SPECTRUM
##DATA CLASS= NTUPLES
##ORIGIN= UXNMR, Bruker Analytische Messtechnik GmbH
##OWNER= root
$$ XWIN-NMR		Version 3.5
$$ Tue Apr 27 15:20:15 2021 Russian Standard Time (UT+4h)  she@DPX200
##.OBSERVE FREQUENCY= 200.131506
##.OBSERVE NUCLEUS= ^1H
##.ACQUISITION MODE= SIMULTANEOUS
##.ACQUISITION SCHEME= undefined
##.AVERAGES= 8
##.DIGITISER RES= 18
##SPECTROMETER/DATA SYSTEM= spect
##.PULSE SEQUENCE= zg30
##.SOLVENT NAME= DMSO
##.SHIFT REFERENCE= (INTERNAL, DMSO, 0, 16.0134)
##AUDIT TRAIL= $$ (NUMBER, WHEN, WHO, WHERE, WHAT)
$$ ##TITLE= Audit trail, XWIN-NMR		Version 3.5
$$ ##JCAMPDX= 5.01
$$ ##ORIGIN= Bruker BioSpin GmbH
$$ ##OWNER= she
$$ F:/spectra/data/she/nmr/H-F/1/pdata/1/auditp.txt
$$ ##AUDIT TRAIL=  $$ (NUMBER, WHEN, WHO, WHERE, WHAT)
(   1,<2021-04-27 15:17:34.09 +0400>,<she>,<DPX200>,
      <created by zg, POWCHK disabled, PULCHK disabled
       configuration hash MD5:
       00 E9 B6 7A A2 85 ED C7 34 08 36 98 17 FE 4E 26
       data hash MD5: 16K
       31 CC C1 31 FE 5F 3B 2C 94 90 7F 9E F1 BE 33 89>)
(   2,<2021-04-27 15:17:38.93 +0400>,<she>,<DPX200>,
      <Start of raw data processing
       efp BC_mod = 2 LB = 0.24 FT_mod = 6 PKNL = 1 PHC0 = -11121.43 PHC1 = 13.00096 SI = 16K 
       data hash MD5: 16K
       BE 68 49 E4 02 3A 60 A6 68 08 EF A6 A6 DB F9 CD>)
(   3,<2021-04-27 15:17:59.50 +0400>,<she>,<DPX200>,
      <pk PHC0 = -0.4135968 PHC1 = -2.6 
       data hash MD5: 16K
       2B E0 E8 05 EF F0 EB 49 20 E6 64 28 39 66 1A 1B>)
(   4,<2021-04-27 15:18:03.01 +0400>,<she>,<DPX200>,
      <abs ABSG = 5 
       data hash MD5: 16K
       45 BA 2B 40 60 DB 0A A0 CA 67 BE D2 11 0A D9 73>)
$$ ##END=
$$ 
$$ hash MD5
$$ 69 22 01 67 09 A4 DF 05 60 D8 CE AC 41 15 27 F3
##$RELAX= 
##$RELAX= 
##$RELAX= 
##$RELAX= 
##$RELAX= 
##$RELAX= 
$$ Bruker specific parameters
$$ --------------------------
##$DU= <F:/spectra>
##$EXPNO= 1
##$NAME= <H-F>
##$PROCNO= 1
##$TYPE= <nmr>
##$USER= <she>
##$AMP= (0..31)
100 100 100 100 100 100 100 100 100 100 100 100 100 100 100 100 100 100 
100 100 100 100 100 100 100 100 100 100 100 100 100 100 
##$AQSEQ= 0
##$AQ_mod= 1
##$AUNM= <au_zg>
##$AUTOPOS= <>
##$BF1= 200.13
##$BF2= 200.13
##$BF3= 200.13
##$BF4= 200.13
##$BF5= 200.13
##$BF6= 200.13
##$BF7= 200.13
##$BF8= 200.13
##$BYTORDA= 1
##$CFDGTYP= 0
##$CFRGTYP= 5
##$CHEMSTR= <none>
##$CNST= (0..31)
1 1 145 1 1 1 1 1 1 1 1 1 1 1 1 1 1 1 1 1 1 1 1 1 1 1 1 1 1 1 1 1 
##$CPDPRG= <>
##$CPDPRG1= <>
##$CPDPRG2= <>
##$CPDPRG3= <>
##$CPDPRG4= <mlev>
##$CPDPRG5= <mlev>
##$CPDPRG6= <mlev>
##$CPDPRG7= <mlev>
##$CPDPRG8= <mlev>
##$CPDPRGB= <>
##$CPDPRGT= <>
##$D= (0..31)
0 1.2 0 0 0 0 0 0 0 0.06 0 0.03 0 0 0 0 0.0002 0 0 0 0 0 0 0 0 0 0 0 0 
0 0 0 
##$DATE= 1619522253
##$DBL= (0..7)
120 120 120 120 120 120 120 120 
##$DBP= (0..7)
150 150 150 150 150 150 150 150 
##$DBP07= 0
##$DBPNAM0= <>
##$DBPNAM1= <>
##$DBPNAM2= <>
##$DBPNAM3= <>
##$DBPNAM4= <>
$$ [...]
##$SUBNAM3= <"">
##$SUBNAM4= <"">
##$SUBNAM5= <"">
##$SUBNAM6= <"">
##$SUBNAM7= <"">
##$SUBNAM8= <"">
##$SUBNAM9= <"">
##$SW= 16.9725357007746
##$SWIBOX= (0..15)
0 0 2 0 0 0 0 0 0 0 0 0 0 0 0 0 
##$SW_h= 3396.73913043478
##$TD= 16384
##$TD0= 1
##$TE= 0
##$TE2= 300
##$TE3= 300
##$TEG= 300
##$TL= (0..7)
0 120 120 120 120 120 120 120 
##$TP= (0..7)
150 150 150 150 150 150 150 150 
##$TP07= 0
##$TPNAME0= <>
##$TPNAME1= <>
##$TPNAME2= <>
##$TPNAME3= <>
##$TPNAME4= <>
##$TPNAME5= <>
##$TPNAME6= <>
##$TPNAME7= <>
##$TPOAL= (0..7)
0.5 0.5 0.5 0.5 0.5 0.5 0.5 0.5 
##$TPOFFS= (0..7)
0 0 0 0 0 0 0 0 
##$TUNHIN= 0
##$TUNHOUT= 0
##$TUNXOUT= 0
##$USERA1= <user>
##$USERA2= <user>
##$USERA3= <user>
##$USERA4= <user>
##$USERA5= <user>
##$V9= 5
##$VALIST= <valist>
##$VCLIST= <CCCCCCCCCCCCCCC>
##$VD= 0
##$VDLIST= <DDDDDDDDDDDDDDD>
##$VPLIST= <PPPPPPPPPPPPPPP>
##$VTLIST= <TTTTTTTTTTTTTTT>
##$WBST= 1024
##$WBSW= 4
##$XGAIN= (0..3)
0 0 0 0 
##$XL= 0
##$YL= 0
##$YMAX_a= 320651
##$YMIN_a= -196309
##$ZGOPTNS= <>
##$ZL1= 120
##$ZL2= 120
##$ZL3= 120
##$ZL4= 120
##$ABSF1= 15.98128
##$ABSF2= -0.9913816
##$ABSG= 5
##$ABSL= 3
##$ALPHA= 0
##$AQORDER= 0
##$ASSFAC= 0
##$ASSFACI= 0
##$ASSFACX= 0
##$ASSWID= 0
##$AUNMP= <proc_1d>
##$AZFE= 0.1
##$AZFW= 0.1
##$BCFW= 0
##$BC_mod= 2
##$BYTORDP= 0
##$COROFFS= 0
##$CY= -3
##$DATMOD= 1
##$DC= 0
##$DFILT= <>
##$DTYPP= 0
##$F1P= 0
##$F2P= 0
##$FCOR= 1
##$FTSIZE= 16384
##$FT_mod= 6
##$GAMMA= 0
##$GB= 0
##$INTBC= 1
##$INTSCL= 1.334414e-10
##$ISEN= 128
##$LB= 0.24
##$LEV0= 0
##$LPBIN= 0
##$MAXI= 10000
##$MC2= 0
##$MEAN= 0
##$ME_mod= 0
##$MI= 1.114404
##$NCOEF= 0
##$NC_proc= -7
##$NLEV= 6
##$NOISF1= 3.799351
##$NOISF2= 2.8
##$NSP= 0
##$NTH_PI= 0
##$NZP= 0
##$OFFSET= 16.01339
##$PC= 1
##$PHC0= -11121.84
##$PHC1= 10.40096
##$PH_mod= 1
##$PKNL= yes
##$PPARMOD= 0
##$PSCAL= 0
##$PSIGN= 0
##$REVERSE= no
##$SF= 200.129999609843
##$SI= 16384
##$SIGF1= 3
##$SIGF2= 2
##$SINO= 5.538805
##$SIOLD= 16384
##$SREGLST= <1H.CDCl3>
##$SSB= 0
##$STSI= 16384
##$STSR= 0
##$SW_p= 3396.73913043479
##$SYMM= 0
##$S_DEV= 0
##$TDeff= 16384
##$TDoff= 0
##$TI= <>
##$TILT= no
##$TM1= 0
##$TM2= 0
##$TOPLEV= 0
##$USERP1= <user>
##$USERP2= <user>
##$USERP3= <user>
##$USERP4= <user>
##$USERP5= <user>
##$WDW= 1
##$XDIM= 16384
##$YMAX_p= 295210174
##$YMIN_p= -548948
$$ End of Bruker specific parameters
$$ ---------------------------------
##NTUPLES= NMR SPECTRUM
##VAR_NAME=  FREQUENCY,     SPECTRUM/REAL,   SPECTRUM/IMAG
##SYMBOL=    X,             R,               I
##VAR_TYPE=  INDEPENDENT,   DEPENDENT,       DEPENDENT
##VAR_FORM=  AFFN,          ASDF,            ASDF
##VAR_DIM=   16384,         16384,           16384
##UNITS=     HZ,            ARBITRARY UNITS, ARBITRARY UNITS
##FACTOR=    0.207333158178282, 1,           1
##FIRST=     3204.7596518791, 0,             0
##LAST=      -191.979478555695, 0,           0
##MIN=       -191.979478555695, -548948,     0
##MAX=       3204.7596518791, 295210174,     0
$$ Real data points
##PAGE= N=1
##DATA TABLE= (X++(R..R)), XYDATA
$$ [...]
4513I537573k17750k24028l63185k92161m13457m26609j63000l17863k29096k62571
4503F627853k83806k54142j53875j81258k27186l73932j68888L7035r7574k39707
4493D684520k0653k06966k15747k8599N0805j60525j62995N415L920j0984l51339
4482C586852o6249k59877j42186k7730j21163n4372N446l3557j13288N2266J37696
4471B963838p0026J33310R077k42559j1879k26913J19255L2106k20132J74825
4461B660902J31163j0869R037M6961q0960l6297o2684k57720j19671m3359l9637
4450B196866Q3870O7831J82519r2647R7338n4152o8806o5203J3129J8575J48322
4439B527642N6654n6089J86142j25462k31179L6220K82024K5007n2908N3364j99994
$$ plain form
4513 9537573 9319823 9095795 8732610 8440449 8026992 7600383 7437383 7119520 6890424 6627853
4503 6627853 6344047 6089905 5936030 5754772 5527586 5153654 4984766 5021801 4924227 4684520
4493 4684520 4663867 4456901 4241154 4212555 4263360 4102835 3939840 3945255 3949175 3938191 3586852
4482 3586852 3520603 3260726 3118540 3090810 2969647 2915275 2920721 2887164 2773876 2826142 2963838
4471 2963838 2893812 3027122 3036199 2793640 2781761 2554848 2674103 2706209 2486077 2660902
4461 2660902 2792065 2781196 2790233 2837194 2756234 2719937 2657253 2399533 2279862 2236503 2196866
4450 2196866 2280736 2348567 2531086 2438439 2535777 2481625 2412819 2347616 2360745 2379320 2527642
4439 2527642 2584296 2528207 2714349 2588887 2357708 2393928 2675952 2700959 2648051 2701415 2501421
4428B501421J13202L8147j12900N1808p7266Q1228L5223Q4092J58674n4119k03744
4417B615766K19565L04937J44443O6212j24852j27216O9290K5712L3981J71687
4407C399525o1098J1779L84776J17907n5964M744J81123K04141q41J6184K06781
4396D409057P801J3525J00374P6300l2224J46432J50115n0244j5184L7379J02363
4385D945694O4774J87426K63195K19655n3316J21293J4507R3681N9725K67458
4375F184092J23299m0131Q1474L4736Q5100J75994r8242l4550M44730J50540P8203
4364G185245o3441J75973K18735K72072k3624K31862K89502J96727J15717N5407
4354H654175K96656K92472J99635o378K44579L16360J73832K42468M0412J03463
$$ plain form
4428 2501421 2614623 2652770 2539870 2591678 2514412 2595640 2630863 2714955 2873629 2819510 2615766
4417 2615766 2835331 3140268 3284711 3350923 3226071 3098855 3168145 3193857 3227838 3399525
4407 3399525 3338427 3350206 3734982 3852889 3796925 3801669 3982792 4186933 4186092 4202276 4409057
4396 4409057 4416858 4430383 4530757 4607057 4574833 4721265 4871380 4821136 4805952 4843331 4945694
4385 4945694 5010468 5197894 5461089 5680744 5627428 5748721 5763228 5856909 5916634 6184092
4375 6184092 6307391 6267260 6348734 6383470 6468570 6644564 6546322 6511772 6956502 7107042 7185245
4364 7185245 7121804 7297777 7516512 7788584 7764960 7996822 8286324 8483051 8598768 8654175
4354 8654175 8950831 9243303 9442938 9436560 9681139 9997499 10171331 10413799 10454211 10557674
4344A0557674J44685q0726J60465L5187J61332J34931M2935K32419Q5638o2383
4334A1412157o2148K49886J01027N1107k9965O8296R1651K21714j17797J62294
4324A2148222L15939Q2654J45587J02444k2546m1153J89861J67980K04641L12039
4314A3605668J21518J72331K21383j23193P0436L21248J47941o2280N3765j44003
4304A4384814l5504K61868j14561l75402J9418K4978r3269j02271r531j42841
4294A3817699r1232j73573Q6284j46804n7658m4888l8181p0904R1994j10374r0563
4283A3171800J13373n9887q0234J20882j48943J48699K4481k6955p417j33464
4273A3122335j04586j46323p6318J04293M6797p8053m7046l3365o7741j3689k69140
$$ plain form
4344 10557674 10702359 10621633 10782098 10817285 10978617 11113548 11156483 11388902 11474540 11412157
4334 11412157 11350009 11599895 11700922 11752029 11722064 11790360 11882011 12103725 11985928 12148222
4324 12148222 12464161 12546815 12692402 12794846 12772300 12731147 12921008 13088988 13293629 13605668
4314 13605668 13727186 13899517 14120900 13997707 14068143 14389391 14537332 14475052 14528817 14384814
4304 14384814 14349310 14611178 14496617 14121215 14140633 14165611 14072342 13970071 13960540 13817699
4294 13817699 13726467 13552894 13639178 13492374 13434716 13389828 13351647 13280743 13372737 13262363 13171800
4283 13171800 13285173 13225286 13145052 13265934 13116991 13265690 13290171 13263216 13255799 13122335
4273 13122335 13017749 12871426 12795108 12899401 12946198 12868145 12821099 12787734 12719993 12706304 12437164
4262A2437164j0098J07046j02466j87300j74372j3903q6129p7852j98415J76762
4252A1870437k30375l3151r2331l8587k15939k26836L6125j32628l57527J34200
4242A0713388k01983j630l51275j23310p3201o7513n0877k12255j53894j29008
4232I348442j88940M304n0986n7807n7424j56312q2693m6866q1930j93477Q904
4221H445215j03374r0850O9020K674q1674k8140j9959p9846p8755j27332J11678
4210H018657M5662j11510K610J4903J71405k56997p9895j34239o9829m7835k55534
4199G297398N5959J5351j29495M1805m0245n8945l796j40717Q8240Q8639L8354
4188G252548J31499J54793q1933p447J83879o3103q5124K0004M07379L2295l394
$$ plain form
4262 12437164 12427066 12534112 12431646 12244346 12069974 12056071 11969942 11892090 11693675 11870437
4252 11870437 11640062 11606911 11514580 11475993 11260054 11033218 11069343 10936715 10579188 10713388
4242 10713388 10511405 10509775 10158500 10035190 9961989 9894476 9843599 9631344 9477450 9348442
4232 9348442 9159502 9163806 9112820 9055013 8997589 8841277 8758584 8711718 8629788 8436311 8445215
4221 8445215 8341841 8250991 8320011 8322685 8241011 8212871 8192912 8113066 8034311 7906979 8018657
4210 8018657 8064319 7952809 7955419 7970322 8141727 7884730 7804835 7670596 7600767 7552932 7297398
4199 7297398 7353357 7368708 7239213 7281018 7240773 7181828 7178032 7037315 7125555 7214194 7252548
4188 7252548 7384047 7538840 7456907 7449460 7633339 7570236 7485112 7505116 7912495 7944790 7941396
4177G941396q4326K18032J07325j09346M9513J93071j72753J89900R2737j51340
4167H274209j98667M8620n2202Q4670o3970j37640K82222J90386n0361J58059
4157H535326M8831j90138n4647J9530J23261r8257K2573M8283M9077R6413L1764
4146H632016M1228j00859l7850j25762j00156K04789P5614N2881J26544N0146
4136H818591k00266M9354r0103k4888J14122n9520P2321J24468Q3011J42168M3260
4125I072518M0004k2197J76625J33815J04982K63532K62991J02867J73762J71535
4115A0480434J15169k1121L09867L12557M56102J35752l2932M04802K04557K25806
4105A2590993M50512L43450M47080L70706K79014J92736K75383L71050M79418
$$ plain form
4177 7941396 7857070 8075102 8182427 8073081 8122594 8315665 8142912 8332812 8425549 8274209
4167 8274209 8075542 8124162 8071960 8156630 8092660 7955020 8237242 8427628 8377267 8535326
4157 8535326 8584157 8394019 8339372 8358902 8482163 8383906 8406479 8454762 8503839 8600252 8632016
4146 8632016 8673244 8572385 8534535 8408773 8308617 8513406 8589020 8641901 8768445 8818591
4136 8818591 8618325 8667679 8577576 8552688 8666810 8607290 8679611 8804079 8887090 9029258 9072518
4125 9072518 9112522 9090325 9266950 9400765 9505747 9769279 10032270 10135137 10308899 10480434
4115 10480434 10595603 10574482 10884349 11196906 11653008 11788760 11755828 12160630 12365187 12590993
4105 12590993 13041505 13384955 13832035 14202741 14481755 14674491 14949874 15320924 15800342
4096A5800342L36565J74811L37244K61519J71233l5999M0253L91571O4300K45081
4086A7786920J78392j02972J51102J08932K27139K02568m0366k5723L51498N1678
4076A8889168L22532K52120P6409K93370J29934J42338J99156R2175L53530K62345
4066B1013077K15571L22919J94324L88120L02230J53064K69549J28392L40810
4057B3328056J95428J87879N46763L6133J23373M26706L31968J81635N16395K53853
4047B6128189J56075K66346J37093J79351M12815M09506K15631K09956J86621
4038B8301583J62756K63226L50387J67769R0381J78699J40625M33738K0838r9503
4028C0010499J26519J35120R9368Q2996L8276q0617L1323k3690j45777l09560
$$ plain form
4096 15800342 16136907 16311718 16648962 16910481 17081714 17045715 17085968 17477539 17541839 17786920
4086 17786920 17965312 17862340 18013442 18122374 18349513 18552081 18511715 18485992 18837490 18889168
4076 18889168 19211700 19463820 19540229 19833599 19963533 20105871 20305027 20397202 20750732 21013077
4066 21013077 21228648 21551567 21745891 22134011 22436241 22589305 22858854 22987246 23328056
4057 23328056 23523484 23711363 24258126 24294259 24417632 24844338 25176306 25357941 25874336 26128189
4047 26128189 26284264 26550610 26687703 26867054 27279869 27689375 27905006 28114962 28301583
4038 28301583 28464339 28727565 29077952 29245721 29336102 29514801 29655426 30089164 30110002 30010499
4028 30010499 30137018 30272138 30371506 30454502 30492778 30412161 30443484 30419794 30274017 29964457
4018B9964457j83885k41410n40690k30771j20915k65714l48779l98611m84694
4009B7148988o32164l15407m38258n80755l46726l88603m39577n41450m66440
4000B2999608m76250n07217m07905m57334l50637m95719m80714m33599l18807
3991A9071426o34668o39572m57972l16754n27448p24948m01362j39715l69020
3982A4859967m98845m94694k13853l99903k86781k03337j87456r0918j54300l15103
3972A2014777k24339j01467q3040j60252n0734L0678n6423k84373M0987P836P813
3961A1141463p7108j37795K51294K01246K5244j13128j01647J46680J3072R3855
3951A1443176P8441k12240K2238m1872Q4807K9422j05758O7008m564j30405J5543
$$ plain form
4018 29964457 29780572 29539162 28998472 28767701 28646786 28381072 28032293 27633682 27148988
4009 27148988 26516824 26201417 25763159 25182404 24835678 24447075 24007498 23466048 22999608
4000 22999608 22523358 22016141 21608236 21150902 20800265 20304546 19823832 19390233 19071426
3991 19071426 18436758 17797186 17339214 17022460 16495012 15770064 15368702 15228987 14859967
3982 14859967 14361122 13866428 13652575 13252672 12965891 12762554 12575098 12484180 12329880 12014777
3972 12014777 11790438 11688971 11605931 11445679 11394945 11425623 11369200 11084827 11125814 11133650 11141463
3961 11141463 11064355 10926560 11177854 11379100 11404344 11291216 11189569 11336249 11349321 11443176
3951 11443176 11521617 11309377 11331615 11289743 11374550 11403972 11298214 11365222 11360658 11230253 11245796
3940A1245796K33648j8052j29188r0038j42365J9832n9434j231m2511r4597L3232
3929A0955092j10854j18483J91950j44845N2484Q3142j50573j7484R5096j02172
3919A0733353k5878K8235K481m9565o5095M1931j84551n4122K52738J09168j67631
3908A0621064K1401J32196J02607J4709n6828N8983k5901N9214p5687O7999K86355
3897A1206112N0354L9349M8262q5674K64317J90087J93182J59721J67664J91082
3887A2424456l6131O1262K66000L70402O8197K72110K59461J67733J36805J22469
3877A4112764M15664j07487M7066M30048M48834P6848M33442J76924J86697L59979
3867A6580779J34934N14042L42450K37349L28092J07350J63558K00255M63708
$$ plain form
3940 11245796 11479444 11461392 11332204 11242166 11099801 11119633 11060199 11058968 11016457 10921860 10955092
3929 10955092 10844238 10725755 10917705 10772860 10825344 10908486 10757913 10740429 10835525 10733353
3919 10733353 10707475 10735710 10738191 10688626 10623531 10665462 10480911 10426789 10679527 10788695 10621064
3908 10621064 10642465 10774661 10877268 10891977 10835149 10894132 10868231 10927445 10851758 10919757 11206112
3897 11206112 11256466 11295815 11344077 11258403 11522720 11712807 11905989 12065710 12233374 12424456
3887 12424456 12388325 12449587 12715587 13085989 13154186 13426296 13685757 13853490 13990295 14112764
3877 14112764 14528428 14420941 14468007 14898055 15346889 15423737 15857179 16034103 16220800 16580779
3867 16580779 16715713 17229755 17572205 17809554 18137646 18244996 18408554 18608809 19072517
3858A9072517L48317K46971L22755M41154M85264L51325L44676M50680J92608
3849B2256267L24732N69461L92316L22742L66960N51017M14033M54655Q17170
3840B6469353N44082O26430O20337N74334N62208Q37462Q13425Q46703Q32260
3831C2726594R67544R99105Q65167J163596J131158J338117J136360J360171J211396
3822D2899208J461437J655176J833053J802423K127941J915013K257388K455043
3814E8406682K732072K955900L032411L381001L516489L459264L628608L817765
3806H4930192M044355L899440L838854L625345L198409K401592J788343J208332
3798A08934862N72037j21111o67000j036992j235595j192041j127519q51656n36607
$$ plain form
3858 19072517 19420834 19667805 19990560 20431714 20916978 21268303 21612979 22063659 22256267
3849 22256267 22580999 23150460 23542776 23865518 24232478 24783495 25197528 25652183 26469353
3840 26469353 27013435 27639865 28260202 28834536 29396744 30234206 31047631 31894334 32726594
3831 32726594 33694138 34693243 35558410 36722006 37853164 39191281 40327641 41687812 42899208
3822 42899208 44360645 46015821 47848874 49651297 51779238 53694251 55951639 58406682
3814 58406682 61138754 64094654 67127065 70508066 74024555 77483819 81112427 84930192
3806 84930192 88974547 92873987 96712841 100338186 103536595 105938187 107726530 108934862
3798 108934862 109506899 109385788 108718788 107681796 106446201 105254160 104126641 103274985 102738378
3789A02738378k34626K555M63534M01583O26673R56888Q38537N57138M72773N24903
3779A07348336j80217q28864j447586k218109k876505l318142l679965l997688
3771H8801260m009827l897034l617062l645557l408506k988347k490968k386522
3763F2357437k333162k029734j880429j965659j693838j425231j412946j127847
3755D8488591j170428j138963j101026q74573q91479r20008p99666q70532p28173
3746C9993743p39347o81884n32895p73496n79577p22635n48982o05098n12459
3737C4297370l58051n73461m49566l19866l65756n42875m45263m56122m47338
3728C0339072m37157k55817l56461l56200m98249k32969n26810k00504k52631
$$ plain form
3789 102738378 102503752 102506307 102969841 103371424 103998097 104954985 105793522 106350660 106823433 107348336
3779 107348336 107168119 106339255 104891669 102673560 99797055 96478913 92798948 88801260
3771 88801260 84791433 80894399 77277337 73631780 70223274 67234927 64743959 62357437
3763 62357437 60024275 57994541 56114112 54148453 52454615 51029384 49616438 48488591
3755 48488591 47318163 46179200 45078174 44203601 43312122 42392114 41592448 40721916 39993743
3746 39993743 39254396 38572512 38039617 37266121 36686544 35963909 35414927 34809829 34297370
3737 34297370 33939319 33365858 32916292 32596426 32230670 31687795 31242532 30786410 30339072
3728 30339072 29901915 29646098 29289637 28933437 28435188 28202219 27675409 27474905 27222274
3719B7222274n04449l31865l27610k89037l40422l43690l49747l79472k69111
3710B4086871k94945m13282l51373l78712n71811l79929k86212m30943j70530
3701B0809134k26560m19179k11912l29840k63214k27440l29173l43403m72917
3692A7985496k71219k54366k55700j24447m25143m58501l28306J71459j50514
3683A5888759m05707m69177k47754j12825l25298j82997p1827n1015l56199m05215
3673A3260745n6669l9090l29189j59295j89709k10171j42101j75324j32971k87266
3663A1538960l87092k01443j94900j52548j92238r2580l24220p0282k01215j45874
3653I576568j94534k52921M4127j95224k81303k21605m8273j85176j88715r4491
$$ plain form
3719 27222274 26717825 26385960 26058350 25769313 25428891 25085201 24735454 24355982 24086871
3710 24086871 23791926 23378644 23027271 22648559 22076748 21696819 21410607 20979664 20809134
3701 20809134 20582574 20163395 19951483 19621643 19358429 19130989 18801816 18458413 17985496
3692 17985496 17714277 17459911 17204211 17079764 16654621 16196120 15867814 16039273 15888759
3683 15888759 15483052 15013875 14766121 14653296 14327998 14145001 14073174 14022159 13665960 13260745
3673 13260745 13204076 13164986 12835797 12676502 12486793 12276622 12134521 11959197 11826226 11538960
3663 11538960 11151868 10950425 10755525 10602977 10410739 10318159 9993939 9923657 9722442 9576568
3653 9576568 9382034 9129113 9173240 8978016 8696713 8475108 8426835 8241659 8052944 7958453
3643G958453n1783k36973j84032J2646j20795k3206j58166q5666j36209o4999
3633F909270L0318j73906p7743j81600q2792k37509K9327r414j0143j43406k03986
3622E848416j55044j10462j4664j48112l5542L8617l5993j21311j43413j63974
3612D958518k9049m2082M5125L83k94614k19544J56320k43806J9761J73663J061
3601D525736N3964j83965m1858L5003j92647l2134J20998L3047J10785r6952j35841
3590D196136L7975j40122K5410n1520q9293j66452R6154J43287j33041j85828
3580C732706l187j11090J08539Q8267n1591N8174k25051r1442o298j7266q5973
3569C395788R4487K15524j9596M7833o8275l1172q1181p6775m6942M821j23521
$$ plain form
3643 7958453 7906670 7669697 7485665 7498311 7377516 7354310 7196144 7110478 6974269 6909270
3633 6909270 6939588 6765682 6687939 6506339 6423547 6186038 6215365 6205951 6195808 6052402 5848416
3622 5848416 5693372 5582910 5568246 5420134 5384592 5423209 5387216 5265905 5122492 4958518
3612 4958518 4929469 4887387 4932512 4932895 4638281 4418737 4575057 4331251 4351012 4524675 4525736
3601 4525736 4579700 4395735 4353877 4388880 4196233 4164099 4285097 4318144 4428929 4331977 4196136
3590 4196136 4234111 4093989 4119399 4067879 3978586 3812134 3908288 4051575 3918534 3732706
3580 3732706 3729519 3618429 3726968 3815235 3763644 3821818 3596767 3505325 3499027 3481761 3395788
3569 3395788 3490275 3705799 3686203 3734036 3665761 3634589 3553408 3476633 3429691 3434512 3310991
3558C310991l9861j6921j89284J7244R3403p4317R3144j31415l15780m7717Q3334
3547B782821L6586o8474M8128J09686P9682m3824r430j71343L9575p1100r728
3536B722579n1304j90886q9271J61592R1634m4507r7815O9885O6629M7642J9032
3525B705210J35297j42659O2353P5057j48795K6790Q1932j02682l8629J86372
3515B840246J5191k7598j17369K503q3326o9221J59976K55404L4848l67450q3476
3504B559728J75639l3937L9943P4088p7318k8700K15737n9820K0097j16861p3050
3493B695546K36021o9480q0444q8042k2622q84Q4234J20912R8648r8993J46061
3482C020957j86909j1483J08747r8700K35434q2006L8097r7553K00561O3284k5111
$$ plain form
3558 3310991 3271130 3254209 3064925 3082169 3175572 3101255 3194399 3062984 2747204 2699487 2782821
3547 2782821 2819407 2750933 2799061 2908747 2988429 2944605 2935175 2763832 2803407 2732307 2722579
3536 2722579 2671275 2480389 2391118 2552710 2644344 2599837 2502022 2571907 2638536 2686178 2705210
3525 2705210 2840507 2697848 2760201 2835258 2686463 2713253 2795185 2692503 2653874 2840246
3515 2840246 2855437 2827839 2710470 2712973 2629647 2560426 2720402 2975806 3010654 2643204 2559728
3504 2559728 2735367 2701430 2741373 2815461 2738143 2709443 2925180 2865360 2885457 2768596 2695546
3493 2695546 2931567 2862087 2781643 2693601 2670979 2670095 2754329 2875241 2973889 2874896 3020957
3482 3020957 2834048 2822565 2931312 2832612 3068046 2986040 3024137 2926584 3127145 3190429 3165318
3471C165318N0506K17290Q3841J2630M1018k5107J96405O9307L5157J85934l7656
3460C994643l3676N1547J19285Q673J64778m1477J41384J54162O1352p0415J80520
3449D730776L02528Q1957j14782L5606K25076R3081K9169r6980J29724J20620
3439E536775J58579m711J13632J00180Q7732K8630K01320J06760J42026j3586
3429F457337J48992l4605J37668J45044M1901R1207k7140J45027J61438J33041
3419G399910K58095K72121K11290J13257K33499R7186K35109L01941J01373K63051
3409I486832L62916L77338L16583Q1756K39960P11725O54706K19572O04897N73937
3399A3630222R06955P75820O99780P67189P89194P13148R99227J451480J255476
$$ plain form
3471 3165318 3215824 3433114 3516955 3529585 3570603 3545496 3741901 3811208 3846365 4032299 3994643
3460 3994643 3960967 4012514 4131799 4140472 4305250 4263773 4405157 4559319 4620671 4550256 4730776
3449 4730776 5033304 5115261 5000479 5036085 5261161 5354242 5383411 5286431 5416155 5536775
3439 5536775 5695354 5690643 5804275 5904455 5992187 6020817 6222137 6328897 6470923 6457337
3429 6457337 6606329 6571724 6709392 6854436 6896337 6987544 6960404 7105431 7266869 7399910
3419 7399910 7658005 7930126 8141416 8254673 8488172 8585358 8820467 9122408 9223781 9486832
3409 9486832 9849748 10227086 10543669 10625425 10865385 11577110 12231816 12451388 13056285 13630222
3399 13630222 14537177 15312997 16012777 16779966 17569160 18282308 19281535 20733015 21988491
3390B1988491J355554J650705K168790K181630K477235K702556L015569L142303
3382D0682833L031537L280688L136197K713896K979011K783416K620093L225543
3374F4453214L593944L577661L593206K952790K045439J384249Q92604R19866
3366H3412973J365160J990813K203552J340798L97416q13936k321752l272036
3358H4302988l290906k534873j984568j761205j840236k252512k973622l893272
3350F3771794m396798m307300l902728l129703k480769k570559k603458k671666
3342C7708813l223847l152958k885447k704868k046823j733122j406300j408800
3334A9146648j154416r37820j033076o82259n31457p10899n99536n33446l61942
$$ plain form
3390 21988491 23344045 24994750 27163540 29345170 31822405 34524961 37540530 40682833
3382 40682833 43714370 46995058 50131255 52845151 55824162 58607578 61227671 64453214
3374 64453214 68047158 71624819 75218025 78170815 80216254 81600503 82493107 83412973
3366 83412973 84778133 86768946 88972498 90313296 90710712 89896776 87575024 84302988
3358 84302988 81012082 78477209 76492641 74731436 72891200 70638688 67665066 63771794
3350 63771794 59374996 55067696 51164968 48035265 45554496 42983937 40380479 37708813
3342 37708813 34484966 31332008 28446561 25741693 23694870 21961748 20555448 19146648
3334 19146648 17992232 17054412 16021336 15339077 14807620 14096721 13497185 12963739 12601797
3325A2601797m51449n87962l15886l91456n41865l68112l88011l37133n29000
3316H690923k20463k56262p9063m29330j71038j01987j75650k19792p1837j46355
3306F819146k31598j62581k58932j55788q9470j59870j55444j06925m5908j97464
3296E255166k57855K3981r6473j61632j51017q8688j42048j1589j5841L9265p8019
3285D315250j07694P5713K0025M3161k27891j80837m9233k04748p0877M0905p8232
3274C575542m6728j19140M1803p8427j33154P4536m937j7496j01113M3676k75371
3263B959191k8829q3917N9987j13675M6299q452p5587k2954L592m3107j22373
3252B570175j6057J06633n4265J01115L284l6768L0091k50707J62689P1421l63380
$$ plain form
3325 12601797 12150348 11562386 11246500 10855044 10313179 9945067 9557056 9219923 8690923
3316 8690923 8470460 8214198 8135135 7705805 7534767 7432780 7257130 7037338 6965501 6819146
3306 6819146 6587548 6424967 6166035 6010247 5920777 5760907 5605463 5498538 5452630 5255166
3296 5255166 4997311 5021292 4924819 4763187 4612170 4523482 4381434 4369845 4354004 4393269 4315250
3285 4315250 4207556 4283269 4303294 4346455 4118564 3937727 3888494 3683746 3612869 3653774 3575542
3274 3575542 3528814 3409674 3451477 3373050 3239896 3314432 3309495 3291999 3190886 3234562 2959191
3263 2959191 2930362 2846445 2906432 2792757 2839056 2830604 2755017 2732063 2735655 2692548 2570175
3252 2570175 2554118 2660751 2606486 2707601 2710885 2674117 2704208 2453501 2616190 2687611 2324231
3241B324231J13101m5144J11675j72273r9656J6828k0678M3946Q9947j33601R827
3230B238203l6211L7368j4022J59537n0666j45583r3415L0827J86108j8304j63239
3219B130603j2346J21333m3982J2061p4100R6657j10257J07721k391K4325Q4580
3208B334204o2960j69534J1415R9202n3731l3503j82610K07483P3355j73076j10466
3197A939779O1569L4818N6027j0335k9981J07016O7814K25232j40854O3346l13
3186B374118N8414j25741J3190Q2925j6946j38556L7668j38395q8901O9472K35442
3175B362690J00590l1621k1432J22525K430R533j5013j34967J4020P6238R3705
3164B578698j24450Q6077J58243l4655J10827O4961p6538k3213J55689q7334m7037
$$ plain form
3241 2324231 2437332 2392188 2503863 2331590 2231934 2248762 2228084 2272030 2361977 2228376 2238203
3230 2238203 2201992 2239360 2225338 2384875 2334209 2188626 2095211 2126038 2312146 2293842 2130603
3219 2130603 2118257 2239590 2195608 2207669 2133569 2230226 2119969 2227690 2225299 2249624 2334204
3208 2334204 2271244 2101710 2113125 2212327 2158596 2125093 1942483 2149966 2223321 2050245 1939779
3197 1939779 2001348 2036166 2092193 2081858 2051877 2158893 2226707 2451939 2311085 2374431 2374118
3186 2374118 2432532 2306791 2319981 2402906 2385960 2247404 2285072 2146677 2057776 2127248 2362690
3175 2362690 2463280 2431659 2410227 2532752 2535182 2544715 2529702 2394735 2408755 2484993 2578698
3164 2578698 2454248 2540325 2698568 2663913 2774740 2839701 2763163 2739950 2895639 2808305 2761268
3153B761268R7579Q049Q3901n3567n7635K03925j1429J17185N8784r9413J30418
3142C239065j4669M1449k7912j15404J2108J13271J58834K39593k0990q3342n3072
3131C488931n5100J35747J86597R4927j5648j47746Q1199R3169j1870N2535K2445
3120C925186J75689j06029K9208J53413Q4257J41360K74820k6211J04647K41867
3110D998207Q7140K7626L65136K11258N9458j1365L4228P7381J58140J54681N4498
3099F216388l7445M5658J82484L1874N4932J11619R7060j37604M28854K86124
3089G279944R4504q5749o5256J68367K80718P8537R1792J63519J08221J73974
3079H288571K81948P1549L32738K82647K35996K96601J00125J78367K21695N39573
$$ plain form
3153 2761268 2858847 2866896 2950797 2897230 2839595 3043520 3032091 3149276 3208060 3108647 3239065
3142 3239065 3224396 3265845 3237933 3122529 3134637 3247908 3406742 3646335 3625345 3542003 3488931
3131 3488931 3433831 3569578 3756175 3851102 3835454 3687708 3768907 3862076 3850206 3902741 3925186
3120 3925186 4100875 3994846 4024054 4177467 4261724 4403084 4677904 4651693 4756340 4998207
3110 4998207 5085347 5112973 5478109 5689367 5748825 5737460 5771688 5849069 6007209 6161890 6216388
3099 6216388 6178943 6224601 6407085 6438959 6493891 6605510 6702570 6564966 6993820 7279944
3089 7279944 7374448 7288699 7223443 7391810 7672528 7751065 7842857 8006376 8114597 8288571
3079 8288571 8570519 8642068 8974806 9257453 9493449 9790050 9890175 10068542 10290237 10829810
3069A0829810N28865J18538L01076L46473M11045L42576L81222L96903N00165
3060A4156673O34811L85698O57401M89203M32884O41342O82045O88431P78717
3051A9547205N69774N15688Q01279R26115R49027O85264Q51720R18723P49260
3042B6514055Q81808Q92645Q97847R86707R46530P21874Q09834J001985P04866
3033C4358151Q57525R83792P73493Q70637N42094O14513P14820N83183N83505
3024D0881713K63878N55678M43084M68845L35408J75281L08261O8648r9280J88681
3014D3590197P7105P3670j99079j8547P3170J84834L4325J3035Q5775M9793n9458
3003D3904820r6098m2886k04941M2735j40495j95068q7512j18255j98377k33905
$$ plain form
3069 10829810 11358675 11477213 11778289 12124762 12535807 12878383 13259605 13656508 14156673
3060 14156673 14791484 15177182 15834583 16323786 16756670 17398012 18080057 18768488 19547205
3051 19547205 20116979 20632667 21433946 22360061 23309088 23994352 24846072 25764795 26514055
3042 26514055 27395863 28288508 29186355 30173062 31119592 31841466 32651300 33653285 34358151
3033 34358151 35215676 36199468 36972961 37843598 38385692 39000205 39715025 40298208 40881713
3024 40881713 41145591 41701269 42144353 42613198 42948606 43123887 43432148 43500796 43401516 43590197
3014 43590197 43667302 43740972 43541893 43523346 43596516 43781350 43815675 43828710 43914485 43964278 43904820
3003 43904820 43808722 43765836 43560895 43603630 43463135 43268067 43180555 43062300 42863923 42630018
2993D2630018l44197m61830j92390l09770o44249k73035m84308l91115m94994
2984C9034130m89839l80532m50445l81878k87047k88429j29808k40218k96917
2975C6089017k40138J12385J23187j17248J92075M8761J91299L31327R9519K58040
2965C7088224K77311K24370K72343K81699M39361M71465L25529K71010K67172
2956C9918484M36123Q9200J62037L76265M36892L38725R88452J122143R86015
2947D4854336J392701J447858J138666K86802j538155l559665m039476k663972
2939C7319095j856278j659054j142225q90857p89442p03751m26746l10079k96648
2930B9244015l69415m89373l13021j09323m16589j14366k21291j95418k73702
$$ plain form
2993 42630018 42285821 41823991 41631601 41321831 40677582 40404547 39920239 39529124 39034130
2984 39034130 38544291 38163759 37713314 37331436 37044389 36755960 36626152 36385934 36089017
2975 36089017 35848879 35961264 36084451 35967203 36159278 36208039 36399338 36730665 36830184 37088224
2965 37088224 37365535 37589905 37862248 38143947 38583308 39054773 39380302 39651312 39918484
2956 39918484 40354607 40443807 40605844 40982109 41419001 41757726 42746178 43868321 44854336
2947 44854336 46247037 47694895 48833561 49120363 47582208 44022543 39983067 37319095
2939 37319095 35462817 33803763 32661538 31770681 30981239 30277488 29850742 29540663 29244015
2930 29244015 28874600 28385227 28072206 27962883 27546294 27431928 27210637 27015219 26741517
2921B6741517l03155m10969o66515m76732m44526m12197n65876o86390o06985
2912B2168172m68684n84147m13551p32676m59780m08040n94817m61241n77899
2903A7467337m84005m74259m44361m41533l15754j81636l32524n72233j90230
2894A4030802k65213k57713l33660k25688k87467j14447j19925l34254k11139
2885A1881296k57845j99895l24569k25740k10344j53829j87250l31733k94849
2876I695242k42922n57540k28932r5586k36361l2749o4813j21604k96818l16852
2866G501065k76415j07869j12673k14843j31830k3521k40619j86360j15704j5922
2856F075309n6825j02520J4985l61383k13643j71740j84942m3747R715j50997
$$ plain form
2921 26741517 26438362 26027393 25360878 24884146 24439620 24027423 23461547 22775157 22168172
2912 22168172 21699488 21115341 20701790 19969114 19509334 19101294 18506477 18045236 17467337
2903 17467337 16983332 16509073 16064712 15623179 15307425 15125789 14793265 14221032 14030802
2894 14030802 13765589 13507876 13174216 12948528 12661061 12546614 12426689 12092435 11881296
2885 11881296 11623451 11423556 11098987 10873247 10662903 10509074 10321824 9990091 9695242
2876 9695242 9452320 8894780 8665848 8570262 8333901 8301152 8236339 8114735 7817917 7501065
2866 7501065 7224650 7116781 7004108 6789265 6657435 6633914 6393295 6206935 6091231 6075309
2856 6075309 6018484 5915964 5930949 5569566 5355923 5184183 4999241 4955494 4965209 4814212
2846D814212N1282m5339o8130n9688j90220k22027o7734m7001M5429l4011j01398
2835D075375N8485l52081K29574o0481k17603J05746j38551P7217J74159n847
2825C945993q4085j98934j04332j8127J75427j38039q1537m529j94754Q8890R8041
2814C484014Q3461p3353j62837L4108m7197N3692l2553J0628j73091l4415L4623
2803C177080O3702j07468L1513J47298R4143j5076j74445K72574L9962r5366M218
2792C438135m1646j62978J47803j54960m5096J35916O129J17183o6828j59897
2782C213761J64533l8549J00592l4913K7046K63669l40719k5665O1308J71667
2772C562730J8929k6103J09719j65022k80573O3914K23948k4544o1306M2502k0014
$$ plain form
2846 4814212 4865494 4820155 4752025 4692337 4502117 4280090 4212356 4165355 4210784 4176773 4075375
2835 4075375 4133860 3781779 4011353 3950872 3733269 3839015 3700464 3777681 3951840 3945993
2825 3945993 3861908 3662974 3558642 3540515 3715942 3577903 3496366 3491837 3297083 3385973 3484014
2814 3484014 3567475 3494122 3331285 3365393 3318196 3371888 3339335 3349963 3176872 3142457 3177080
2803 3177080 3240782 3133314 3164827 3312125 3406268 3391192 3216747 3489321 3529283 3433917 3438135
2792 3438135 3396489 3233511 3381314 3226354 3181258 3317174 3323303 3440486 3373658 3213761
2782 3213761 3378294 3339745 3440337 3405424 3432470 3696139 3355420 3329755 3391063 3562730
2772 3562730 3581659 3555556 3665275 3500253 3219680 3283594 3507542 3482998 3421692 3464194 3444180
2761C444180l2110K98803L7292o744M2391k78892J14076J59763o1371M6302p5048
2750C688642O7157n1729L50012O1853j39923j08552J33848K56639o6019k7812
2740D164116J05629N2069r6817O6432n90J16925P6009J60877J24823k74673j03355
2729D391445N6554K31163Q6813K48896M0501k71993J55571J6704m8799J93009
2719E099864K01541Q5956J5334j62583N7757J2445K57171n9993p1212Q5424J18089
2708E639793J80546R3947M5246J23331R9590o7928K6315J1456J21889K30941O1702
2697F566828J10252M9250J08905J25337J62101Q2947n080J70140K37651J39987
2687G748318K8499J81771N964J79869J38048Q7224K73948P5747m5154L02831L14705
$$ plain form
2761 3444180 3412070 3710873 3748165 3741421 3783812 3504920 3618996 3778759 3717388 3763690 3688642
2750 3688642 3755799 3704070 4054082 4115935 3976012 3867460 4001308 4257947 4191928 4164116
2740 4164116 4269745 4321814 4224997 4291429 4290839 4407764 4483773 4644650 4769473 4494800 4391445
2729 4391445 4447999 4679162 4765975 5014871 5055372 4783379 4938950 4955654 4906855 5099864
2719 5099864 5301405 5387361 5402695 5240112 5297869 5310314 5567485 5507492 5436280 5521704 5639793
2708 5639793 5820339 5914286 5959532 6082863 6182453 6114525 6140840 6152296 6274185 6505126 6566828
2697 6566828 6677080 6726330 6835235 6960572 7122673 7205620 7200540 7370680 7608331 7748318
2687 7748318 7776817 7958588 7964552 8144421 8282469 8369693 8643641 8719388 8674234 8977065 9291770
2676I291770K41660Q1835L03463J53923K20600K16567J75590l837K83356K77542
2666A1242469J94458K74808K63189M58098M3697M37820L76508M12053K64919N03140
2656A4471159L66641J02529L63855M66591O55652N47728O14860L27663N13043
2647A8429721O55575Q08018O51925O29877P86317O65571Q59888Q81535R54637
2638B5323064J055310J183262J210184J134949J144609J316486J546813J472317
2630C5386994J445850J696971J831305J901898J773663J920802J965591J734211
2622D9657285J740250J768261J597579J572420J309909J184348R06518P72038
2614F0508608P49671M16567M53541J39511k11191k09486k53075k85647m33936
$$ plain form
2676 9291770 9533430 9615265 9918728 10072651 10293251 10509818 10685408 10681571 10964927 11242469
2666 11242469 11436927 11711735 11974924 12433022 12476719 12914539 13291047 13703100 13968019 14471159
2656 14471159 14837800 14940329 15304184 15770775 16426427 16974155 17589015 17916678 18429721
2647 18429721 19085296 19893314 20545239 21175116 21961433 22627004 23486892 24368427 25323064
2638 25323064 26378374 27561636 28771820 29906769 31051378 32367864 33914677 35386994
2630 35386994 36832844 38529815 40361120 42263018 44036681 45957483 47923074 49657285
2622 49657285 51397535 53165796 54763375 56335795 57645704 58830052 59736570 60508608
2614 60508608 61258279 61674846 62128387 62267898 62056707 61847221 61594146 61308499 60874563
2605F0874563n47831n66014q93664j037518j112369j345868j602102j348098j504314
2596E0916785j970907j820590j806200j936439j859995j700038j756223j631412
2588C6434981j579631j670307j436751j317321j320169j046402r69329j072736
2580B6022335q47476p28997q58918q69775p93709n73997n17776p34572m80538
2571A9616577l61941m17784p95986l52817j65803n01489k34638m40346j29512
2562A6216261k11986r3608j34400k32820l59258k70563k29104k22261k696j64926
2552A4294639j39884M6571j03551J55034j17188k21910J16932j94654M1529J93910
2542A4071428m5488k30563n979J68340j6692J23233M266k1661J02081J46922m019
$$ plain form
2605 60874563 60326732 59760718 58867054 57829536 56717167 55371299 53769197 52421099 50916785
2596 50916785 48945878 47125288 45319088 43382649 41522654 39822616 38066393 36434981
2588 36434981 34855350 33185043 31748292 30430971 29110802 28064400 27095071 26022335
2580 26022335 25174859 24445862 23586944 22717169 21923460 21349463 20831687 20097115 19616577
2571 19616577 19254636 18836852 18040866 17688049 17522246 17020757 16786119 16345773 16216261
2562 16216261 16004275 15910667 15776267 15543447 15184189 14913626 14684522 14462261 14459565 14294639
2552 14294639 14154755 14201326 14097775 14252809 14135621 13913711 14030643 13835989 13877518 14071428
2542 14071428 14025940 13795377 13789398 13957738 13941046 14064279 14068545 14046884 14148965 14295887 14291868
2531A4291868m1750K47710N2330N1732K76134P2778J09839K91057J65086K14846
2521A5731630J97529N91798K01177J06716L04616M38862L41604K75214K07784
2512A8396930L48869L22781M93953M45620M55647O16122M59136L95540O14370
2503B2548968M10168K83064L89835J73266L35761L75708Q3162M2658M02729J25338
2493B5170657j2308R9628K29410J47824Q1138J61289L0803L28482L40569J06289
2483B6683781K00970K15471M36582N09659L90636M39236N18719M66801Q89049
2474C0750904O64935Q45677P67703R54793R91654R76371R72483J251149J073579
2465C9249248J068874J342301J522356J641790J879957J717345J865361K095526
$$ plain form
2531 14291868 14250118 14497828 14550158 14601890 14878024 14950802 15060641 15351698 15516784 15731630
2521 15731630 15929159 16520957 16722134 16828850 17133466 17572328 17913932 18189146 18396930
2512 18396930 18745799 19068580 19562533 20008153 20463800 21079922 21539058 21934598 22548968
2503 22548968 22959136 23242200 23632035 23805301 24141062 24516770 24599932 24642590 25045319 25170657
2493 25170657 25158349 25257977 25487387 25635211 25716349 25877638 25908441 26236923 26577492 26683781
2483 26683781 26884751 27100222 27536804 28046463 28437099 28876335 29395054 29861855 30750904
2474 30750904 31415839 32261516 33029219 33984012 34975666 35952037 36924520 38175669 39249248
2465 39249248 40318122 41660423 43182779 44824569 46704526 48421871 50287232 52382758
2457E2382758K164731K316200K463201K257371K338884K890955K895926K836721
2449G2546747K892995L011812K819300L000044K952868K839549K658217K526927
2441I5248459K492818K113523K003461J878395J540433J343262R67666Q09114
2433A08397131L47363l3594n65107o67464j061871j380362j553165j703858k065202
2424I9713871k100111k419132k342906k365186k542979k474633k592540k745400
2416H0130984k369090k584516k506470k544168k632886k686088k496444k406195
2408E9905127k486453k466583k267609k086399k007718j959298j927173j887571
2400D2816323j699845j349172j446952j576760j468667j080477q46380r90029
$$ plain form
2457 52382758 54547489 56863689 59326890 61584261 63923145 66814100 69710026 72546747
2449 72546747 75439742 78451554 81270854 84270898 87223766 90063315 92721532 95248459
2441 95248459 97741277 99854800 101858261 103736656 105277089 106620351 107588017 108397131
2433 108397131 108744494 108710900 108145793 107478329 106416458 105036096 103482931 101779073 99713871
2424 99713871 97613760 95194628 92851722 90486536 87943557 85468924 82876384 80130984
2416 80130984 77761894 75177378 72670908 70126740 67493854 64807766 62311322 59905127
2408 59905127 57418674 54952091 52684482 50598083 48590365 46631067 44703894 42816323
2400 42816323 41116478 39767306 38320354 36743594 35274927 34194450 33348070 32358041
2392C2358041r95705j029836q09976r78504p21894n04301m77986m96093n61065
2383B5782681m18872m06915n76979n46905j31561k24944k62490l18674j62233
2374B2733108j80400K7093k22772k73467l31544J0983J40176R078q5516M0831
2364B1867570j4231l34540l21821l41135j65543l6676k60781l92530n28740k71697
2354A9199876l83312l97897m63509n39381k43496k68586m96142n15980l29784
2345A5561789k28001k49235m58219m03779j80425l72647j21399k94048k17958
2336A3036078j58289j69075k59896k2589j93453l46141J5915j17401k39198k85035
2326A1260916j00752O1883k24431k00241r3658n5262k82846K4905O9395n6568
$$ plain form
2392 32358041 31362336 30332500 29522524 28544020 27822126 27317825 26839839 26343746 25782681
2383 25782681 25363809 24956894 24379915 23833010 23701449 23476505 23214015 22895341 22733108
2374 22733108 22552708 22579801 22357029 22083562 21752018 21763001 21903177 21912255 21826739 21867570
2364 21867570 21853339 21518799 21196978 20855843 20690300 20653624 20392843 20000313 19471573 19199876
2354 19199876 18816564 18418667 17955158 17415777 17172281 16903695 16407553 15891573 15561789
2345 15561789 15333788 15084553 14626334 14222555 14042130 13669483 13548084 13254036 13036078
2336 13036078 12877789 12708714 12448818 12426229 12232776 11886635 11902550 11785149 11545951 11260916
2326 11260916 11160164 11222047 10997616 10797375 10703717 10648455 10365609 10390514 10459909 10403341
2316A0403341j03056k1204q7158j8101J00962J23744p6455l86917j3630K2544
2306I944070K4602r450K46027n4838J2214J5148k9092l9251j42977N575l8704
2295I933324L4377N8019J08164J64993p4149P1010K98463J59776r7128N7246J43343
2284A0857438K52592k756K09058J45293L5770L76359J45654J17261L22777J44948
2274A2604394M4004J98105J91695K07501L27530J87175O4703L51508J91125M70256
2264A4837996L57694K09725L68814L71623J35902K97450L93793L64814L73177
2255A7710988K26194L57925L80649L43678K18426K10733L98627K27907L55046
2246B0430173L38862N01184L55560K30848N03762K14376M69913L44566K78613
$$ plain form
2316 10403341 10300285 10279081 10191923 10173822 10274784 10398528 10322073 9935156 9921526 9944070
2306 9944070 9968672 9959222 10205249 10150411 10162625 10177773 10148681 10109430 9966453 9972028 9933324
2295 9933324 9967701 10025720 10133884 10298877 10224728 10295738 10594201 10753977 10656849 10714095 10857438
2284 10857438 11110030 11107274 11316332 11461625 11497395 11873754 12019408 12136669 12459446 12604394
2274 12604394 12648398 12846503 13038198 13245699 13573229 13760404 13825107 14176615 14367740 14837996
2264 14837996 15195690 15405415 15774229 16145852 16281754 16579204 16972997 17337811 17710988
2255 17710988 17937182 18295107 18675756 19019434 19237860 19448593 19847220 20075127 20430173
2246 20430173 20769035 21270219 21625779 21856627 22360389 22574765 23044678 23389244 23667857
2237B3667857M70749M81764M00203M66305N76628P02004N35370P64849P19629
2228B8785358Q23276Q50824R59900R15269J025575J079907J015001J256005J276246
2219C7987361J316773J582609J634792J806985K058349K067803J903725K025689
2211E2384086K381252K482424K610917K915052K902937L181564L056672L407957
2203G5322861L369226L401708L635615L656242L408565L382180L416145L117438
2195A02709980K951048K707609K522291K115585J884660J603725J140441R45332
2187A18580671O84614L60051m7021l94555n60947p66479j084226j394066j781418
2178A13596624k101225k207614k620986k565888k675905l026193l318075l468715
$$ plain form
2237 23667857 24138606 24620370 25020573 25486878 26063506 26765510 27300880 28065729 28785358
2228 28785358 29608634 30459458 31419358 32334627 33360202 34440109 35455110 36711115 37987361
2219 37987361 39304134 40886743 42521535 44328520 46386869 48454672 50358397 52384086
2211 52384086 54765338 57247762 59858679 62773731 65676668 68858232 71914904 75322861
2203 75322861 78692087 82093795 85729410 89385652 92794217 96176397 99592542 102709980
2195 102709980 105661028 108368637 110890928 113006513 114891173 116494898 117635339 118580671
2187 118580671 119265285 119625336 119578315 119183760 118622813 117856334 116772108 115378042 113596624
2178 113596624 111495399 109287785 106666799 104100911 101425006 98398813 95080738 91612023
2170I1612023l448400l407589l448597l335807l392100l497006l311584l092895
2162F4678045k859729k848180k633545k363422k260986k128009j982253j817117
2154D5784804j793949j549661j588678j432090j204681r83018j151965j210565
2146C4870197r78249q43407p55562p13418p33236n40554o21444n50033l03504
2137B8830790n1315l48581m65377m46185j53677k87029l62707m41110k03077k47164
2127B5824568j96103n74166n49128j83583l59454m82852n02032j66738j61003
2118B2649509l79639l13178l99654k88829l16213k74042k06751l07370k93366
2109A9870467l40822m92393k64648j16087k25390j06217k91332r7464j96996j31476
$$ plain form
2170 91612023 88163623 84756034 81307437 77971630 74579530 71082524 67770940 64678045
2162 64678045 61818316 58970136 56336591 53973169 51712183 49584174 47601921 45784804
2154 45784804 43990855 42441194 40852516 39420426 38215745 37232727 36080762 34870197
2146 34870197 33891948 33048541 32292979 31579561 30846325 30305771 29684327 29134294 28830790
2137 28830790 28779475 28430894 27965517 27519332 27365655 27078626 26715919 26274809 26071732 25824568
2127 25824568 25628465 25054299 24505171 24321588 23962134 23479282 22977250 22810512 22649509
2118 22649509 22269870 21956692 21557038 21268209 20951996 20677954 20471203 20163833 19870467
2109 19870467 19529645 19037252 18772604 18656517 18431127 18324910 18033578 17936114 17739118 17607642
2099A7607642j29486K429n3426j55355j8097R0705k815M5498l407R3288K39504
2088A7716480j31922j37320j01717R3281J22481J4422L890p0442J5836j11500
2078A7413489j18855J51097O1780J60760J04063J56646J77719j00610M4707L55792
2068A8406588K77570K92574K35594L43950M76292L21850N79380O52562M89556
2059B2075916N55200N42239O23287N74060P36505R50061R78206Q43053P55271
2050B8633798R17840J095635J096124J112328J232408J236140J399095J442169
2042C8165537J779731J724262J640428J814894J995394J940640K165709J866334
2034E3092929K167111K306580K233835K029079J920321J829703J707472J279965
$$ plain form
2099 17607642 17478156 17480585 17427159 17271804 17253707 17344412 17341597 17387095 17383688 17476976 17716480
2088 17716480 17584558 17447238 17345521 17438802 17561283 17575705 17579595 17509153 17524989 17413489
2078 17413489 17294634 17445731 17507511 17668271 17772334 17928980 18106699 18006089 18050796 18406588
2068 18406588 18684158 18976732 19212326 19556276 20032568 20354418 20933798 21586360 22075916
2059 22075916 22631116 23173355 23796642 24370702 25107207 26057268 27035474 27878527 28633798
2050 28633798 29551638 30647273 31743397 32855725 34088133 35324273 36723368 38165537
2042 38165537 39945268 41669530 43309958 45124852 47120246 49060886 51226595 53092929
2034 53092929 55260040 57566620 59800455 61829534 63749855 65579558 67287030 68566995
2026F8566995J078651O90357O10320j11660n04003p35974j020412j364536j787829
2017F5421909k042673k234355j991208k307581k530975k592887k483535k333980
2009D6904715k131872k136783k141566k107543j995885j723608j661314j401479
2001C1604665j469302j276988j415163j094216r62013q54283r23887q32259q72522
1992B1904032j035893o59851n47374o37304n78286m89218o79945m72831l86512
1983A6416818m34564l97653k67558m60779l69182l23305m06643k68823j36390
1974A3351921j96809j44013k45125k20231j26117k67981k54129J74044N16m9651
1964A2022425j37438l0269j5808j56646m3215j82657l21598K3874j64780j82397
$$ plain form
2026 68566995 69645646 70336003 70946323 70834663 70330660 69594686 68574274 67209738 65421909
2017 65421909 63379236 61144881 59153673 56846092 54315117 51722230 49238695 46904715
2009 46904715 44772843 42636060 40494494 38386951 36391066 34667458 33006144 31604665
2001 31604665 30135363 28858375 27443212 26348996 25386983 24532700 23608813 22776554 21904032
1992 21904032 20868139 20208288 19660914 19023610 18445324 17956106 17276161 16803330 16416818
1983 16416818 15982254 15584601 15317043 14856264 14487082 14163777 13757134 13488311 13351921
1974 13351921 13155112 13011099 12765974 12545743 12419626 12151645 11897516 12071560 12072076 12022425
1964 12022425 11884987 11854718 11838910 11682264 11639049 11456392 11134794 11158668 10993888 10811491
1954A0811491p1699m7797j22849j93689k98614j05167n55359j95541q2136k90665
1944H847975k29143j8885r964j22810n2505j91584j33534j31771l35108q8266
1934G534405K704q9502p8370r2459j97176q0803j36038J8262J08992l106M7307
1923G034216N7373J35814j35622j70377j86237R9281n5772j02794p5509q4267
1913F516106J76878j0950j03452J6219J43264K4453m4958n559p5243K476j06718
1902F532516m6365Q2309M7393J30919L3578p5009Q4986J57989l2675R3585Q5820
1891G095046L5030j73908k4415R4032R8012O8190p6064J14784r4672k5104J90772
1880G301703R8248K1773L5995j50146K18580J55003K1280Q8285J63749n0525L1022
$$ plain form
1954 10811491 10739792 10691995 10569146 10375457 10076843 9971676 9416317 9220776 9138640 8847975
1944 8847975 8618832 8599947 8589983 8467173 8414668 8223084 8089550 7957779 7622671 7534405
1934 7534405 7537109 7447607 7369237 7276778 7079602 6998799 6862761 6881023 6990015 6986909 7034216
1923 7034216 7091589 7227403 7091781 6921404 6735167 6834448 6778676 6675882 6600373 6516106
1913 6516106 6692984 6682034 6578582 6594801 6738065 6762518 6717560 6712001 6636758 6639234 6532516
1902 6532516 6486151 6568460 6615853 6746772 6780350 6705341 6790327 6948316 6915641 7009226 7095046
1891 7095046 7130076 6956168 6931753 7025785 7123797 7191987 7115923 7230707 7136035 7110931 7301703
1880 7301703 7399951 7421724 7457719 7307573 7526153 7681156 7702436 7790721 7954470 7903945 7934967
1869G934967J70005M2920J10149Q3208j12395J55029K25766L5781J49784J23989
1859H919203J47097K32011J89549J23401J18469O710J05747M14912J80463J56442
1849A0594004K36780K89553Q6823L11751L06096J73450J69727L38503M32423P9271
1839A3018381n4684K93622L16909K62600K78124K23836L28807J99427K87949L46511
1829A5501482M35769K17845J71435K06851M48271L49428L60997L94456M71683
1820A8558217L49123M20644M01754M35948M93381N47020O33862M54431N04204
1811B2798584O51302N08203O26040Q80953N88263P62718P49436P53148P43968
1802B9062615P43626Q90144R65688J018234J104672J058107J131816J498183J548970
$$ plain form
1869 7934967 8104972 8147892 8258041 8341249 8228854 8383883 8609649 8645430 8795214 8919203
1859 8919203 9066300 9298311 9487860 9611261 9729730 9736440 9842187 10257099 10437562 10594004
1849 10594004 10830784 11120337 11207160 11518911 11825007 11998457 12168184 12506687 12939110 13018381
1839 13018381 12963697 13257319 13574228 13836828 14114952 14338788 14667595 14867022 15154971 15501482
1829 15501482 15937251 16155096 16326531 16533382 16981653 17331081 17692078 18086534 18558217
1820 18558217 18907340 19327984 19729738 20165686 20659067 21206087 21839949 22294380 22798584
1811 22798584 23449886 23958089 24584129 25465082 26053345 26816063 27565499 28318647 29062615
1802 29062615 29806241 30696385 31662073 32680307 33784979 34843086 35974902 37473085 39022055
1793C9022055J528707J393055J583469J683346J635480J852325K041492K278182
1785E3018111K303100K593250K731540K864032K846972L108209L337972L702101
1777G6505287L933154M079912M591386M930410N263981N847412O333182O757005
1769A18241729P387788Q082775Q704664R749988J0351075J1379729J2122357J2792950
1761A98813055J3487634J4151702J4405386J4173156J3254482J1515531R032535
1754B88833481N339893J036800l845347q623891j2638362j5504578j7199789j7278896
1746B20119311j6668416j5708661j4658796j3223990j1828198j0635398r632164
1739A27763688q874803p738577p139769o623092n879615n089491m742841m502714
$$ plain form
1793 39022055 40550762 41943817 43527286 45210632 46846112 48698437 50739929 53018111
1785 53018111 55321211 57914461 60646001 63510033 66357005 69465214 72803186 76505287
1777 76505287 80438441 84518353 89109739 94040149 99304130 105151542 111484724 118241729
1769 118241729 125629517 133712292 142416956 152166944 162518019 173897748 186020105 198813055
1761 198813055 212300689 226452391 240857777 255030933 268285415 279800946 288833481
1754 288833481 294173374 295210174 291364827 282740936 270102574 254597996 237398207 220119311
1746 220119311 203450895 187742234 173083438 159859448 148031250 137395852 127763688
1739 127763688 118888885 111150308 104010539 97387447 91507832 86418341 81675500 77172786
1731G7172786l839854l707257l415884l259773k786105k489471k533494k289037
1723E2851911k200118j969146j865339j887012j650850j702301j504301j419799
1715C8653045j228464j198594j171257j081906j187474j232238j209812r69555
1707B9373745p67713j182909n81262o71893r17003q70768o13673n42366o22409
1698B2603749m56471n09999n83315o91645n46935m80991m63449l66858m81471
1689A8022615m56698n11106l85805m52301j74165k30363m60357n08579l20715
1680A4522526l69657k76813k85266k42608k48390k44019j82384l99004k45473
1671A2028912m14816k99074k90198j33056j77195l19908m35753k68545k09647
$$ plain form
1731 77172786 73332932 69625675 66209791 62950018 60163913 57674442 55140948 52851911
1723 52851911 50651793 48682647 46817308 44930296 43279446 41577145 40072844 38653045
1715 38653045 37424581 36225987 35054730 33972824 32785350 31553112 30343300 29373745
1707 29373745 28606032 27423123 26841861 26169968 25252965 24382197 23768524 23226158 22603749
1698 22603749 22147278 21637279 21053964 20362319 19815384 19334393 18870944 18504086 18022615
1689 18022615 17565917 17054811 16669006 16216705 16042540 15812177 15351820 14843241 14522526
1680 14522526 14152869 13876056 13590790 13348182 13099792 12855773 12673389 12274385 12028912
1671 12028912 11614096 11315022 11024824 10891768 10714573 10394665 9958912 9690367 9480720
1662I480720j11955k41804j4791p4047k09500k21255m52392j95998j15511N0595
1652G894062k52275j8546l0928m41397j28308K7188k28863r6537l8313k45354
1642F440729m4209p2401M1960q9993j55378k03523j28072o8166N529j05444r8441
1631E522591k30145q1089k70179k9041n8663k7232q4853p7609l3559n1078j38622
1620D440521j79496j36822K3750L5202j22387j05930J1413r7343k7130j08452
1610C733326n5738J0061j87522q7732o812N6210k28713R3722k2769q7386k9708
1599C186939p1049J3780j54016O3657m6297R1719q9971P7730k76226n1295M0466
1588B785437j03669N415r6563k2414k3586q8889q6093J26187j85006L5254J5937
$$ plain form
1662 9480720 9368765 9126961 9112170 9038123 8828623 8607368 8154976 7958978 7843467 7894062
1652 7894062 7641787 7623241 7592313 7150916 7022608 7049796 6820933 6724396 6686083 6440729
1642 6440729 6396520 6324119 6366079 6276086 6120708 5917185 5789113 5720947 5726476 5621032 5522591
1631 5522591 5292446 5211357 4941178 4912137 4853474 4826242 4741389 4663780 4630221 4579143 4440521
1620 4440521 4261025 4124203 4147953 4183155 4060768 3954838 3966251 3868908 3841778 3733326
1610 3733326 3677588 3687649 3500127 3412395 3405583 3461793 3233080 3326802 3304033 3216647 3186939
1599 3186939 3115890 3129670 2975654 3039311 2993014 3084733 2994762 3072492 2796266 2744971 2785437
1588 2785437 2681768 2687183 2590620 2568206 2544620 2455731 2369638 2495825 2310819 2346073 2362010
1577B362010j68117J924L0623j43901P4754j7074j74063l591Q6822j07660Q6615
1566B028342J25461n772o0879j47923j82192K12813L1637k1740j51743J39026
1556A967030J81477j88792n0200j06817K2582O8497q1771o3613p0146J30640j25184
1545A683703j16208R7357m5190L6474o7106j29427K12364j42794J45673J39935
1535A814781j79653k29439J09906Q9960m5408p0056k74942J75923J30542o2068
1525A459546k6167O9656k17317j903N5507j48744J7775P8177L7926P9362q2764
1514A321054k3409j06683J13804l896j19889J67693p9983J42057j29112K02257
1504A483893k6335n1797p4907j64685J51941O8721Q1445k9730j2716k0220j20598
$$ plain form
1577 2362010 2193893 2195817 2226440 2082539 2157293 2140219 1966156 1962565 2049387 1941727 2028342
1566 2028342 2153803 2148031 2087152 1939229 1757037 1969850 2001487 1979747 1828004 1967030
1556 1967030 2148507 1959715 1909515 1802698 1825280 1893777 1812006 1748393 1678247 1808887 1683703
1545 1683703 1567495 1664852 1619662 1656136 1589030 1459603 1671967 1529173 1674846 1814781
1535 1814781 1635128 1405689 1515595 1605555 1560147 1490091 1215149 1391072 1521614 1459546
1525 1459546 1433379 1503035 1285718 1283815 1339322 1190578 1208353 1286530 1324456 1403818 1321054
1514 1321054 1297645 1190962 1304766 1300870 1180981 1348674 1268691 1410748 1281636 1483893
1504 1483893 1457558 1405761 1330854 1166169 1318110 1386831 1468276 1438546 1425830 1405610 1285012
1493A285012j05507m5505n5316K9678N5230J2496m9076n1186J15464J39320j2710
1482A317900J7434j0945O0370p114k0436j79849J75071j34564J1898j26516Q950
1471A112199J17866n3060J74013M0261N295l106m9308J48404J34242p3678N8833
1460A611961J14311j54565K37027J9813Q7434L4414o5226q0965r1700P2668l0172
1449A755000j72575P35J51947K0008P2957l57464o5882m169N416j40435n9953
1438A205585P9613K9683L3127p2561j21707l4805j26733k0606o7667J7317M739
1427I25985j00351Q3834P544j14530J75600l3516k07166r3346J09974l6605O1609
1416G79032N762q0655l6160j22579M9350K19433M636l6808p7946k20338K6093
$$ plain form
1493 1285012 1179505 1134000 1078684 1108362 1163592 1176088 1127012 1075826 1191290 1330610 1317900
1482 1317900 1335334 1324389 1384759 1377645 1357209 1177360 1352431 1217867 1229765 1103249 1112199
1471 1112199 1230065 1177005 1351018 1391279 1396574 1393468 1344160 1492564 1626806 1553128 1611961
1460 1611961 1726272 1571707 1808734 1828547 1915981 1950395 1885169 1804204 1712504 1785172 1755000
1449 1755000 1582425 1583160 1735107 1755115 1828072 1470608 1404726 1400557 1405973 1265538 1205585
1438 1205585 1285198 1314881 1348008 1275447 1153740 1118935 992202 971596 903929 921246 925985
1427 925985 825634 909468 917012 802482 978082 944566 737400 644054 754028 717423 779032
1416 779032 784794 704139 667979 545400 594750 814183 818819 782011 704065 483727 509820
1405E09820L7643j68364K0485J12116o4748O6006K18747m0170j42986J2247q3917
1394D76879K5007J41930L7995l34779n8242K3048J05100J92305q8998r9132J25521
1383E46634m5500k20377l3844J12304J9695n644p9810L6110J01108j29811R827
1372C10692J50601n7466m9443j15181p867J18935l0033k4688m2364R321j05512
1361A56995j10725K08282R7553j22635j16949K9711J29376P7265m8502Q638m0730
1350B68279J45496j17400n1249L6436k5094O1950o8883l3272L2296K0792k17053
1339E2298N4670J48886k16985N7250J83487m3517j5542k1678J33500J0249j68469
1328A74149J45343O1866j06469p5K452N5954o4443J21953O3895j57323j3964p8179
$$ plain form
1405 509820 547463 379099 399584 511700 446952 512958 731705 691535 548549 560796 476879
1394 476879 501886 643816 681811 347032 288790 311838 416938 609243 520245 421113 546634
1383 546634 501134 280757 246913 359217 378912 373268 293458 329568 430676 300865 310692
1372 310692 461293 403827 354384 239203 231336 350271 320238 295550 253186 262507 156995
1361 156995 46270 254552 352105 229470 112521 142232 271608 348873 300371 309009 268279
1350 268279 413775 296375 245126 281562 256468 318418 249535 216263 248559 269351 52298
1339 52298 106968 255854 38869 96119 279606 236089 220547 198869 332369 342618 174149
1328 174149 319492 381358 274889 274814 277266 333220 268777 390730 454625 297302 283338 205159
1316B05159r9757J11488k3499m9425j41671q2501N5083K00092L635J23194l6209
1305B65589k26427O739J50269J9668n9553P6551n1652n996j85422k3572J53432
1294A19626J16188q4467j17062Q1287J1757o9079r2246J01250K01147P3196l4883
1283C06714j34936j23236J17406K9792J18244J2194J2125M9094L904j30666j20701
1272A39934j4845n78K10298m540l1135J45982p1559j94702K3357J38217k38481
1261A01948Q0296M6397k00698K22066Q8145l4008p6833L2479j78114k0144Q7058
1250A48592K80611M0032k35679q3314k45600N2819L08655N2726O0755j28413j79818
1239G1366n0358J36571o3636n2097j31707O3718K10991k49780m7435K0201P0171
$$ plain form
1316 205159 105402 216890 193391 143966 2295 -80206 -25123 174969 178604 301798 265589
1305 265589 39162 45901 196170 215838 156285 232836 181184 175188 -10234 -33806 119626
1294 119626 235814 151347 34285 115572 127329 58250 -33996 67254 268401 341597 306714
1283 306714 171778 48542 165948 195740 313984 326178 338303 387397 391301 260635 139934
1272 139934 125089 124511 334809 330269 299134 445116 373557 178855 202212 340429 101948
1261 101948 182244 228641 27943 250009 338154 304146 227313 259792 81678 61534 148592
1250 148592 429203 469235 233556 150242 -95358 -42539 266116 318842 379597 251184 71366
1239 71366 21008 157579 93943 41846 -89861 -26143 184848 -64932 -112367 -92166 -21995
1228b1995J00820J2416o0744L8154j26096j9646J17209J14384k3913o2412K1150
1217H9327M325J26556r1766o8195j4952J82974P1700q3342j41557J23638J0097
1206B08805r4659J8819j02171l273j14672J45856l3476p4022J23497K20797Q3914
1195C79415k5429q0227J34157j08541k48866J44968j05813o8809J05482l3654
1185I2683J52170k10224M7026J32710p873j3439l830j03199j74065j9272J64125
1174E6812R5846j0363j85932j34600K36413J77041j3935M7531k97444r588J56282
1163A18063k02487o7720q302K73325o7243j30676P8321j7450j33592P3287O2416
1152b2058R0170M835J4953j22132P8530P6269P5403r9892j66490M5701j6602Q5714
$$ plain form
1228 -21995 78825 91241 30497 68651 -57445 -77091 40118 154502 130589 68177 89327
1217 89327 93652 220208 128442 60247 45295 228269 299969 216627 75070 198708 208805
1206 208805 114146 132965 30794 27521 -87151 58705 25229 -48793 74704 295501 379415
1195 379415 353986 273759 407916 299375 50509 195477 89664 20855 126337 92683
1185 92683 244853 34629 81655 214365 206492 193053 189223 86024 -88041 -107313 56812
1174 56812 152658 142295 -43637 -178237 58176 235217 221282 268813 -28631 -38219 118063
1163 118063 -84424 -152144 -160446 112879 45636 -85040 -6719 -24169 -157761 -84474 -22058
1152 -22058 68112 72947 87900 -34232 44298 120567 195970 96078 -70412 -24711 -41313 44401
1140D4401J5614M9203q3696j30928r3682J8384O9217J1529n163N4699K22090j4943
1128A56725j13860o3691K08633j0193j02182k0210k5064j33348L7698O9628O6673
1117G0809J8396j6796m15409Q9268L10860N9188n9832j2799L7613k33894k7787
1106a80383J13045O5269j7705q3604j42630K23199L01761j21336o2630k5732j09889
1095d0635R880j50649P6235K3575J55794l217J03825j03775j58629N5101q9962
1084a22457n0976J66919O5768K4055k9930j01329J61821j0001j51085o7073P1016
1073d3272J25834N507l726l15416k1876K73724M7429k78280Q7916K23169q9435
1062A1574m3344J01025J66446j47615q6490Q0578j30702K69794j02662j72859
$$ plain form
1140 44401 60015 109218 25522 -105406 -199088 -180704 -111487 -99958 -105121 -50422 171668 156725
1128 156725 42865 -20826 187807 177614 75432 55222 30158 -103190 -65492 4136 70809
1117 70809 89205 72409 -343000 -253732 57128 116316 56484 43685 81298 -152596 -180383
1106 -180383 -67338 -2069 -19774 -103378 -246008 -22809 278952 157616 94986 69254 -40635
1095 -40635 -30755 -181404 -105169 -81594 74200 70983 174808 71033 -87596 -32495 -122457
1084 -122457 -173433 -6514 59254 83309 53379 -47950 113871 103870 -47215 -114288 -43272
1073 -43272 82562 88069 84343 -231073 -252949 20775 68204 -210076 -122160 101009 11574
1062 11574 -31770 69255 235701 88086 1596 82174 -48528 221266 118604 -54255
1052e4255J51500K573l6089r8242j04482J38955O5613N7806p5690K2502J32086
1041B02277j57798J34078o146J68749q9796k26637r6305k1490N6735q6391J33578
1030A0854m846K0629J69735o0657K4634L1176P791P4597N8698j50090k6928j3506
1018A42087J9613j45007q3154K0028k04458j49172O2112J58360J33257L49472
1008C03138l2922k4611M9136j55719j26645M3646j20904m3331K16120O7789J45308
997C21005j13879k5322p3331j8798K5662J6276J81655k04675m448K28890j27808
986B05227j37359K3359L5259L1079L6980K03124J4960k97505j04901L228J1841
975B5292J97054R0475K28154m8516j70167r6452N1170K43195j22054j39673j9526
$$ plain form
1052 -54255 97245 99818 63729 -34513 -138995 -40 65573 123379 47689 70191 202277
1041 202277 44479 178557 172411 341160 251364 24727 -71578 -93068 -36333 -122724 10854
1030 10854 6008 26637 196372 135715 160349 191525 199316 273913 332611 182521 155593 142087
1018 142087 161700 16693 -66461 -46433 -250891 -400063 -337951 -179591 -46334 303138
1008 303138 270216 245605 294741 139022 12377 56023 -64881 -108212 107908 175697 321005
997 321005 207126 181804 108473 89675 115337 131613 313268 108593 104145 333035 205227
986 205227 67868 91227 126486 157565 194545 397669 412629 115124 10223 13451 25292
975 25292 222346 312821 540975 492459 322292 225840 277010 520205 398151 258478 238952
964B38952J39619j29764J57119j6466k5935j3074M2500n926J37651J33396M9809
953G07881L0226J37194q1677r0126K5609J49008J13622o137K18852j17585J82240
942A269107Q418K06371K69487M605K209K3622L90987K64908L74913M09010N70443
931C794080O16638N80528P37909P56735P32343N41200m37629j430306j164789
922D726709j020299p42592n04244k50789l38196k74109j45440r3147j29587j14981
912A113325j51395j666q7855J96320j23117k20496j03438M1013j00494k29292
902C32905m3914N7421M6593J5225k2316J95044J3068j04673k01041j07526J3553
891A94339j4514R7864K1442n6119J07296J75670k73506L3180R9276m6639j91237
$$ plain form
964 238952 378571 248807 405926 389460 363525 350451 392951 387025 524676 658072 707881
953 707881 738107 875301 793624 703498 729107 878115 991737 985600 1204452 1086867 1269107
942 1269107 1277525 1483896 1753383 1757988 1760197 1783819 2174806 2439714 2814627 3223637 3794080
931 3794080 4410718 4991246 5729155 6485890 7218233 7759433 7321804 5891498 4726709
922 4726709 3706410 2963818 2459574 2208785 1870589 1596480 1451040 1357893 1228306 1113325
912 1113325 961930 960264 872409 1068729 945612 725116 621678 662691 562197 332905
902 332905 288991 346412 393005 408230 385914 580958 594026 489353 288312 180786 194339
891 194339 179825 277689 299131 243012 350308 525978 252472 285652 384928 338289 147052
880A47052n4501p1181K27377l5513K6514m7416O2930q8541k6211M55j55748L9059
868B4276J29654P2020l7255j16802k6906q1691m1744n7640j0995j104l7481j32392
856c18060J11227J23119J39700J55599k62137J34874K32740M5234j63354N1999
846B50941k21950k58055K0433K23112M0624j73999N0966J1818o846O610O5785
835I439J56394J250l5810J19053j59684l41137P1005O2985R0180N6161L5910L5566
823A01312K4104J56193j92164k08991J18280J87553k35312m2083K32841K3370
813A65103j52838J3028P74p7231J00652O5923j35416o5596j3785N9518O9204k06892
801a77556N4059P5814Q7178O1971n3541J54309N1922k98197P7228J36473M194
$$ plain form
880 147052 92551 21370 248747 213234 239748 192332 255262 166721 140510 140965 -14783 24276
868 24276 153930 225950 188695 71893 44987 -36704 -78448 -136088 -147083 -148187 -185668 -318060
856 -318060 -206833 -83714 55986 211585 -50552 84322 317062 362296 198942 250941
846 250941 28991 -229064 -208631 14481 55105 -118894 -67928 -56110 -62956 -56346 9439
835 9439 165833 167083 131273 250326 90642 -250495 -179490 -116505 -26325 29836 65746 101312
823 101312 125416 281609 89445 -119546 -1266 186287 -49025 -91108 141733 165103
813 165103 12265 25293 26067 -51164 49488 115411 -20005 -85601 -99386 -39868 29336 -177556
801 -177556 -123497 -47683 39495 101466 47925 202234 254156 -44041 33187 169660 173854
790A73854P1951n524k7677R3528k17111j78089K6948r2581R4342O5239J33137
779A38017n56q6259N7428j21344P9776o4005n0554O1837l8662j18932L293N3241
767h6720K0534K28902M7289p5922j0420j71464j10377M3915J03424j17309j04054
756b32202J78270J48478j68067j69211J42110L4390k8264J48272J25582k62420
746h3062q6013J35739n5239J02275l0841j75553k9827K54906K03401j98501l8398
735a113j6128k1186m2365j55107J02284J33748k94019J44621J18346k34116l0184
724b95219P1451j92394Q2810P2391O9219O0071j93934J86437m522j16837P843
713b52684j42391Q0167o7282j9292K07317Q0113L7686j27196o209l4295j63312
$$ plain form
790 173854 245805 240281 212604 306132 89021 -89068 -62120 -154701 -60359 4880 138017
779 138017 137461 51202 108630 -12714 67062 3057 -47497 14340 -24322 -143254 -139961 -86720
767 -86720 -66186 162716 210005 134083 123663 -47801 -158178 -114263 -10839 -128148 -232202
756 -232202 -53932 94546 -73521 -242732 -100622 -66232 -94496 53776 179358 -83062
746 -83062 -169075 -33336 -88575 13700 -17141 -192694 -222521 32385 235786 37285 -1113
735 -1113 -17241 -38427 -80792 -235899 -133615 133 -293886 -149265 -30919 -265035 -295219
724 -295219 -223768 -416162 -333352 -260961 -191742 -131671 -325605 -139168 -143690 -260527 -252684
713 -252684 -395075 -314908 -382190 -401482 -194165 -114052 -76366 -203562 -209771 -244066 -407378
702d07378J10977p2669J43692M0934j6601k1921j09020J44193J31377o3645N6765
691f3296J9242k7470J80869k2579j08766q5309j56045n0551O4864Q4854m717p9740
679b48644P0960R666r0689K1596M0674K03913J43160k61294k1560O4926j009l8327
667a06628m8011n3958J9934N9075Q5157N3497j90315k716J41179j77302J4403
656b05685K11232N5862K4833m0686j35078n2859r7360o0200N3376k9632J920K24675
644d9602K0282l8453K8630R9594j81700O1968Q7234j47564j70623M9140R4278
633a46816j02981p866K22766j37163J00079Q4714p1604Q2164M6031K27744j78041
622A19027k07164r484R4514K7665m7837k46398M0597L3721m7822L5838l5855K2738
$$ plain form
702 -407378 -296401 -369070 -225378 -184444 -201045 -222966 -331986 -187793 -56416 -120061 -63296
691 -63296 -44054 -71524 109345 86766 -22000 -107309 -263354 -313905 -249041 -164187 -168904 -248644
679 -248644 -177684 -168018 -258707 -237111 -196437 7476 150636 -110658 -132218 -67292 -68301 -106628
667 -106628 -154639 -208597 -188663 -129588 -44431 9066 -181249 -183965 -42786 -220088 -205685
656 -205685 5547 61409 86242 45556 -89522 -142381 -239741 -299941 -246565 -276197 -274277 -49602
644 -49602 -29320 -67773 -39143 60451 -121249 -59281 27953 -119611 -290234 -241094 -146816
633 -146816 -249797 -257663 -34897 -172060 -71981 12733 -58871 23293 69324 297068 119027
622 119027 -88137 -97621 -3107 24558 -23279 -269677 -229080 -195359 -243181 -207343 -243198 -220460
610b20460Q0158M8202p6879j00673L9712J1014o6911j06011J12768K22466r7918
599a54532m0011K00625J11329j07996j467j4401m902n8376P0862p3463J01890
588B9558j71877k61052J06881R9735N1669j20513Q1533J52286L120j24945O0658
577i2947j0042J83921P6738P1872j97637m6130j34861r1888R1005K2026k8669
566a56612j88466J38512J61986k0546o6588N2819P7271J0050q6110M180m838j05738
554a84080o6311J13581J16787L210J06552j63735j29720N7891J49546r705j2125
543a8109p7142o6501j4722j49530K6102k1625J3208J70122Q9504j4815K4960j14030
531a52578m823R1782j01337l1922O442N0746R8425K1993o3411O5475K1199L7313
$$ plain form
610 -220460 -140302 -92100 -168979 -269652 -229940 -218926 -285837 -391848 -279080 -56614 -154532
599 -154532 -194543 6082 117411 9415 7948 -6453 -11355 -69731 1131 -72332 29558
588 29558 -142319 -403371 -296490 -196755 -145086 -265599 -184066 -31780 -28660 -153605 -92947
577 -92947 -102989 80932 157670 229542 31905 -14225 -149086 -240974 -149969 -127943 -156612
566 -156612 -345078 -206566 -44580 -65126 -131714 -78895 -1624 8426 -77684 -73504 -78342 -184080
554 -184080 -250391 -136810 -20023 -16813 89739 -73996 -203716 -145825 3721 -5984 -18109
543 -18109 -95251 -161752 -176474 -326004 -299902 -321527 -308319 -138197 -48693 -63508 -38548 -152578
531 -152578 -157401 -65619 -166956 -198878 -192436 -141690 -43265 -21272 -84683 -19208 1991 39304
519C9304K485l260P2143j50802J16215n7456Q1859l4761j40732N2017n6837l1977
507a11802Q685q9593j4272O9850n2708j29509n5381J69897M4003j74395q9529
496d24754L35297k3129M811J48354l2031j67816M1860j04277J82568M5269p6795
485g0643J40982j30595k02246K9828J70693j5280j5786p9264M8662r8372M5372
474a76649L0036j6730n686K19527j55583j96396J11683K30261J9103L8095J03648
463B01309k76699m8086M2149M3966j18667q7124K5399j08953P4225K3964L6034
452a92483k23166j1238J0806K01470N5164K089K31191P2842n0754j74705j46944
441b25728P4663j29390R102J01893j1897J96842J05281j19710j88619L8058J58816
$$ plain form
519 39304 41789 38529 110672 -40130 76085 18629 100488 65727 -75005 -22988 -79825 -111802
507 -111802 -103117 -192710 -206982 -137132 -189840 -319349 -374730 -204833 -160830 -335225 -424754
496 -424754 -89457 -112586 -107775 40579 8548 -159268 -117408 -221685 -39117 6152 -70643
485 -70643 70339 -60256 -262502 -232674 -61981 -77261 -93047 -172311 -123649 -222021 -176649
474 -176649 -146613 -163343 -169029 50498 -105085 -301481 -189798 40463 59566 97661 201309
463 201309 -75390 -123476 -81327 -37361 -156028 -243152 -217753 -326706 -252481 -228517 -192483
452 -192483 -415649 -426887 -416081 -214611 -159447 -157358 73833 146675 95921 -78784 -225728
441 -225728 -151065 -280455 -271353 -169460 -181357 15485 120766 1056 -187563 -149505 9311
430I311K1370j08695k7390q8960K7166r6650j8225N2816K37714K1740k02135j01630
418b73568R5086L6376o261Q2625j1881O9901r1931j45245j8294J67536J60k7535
406a23031J07058P8588j23269j67291k787j422j5572j1492o786j8421Q215M2147
394b34063j0812L6662N8188q0439J47694N1276j33194p7879n9557N4073M6802
383b01249p776q1502J72802M923j66059J11269Q766J50306p1223j26675j33497
372c39915J12725j2704J45050J29816j24093j38021k9094O0668J07187k684m7367
361a38432M018L592P5252O3954j60560j65478j9864O3426J891r8831J68619J53291
349d9122M8510r6425j42081p0595J55447k5258j71173J6341k865P2569m094J54058
$$ plain form
430 9311 30681 -78014 -105404 -194364 -167198 -263848 -282073 -229257 8457 30197 -171938 -273568
418 -273568 -178482 -142106 -148367 -65742 -77623 -7722 -99653 -244898 -263192 -95656 -95496 -123031
406 -123031 -15973 62615 -60654 -227945 -230732 -232154 -247726 -259218 -266004 -284425 -276210 -234063
394 -234063 -244875 -208213 -150025 -230464 -82770 -31494 -164688 -242567 -302124 -248051 -201249
383 -201249 -209025 -290527 -117725 -112802 -278861 -167592 -158826 -8520 -79743 -206418 -339915
372 -339915 -227190 -239894 -94844 34972 -89121 -227142 -256236 -195568 -88381 -91065 -138432
361 -138432 -134414 -130822 -55570 8384 -152176 -317654 -337518 -274092 -272201 -371032 -202413 -49122
349 -49122 -612 -97037 -239118 -309713 -154266 -179524 -350697 -334356 -337221 -264652 -268746 -114688
337a14688o9100J0789J37673j36393j42902j282J30483m9754J0955k41428N3972
326d11675J26533P5638n9580M4266J14779k12291M6879P9418R2774K0202j55497
315b38554J57236n4389n2684R67J6641M0307k6196Q912n9970N1573m9312K64340
303E8871n1515r0502m2485m2789Q1346l8980J36673q5496k33482r3480K66449
292a35390J25059j07071Q91J4661J8418j61761q6295K22903K0930j08879M1375
281a55159j8213J05682n8068N0539m7033k37012L0420Q8671J027r6432k801K26573
269a11806K26287k51492m6862j9538o5421j6911j4951j0115J56943j77287P5886
258b55267J5581K4705J9864n2568o010o6355o553j31119K33340j5577M0085K20670
$$ plain form
337 -114688 -183788 -172999 -35326 -171719 -314621 -315903 -185420 -235174 -224219 -465647 -411675
326 -411675 -285142 -209504 -269084 -224818 -110039 -322330 -275451 -196033 -103259 -83057 -238554
315 -238554 -81318 -135707 -188391 -187424 -170783 -130476 -156672 -147760 -207730 -156157 -205469 58871
303 58871 7356 -83146 -125631 -168420 -87074 -126054 10619 -74877 -308359 -401839 -135390
292 -135390 -10331 -117402 -116511 -101850 -83432 -245193 -331488 -108585 -87655 -196534 -155159
281 -155159 -173372 -67690 -125758 -75219 -122252 -359264 -328844 -240173 -239146 -335578 -338379 -111806
269 -111806 114481 -137011 -183873 -203411 -268832 -285743 -300694 -310809 -153866 -331153 -255267
258 -255267 -239686 -214981 -195117 -247685 -253695 -320050 -326603 -457722 -224382 -239959 -199874 20796
246B0796j37636p7023M9714J04873o4284O33q4679q5246N1178j05748L2484r5960
234c90898P2844J13581P2043N0047j34945o5247O7484k1470K8544n3900p907N6978
222b12846o138K7624M852j42890L6668m9865p0408l39M8630L6933k6322J37247
210b16854M7907o2027L3293M7732n9116j6743J32570l9490q5710J58325j38427
199a98540k54310L2929J99045k7445K030J63396m7271k45264n8367K28885K5419
188a79493l21460J24262R1000J11754q479k28596K2461L35898K9165j45613O6027
177a03074j23393k1670m6171M2678O308K8358J16265l3515l9326O4050o3410K3774
165a49126j07577j0094J46269p370r1473J31432Q5305j94793k77670Q3757P0816
$$ plain form
246 20796 -116840 -193863 -144149 -39276 -103560 -102927 -187606 -272852 -221674 -327422 -294938 -390898
234 -390898 -318054 -204473 -132430 -82383 -217328 -282575 -215091 -236561 -208017 -261917 -269824 -212846
222 -212846 -218984 -191360 -186508 -329398 -292730 -342595 -413003 -413342 -364712 -327779 -354101 -216854
210 -216854 -168947 -230974 -197681 -149949 -209065 -225808 -93238 -132728 -218438 -60113 -198540
199 -198540 -452850 -419921 -220876 -248321 -246291 -82895 -130166 -375430 -433797 -204912 -179493
188 -179493 -500953 -376691 -285691 -173937 -182416 -411012 -388551 -52653 -23488 -169101 -103074
177 -103074 -226467 -248137 -294308 -251630 -245322 -216964 -100699 -134214 -173540 -109490 -172900 -149126
165 -149126 -256703 -266797 -120528 -127898 -219371 -87939 -2634 -197427 -475097 -391340 -320524
154c20524K7954L4739k0126Q6199P406k3180j19990K7036J06713m1105R6989O1170
142g6719j3801r9360O923m0345J24855n7263l1820j38621J39401Q7022m2771j1862
130a54361R352L4629j81600Q9750q1620o4748J04141M5901p943k15517q1580K11084
118b92512J75287j480q7989J5001l2431m4730q4774j3245J37600m0419j15264
107c84956J30391j2476j82r0086k0024K9554k6985l8489l8558N6206J36383l1782
95b91004m5556k6806J13200R5350j10870r1577K32547P8976o993r150q5801n0324
83a98008J35378m4627R659m8066r3976l8842l7871M1199m7590q6689J07883J12587
71a88963K0660k6709O931j02202r1974J30188m0866m3667L0534R8235r560j24241
$$ plain form
154 -320524 -292570 -257831 -277957 -191758 -184352 -207532 -327522 -300486 -193773 -234878 -137889 -76719
142 -76719 -90520 -189880 -182957 -223302 -98447 -155710 -187530 -326151 -186750 -99728 -142499 -154361
130 -154361 -145009 -110380 -291980 -202230 -283850 -348598 -244457 -198556 -206499 -422016 -503596 -292512
118 -292512 -117225 -118705 -206694 -191693 -224124 -268854 -353628 -366873 -229273 -269692 -384956
107 -384956 -254565 -267041 -267223 -357309 -377333 -347779 -374764 -413253 -451811 -395605 -259222 -291004
95 -291004 -336560 -363366 -250166 -154816 -265686 -357263 -124716 -45740 -52733 -61883 -147684 -198008
83 -198008 -62630 -107257 -97598 -145664 -239640 -278482 -316353 -275154 -322744 -409433 -301550 -188963
71 -188963 -168303 -195012 -188081 -290283 -382257 -252069 -292935 -336602 -306068 -207833 -217393 -341634
59c41634n3846j9101J5494L2587R6850J10624n9693j49139l1667R9028J45312
48a55185j05696k4665R6184J02522J3674M5907j02661M7740n8818k49792M6060
37c44730Q9339M1804k6758k7076l3481n6371m7361J28441Q1891O6283J3728j30962
25b45253j30010P8084L8457P3360l6508j61848p777O722o0495P1853J8991q9523
13d43947J8654Q1347Q432q401L1517J60071J9804R0008j17172n1552N2362k3429
1a82306j47008
0c29314
$$ plain form
59 -341634 -395480 -414581 -399087 -366500 -269650 -159026 -218719 -367858 -399525 -300497 -155185
48 -155185 -260881 -285546 -189362 -86840 -73166 -27259 -129920 -82180 -140998 -390790 -344730
37 -344730 -255391 -213587 -240345 -267421 -300902 -357273 -404634 -276193 -194302 -128019 -114291 -245253
25 -245253 -375263 -297179 -258722 -185362 -221870 -383718 -391495 -384773 -445268 -373415 -354424 -443947
13 -443947 -425293 -343946 -335514 -343915 -312398 -152327 -132523 -42515 -159687 -211239 -158877 -182306
1 -182306 -329314
0 -329314
$$ Imaginary data points
##PAGE= N=2
##DATA TABLE= (X++(I..I)), XYDATA
16383c665336N9042P0867K44118j7528j17286J07269J82100O0289l7718J01341
16373c012842O5080L8294L9882p5699J07201Q6741J25359J55095p0184j50506
16363b691579Q9905K6472P2900Q6408M7381R4449l5932P8793Q9401N2760q145
16352b097187P2652J32613J3472M9250M5045k5969J27970R4447O7468q7954q8616
16341a696809P9616K26572R2030K6056j62496J22698K36822J25342J17331p5590
16331i08428m1709J12591L5375j4283J6410P1625K8431M3487N5888N5147J99398
16320c46068M0898r7867N7645l9004N4247O4749N1514r9327L2472N1897O2117
16309a66727O7529J50675l0445K2991J06907J14890o440m9746L0319q9251J31786
$$ plain form
16383 -3665336 -3606294 -3535427 -3291309 -3308837 -3426123 -3318854 -3136754 -3076465 -3114183 -3012842
16373 -3012842 -2947762 -2909468 -2869586 -2945285 -2838084 -2751343 -2625984 -2470889 -2541073 -2691579
16363 -2691579 -2601674 -2575202 -2502302 -2415894 -2368513 -2274064 -2309996 -2231203 -2141802 -2089042 -2097187
16352 -2097187 -2024535 -1891922 -1878450 -1829200 -1784155 -1810124 -1682154 -1587707 -1520239 -1608193 -1696809
16341 -1696809 -1617193 -1390621 -1298591 -1272535 -1435031 -1312333 -1075511 -950169 -832838 -908428
16331 -908428 -950137 -837546 -802171 -816454 -800044 -728419 -699988 -656501 -600613 -545466 -346068
16320 -346068 -305170 -403037 -345392 -384396 -330149 -265400 -213886 -313213 -280741 -228844 -166727
16309 -166727 -99198 51477 21032 44023 150930 265820 259380 209634 239953 150702 282488
16298B82488K4927J38490O6423K2365k5859K23333Q289J26695J9216j90382J41662
16287H37647J20970J03819P805l2288q9010n4230R5936J7732K2769J07658K26636
16276A365444J39078k48109k3880P2795K5968J8923M3166j4552j37035J30850
16266A372648j8922l2577J72929J09321P9433j55578L2408K41965J11714r4997
16256A818344J54926J39232p0659N5089j7874m4767L4775J15339k3672M1279K6712
16245B228724N5683K1067P0519j51123O2022J87013l8111K3779l951m2008Q8474
16234B502088j45597O7185J22760M0402j25615R1710N0897N5649l9201R9280J52840
16223B872398l1575j19900R6138Q9662Q1603L1111p6005P3569j34610q845Q5009
$$ plain form
16298 282488 307415 445905 512328 534693 508834 732167 740456 867151 886367 695985 837647
16287 837647 958617 1062436 1070241 1037953 948943 894713 990649 1008381 1031150 1138808 1365444
16276 1365444 1504522 1256413 1232533 1305328 1331296 1350219 1393385 1378833 1241798 1372648
16266 1372648 1353726 1321149 1494078 1603399 1682832 1527254 1559662 1801627 1913341 1818344
16256 1818344 1973270 2112502 2041843 2096932 2079058 2034291 2069066 2184405 2160733 2202012 2228724
16245 2228724 2284407 2305474 2375993 2224870 2286892 2473905 2435794 2459573 2455622 2413614 2502088
16234 2502088 2356491 2423676 2546436 2586838 2461223 2552933 2603830 2659479 2620278 2719558 2872398
16223 2872398 2840823 2720923 2817061 2906723 2988326 3019437 2943432 3017001 2882391 2873546 2958555
16212B958555J44875k37818J9431J01475P760K8023P8529K6326K4513l8879J6666
16201C129456j11718j6623m5330J29295J15811o9494L5794J03008M9391k6031
16191C293559j23748K5723J78517o964R639m7996O8897J9698Q4609J03956j46639
16180C459251n8256K82692P3051j63061J40451O3720p3269M1605r8259K5130M685
16169C697740q4735m8246J01437M9115j13033M5008J54420J48827P1602M1822
16159D063957l77517j46611J90868Q2546m5046L6017O6161J13516r3823j15161
16149C774907L9020J55742L2495q7964q1636j2795l3477j1710O6155J66731O2642
16138D070110q4075K9415J68614j45090m5033N4898j521J09494j02399m9473k8285
$$ plain form
16212 2958555 3103430 2865612 2885043 2986518 2994278 3022301 3100830 3127156 3151669 3112790 3129456
16201 3129456 3017738 3001115 2955785 3085080 3200891 3131397 3167191 3270199 3319590 3293559
16191 3293559 3169811 3195534 3374051 3367087 3376726 3328730 3397627 3417325 3501934 3605890 3459251
16180 3459251 3400995 3683687 3756738 3593677 3734128 3797848 3724579 3766184 3667925 3693055 3697740
16169 3697740 3613005 3564759 3666196 3715311 3602278 3647286 3801706 3950533 4022135 4063957
16159 4063957 3686440 3539829 3730697 3813243 3768197 3804214 3870375 3983891 3890068 3774907
16149 3774907 3813927 3969669 4002164 3914200 3832564 3819769 3786292 3774582 3840737 4007468 4070110
16138 4070110 3986035 4015450 4184064 4038974 3993941 4048839 4047318 4156812 4054413 4004940 3976655
16127C976655m067O1189n1076R2735M4135j9562q290p6626N2423j22943r647J35960
16115D070886J29838M311q1236O5478P4591j400k14922j79789L24342m1751k2233
16104D128115r190r541q2155j15332J37487R877O9910M450j6546J02406J82440
16093D401921N300j23188j00927k75015M2691O642J58902L0614P740N4133k5425
16082D183388p1756Q1886J59737j14564l2130Q0670l5112P5609k15414j39679
16072C972635j0020J41947J16655m2900R7075j10326J92320J26942j25818L2140
16062D390650j11923r6887Q2822q3839Q4673j05182Q7595j02216M5331J17510
16052D308534n6777K08616l2297j20335Q7941j5281j74367N7642L8927Q1610m8089
$$ plain form
16127 3976655 3972588 4033777 3982701 4075436 4119571 4100009 4091719 4015093 4067516 3944573 3934926 4070886
16115 4070886 4200724 4205035 4123799 4189277 4263868 4262468 4047546 3867757 4192099 4150348 4128115
16104 4128115 4118925 4109384 4027229 3911897 4049384 4059261 4129171 4133621 4117075 4219481 4401921
16093 4401921 4407221 4284033 4183106 3908091 3950782 3957424 4116326 4146940 4154680 4208813 4183388
16082 4183388 4111632 4193518 4353255 4238691 4206561 4287231 4252119 4327728 4112314 3972635
16072 3972635 3962615 4104562 4221217 4178317 4275392 4165066 4357386 4484328 4358510 4390650
16062 4390650 4278727 4181840 4264662 4180823 4265496 4160314 4247909 4145693 4191024 4308534
16052 4308534 4251757 4460373 4428076 4307741 4395682 4380401 4206034 4263676 4302603 4384213 4336124
16041D336124r000j40666P9590Q4817L6598N3771j00025j60789j21421R5039J41348
16030D295386O6732K4777M3595p4062j21989J82888O5908j00152j24922m7060
16020D211101L60902L4494j44082j02851k324Q9605K7292O8736N8456k52075j02940
16009D246314L7152j58858q9762K7274Q4575K16681j36398m1233N7194M6679k57469
15998D032149J46918J92652n9983P0411k33152Q9585k7195P2622J10124n7275
15988D336856m0695j095j33299L5082K64548k03563K9970J23531K2955N3456k8883
15977D458863j28550o5084p5889J16510m4436P457n6493o2862M2672N5505M7684
15966D295377J38742R205L3004M2305J7051k67459M3652L3539n7233J54664J51416
$$ plain form
16041 4336124 4327124 4186458 4266048 4350865 4387463 4441234 4341209 4180420 4058999 4154038 4295386
16030 4295386 4362118 4386895 4430490 4356428 4234439 4417327 4483235 4383083 4258161 4211101
16020 4211101 4572003 4606497 4462415 4359564 4357240 4446845 4474137 4542873 4601329 4349254 4246314
16009 4246314 4283466 4124608 4034846 4062120 4146695 4363376 4226978 4185745 4242939 4289618 4032149
15998 4032149 4179067 4371719 4311736 4382147 4148995 4238580 4211385 4284007 4394131 4336856
15988 4336856 4296161 4295066 4161767 4196849 4461397 4257834 4287804 4411335 4434290 4487746 4458863
15977 4458863 4330313 4265229 4189340 4305850 4261414 4268871 4212378 4149516 4192188 4247693 4295377
15966 4295377 4434119 4443324 4476328 4518633 4535684 4268225 4311877 4345416 4288183 4442847 4594263
15955D594263p4338n0385L1833N7910J6220j07061J60523K9833k42771j13486
15945D302541O7917J337p4314k9576J32104j75243P2745Q0538l1231j75545J22672
15934D293945k3102K7562R076N169j77895O0982l6291K69425N139l6576L5824
15923D433258K15569p1546k19108j38486j1546O2250r1467J83259O1169J56848
15913D580200l6002l7262o7128q4026K185J0367j01460m3273J14517O2290j88562
15902D211846j7648K16327k435J11775J5139j77067R3575q089P6970o2981j11392
15891D346020m5564p5325K36442p4485N4198J16994n3984j06298j31318P0861
15881D337541J33605K14801j13604k40694M2007J8421j66603m6001k351J80544
$$ plain form
15955 4594263 4519925 4469540 4501373 4559283 4575503 4468442 4628965 4658798 4416027 4302541
15945 4302541 4370458 4371795 4297481 4267905 4400009 4224766 4297511 4378049 4346818 4171273 4293945
15934 4293945 4270843 4298405 4307481 4312650 4134755 4195737 4159446 4428871 4434010 4397434 4433258
15923 4433258 4648827 4577281 4358173 4219687 4208141 4270391 4178924 4362183 4423352 4580200
15913 4580200 4544198 4506936 4439808 4355782 4357967 4368334 4266874 4223601 4338118 4400408 4211846
15902 4211846 4194198 4410525 4408090 4519865 4535004 4357937 4451512 4443423 4520393 4457412 4346020
15891 4346020 4300456 4225131 4461573 4387088 4441286 4558280 4504296 4397998 4266680 4337541
15881 4337541 4471146 4685947 4572343 4331649 4373656 4392077 4225474 4179473 4177122 4357666
15871D357666O0692K3844j43790r3308J04045P5580J263R2303K47197p733k58341
15860D459418o8250K7058j88552R5196K89010j41922p4234j13036r3622J31368
15850D322434l5758k3304l3451P0920j160J24439n9571j04266m2130l6699J06785
15839D288239m7956J25962M9476N5522j16221M0989j14811K2628l949N153m0230
15828D264802K5730o502o430m9274O8284J2026k3647P8813J02565J76319k33702
15817D408984o9952J49137L9819N7149M845J7604l1580k23387r2932j8326J74779
15806D416140j07738k552J20669J11895n2979r6816q6262L3062N0823O0597P1487
15795D518326j35506p0781J27080J8145k621J22257J4008j24391N4132O8161j7228
$$ plain form
15871 4357666 4418358 4442202 4298412 4205104 4309149 4384729 4385992 4478295 4725492 4717759 4459418
15860 4459418 4391168 4418226 4229674 4324870 4613880 4471958 4397724 4284688 4191066 4322434
15850 4322434 4286676 4263372 4229921 4300841 4299681 4424120 4364549 4260283 4218153 4181454 4288239
15839 4288239 4240283 4366245 4415721 4471243 4355022 4396011 4281200 4303828 4299879 4305032 4264802
15828 4264802 4290532 4284030 4277600 4228326 4296610 4308636 4284989 4363802 4466367 4642686 4408984
15817 4408984 4339032 4488169 4527988 4585137 4589982 4607586 4576006 4352619 4259687 4241361 4416140
15806 4416140 4308402 4305850 4426519 4538414 4485435 4388619 4302357 4335419 4386242 4446839 4518326
15795 4518326 4382820 4312039 4439119 4457264 4454643 4576900 4590908 4466517 4520649 4588810 4571582
15784D571582j57678J44916j27162j06137Q689J1861p4576J45011K20353j33143
15774D503716l2462L3719j74032j44164J51206J00168j0808k2584j57868j8197
15764D228694L38074j07387Q0040j09733q4160J05547k0684j41542L8145K48876
15754D575870R9210j23352M5296m1479J6570J6675k09365M0232J38491o5710j5847
15743D476591n0747l9602M351J9686K19696j1961n0992J2694j770n4078R0183
15732D614051j3033k41793J17443r4007J3483p5789k5552o1506P5387R3227N6148
15721D458059J36213l0841p0637Q7153J37445j98947j95330N5890J20491J70223
15711D669719n6051r2418P6688K0083r664k9267Q631j86162r4416l8706N7187
$$ plain form
15784 4571582 4413904 4558820 4431658 4325521 4334210 4346071 4271495 4416506 4636859 4503716
15774 4503716 4471254 4504973 4330941 4186777 4337983 4438151 4427343 4404759 4246891 4228694
15764 4228694 4566768 4459381 4539421 4429688 4345528 4451075 4430391 4288849 4326994 4575870
15754 4575870 4675080 4551728 4597024 4555545 4572115 4588790 4379425 4419657 4558148 4492438 4476591
15743 4476591 4425844 4386242 4390593 4410279 4629975 4618014 4567022 4579716 4577946 4523868 4614051
15732 4614051 4601018 4359225 4476668 4382661 4396144 4320355 4294803 4233297 4308684 4401911 4458059
15721 4458059 4594272 4563431 4492794 4579947 4717392 4518445 4323115 4379005 4499496 4669719
15711 4669719 4613668 4521250 4597938 4618021 4608357 4579090 4587721 4401559 4307143 4268437 4325624
15700D325624J14341P1125j52334J07959J9534J71871p0763j61000L0368P206
15690D463931l093m742L6654m5610P713j29340k9840J2140N4579O8536k2486m5728
15678D362714K302L0020P2734J38932j00607n5766r2467J10702O6682J1657j42617
15667D404286j90293J62638J20086R0392J44448l4697l1111k99428K9545J06139
15657D502005j06841K8100j71054O4961j2626j26589L4301J83108J10316r4070
15647D411611K0277L7031J24515J0259n1245o6253J2708o2601k6477P3075J26124
15636D609024Q885j29795j02938m3437p8675N5383J40607M4901J1872j9681j13228
15625D382918k9475J41243J13470P1451j86017P2650q2486j0834j99213J59054
$$ plain form
15700 4325624 4439965 4511090 4358756 4466715 4486249 4658120 4587357 4426357 4456725 4463931
15690 4463931 4460838 4456096 4492750 4447140 4454853 4325513 4295673 4307813 4362392 4430928 4408442 4362714
15678 4362714 4365016 4395036 4467770 4606702 4506095 4450329 4357862 4468564 4535246 4546903 4404286
15667 4404286 4213993 4376631 4496717 4587109 4731557 4696860 4665749 4366321 4395866 4502005
15657 4502005 4395164 4423264 4252210 4317171 4304545 4177956 4212257 4395365 4505681 4411611
15647 4411611 4431888 4468919 4593434 4603693 4552448 4486195 4498903 4436302 4409825 4482900 4609024
15636 4609024 4617909 4488114 4385176 4341739 4263064 4318447 4459054 4503955 4515827 4496146 4382918
15625 4382918 4353443 4494686 4608156 4679607 4493590 4566240 4483754 4472920 4273707 4432761
15615D432761o2847p998J67090k3655M3639N9832j23964j07720q5466k17405K56269
15604D330536K32263j75531q8702J66591P9510l2688r8939m5855N9631J74337
15594D601153J1629k02576r0302o678n4858K00533J10750r7259k3229j45218j08225
15583D195720M4956J3264O5144r1099J46925J77471l2932M5036j18829Q302N6004
15572D509962P2333M1843m3499K6359J24384K0982k6934j05458j88950M1131K19408
15561D691561j28732L2220O9991j21789K0678R0555K3508n1148J00871Q768o9322
15550D667161r0656j58478n2544M3542p2902N6377M4615R1550Q7682k41761l2022
15539D342564Q6020J30529O0599j2937R2069j49761P9949o4933l7550J64907j31200
$$ plain form
15615 4432761 4369914 4361916 4529006 4505351 4548990 4608822 4484858 4377138 4291672 4074267 4330536
15604 4330536 4562799 4387268 4298566 4465157 4544667 4511979 4413040 4367185 4426816 4601153
15594 4601153 4612782 4410206 4319904 4313226 4258368 4458901 4569651 4472392 4449163 4303945 4195720
15583 4195720 4240676 4253940 4319084 4227985 4374910 4552381 4519449 4564485 4445656 4453958 4509962
15572 4509962 4582295 4624138 4580639 4606998 4731382 4752364 4725430 4619972 4431022 4472153 4691561
15561 4691561 4562829 4595049 4665040 4543251 4563929 4654484 4677992 4626844 4727715 4736483 4667161
15550 4667161 4576505 4418027 4365483 4409025 4336123 4392500 4437115 4528665 4616347 4374586 4342564
15539 4342564 4428584 4559113 4619712 4606775 4698844 4549083 4629032 4564099 4526549 4691456 4560256
15528D560256j2952O6896k27390j04304K25108J23530j13455n7747J19668R8693
15518D678303r6262k66528J4558J36758J18217O7381J8461o3885j74533m2686
15508D389784K08131n1444p6968Q1902N4692L508J3762p7469jJ07137j5641j12375
15496D525018J41831J103j03621q8141L4385P9494p2195M6642P0856j8216k40411
15485D376745J14153j808Q9213K7894k06783R6471J65340N343K0349R653N2243
15474D748813p165J94798j61611k755J43254j81406k7533P806j17430J96642q3720
15463D709693o4543j21712j15472J16966R4378R8965j65631J5099j09406Q27K22562
15452D681726j6902l197J30864j98361J36791j5094j21765j04000P1392m904j3679
$$ plain form
15528 4560256 4547304 4614200 4386810 4282506 4507614 4631144 4517689 4459942 4579610 4678303
15518 4678303 4582041 4315513 4330071 4466829 4585046 4652427 4670888 4607003 4432470 4389784
15508 4389784 4597915 4546471 4469503 4551405 4606097 4609605 4623367 4545898 4545897 4653034 4637393 4525018
15496 4525018 4666849 4667952 4564331 4476190 4510575 4590069 4517874 4564516 4635372 4617156 4376745
15485 4376745 4490898 4489090 4578303 4606197 4399414 4495885 4661225 4666568 4686917 4696570 4748813
15474 4748813 4741648 4936446 4774835 4772080 4915334 4733928 4706395 4714201 4596771 4793413 4709693
15463 4709693 4645150 4523438 4407966 4524932 4619310 4718275 4552644 4567743 4458337 4459164 4681726
15452 4681726 4664824 4661627 4792491 4594130 4730921 4715827 4594062 4490062 4561454 4556550 4542871
15441D542871m0827j32959K12391L0115Q9457n6800m5021r0134P1574Q9333m0944
15430D629056J8354O8400J2935J9572k20175J84336j77139j11283K39965O168
15420D670189J06501m1643J00117K8676j25983j37113k3918J22473j3108j09991
15410D576200K7744m3530r6778J61271L5567k44798p84P4135J75033J57529l098
15399D818491m9685j55712j21714o2742J7147Q1881l5623J64900j8952O8996j21910
15388D585077j65124O7760J45035j6066J65510j4783l24238q0946K02790p2254
15378D492761j14602O1566K9091N3156j3873J66054o7337J93466P2351j94337
15368D678296k5418K6834k9532j11089J18741J36482J19695j26447j72166j32565
$$ plain form
15441 4542871 4502044 4369085 4581476 4611591 4701048 4644248 4599227 4509093 4580667 4670000 4629056
15430 4629056 4647410 4715810 4728745 4748317 4528142 4712478 4535339 4424056 4664021 4670189
15420 4670189 4776690 4735047 4835164 4863840 4737857 4600744 4576826 4699299 4686191 4576200
15410 4576200 4603944 4560414 4463636 4624907 4660474 4415676 4414892 4489027 4664060 4821589 4818491
15399 4818491 4768806 4613094 4491380 4428638 4445785 4527666 4492043 4656943 4637991 4706987 4585077
15388 4585077 4419953 4487713 4632748 4616682 4782192 4767409 4443171 4362225 4565015 4492761
15378 4492761 4378159 4439725 4468816 4521972 4508099 4674153 4606816 4800282 4872633 4678296
15368 4678296 4652878 4679712 4650180 4539091 4657832 4794314 4914009 4787562 4615396 4482831
15358D482831k3551J47760J21753J6111j02142r574J2155j11881n915K1254J1328
15347D560129J00924K4511L4933K2547j51132J57654N3963O0493m3304j35476
15337D685242K0426R3778p4199j19801m5768j2834M4005j01400L4392J06893k14406
15326D416328R7427R2397K01358J14932j40290j39770l02356J09055O6717O4500
15316D580298P2802R9272p7128J7101J01087K2888j50285m59q3442J08141K2845
15305D713120p5180J29532J56623j23746j41633j56445m0J09639J87713K3276
15295D822859j4586N2792j55229m0901J4310q1417J2267J0673n4143P6154l6885
15284D605894j60675q7815K97265R0554o8479N0180o3527Q5501q8728k9709R7720
$$ plain form
15358 4482831 4459280 4607040 4728793 4744904 4642762 4633188 4645343 4533462 4527547 4548801 4560129
15347 4560129 4661053 4685564 4720497 4743044 4591912 4749566 4803529 4864022 4820718 4685242
15337 4685242 4705668 4799446 4725247 4605446 4559678 4546844 4590849 4489449 4523841 4630734 4416328
15326 4416328 4513755 4606152 4807510 4922442 4782152 4642382 4340026 4449081 4515798 4580298
15316 4580298 4653100 4752372 4675244 4692345 4793432 4816320 4666035 4665576 4582134 4690275 4713120
15305 4713120 4637940 4767472 4924095 4800349 4658716 4502271 4502231 4611870 4799583 4822859
15295 4822859 4808273 4861065 4705836 4664935 4679245 4597828 4610095 4620768 4566625 4642779 4605894
15284 4605894 4445219 4357404 4654669 4745223 4676744 4726924 4663397 4748898 4660170 4630461 4728181
15273D728181p3147P4091P0498l6297R376J3287J7445n5329j75049j2897j1563
15262D548596J74765J80455K4304j23798n4916O4181n3979O7770o8042j07482
15252D651854Q0495j3556K1422r3805j8728L4588J69533q0081n1703J9337J5209
15241D734565J62721j25928M5870m7226r4373L7309J22936k8416p9072q585L248
15230D723049p2293K8505K27912n1644j9438r0264k1696l4232L9889P2613j423
15219D800978m4849l31938Q3517J58580n776L446J95793N4149K8097o6393k27502
15208D648102j00129J17249n7311j85634J82233O3767K33655K9284k01356J17545
15198D847405r1117k35873J5980m3792O2286K30666p435M3141J9922k8890o8469
$$ plain form
15273 4728181 4655034 4729125 4799623 4763326 4772702 4785989 4803434 4748105 4573056 4560159 4548596
15262 4548596 4723361 4903816 4928120 4804322 4749406 4813587 4759608 4827378 4759336 4651854
15252 4651854 4732349 4718793 4740215 4646410 4627682 4662270 4831803 4751722 4700019 4719356 4734565
15241 4734565 4897286 4771358 4817228 4770002 4675629 4712938 4835874 4807458 4728386 4719801 4723049
15230 4723049 4650756 4679261 4907173 4855529 4836091 4745827 4724131 4689899 4729788 4802401 4800978
15219 4800978 4756129 4424191 4507708 4666288 4660512 4663958 4859751 4913900 4941997 4875604 4648102
15208 4648102 4547973 4665222 4607911 4422277 4604510 4668277 4901932 4931216 4729860 4847405
15198 4847405 4756288 4520415 4536395 4492603 4554889 4785555 4778120 4821261 4841183 4812293 4743824
15187D743824r2005m6671K61519m693m9974J87339k01076p4393j34432J47462
15177D736900J66950l0068j16247j0309J41921j23646m7936J3062L2036Q0051
15167D842714k08978O9597J96054l2709j00065k31760q157J59596L1439q4089
15157D633642R4290j9359q8533L206J71834J76033M2418L4047m0258j81877k61425
15146D564018M5577K68594j18139J26040J36225k19083o6066K4344M3964l2558
15136D772916N7271j87843m1313O3933r9426J88820Q0583L8603m7788j99229n550
15125D620977q3613Q7097K24398l7708k6618M1769j3744l0911L6114R9009j75903
15114D740867N5844J16195J03427j72420j6691k8550p1733m6859K4691L7519j61177
$$ plain form
15187 4743824 4651819 4605148 4866667 4861974 4812000 4999339 4798263 4723870 4589438 4736900
15177 4736900 4903850 4873782 4757535 4747226 4889147 4765501 4717565 4730627 4762663 4842714
15167 4842714 4633736 4703333 4899387 4866678 4766613 4534853 4526696 4686292 4717731 4633642
15157 4633642 4727932 4708573 4620040 4623246 4795080 4971113 5013531 5047578 5007320 4825443 4564018
15146 4564018 4609595 4878189 4760050 4886090 5022315 4803232 4737166 4761510 4805474 4772916
15136 4772916 4830187 4642344 4601031 4664964 4565538 4754358 4834941 4873544 4825756 4626527 4620977
15125 4620977 4537364 4624461 4848859 4811151 4784533 4826302 4812558 4781647 4817761 4916770 4740867
15114 4740867 4796711 4912906 5016333 4843913 4827222 4798672 4726939 4680080 4704771 4742290 4581113
15103D581113J08455J54723K3477j81141J69052J73373l06405j11479r0080L5692
$$ plain form
15103 4581113 4689568 4844291 4867768 4686627 4855679 5029052 4722647 4611168 4521088 4556780
$$ [...]
##END NTUPLES=NMR SPECTRUM
##END=
