##TITLE=1H_CG-1145
 CDCl3,8 sc, 
 7.04.2021
##JCAMPDX= 6.0         $$ Bruker NMR JCAMP-DX V2.0
##DATA TYPE= NMR SPECTRUM
##DATA CLASS= NTUPLES
##ORIGIN= UXNMR, Bruker Analytische Messtechnik GmbH
##OWNER= root
$$ XWIN-NMR		Version 3.5
$$ Wed Apr  7 11:41:55 2021 Russian Standard Time (UT+4h)  she@DPX200
##.OBSERVE FREQUENCY= 200.131506
##.OBSERVE NUCLEUS= ^1H
##.ACQUISITION MODE= SIMULTANEOUS
##.ACQUISITION SCHEME= undefined
##.AVERAGES= 8
##.DIGITISER RES= 18
##SPECTROMETER/DATA SYSTEM= spect
##.PULSE SEQUENCE= zg30
##.SOLVENT NAME= CDCl3
##.SHIFT REFERENCE= (INTERNAL, CDCl3, 0, 15.9771)
##AUDIT TRAIL= $$ (NUMBER, WHEN, WHO, WHERE, WHAT)
$$ ##TITLE= Audit trail, XWIN-NMR		Version 3.5
$$ ##JCAMPDX= 5.01
$$ ##ORIGIN= Bruker BioSpin GmbH
$$ ##OWNER= she
$$ F:/spectra/data/she/nmr/H-F/1/pdata/1/auditp.txt
$$ ##AUDIT TRAIL=  $$ (NUMBER, WHEN, WHO, WHERE, WHAT)
(   1,<2021-04-07 11:40:49.12 +0400>,<she>,<DPX200>,
      <created by zg, POWCHK disabled, PULCHK disabled
       configuration hash MD5:
       00 E9 B6 7A A2 85 ED C7 34 08 36 98 17 FE 4E 26
       data hash MD5: 16K
       52 74 72 81 12 45 29 30 AD 2D CB 3D 43 6A 40 66>)
(   2,<2021-04-07 11:40:55.90 +0400>,<she>,<DPX200>,
      <Start of raw data processing
       efp BC_mod = 2 LB = 0.24 FT_mod = 6 PKNL = 1 PHC0 = -11119.26 PHC1 = 11.20092 SI = 16K 
       data hash MD5: 16K
       A0 AC 19 6F 74 D8 22 09 7B 33 A3 24 54 48 6F 24>)
(   3,<2021-04-07 11:41:14.75 +0400>,<she>,<DPX200>,
      <pk PHC0 = -2.174528 PHC1 = 3 
       data hash MD5: 16K
       D8 B4 34 B0 F7 F8 53 D2 73 49 CF AB 9B 1D D9 83>)
(   4,<2021-04-07 11:41:17.76 +0400>,<she>,<DPX200>,
      <abs ABSG = 5 
       data hash MD5: 16K
       E6 40 2C EE 12 26 B5 64 0D 85 AE F1 6C 1F ED 54>)
$$ ##END=
$$ 
$$ hash MD5
$$ 66 7E A1 62 D3 14 D0 85 3D EF 0A 7C 92 E8 F2 36
##$RELAX= 
##$RELAX= 
##$RELAX= 
##$RELAX= 
##$RELAX= 
##$RELAX= 
$$ Bruker specific parameters
$$ --------------------------
##$DU= <F:/spectra>
##$EXPNO= 1
##$NAME= <H-F>
##$PROCNO= 1
##$TYPE= <nmr>
##$USER= <she>
##$AMP= (0..31)
100 100 100 100 100 100 100 100 100 100 100 100 100 100 100 100 100 100 
100 100 100 100 100 100 100 100 100 100 100 100 100 100 
##$AQSEQ= 0
##$AQ_mod= 1
##$AUNM= <au_zg>
##$AUTOPOS= <>
##$BF1= 200.13
##$BF2= 200.13
##$BF3= 200.13
##$BF4= 200.13
##$BF5= 200.13
##$BF6= 200.13
##$BF7= 200.13
##$BF8= 200.13
##$BYTORDA= 1
##$CFDGTYP= 0
##$CFRGTYP= 5
##$CHEMSTR= <none>
##$CNST= (0..31)
1 1 145 1 1 1 1 1 1 1 1 1 1 1 1 1 1 1 1 1 1 1 1 1 1 1 1 1 1 1 1 1 
##$CPDPRG= <>
##$CPDPRG1= <>
##$CPDPRG2= <>
##$CPDPRG3= <>
##$CPDPRG4= <mlev>
##$CPDPRG5= <mlev>
##$CPDPRG6= <mlev>
##$CPDPRG7= <mlev>
##$CPDPRG8= <mlev>
##$CPDPRGB= <>
##$CPDPRGT= <>
##$D= (0..31)
0 1.2 0 0 0 0 0 0 0 0.06 0 0.03 0 0 0 0 0.0002 0 0 0 0 0 0 0 0 0 0 0 0 
0 0 0 
##$DATE= 1617781248
##$DBL= (0..7)
120 120 120 120 120 120 120 120 
##$DBP= (0..7)
150 150 150 150 150 150 150 150 
##$DBP07= 0
##$DBPNAM0= <>
##$DBPNAM1= <>
##$DBPNAM2= <>
##$DBPNAM3= <>
##$DBPNAM4= <>
##$DBPNAM5= <>
$$ [...]
##$SUBNAM3= <"">
##$SUBNAM4= <"">
##$SUBNAM5= <"">
##$SUBNAM6= <"">
##$SUBNAM7= <"">
##$SUBNAM8= <"">
##$SUBNAM9= <"">
##$SW= 16.9725357007746
##$SWIBOX= (0..15)
0 0 2 0 0 0 0 0 0 0 0 0 0 0 0 0 
##$SW_h= 3396.73913043478
##$TD= 16384
##$TD0= 1
##$TE= 0
##$TE2= 300
##$TE3= 300
##$TEG= 300
##$TL= (0..7)
0 120 120 120 120 120 120 120 
##$TP= (0..7)
150 150 150 150 150 150 150 150 
##$TP07= 0
##$TPNAME0= <>
##$TPNAME1= <>
##$TPNAME2= <>
##$TPNAME3= <>
##$TPNAME4= <>
##$TPNAME5= <>
##$TPNAME6= <>
##$TPNAME7= <>
##$TPOAL= (0..7)
0.5 0.5 0.5 0.5 0.5 0.5 0.5 0.5 
##$TPOFFS= (0..7)
0 0 0 0 0 0 0 0 
##$TUNHIN= 0
##$TUNHOUT= 0
##$TUNXOUT= 0
##$USERA1= <user>
##$USERA2= <user>
##$USERA3= <user>
##$USERA4= <user>
##$USERA5= <user>
##$V9= 5
##$VALIST= <valist>
##$VCLIST= <CCCCCCCCCCCCCCC>
##$VD= 0
##$VDLIST= <DDDDDDDDDDDDDDD>
##$VPLIST= <PPPPPPPPPPPPPPP>
##$VTLIST= <TTTTTTTTTTTTTTT>
##$WBST= 1024
##$WBSW= 4
##$XGAIN= (0..3)
0 0 0 0 
##$XL= 0
##$YL= 0
##$YMAX_a= 390630
##$YMIN_a= -478483
##$ZGOPTNS= <>
##$ZL1= 120
##$ZL2= 120
##$ZL3= 120
##$ZL4= 120
##$ABSF1= 15.97713
##$ABSF2= -0.995532
##$ABSG= 5
##$ABSL= 3
##$ALPHA= 0
##$AQORDER= 0
##$ASSFAC= 0
##$ASSFACI= 0
##$ASSFACX= 0
##$ASSWID= 0
##$AUNMP= <proc_1d>
##$AZFE= 0.1
##$AZFW= 0.1
##$BCFW= 0
##$BC_mod= 2
##$BYTORDP= 0
##$COROFFS= 0
##$CY= -3
##$DATMOD= 1
##$DC= 0
##$DFILT= <>
##$DTYPP= 0
##$F1P= 0
##$F2P= 0
##$FCOR= 1
##$FTSIZE= 16384
##$FT_mod= 6
##$GAMMA= 0
##$GB= 0
##$INTBC= 1
##$INTSCL= 2.992141e-10
##$ISEN= 128
##$LB= 0.24
##$LEV0= 0
##$LPBIN= 0
##$MAXI= 10000
##$MC2= 0
##$MEAN= 0
##$ME_mod= 0
##$MI= 1.114404
##$NCOEF= 0
##$NC_proc= -6
##$NLEV= 6
##$NOISF1= 3.799351
##$NOISF2= 2.8
##$NSP= 0
##$NTH_PI= 0
##$NZP= 0
##$OFFSET= 15.97713
##$PC= 1
##$PHC0= -11121.43
##$PHC1= 14.20092
##$PH_mod= 1
##$PKNL= yes
##$PPARMOD= 0
##$PSCAL= 0
##$PSIGN= 0
##$REVERSE= no
##$SF= 200.130006866141
##$SI= 16384
##$SIGF1= 3
##$SIGF2= 2
##$SINO= 5.538805
##$SIOLD= 16384
##$SREGLST= <1H.CDCl3>
##$SSB= 0
##$STSI= 16384
##$STSR= 0
##$SW_p= 3396.73913043479
##$SYMM= 0
##$S_DEV= 0
##$TDeff= 16384
##$TDoff= 0
##$TI= <>
##$TILT= no
##$TM1= 0
##$TM2= 0
##$TOPLEV= 0
##$USERP1= <user>
##$USERP2= <user>
##$USERP3= <user>
##$USERP4= <user>
##$USERP5= <user>
##$WDW= 1
##$XDIM= 16384
##$YMAX_p= 452394830
##$YMIN_p= -360175
$$ End of Bruker specific parameters
$$ ---------------------------------
##NTUPLES= NMR SPECTRUM
##VAR_NAME=  FREQUENCY,     SPECTRUM/REAL,   SPECTRUM/IMAG
##SYMBOL=    X,             R,               I
##VAR_TYPE=  INDEPENDENT,   DEPENDENT,       DEPENDENT
##VAR_FORM=  AFFN,          ASDF,            ASDF
##VAR_DIM=   16384,         16384,           16384
##UNITS=     HZ,            ARBITRARY UNITS, ARBITRARY UNITS
##FACTOR=    0.207333158178282, 1,           1
##FIRST=     3197.50312383659, 0,            0
##LAST=      -199.236006598202, 0,           0
##MIN=       -199.236006598202, -360175,     0
##MAX=       3197.50312383659, 452394830,    0
$$ Real data points
##PAGE= N=1
##DATA TABLE= (X++(R..R)), XYDATA
$$ [...]
4459A1506589n20510k66868l56485l18787k25805k34291k98714n5317j62138k13867
4449H853807l57759l46404l34479k50471m58253k85167j93254j89198k66548j13588
4439F058686q9130p8907j96060q3449j77285j94934n3425j30298J65504k97616
4429D923086j75382r2776J5722q5592q2232j10946j16596n6351j17193q3239j1922
4418D006579j30448j57688r5470k7548J3532J0889n5893r0464j15687P7813j3966
4407C421649j81771j27019O2750l0213J1839O820k9674j09221n4198p4967j19017
4396B776978j77504r4196P3814n1718L5570M7056j68888n1059M2297M4685N4509
4385B531544j60056Q1426k6497m4516r6841j2246L4123j3568J21447K56591n2773
$$ plain form
4459 11506589 10986079 10719211 10362726 10043939 9818134 9583843 9285129 9229812 9067674 8853807
4449 8853807 8496048 8149644 7815165 7564694 7106441 6821274 6628020 6438822 6172274 6058686
4439 6058686 5969556 5890649 5694589 5611140 5433855 5238921 5185496 5055198 5220702 4923086
4429 4923086 4747704 4654928 4670650 4585058 4502826 4391880 4275284 4218933 4101740 4018501 4006579
4418 4006579 3876131 3718443 3622973 3595425 3608957 3619846 3563953 3473489 3357802 3435615 3421649
4407 3421649 3239878 3112859 3175609 3145396 3157235 3164055 3134381 3025160 2970962 2895995 2776978
4396 2776978 2599474 2505278 2579092 2527374 2562944 2610000 2441112 2390053 2432350 2477035 2531544
4385 2531544 2371488 2452914 2426417 2381901 2285060 2272814 2306937 2293369 2414816 2671407 2618634
4374B618634R1989l7572n668R500j34056L5414L0240k6435R771N2803l1590P7543
4362B690573j94000N4607L3248k09211k0251L8395j8951k43051j29159P6890Q1625
4351B160715k4792l0617R006p657j5903n8545J2405J25081j10258k8545K7495
4340B058385O1064q4430K0600M3020j7997L3086p8558o5438R9255O9092j6400
4329B121679j09065j5617M8155n6054K8390k6918j16785N849P3988N9709J10221
4318B123552o6405M6569l378m2926J72216J1447Q103J19387j30303q2668J81971
4307B337565J75052L2929l529l7530R9103k2157j43395K0181j0595L7905n9835
4296B425694J48008k4623j24850J2398k6508K8847O8943O4854j04840K3997M6202
$$ plain form
4374 2618634 2710623 2673051 2667383 2676883 2542827 2578241 2608481 2582046 2591817 2644620 2613030 2690573
4362 2690573 2496573 2551180 2584428 2375217 2354966 2393361 2374410 2131359 2002200 2079090 2160715
4351 2160715 2135923 2105306 2114312 2106655 2090752 2032207 2044612 2169693 2059435 2030890 2058385
4340 2058385 2119449 2035019 2055619 2098639 2080642 2113728 2035170 1969732 2068987 2138079 2121679
4329 2121679 2012614 1996997 2045152 1989098 2017488 1990570 1873785 1879634 1953622 2013331 2123552
4318 2123552 2057147 2103716 2100338 2057412 2229628 2241075 2249178 2368565 2238262 2155594 2337565
4307 2337565 2512617 2545546 2542017 2504487 2603590 2581433 2438038 2458219 2447624 2485529 2425694
4296 2425694 2573702 2549079 2424229 2436627 2410119 2438966 2507909 2572763 2467923 2491920 2538122
4285B538122J33813P0879Q0366K9989k5831L0066K22548M1666J33739K03994J24585
4274C583936J09563R4085J11887J33271J74110L25112L99930K77591K32298L92516
4264E834299M00844N43345O81261P34902R06153J218651J415401J821762K472167
4255A6028785K653941K458841K013285M27276j443580k270523k892687l018616
4247A3956722k480338j695160j344079j005064p32064q24718m56635m16024m17204
4238D585436l90032l62076q4428j23454l18042k21588q8900k16743j7801k39394
4228B522978j72499m91o7163J3282j49557J00791L6169j26435M0661j5012j36777
4217B045947k4300K7759K6869P7769j75124j46880p3361N2024n29m7254J4259
$$ plain form
4285 2538122 2671935 2742814 2823180 2853169 2827338 2857404 3079952 3121618 3255357 3459351 3583936
4274 3583936 3693499 3787584 3899471 4032742 4206852 4531964 4931894 5209485 5441783 5834299
4264 5834299 6235143 6778488 7459749 8194651 9100804 10319455 11734856 13556618 16028785
4255 16028785 18682726 21141567 23154852 23582128 22138548 19868025 16975338 13956722
4247 13956722 11476384 9781224 8437145 7432081 6700017 5875299 5418664 5002640 4585436
4238 4585436 4195404 3833328 3748900 3625446 3307404 3085816 2996916 2780173 2762372 2522978
4228 2522978 2350479 2349988 2282825 2296107 2146550 2247341 2283510 2157075 2197736 2182724 2045947
4217 2045947 2021647 2049406 2076275 2154044 1978920 1832040 1758679 1810703 1810174 1762920 1777179
4206A777179o7976K1384p7441o5868J9185p791n7017l1773Q4340q1213p4700P9043
4194A517352R293p4789R3396r7588o5991r8306K1974M1111n4726J94758K3199
4183A509683n113K0875o9996N1509Q755O9899J00760q6860m7887K6809L001l7803
4171A543632M526M3485Q4881m174j75265o9017k392L2970M2920m0210j0035K453
4159A453774j07473m9007P5754j74559j08324N0659N0437k5681j6499M7390j58483
4148A037988J08171p2469J17564J20054j18038j13601j2157j22508o3467K09333
4138A090870n4445J1707n1067M9694J04331M2384N6087o0232Q4715J4993m5337
4127A243700K1948m7794K04523j03092j67179L4713J96286P1863J9620j66080
$$ plain form
4206 1777179 1709203 1730587 1653146 1587278 1606463 1598672 1541655 1509882 1594222 1513009 1438309 1517352
4194 1517352 1526645 1451856 1545252 1447664 1381673 1283367 1305341 1346452 1291726 1486484 1509683
4183 1509683 1504570 1525445 1455449 1506958 1515713 1585612 1686372 1599512 1551625 1578434 1581435 1543632
4171 1543632 1548158 1591643 1676524 1672350 1497085 1428068 1425676 1458646 1501566 1461356 1451321 1453774
4159 1453774 1346301 1297294 1373048 1198489 1090165 1140824 1191261 1165580 1149081 1196471 1037988
4148 1037988 1146159 1073690 1191254 1311308 1193270 1079669 1067512 945004 881537 1090870
4138 1090870 1036425 1048132 997065 1046759 1151090 1193474 1249561 1189329 1274044 1289037 1243700
4127 1243700 1265648 1217854 1422377 1319285 1152106 1186819 1383105 1454968 1474588 1308508
4117A308508j28553O7426j80023m3483P6370J04623q0283p2359K0806L1140J37607
4106A241779Q899k05669k703Q2961P5171R8237J17131j9452k05565m2778J5734
4095A163745J54803j0835k9826o6312J45274p5396j01719L0631J20776L3677k28698
4084A136120K1371Q8485J2115O7546P1781p9105j34531R7798l9058m0202L8086
4073A240406J47463K98367j48342j91290P1987R5615J01064p664N314R807M678
4062A627405K0316J52999J11051m0735L587j7998n1377m9269P0704L2574m1234
4051A818023k5938K9108j73156J47377j10344J05163L933L8062J7088J5747J1238
4040A876301j04374q7722K3474L8188N3068K4381j01282O9563J2219K9742M954
$$ plain form
4117 1308508 1179955 1247381 1067358 1023875 1100245 1204868 1124585 1052226 1073032 1104172 1241779
4106 1241779 1250678 1045009 1042306 1125267 1200438 1298675 1415806 1396354 1190789 1148011 1163745
4095 1163745 1318548 1307713 1277887 1211575 1356849 1281453 1179734 1210365 1331141 1364818 1136120
4084 1136120 1157491 1245976 1258091 1325637 1397418 1318313 1183782 1281580 1242522 1202320 1240406
4073 1240406 1387869 1686236 1537894 1346604 1418591 1514206 1615270 1607606 1612920 1622727 1627405
4062 1627405 1647721 1800720 1911771 1871036 1874623 1856625 1805248 1755979 1826683 1859257 1818023
4051 1818023 1792085 1821193 1648037 1795414 1685070 1790233 1794166 1832228 1849316 1865063 1876301
4040 1876301 1771927 1684205 1707679 1745867 1798935 1823316 1722034 1791597 1803816 1833558 1838512
4029A838512N4869M1464Q4670j163j28524O4124J14679r3369J28592k0633k5627
4018B057594n1137r5015L2700j51245L513J3392j15258l151j39602k3519J89693
4007A717965L8581n4121m2854K14952o2620l6635o7443p296j670o8877J55926
3996A785908R2239k2464O5664M3333M0699o996j17790R3123j31166q291J729o1602
3984A774386k5977O3440P516k5816n0304l0124M144J28552j02547R5795j57926
3973A681139J09407M85K4154O2363o5423l998O8250j7747P330J9419L8273n1677
3961A871975M4097J95257k1121k8239m6455p1755P2857P3110j61305j40466K89585
3950B077540J56313j35654J09017O2710K7054j1609J13894P3273P7909j05282
$$ plain form
4029 1838512 1893381 1934845 2019515 2018352 1889828 1953952 2068631 1975262 2103854 2083221 2057594
4018 2057594 2006457 1911442 1944142 1792897 1796410 1809802 1694544 1691393 1551791 1528272 1717965
4007 1717965 1756546 1702425 1659571 1874523 1811903 1775268 1707825 1700529 1698859 1629982 1785908
3996 1785908 1878147 1855683 1921347 1964680 2005379 1998383 1880593 1973716 1842550 1834259 1835988 1774386
3984 1774386 1748409 1811849 1819365 1793549 1743245 1713121 1717265 1845817 1743270 1839065 1681139
3973 1681139 1790546 1791031 1815185 1877548 1812125 1808127 1876377 1858630 1865960 1885379 1923652 1871975
3961 1871975 1916072 2111329 2090208 2061969 2015514 1943759 2016616 2089726 1928421 1787955 2077540
3950 2077540 2233853 2098199 2207216 2269926 2296980 2285371 2399265 2472538 2550447 2445165
3940B445165K34m5880R0935N5242R9578q4777K9908o5955k3783R7302J8479n5709
3928B560739J04647r676K9052K06583M3733J5274p7018k7482K55632m4417j45533
3917B911534M0557N9331J52477N5589j10815P0366J61041m6782O6379O207j15726
3906C250158J71564R4582Q4654r356k4708J84626J2909R1125Q9227j8811K12578
3895D138548J05842q0297K7872N7515m235R9533j0139M2753J32989J40194M6160
3884D696735R942Q4730R6563K12717J51327m6042O3340Q0461p9418p79J06834
3873E376410K05355K2383J43343J75526n3902J28229P5268K4180J06172M7575
3863F250539J012J07908K33886P6867J98742j1249J10691P2780J42448L46173
$$ plain form
3940 2445165 2445399 2399519 2490454 2545696 2645274 2560497 2590405 2524450 2500667 2597969 2616448 2560739
3928 2560739 2665386 2655710 2684762 2891345 2935078 2950352 2873334 2845852 3101484 3057067 2911534
3917 2911534 2952091 3011422 3163899 3219488 3108673 3179039 3340080 3293298 3359677 3365884 3250158
3906 3250158 3421722 3516304 3600958 3591602 3566894 3751520 3764429 3855554 3944781 3925970 4138548
3895 4138548 4244390 4164093 4191965 4249480 4245245 4344778 4334639 4377392 4510381 4650575 4696735
3884 4696735 4706677 4791407 4887970 5100687 5252014 5205972 5269312 5349773 5270355 5269576 5376410
3873 5376410 5581765 5604148 5747491 5923017 5869115 5997344 6072612 6096792 6202964 6250539
3863 6250539 6251551 6359459 6593345 6670212 6868954 6857705 6968396 7041176 7183624 7529797
3853G529797J48990j2392o3790K32137L35129L8660J46453K02618K51379J78089
3843H987070O2325J09270L33641K15182K84255L8269K52036L05595K21356J27221
3833A0936220L52797N22709L73441L20996J22999L96449N83101M91191M81859
3824A4581762M18564M46363N57002N54457M84499M36930O93279O97336O88906
3815A9559098O62627P43139J017397R69380Q65395J113957J357501J478028J532117
3806B9298639K004303K452296K773685L807153M599071N865311P241073Q150386
3798F6191917Q643780P697307M549950l27454m929898q613155r481471q295732
3790E5435244o238989m374923l048339k258182j773256j355497r88244r87297
$$ plain form
3853 7529797 7678787 7666395 7602605 7834742 8169871 8208531 8354984 8557602 8808981 8987070
3843 8987070 9049395 9158665 9492306 9707488 9991743 10030012 10282048 10587643 10808999 10936220
3833 10936220 11289017 11811726 12185167 12506163 12629162 13025611 13608712 14099903 14581762
3824 14581762 15000326 15446689 16003691 16558148 17042647 17479577 18172856 18870192 19559098
3815 19559098 20221725 20964864 21982261 22951641 23817036 24930993 26288494 27766522 29298639
3806 29298639 31302942 33755238 36528923 40336076 44935147 50800458 58041531 66191917
3798 66191917 74835697 82533004 87082954 86755500 81825602 73212447 63730976 55435244
3790 55435244 49196255 44821332 41772993 39514811 37741555 36386058 35397814 34410517
3782C4410517p62786n71432k14289R8423J4105R5543J84185L90067M28558M77117
3772C4550008N49260M95132M88436M88763N46003N72246P13167N00537N63050
3763C9466602P82770R35922R52283J053028J337482J469882J678376J889154K063282
3754E1628781K137140K246593K366692K357755K282479K251395K470770K766673
3746G0508278K762428K796056K733983K505142K415145K168173K111809K181048
3738I0182062K556072L032657L604043M401901N033233N886313O938515P899531
3730A29534327R340789J0213794R476735O701740K871368n20934l702139o658871
3722A57256809p907757o958187n062027l141744k090464j732342j591102j608774
$$ plain form
3782 34410517 33647731 33076299 32862010 32960433 32974538 33070081 33254266 33644333 34072891 34550008
3772 34550008 35099268 35594400 36082836 36571599 37117602 37689848 38403015 38903552 39466602
3763 39466602 40249372 41185294 42137577 43190605 44528087 45997969 47676345 49565499 51628781
3754 51628781 53765921 56012514 58379206 60736961 63019440 65270835 67741605 70508278
3746 70508278 73270706 76066762 78800745 81305887 83721032 85889205 88001014 90182062
3738 90182062 92738134 95770791 99374834 103776735 108809968 114696281 121634796 129534327
3730 129534327 138875116 149088910 158565645 165267385 168138753 167617819 163915680 157256809
3722 157256809 149349052 142390865 137328838 134187094 132096630 130364288 128773186 127164412
3714A27164412k409883l069883l976287m598842n206081n757286n673042n166012
3706I1307096m353040l544134k524244j200277n22383L9119L63457P02579O95320
3697H0963493M60647q60654k409630l765697m825128n217972m817780m323275
3689E5204004l690335l263880l073414k484976k102673j784789j527164j336539
3681C5940234j128507p77278o48143o23133m28645l50031k51653k94415k92729
3672C1145700l23145m08296o25250r15740p92289r84636r63625j014353p82670
3663B4335696p09329o92786n49401m01995n37070m23879m86434m50607n60654
3654A9523541m29439n05299o53469n45836p37318m63209m38282n27919l44048
$$ plain form
3714 127164412 124754529 121684646 117708359 113109517 107903436 102146150 96473108 91307096
3706 91307096 86954056 83409922 80885678 79685401 79163018 79202137 79565594 80268173 80963493
3697 80963493 81424140 80563486 78153856 74388159 69563031 64345059 59527279 55204004
3689 55204004 51513669 48249789 45176375 42691399 40588726 38803937 37276773 35940234
3681 35940234 34811727 34034449 33386306 32763173 32334528 31984497 31732844 31438429 31145700
3672 31145700 30822555 30414259 29789009 28873269 28080980 27096344 26132719 25118366 24335696
3663 24335696 23626367 22933581 22384180 21982185 21445115 21021236 20534802 20084195 19523541
3654 19523541 19094102 18588803 17935334 17389498 16652180 16188971 15750689 15222770 14878722
3645A4878722l38338k31338k15846l28173l17617m24478k01423r9559k51636k25603
3635A2244711k33462k03215m58766k30823j09030k36173j28912m0207l32650j11295
3625A0160178L510k13668k17735l3455L1784j45212J5262j42318k63489n8752
3615I136105K7084j22280K9106k5931j57818M0123q1200k0478o5768k08561j04240
3604H446142j48886L2559J2771o244q8479p6660P4117J3149l9007K689k5524r728
3592H186899o839j05567J4402p6185j18850j61834r446k6710L925M2578r4536
3581G647837o5590n1829J33462J62923R9830q4026L6034q7593j27144n5j3658
3570G650191J57589n3832r2482O7767J37687k3594O067l6056N6003l7367l5447
$$ plain form
3645 14878722 14540384 14309046 14093200 13765027 13447410 13022932 12821509 12721950 12470314 12244711
3635 12244711 12011249 11808034 11349268 11118445 11009415 10773242 10644330 10604123 10271473 10160178
3625 10160178 10163688 9950020 9732285 9698830 9730614 9585402 9600664 9458346 9194857 9136105
3615 9136105 9163189 9040909 9070015 9044084 8886266 8926389 8845189 8824711 8758943 8550382 8446142
3604 8446142 8297256 8329815 8342586 8336342 8247863 8171203 8245320 8258469 8219462 8222151 8196627 8186899
3592 8186899 8180060 8074493 8088895 8012710 7893860 7732026 7722580 7695870 7699795 7742373 7647837
3581 7647837 7582247 7530418 7663880 7826803 7926633 7842607 7878641 7791048 7663904 7663849 7650191
3570 7650191 7807780 7753948 7661466 7729233 7866920 7843326 7849393 7813337 7869340 7831973 7796526
3559G796526P2355J51375O8833j97784m5599j1484N7077K2318K3116l9892J75247
3548H072088P1969r488l7455J02193Q1823J36679l7480N0494J07828N5540K4648
3537H618839K3149R7632J1571j6032l444R9076r6810L3292K4882K42974K01106
3526I236235J14502J98926K73020L2254J22082O6919k6214J46606j9012J88894
3516A0334212J5150p0179n6071L5623r9808R0075Q1116J11676p6630J80644K47845
3505A0793653P0658m904R4250M3594M9244K12180J8662J19621J07733J72002J31333
3494A1808026Q5585K3556K2859J7893J61533o0739O8589J25738J16637R2393K60113
3483A2722183K84852J66667J41928L82154J93147J75658L94281K45541K57943
$$ plain form
3559 7796526 7868881 8020256 8089089 7891305 7845706 7834222 7891299 7913617 7936733 7896841 8072088
3548 8072088 8144057 8134569 8097114 8199307 8281130 8417809 8380329 8430823 8538651 8594191 8618839
3537 8618839 8641988 8739620 8751191 8735159 8731715 8830791 8733981 8767273 8792155 9035129 9236235
3526 9236235 9350737 9549663 9822683 9854937 9977019 10043938 10017724 10164330 10145318 10334212
3516 10334212 10349362 10279183 10223112 10258735 10158927 10249002 10330118 10441794 10365164 10545808 10793653
3505 10793653 10864311 10859407 10953657 10997251 11046495 11258675 11277337 11396958 11504691 11676693 11808026
3494 11808026 11893611 11917167 11940026 11957919 12119452 12058713 12127302 12253040 12369677 12462070 12722183
3483 12722183 13007035 13173702 13315630 13697784 13890931 14066589 14460870 14706411 14964354
3474A4964354L64144L73126L38864M03784M16875L26410L42716M38831M29920
3465A8399024N72606N92711O09563M89493N29387O29255P80330O69869P75180
3456B4047418R47415R18154R39604J060341J247861J150513J245528J359074J253763
3447C4169671J478311J440835J526107J942876K139809K206936K446859K766174
3439E0117578L065550L171771L632314M175161M303572M971770N696394O581380
3431H5715490P732169R328210J1367834J3896788J6300334J8362558J9805968
3424A82509351J9945367J7263234J0225743r15063j2847164k1089587k3311769
3417A71780112k1496254j8302492j4808047j2228276j0093054q820717p602111
$$ plain form
3474 14964354 15328498 15701624 16040488 16444272 16861147 17187557 17530273 17969104 18399024
3465 18399024 18971630 19564341 20173904 20663397 21192784 21822039 22602369 23272238 24047418
3456 24047418 24994833 25912987 26852591 27912932 29160793 30311306 31556834 32915908 34169671
3447 34169671 35647982 37088817 38614924 40557800 42697609 44904545 47351404 50117578
3439 50117578 53183128 56354899 59987213 64162374 68465946 73437716 79134110 85715490
3431 85715490 93447659 102775869 114143703 128040491 144340825 162703383 182509351
3424 182509351 202454718 219717952 229943695 229028632 216181468 195091881 171780112
3417 171780112 150283858 131981366 117173319 104945043 94851989 86031272 78429161
3410G8429161o518711n629240m888114m227220l533344l211582k795639k601583
3402D5023728k194422j891811j570121j191471j152685j205964p69820q83341
3394C4164093m91157k20100l83647k11381q6076j32907R3800P3384L077K86532
3384C3095618K77366K95408M77960L58937M00223L90226M31145O08286Q69969
3375C7205138J193389J581050J939373K121873K473580K576310K783870K235541
3367E4110124J312026o2682j421615k032852k403627k323952j904218j522802
3359D3750402j237728p85026m20740k19291L7520M2250J0952J18328J57844J10709
3349D1565220K7538N44066Q08446R89758J329122J529739K138189K764388L711875
$$ plain form
3410 78429161 71910450 66281210 61393096 57165876 53632532 50420950 47625311 45023728
3402 45023728 42829306 40937495 39367374 38175903 37023218 35817254 35047434 34164093
3394 34164093 33672936 33452836 33069189 32857808 32771732 32638825 32732625 32806009 32809086 33095618
3384 33095618 33372984 33668392 34146352 34505289 34905512 35295738 35726883 36335169 37205138
3375 37205138 38398527 39979577 41918950 44040823 46514403 49090713 51874583 54110124
3367 54110124 55422150 55359468 53937853 51905001 49501374 47177422 45273204 43750402
3359 43750402 42512674 41727648 41306908 41087617 41125137 41167387 41178339 41296667 41454511 41565220
3349 41565220 41592758 42136824 42945270 43935028 45264150 46793889 48932078 51696466 55408341
3340E5408341M281720N088760N583773N807152N157632L543774Q38110k541498
3332H3167764n197667o348578o366558n915505n002525l847684k970490k510090
3324D5008667k399101j904440j723014j815823j631339j470580j145568r16302
3316C2002500r47684n80686l43677p4140K45967M53123O79346R78967J523610
3307C3937326J660839J784765J925146J925402J340966M41953o64067j717158
3299D0635172k621575l069921k909231k796794k508808k070965j917416j615735
3291B1124727j347444j048610j048513q98401p54343r09220o59326n64163n85193
3282A3309514n02944l75703l80397l70513l36290l16267j79772j51198j76062
$$ plain form
3340 55408341 59690061 64778821 70362594 76169746 81327378 84871152 85709262 83167764
3332 83167764 77970097 71621519 65254961 59339456 54336931 50489247 47518757 45008667
3324 45008667 42609566 40705126 38982112 37166289 35534950 34064370 32918802 32002500
3316 32002500 31054816 30474130 30130453 30056313 30302280 30755403 31434749 32413716 33937326
3307 33937326 35598165 37382930 39308076 41233478 42574444 43016397 42352330 40635172
3299 40635172 38013597 34943676 32034445 29237651 26728843 24657878 22740462 21124727
3291 21124727 19777283 18728673 17680160 16781759 16027416 15118196 14458870 13894707 13309514
3282 13309514 12806570 12430867 12050470 11679957 11343667 11027400 10847628 10696430 10520368
3273A0520368l60236l01981j65691j92224k88825j45223l9888q5339j49580j0233
3263H781148r4342k76130j54776k01824k73402r8155j17602k11795r7394r7787
3253G157941p9059m4222o2289l025m9332j06118n6592q2195n2376j55227l5387
3242F432119p8460j25605N8869o7292p1557j93035k9129L5001K8540r659P1867
3231F051659l6112k47032O6464k3842j80490j72368M1305j22667r1070l2290N9035
3220E312592J88713n1452m5389L6860j35926J1152J16315j8200K5561O2566j08713
3209E394079o7955Q8209J48J07390J35459k1460p5392N5341L4333R1672p1174
3198E670650M5416p0782m3974k422L1392n7570j7106o8404J29631J79064N2053
$$ plain form
3273 10520368 10160132 9858151 9692460 9500236 9211411 9066188 9026300 8940961 8791381 8781148
3263 8781148 8686806 8410676 8255900 8054076 7780674 7682519 7564917 7353122 7255728 7157941
3253 7157941 7078882 7034660 6972371 6969346 6920014 6813896 6757304 6675109 6622733 6467506 6432119
3242 6432119 6353659 6228054 6286923 6219631 6148074 5955039 5925910 5960911 5989451 5979792 6051659
3231 6051659 6015547 5768515 5834979 5811137 5630647 5458279 5499584 5376917 5285847 5253557 5312592
3220 5312592 5501305 5449853 5404464 5441324 5305398 5316550 5432865 5414665 5440226 5502792 5394079
3209 5394079 5326124 5414333 5414481 5521871 5657330 5635870 5560478 5615819 5650152 5741824 5670650
3198 5670650 5716066 5645284 5601310 5598888 5630280 5572710 5555604 5487200 5616831 5795895 5847948
3187E847948M8786L7218m3432p6114j8511p9402K22416J01429J8077J46209J3656
3176F218280j74159J68073J17218J47284J53257R2530J38863K39556J92620Q3166
3166G376688O4424m8669j3600J24587J98682J54864K8016J71569N6453J41922
3156H254936K61344J32055K91239K61460K77678L78618M16993L71165L81013M58093
3146A1484594N02497M45171N18342N70605O63492P10544O49798P99120R59334
3137A7303497J043752J213386J045381P52259N52727N15338O37456O93479O95195
3128B4452470J177455J549858J957247K676627L538508M457254N125912N750241
3120E0685572O279265N757537L346568o37200m971120p168015o994279n753061
$$ plain form
3187 5847948 5896734 5933952 5890520 5814406 5795895 5716493 5938909 6040338 6058415 6204624 6218280
3176 6218280 6044121 6212194 6329412 6476696 6629953 6722483 6861346 7100902 7293522 7376688
3166 7376688 7441112 7392443 7378843 7503430 7702112 7856976 7884992 8056561 8113014 8254936
3156 8254936 8516280 8648335 8939574 9201034 9478712 9857330 10274323 10645488 11026501 11484594
3146 11484594 11987091 12432262 12950604 13521209 14184701 14895245 15545043 16344163 17303497
3137 17303497 18347249 19560635 20606016 21358275 21911002 22426340 23063796 23757275 24452470
3128 24452470 25629925 27179783 29137030 31813657 35352165 39809419 44935331 50685572
3120 50685572 56964837 62722374 66068942 65431742 60460622 53292607 46298328 40545267
3112D0545267m375196l226473k415894j812603j500147j339056j046821r34302
3104B3894775r56348j038901j322978j255233j150978j202580j112391q49174
3096A5006192o34991o44756p11864n22474m96557l09718l13814j52616j44326
3087A1075076k37627j38223K1524N8659M3263J13523R2692J20134J60213n159
3077A1304075q1274Q5681j49726k20329k26625l29293m69064k78802k06424j35356
3067I292863j62246j77193m8827J55558m308j34946n8975J51796K01265J07438
3057I322425J22010J98099L69936J96052L11165M99024N97169N68354P04451N82078
3047A3470763K70093o43467q83049o86486n41634k51128k10642k8258l5038J37543
$$ plain form
3112 40545267 36170071 32943598 30527704 28715101 27214954 25875898 24829077 23894775
3104 23894775 22938427 21899526 20576548 19321315 18170337 16967757 15855366 15006192
3096 15006192 14371201 13726445 13014581 12492107 11995550 11685832 11372018 11219402 11075076
3087 11075076 10837449 10699226 10720750 10779409 10822672 10936195 11028887 11149021 11309234 11304075
3077 11304075 11222801 11308482 11158756 10938427 10711802 10382509 9913445 9634643 9428219 9292863
3067 9292863 9130617 8953424 8904597 9060155 9055847 8920901 8861926 9013722 9214987 9322425
3057 9322425 9444435 9642534 10012470 10208522 10519687 11018711 11615880 12184234 12888685 13470763
3047 13470763 13740856 13097389 12214340 11527854 10986220 10735092 10524450 10496192 10461154 10598697
3037A0598697J07095p1220J08062J48467m1821o8612k5389K9342q4835J13333
3027A0813119J82919K08979J50189J08622J66303J30180K91648K93433J67018
3018A2512410M9707j44233k02908K9763L7275j599m555O262K6265R4288K52272
3007A2654947K38990K26996K03524L73628J18998m099m5731R6981Q1910j8116
2997A3928028Q586O6012J59085K92055K25461K77298L17252L35128K94316L19335
2987A6222556K81339J84381K87885J89852M69265N22986M76692O61048N00560
2978A9796564N14260K95210J25520M7157K94051M41312L51254O62413O05952Q10536
2968B3944229Q58387J032989J094701R56466Q38367N50943L351j27230k31313
$$ plain form
3037 10598697 10705792 10634572 10742634 10891101 10849280 10780668 10755279 10784621 10699786 10813119
3027 10813119 10996038 11205017 11355206 11463828 11630131 11760311 12051959 12345392 12512410
3018 12512410 12562117 12417884 12214976 12244739 12282014 12280415 12275860 12282122 12308387 12402675 12654947
3007 12654947 12893937 13120933 13324457 13698085 13817083 13812984 13767253 13864234 13946144 13928028
2997 13928028 13936614 14002626 14161711 14453766 14679227 14956525 15273777 15608905 15903221 16222556
2987 16222556 16503895 16688276 16976161 17166013 17635278 18158264 18634956 19296004 19796564
2978 19796564 20310824 20606034 20731554 20778711 21072762 21514074 21865328 22527741 23133693 23944229
2968 23944229 24802616 25835605 26930306 27886772 28725139 29276082 29279433 29152203 28920890
2959B8920890m77050l10027N9846L21385M14713O99453R99419J142619J023265
2950C2794513R93929Q30006L69778j17918p98185j227934j054510r08966r40543
2941B9940170n70751l37671j74473Q3608K72998L43398M20106K06973k22654o78703
2931B9283001r53108j359982j455207j328011j078790r63269q57521o67061m38236
2922B0181816m25811l56150l58381m74826l69118m76158o67097o26276p92018
2913A5635981q07145o15997n99362m89474n63798m82042n13034l28617l60802
2904A0875710m18503l82559m28836l88006k63505l37310l69974l55217l41906
2895G589894l57008j84192k27047j08794k06566j14921j54544p9892j11061p4208
$$ plain form
2959 28920890 28443840 28133813 28193659 28515044 28929757 29629210 30628629 31771248 32794513
2950 32794513 33788442 34618448 34988226 34870308 34072123 32844189 31789679 30880713 29940170
2941 29940170 29369419 29031748 28857275 28940883 29213881 29557279 29977385 30184358 29961704 29283001
2931 29283001 28329893 26969911 25514704 24186693 23107903 22144634 21287113 20620052 20181816
2922 20181816 19756005 19399855 19041474 18566648 18197530 17721372 17054275 16427999 15635981
2913 15635981 14828836 14212839 13613477 13124003 12560205 12078163 11565129 11236512 10875710
2904 10875710 10457207 10074648 9645812 9257806 8994301 8656991 8287017 7931800 7589894
2895 7589894 7232886 7048694 6821647 6712853 6506287 6391366 6236822 6156930 6045869 5971661
2885E971661k62354k41065J4483p1946m9421l1621o8031j87363j83265l6187J25683
2874D980574j25030q3021l3428k7652J5773k7200j86077l9008l3125M5251j20118
2863D366939O9726J36j05728m5161p8203J34761j7096j36536j05364M2358m0860
2852D084972o965J107r8456P1874k5347q1427J51198o6827L0439J9907J6167L795
2840D100437k9046K0550k1318j27646J4113K21850J11061K37504l7866M4566j69008
2829D365197j20269J56580L9790m3092j81371r8603M5582K8645n3014J70625n5870
2818D254200m9166Q4833L5830l5844J23547P4484j45278o4942J5836k2115L7569
2807D308954J01325q0083P9191l0742L1615r8881m9674j7482Q6792O0890J47877
$$ plain form
2885 5971661 5709307 5468242 5482725 5410779 5361358 5329737 5261706 5074343 4891078 4854891 4980574
2874 4980574 4855544 4772523 4739095 4711443 4727216 4700016 4513939 4474931 4441806 4487057 4366939
2863 4366939 4436665 4436801 4331073 4285912 4207709 4342470 4325374 4188838 4083474 4125832 4084972
2852 4084972 4078007 4079114 3980658 4052532 4027185 3945758 4096956 4030129 4060568 4080475 4096642 4100437
2840 4100437 4071391 4091941 4070623 3942977 3957090 4178940 4290001 4527505 4489639 4534205 4365197
2829 4365197 4244928 4401508 4441298 4398206 4216835 4118232 4163814 4192459 4139445 4310070 4254200
2818 4254200 4205034 4289867 4325697 4289853 4413400 4487884 4342606 4277664 4293500 4271385 4308954
2807 4308954 4410279 4330196 4409387 4378645 4410260 4311379 4261705 4244223 4331015 4391905 4539782
2796D539782Q8144J40460K7455j89581J1246J68729J04961o2249P6959J53804
2786E059710k43535q1J8807N8920J53720J38790J85014m0948J59225O4581J45499
2775E699702R9494J06379J53791J41742J55338O8348J19461K51369J25751j1540
2765F909835p2793J01296J19263R2507L1745N6084N4658K9452O4284P6977N6886
2754G520194N2362J26723J35558J26674P4433J25516m3712K6407n7158q0517K25055
2743H231535K829J40407n7438j38243N6888R0094K60342P5849Q262J90003K21431
2732I081959J77353J26871K15509L49788L42189M64711L69096M17341N51471N45188
2722A2641476N41082N74537O73042O18432O88026M73931N07643N77631M16790
$$ plain form
2796 4539782 4627926 4768386 4795841 4606260 4617506 4786235 4891196 4828947 4905906 5059710
2786 5059710 4816175 4816094 4834901 4893821 5047541 5186331 5371345 5330397 5489622 5554203 5699702
2775 5699702 5799196 5905575 6059366 6201108 6356446 6424794 6544255 6795624 6921375 6909835
2765 6909835 6837042 6938338 7057601 7150108 7181853 7237937 7292595 7322047 7386331 7463308 7520194
2754 7520194 7572556 7699279 7834837 7961511 8035944 8161460 8117748 8144155 8086997 8006480 8231535
2743 8231535 8234364 8374771 8317333 8179090 8235978 8326072 8586414 8662263 8670525 8860528 9081959
2732 9081959 9259312 9386183 9601692 9951480 10293669 10758380 11127476 11544817 12096288 12641476
2722 12641476 13182558 13757095 14430137 15048569 15736595 16210526 16718169 17295800 17712590
2713A7712590L66019K15759q4502j67969m1165k950j62817J1784j52725n1747
2703A7642277q3729q2109K61N5030j55716k67998l91141l33604k84562n69495
2693A5529214o54553n95132m86497m70720o68425m48078n02628n62827l67521
2684A0772833m73205k88876l80593k19503k74983j39893n9977j80929J2094k55388
2674H511580j91645m3478r6655m9613m1538j79163j78547K4689O6656j94786O6307
2663G693807k1094l23427O233J29831J11486m2920J3323o65Q9894n265Q0239q4854
2651G646588Q888K7334J63893J93772J34518m921L6759J22321J03198j9681J0620
2640H423289q9668l2828j56867l6424N6412K17771P0395n8002l3462j02463Q8626
$$ plain form
2713 17712590 18078609 18294368 18209866 18041897 18000732 17997782 17834965 17846749 17694024 17642277
2703 17642277 17558548 17476439 17476700 17531730 17376014 17108016 16716875 16383271 16098709 15529214
2693 15529214 14874661 14279529 13793032 13322312 12653887 12205809 11703181 11140354 10772833
2684 10772833 10299628 10010752 9630159 9410656 9135673 8995780 8935803 8754874 8766968 8511580
2674 8511580 8319935 8276457 8179802 8130189 8088651 7909488 7730941 7755630 7822286 7627500 7693807
2663 7693807 7672713 7349286 7355519 7485350 7596836 7553916 7567239 7566574 7656468 7651203 7731442 7646588
2651 7646588 7655476 7682810 7846703 8040475 8174993 8170072 8206831 8329152 8432350 8412669 8423289
2640 8423289 8333621 8300793 8143926 8107502 8163914 8381685 8452080 8394078 8360616 8258153 8346779
2629H346779N3830J9551R8198M7591Q5496N9283J2210K82369N2465Q9864J23374
2618I271010J38301K74428J53376J75486J75033J43903J44043K10942J70856J69868
2608A1027246J30797J95785J23207J14178J90312K80385L04064L04657K66320
2599A2936951L51054L36391J66507K70398K83989N05128M37652K26615L07176
2590A5821861N65228M96111N22566M63812M57057M13877L41356Q3654J87710K53457
2580A9606689P8713l5817j63558j03795j20484k13129k65746r6160k36169j99214
2570A8251330k4767r1915n1573j32074J42206K91822J66333J79919K58779K60391
2560A9250451K16320L45213L73161L94890M31447M36212N03119N46629N22312
$$ plain form
2629 8346779 8400609 8420160 8518358 8565949 8651445 8710728 8722938 9005307 9057772 9147636 9271010
2618 9271010 9409311 9683739 9837115 10012601 10187634 10331537 10475580 10686522 10857378 11027246
2608 11027246 11158043 11353828 11477035 11591213 11781525 12061910 12365974 12670631 12936951
2599 12936951 13288005 13624396 13790903 14061301 14345290 14850418 15288070 15514685 15821861
2590 15821861 16387089 16883200 17405766 17869578 18326635 18740512 19081868 19165522 19353232 19606689
2580 19606689 19685402 19649585 19486027 19382232 19261748 19048619 18782873 18686713 18450544 18251330
2570 18251330 18226563 18134648 18083075 17951001 18093207 18385029 18551362 18731281 18990060 19250451
2560 19250451 19466771 19811984 20185145 20580035 21011482 21447694 21950813 22497442 23019754
2551B3019754Q50760R40705P90093O70974Q09106J018870R78910R60530J028970
2542C1068672J194259J268341J411707J173044J514102J649267J890892K202516
2534D3372800K388863K583057K790061L267009L571546L789377M302174M536919
2526G0601806M917865N025425N164261N350487M917920M555213L970965L017252
2518A07521194K102136R52648q7363j020552j619688j925367k301585k212524
2510A01408899j881202j599968j196983j051020p90352r09998j090649j454449
2502I1434278k146574k729977l326132l824455m402043m554165m741521m639519
2494F1069892m709238m193676l734105l559170l027812k539405k350696k092547
$$ plain form
2551 23019754 23870514 24811219 25601312 26272286 27081392 28100262 29079172 30039702 31068672
2542 31068672 32262931 33531272 34942979 36116023 37630125 39279392 41170284 43372800
2534 43372800 45761663 48344720 51134781 54401790 57973336 61762713 66064887 70601806
2526 70601806 75519671 80545096 85709357 91059844 95977764 100532977 104503942 107521194
2518 107521194 109623330 110575978 110488615 109468063 107848375 105923008 103621423 101408899
2510 101408899 99527697 97927729 96730746 95679726 94889374 93979376 92888727 91434278
2502 91434278 89287704 86557727 83231595 79407140 75005097 70450932 65709411 61069892
2494 61069892 56360654 52166978 48432873 44873703 41845891 39306486 36955790 34863243
2486C4863243j859050j557236j434403j364524j068517r54681j050269q20836
2478B4753727p75326o24515n07345o35156o69229k93666l06353m15398k65427
2469B0261312l39394l64871j65883j90493l20197j56671j19425M601n6950L663
2459A8555692o8509q8664j2815M1787j50105j44242j31120q2852K3741M8402Q8040
2448A8079355j24273j4161K28482K00892K301n9913P1942P9470m1397J20925j21187
2437A8422436q0658J88117l4082J37254J16991k1813J36412J44528o7874j62306
2427A8779005N3344j1566J19831k937n9718j1532k89510j62127k25579J80934
2417A8370145j20840k24781k76947j01712N3368k20160L8769j36491j29501R7839
$$ plain form
2486 34863243 33004193 31446957 30012554 28648030 27579513 26624832 25574563 24753727
2478 24753727 23978401 23353886 22846541 22211385 21542156 21248490 20942137 20526739 20261312
2469 20261312 19921918 19557047 19391164 19200671 18880474 18723803 18604378 18608979 18552029 18555692
2459 18555692 18487183 18398519 18385704 18427491 18277386 18133144 18002024 17919172 17942913 17991315 18079355
2448 18079355 17955082 17940921 18169403 18370295 18372596 18312683 18384625 18464095 18422698 18543623 18422436
2437 18422436 18341778 18529895 18495813 18633067 18750058 18728245 18864657 19009185 18941311 18779005
2427 18779005 18832349 18820783 18940614 18937677 18877959 18866427 18576917 18414790 18189211 18370145
2417 18370145 18249305 18024524 17747577 17645865 17699233 17479073 17517842 17381351 17251850 17349689
2407A7349689P7701Q1237P7610J54970R0672m2572L17884J62837K61276K51125
2397A8782429K04454J15212K51935L01684K00268J72236J82311J71835R3276K01654
2387B0677294L24310M46446K91853L05403K67521L41966L94811M67771M09718
2378B3927093M48415P81383Q06971P53887O75432P97764J008239R70396R88413
2369C1157993J200724J398326J393053J443244J434507J479560J802127J950191
2361D3259725J984588K127304K326130K350274K566485L091750L388634L720793
2353F4815683M216299M912736N449131N936452O849713P710073Q608506R601559
2345A18100152J0762894J1967080J2972769J3623805J4258105J3931787J3318549
$$ plain form
2407 17349689 17427390 17508627 17586237 17741207 17831879 17789307 18107191 18270028 18531304 18782429
2397 18782429 18986883 19102095 19354030 19655714 19855982 20028218 20210529 20382364 20475640 20677294
2387 20677294 21001604 21448050 21739903 22045306 22312827 22654793 23049604 23517375 23927093
2378 23927093 24375508 25156891 25963862 26717749 27393181 28190945 29199184 30169580 31157993
2369 31157993 32358717 33757043 35150096 36593340 38027847 39507407 41309534 43259725
2361 43259725 45244313 47371617 49697747 52048021 54614506 57706256 61094890 64815683
2353 64815683 69031982 73944718 79393849 85330301 92180014 99890087 108498593 118100152
2345 118100152 128863046 140830126 153802895 167426700 181684805 195616592 208935141
2338B08935141J1584931Q750154N481769J551972k669720o755430j0214682j2816256
2330B03847879j4368215j5203446j5077116j4327346j3203599j1851246j0482973
2323A09333938r190163q038785p113648o197796n223385m666794m205178l546027
2315F1152162l261906k815299k313138k059836j986879j843194j754576j254789
2307D3862545j197885j136418j078741j227724r79910p99701o57704n97487o78012
2298C5508963n75803n56857l90564l75868m68621k05917k60665k64500r432R3700
2288C2494436J42904J94574L03556K70176L44233N86939O62913L73096M04376
2279C5777203O08494N61952M24247K02947L44836M09043K76159K85769K68420
$$ plain form
2338 208935141 220520072 229270226 234751995 236303967 233634247 226878817 216664135 203847879
2330 203847879 189479664 174276218 159199102 144871756 131668157 119816911 109333938
2323 109333938 100143775 92104990 84991342 78793546 73570161 68903367 64698189 61152162
2315 61152162 57890256 55074957 52761819 50701983 48715104 46871910 45117334 43862545
2307 43862545 42664660 41528242 40449501 39221777 38241867 37442166 36784462 36186975 35508963
2298 35508963 34933160 34376303 33985739 33609871 33141250 32935333 32674668 32410168 32400736 32494436
2288 32494436 32637340 32831914 33135470 33405646 33749879 34336818 34999731 35372827 35777203
2279 35777203 36385697 36947649 37371896 37574843 37919679 38328722 38604881 38890650 39159070
2270C9159070K94059M80064K50283R8791K40023K34558J78615M17648K57579L34873
2260D1945563M74284L03712O62973L85696M41935L75303K55546J61183J13996
2251D5120191j09348k74121k27463M64k07829k56542o7078o8203J51060N7692
2241D4118823j7473O7795j50678N3503K8220k06805k71231l77713j27417j39800
2231D2977224q9022o5058P1562J39768K18138L47989L57269L55020N85061L41689
2221D5239640M78447O62336N52493N71190N92195P47416Q17752P91817R01007
2212E1354293J191092J197462J183399J597935J677857J831562K195580K321000
2204F4550180K596519L037790L050849L346500L512363L305894L387363L005054
$$ plain form
2270 39159070 39453129 39933193 40183476 40282267 40522290 40756848 40935463 41353111 41610690 41945563
2260 41945563 42419847 42723559 43386532 43772228 44214163 44589466 44845012 45006195 45120191
2251 45120191 45010843 44736722 44509259 44509723 44301894 44045352 43978274 43910071 44061131 44118823
2241 44118823 44101350 44169145 44018467 44071970 44100190 43893385 43622154 43244441 43117024 42977224
2231 42977224 42888202 42823144 42894706 43034474 43252612 43600601 43957870 44312890 44897951 45239640
2221 45239640 45718087 46380423 46932916 47504106 48096301 48843717 49661469 50453286 51354293
2212 51354293 52545385 53742847 54926246 56524181 58202038 60033600 62229180 64550180
2204 64550180 67146699 70184489 73235338 76581838 80094201 83400095 86787458 89792512
2196H9792512K827139K548761K035628J740359J206983J058886Q90995O08766
2188A02710029O05487J049213J008940J378758J609952J743517J797192J932458
2180A13835546J983662J731336J500893J143320Q54345N10849k3088m87273r47103
2171A20102487j316592j486768j957595j990224k025905k078635j960747j553397
2163A05732624j416237j428322r51594r25207j137357j571293j679762j753669
2155I4869183k180738k423102k890322l200290l468463l513622l584137l630185
2147F9978324l561711l587440l457589l011499k804872k535301k303118k120851
2139D6595943j940574j796829j503326j295178r99454r00774p82865o21041m90470
$$ plain form
2196 89792512 92619651 95168412 97204040 98944399 100151382 101210268 102101263 102710029
2188 102710029 103315516 104364729 105373669 106752427 108362379 110105896 111903088 113835546
2180 113835546 115819208 117550544 119051437 120194757 121049102 121559951 121536863 121049590 120102487
2171 120102487 118785895 117299127 115341532 113351308 111325403 109246768 107286021 105732624
2163 105732624 104316387 102888065 101936471 101011264 99873907 98302614 96622852 94869183
2155 94869183 92688445 90265343 87375021 84174731 80706268 77192646 73608509 69978324
2147 69978324 66416613 62829173 59371584 56360085 53555213 51019912 48716794 46595943
2139 46595943 44655369 42858540 41355214 40060036 39060582 38159808 37376943 36755902 36265432
2130C6265432m04937r0201J70521K41446j51146n98564r08095j153953j064517
2121C2305986p19625m21435j78276k6292k418J66617J40647L26130J69533L6339
2111C1797206K74006J02684j18314j24493O1618q8350r7448m4493J0799L0323
2101C1803538P1643K70408K49638J81444J11073J86428L56189K69100J28556P323
2091C3635340l72483n24529o00314m49620l88200k75567k53758m7247j45944m2935
2081C0534743j5404O9221J45329N8285J43405K69032M66577K46040J92213N7454
2071C2166895q2166n0384j4122J4749j87982l2652R3546j20162M4187q9044j33012
2060C1609853n4714j20444j93027k57271m9516n3811l37306l90116k20032m18019
$$ plain form
2130 36265432 35860495 35770294 35940815 36182261 36031115 35432551 34524456 33370503 32305986
2121 32305986 31586361 31164926 30986650 30960358 30957940 31124557 31265204 31591334 31760867 31797206
2111 31797206 32071212 32173896 32055582 31931089 31992707 31904357 31806909 31762416 31773215 31803538
2101 31803538 31875181 32145589 32395227 32576671 32687744 32874172 33230361 33499461 33628017 33635340
2091 33635340 33262857 32738328 32138014 31688394 31300194 31024627 30770869 30723622 30577678 30534743
2081 30534743 30519339 30588560 30733889 30792174 30935579 31204611 31671188 31917228 32109441 32166895
2071 32166895 32084729 32034345 32020223 32034972 31846990 31814338 31907884 31787722 31831909 31742865 31609853
2060 31609853 31555139 31434695 31241668 30984397 30934881 30881070 30543764 30153648 29933616 29515597
2050B9515597l62357m22747m06517k85849m19244l37376k53455l17585j71251
2041B6539216n6475k3165J08584O1023J21036K88205L52464N38487N94849P20015
2031B9244239N34626O53871P82552R52313Q08313Q13124J015147J067471J163711
2022C7035367J405984J611005J843527K173588K566173L009532L254717L623045
2014E6522938M193661M674939M898229N273971N472149N421107N231761N134874
2006I6823629M525391M048211L293995J935089P72713p35325k280789l729314
1998A04653600m719121n358243n982819o192774o193235o130874n745141n378898
1990E8952495n072130m240488l843099l319267k916281k559241k252573j940200
$$ plain form
2050 29515597 29153240 28730493 28323976 28038127 27618883 27281507 27028052 26710467 26539216
2041 26539216 26482741 26459576 26568160 26629183 26750219 27038424 27390888 27929375 28524224 29244239
2031 29244239 29778865 30432736 31215288 32167601 32975914 33789038 34804185 35871656 37035367
2022 37035367 38441351 40052356 41895883 44069471 46635644 49645176 52899893 56522938
2014 56522938 60716599 65391538 70289767 75563738 81035887 86456994 91688755 96823629
2006 96823629 101349020 105397231 108691226 110626315 111399028 110663703 108382914 104653600
1998 104653600 99934479 94576236 88593417 82400643 76207408 70076534 64331393 58952495
1990 58952495 53880365 49639877 45796778 42477511 39561230 37001989 34749416 32809216
1982C2809216j688657j549385j467866j336908j090627r75048j005013q57527
1974B2838185q10445q09131p61762o92065o27583p51740n86987n28018n32967
1965A6737487o62038m85208k80612l61729l87752l21051k77655l59064k65001
1956A3337377k36443j95738j49568q6771l62870l4430m7274q0047j71218o2968
1946A1910050j02946L8956M0067j42724n3648q684j62880j26223l70069k36437
1936A0785462l1281p1035k94404k55453q6376k01286j76980k00625o1733m2495
1926I363794m2179j08470k13261j56668j33070o6742Q4890r1161O478n4945q2176
1915H506490n7772m2014k4629m6184l0535N6550L3078M5734p3365L7114O1227
$$ plain form
1982 32809216 31120559 29571174 28103308 26766400 25675773 24700725 23695712 22838185
1974 22838185 22027740 21218609 20456847 19764782 19137199 18385459 17798472 17270454 16737487
1965 16737487 16075449 15590241 15309629 14947900 14560148 14239097 13961442 13602378 13337377
1956 13337377 13100934 12905196 12755628 12668857 12305987 12271557 12224283 12144236 11973018 11910050
1946 11910050 11807104 11846060 11886127 11743403 11689755 11681071 11518191 11391968 11021899 10785462
1936 10785462 10754181 10683146 10388742 10133289 10046913 9845627 9668647 9468022 9406289 9363794
1926 9363794 9321615 9213145 8999884 8843216 8710146 8643404 8728294 8637133 8643611 8588666 8506490
1915 8506490 8448718 8406704 8382075 8335891 8305356 8361906 8394984 8440718 8367353 8404467 8465694
1904H465694L4202q4808o0410M5725k5202K7827J64467j3803Q095P5408j82138
1893H455057k82n511R3655J04252R8196j4512J43609J90827m0570J20783J29221
1882I274725k8948m5804J00914O7765K71640J58846J80891P2773P5915Q3882J61934
1871A0374533j217R2709K9942M4828P7889J12719J12013J24466J05730P0801M7347
1860A1191760J97192O3326J81268Q0617J88477J42785J13999L80423K73595J34694
1850A2948136l801N0401L58025J84606K30182J35683L47816J79864J76290L48066
1840A4955268L4273K33195K41274K40443J98358L31174M65022M90037M25674L96477
1830A8011195M40961L98995K86899L27691K93982M60732L53808L35311L70845
$$ plain form
1904 8465694 8499896 8415088 8354678 8400403 8375201 8403028 8567495 8553692 8561787 8637195 8455057
1893 8455057 8454775 8449264 8542919 8647171 8745367 8730855 8874464 9065291 9024721 9145504 9274725
1882 9274725 9245777 9199973 9300887 9368652 9640292 9799138 9980029 10052802 10128717 10212599 10374533
1871 10374533 10373316 10466025 10495967 10540795 10618684 10731403 10843416 10967882 11073612 11144413 11191760
1860 11191760 11388952 11452278 11633546 11714163 11902640 12045425 12159424 12539847 12813442 12948136
1850 12948136 12944335 12994736 13352761 13537367 13767549 13903232 14251048 14430912 14607202 14955268
1840 14955268 14989541 15222736 15464010 15704453 15902811 16233985 16699007 17189044 17614718 18011195
1830 18011195 18452156 18851151 19138050 19465741 19759723 20220455 20574263 20909574 21280419
1821B1280419M53068N52886L55952M53502O55293N84270N57873M24839O59100
1812B5977202N48099N36535O96232N84915O51560Q71263P09692P84804P74091
1803C2134393R27417R35307R34809J075937J125536J140608J171963J335496J633428
1794D2414894J801450K044991K300704K489103K701084K671912K872324L025744
1786F2322206K835242L048034K964508L001293L073589K729088K873361K983775
1778H5831096L531787M429447N312712O335481O700857P030721O552836M516866
1770A30241803J249371k838533n929914p167655p161859n963056n016314l748782
1762I3665061k685991k028462j341367q74708l51480J74363M80246O92749J387232
$$ plain form
1821 21280419 21733487 22286373 22642325 23095827 23751120 24335390 24893263 25318102 25977202
1812 25977202 26525301 27061836 27758068 28342983 28994543 29865806 30575498 31360302 32134393
1803 32134393 33061810 33997117 34931926 36007863 37133399 38274007 39445970 40781466 42414894
1794 42414894 44216344 46261335 48562039 51051142 53752226 56424138 59296462 62322206
1786 62322206 65157448 68205482 71169990 74171283 77244872 79973960 82847321 85831096
1778 85831096 89362883 93792330 99105042 105440523 112141380 119172101 125724937 130241803
1770 130241803 131491174 128652641 122722727 115555072 108393213 102430157 97413843 93665061
1762 93665061 90979070 88950608 87609241 86734533 86383053 86557416 87037662 87730411 89117643
1753H9117643J758911K192035K850239L608640M425000M913636N576193O028336
1745A20470633O926375Q028886R049344J0264425J1755104J3709767J6601965
1738A96806499K0228774K4811821L0038752L4417712L7738357L8796580L5856280
1731D18694775K5989716P710339j5981325l6029465m5796504m5102896l9269782
1724B70214858l2177287k5714311k0816191j7194379j4625724j2962448j1744970
1717A34979548j0528446r708491q639775p914645p189350o362043n753236n028799
1709G3854763m353763l948742l426402l060024k888666k573453k281545j913302
1701D9408866j641028j740784j393483j389833j603801j317565j349612j325260
$$ plain form
1753 89117643 90876554 93068589 95918828 99527468 103952468 108866104 114442297 120470633
1745 120470633 127397008 135425894 144475238 154739663 166494767 180204534 196806499
1738 196806499 217035273 241847094 271885846 306303558 344041915 382838495 418694775
1731 418694775 444684491 452394830 436413505 400384040 354587536 309484640 270214858
1724 270214858 238037571 212323260 191507069 174312690 159686966 146724518 134979548
1717 134979548 124451102 114742611 106102836 98188191 90998841 84636798 78883562 73854763
1709 73854763 69501000 65552258 62125856 59065832 56177166 53603713 51322168 49408866
1701 49408866 47767838 46027054 44633571 43243738 41639937 40322372 38972760 37647500
1693C7647500j372570j221405j081161j144155j361098j170324j028770j142177
1685B8125840j035831q28400p61368p65503p18689p63269o31495o33927m61738
1676B1525620l32361n23067l47856k27304m82692l53615l17697n48523k86337
1667A8106168k06090l56265l70753l84480m00025l68592n66405n13747l84725
1658A4555086l09211k54216k11937k57880k97719r8482p8890k31022k23942j38848
1648A2452939k85034l32672K5289k51934k55647n0183j65753k47605k7851k10022
1638A0651527l32763m11005k84012k81634k44240k08350n1276l18037r4809o1392
1628H364009j34268j08971r963r0854l90536j14414j5837k34887k52385O7959
$$ plain form
1693 37647500 36274930 35053525 33972364 32828209 31467111 30296787 29268017 28125840
1685 28125840 27090009 26261609 25500241 24734738 24016049 23252780 22621285 21987358 21525620
1676 21525620 21193259 20670192 20322336 20095032 19612340 19258725 18941028 18392505 18106168
1667 18106168 17900078 17543813 17173060 16788580 16388555 16019963 15453558 14939811 14555086
1658 14555086 14245875 13991659 13779722 13521842 13224123 13125641 13046751 12815729 12591787 12452939
1648 12452939 12167905 11835233 11860522 11608588 11352941 11302758 11137005 10889400 10861549 10651527
1638 10651527 10318764 9907759 9623747 9342113 9097873 8889523 8838247 8520210 8425401 8364009
1628 8364009 8229741 8120770 8110807 8019953 7629417 7515003 7499166 7264279 7011894 7079853
1618G079853n7098j25154r276k80089l18914m4578k3677o1089j78208l6379j42685
1607E802706J12920l8127n0638k93137l4097N6847n8210o7550p806K6732j18389
1596E331251j32612k46510O2301J45760k23100j51764n3196J06696n5003j09252
1586D674571l12019l1588J2221j52933N5926K3062J78989j04977j03331j98757
1576D041164r4152j5835R4302N9693j71677N2448j34942k9215k8744O4201p1550
1565C765693n4951j00564q5938J09788l6174o2481r8125l9207R6507j00785j4431
1554C379332J36311p138j74798o7624m7520J0609q666p5958J92847M0593l06468
1543C071520p295J9499j8127L6147O3631p818j13560p8780j57060L0997K8014
$$ plain form
1618 7079853 7022755 6897601 6888325 6608236 6289322 6244744 6221067 6159978 5981770 5945391 5802706
1607 5802706 5915626 5877499 5826861 5533724 5499627 5556474 5498264 5430714 5422908 5449640 5331251
1596 5331251 5198639 4952129 5014430 5160190 4937090 4785326 4732130 4838826 4783823 4674571
1586 4674571 4362552 4330964 4343185 4190252 4246178 4269240 4448229 4343252 4239921 4041164
1576 4041164 3947012 3931177 4025479 4085172 3913495 3965943 3831001 3801786 3773042 3837243 3765693
1565 3765693 3710742 3610178 3524240 3634028 3597854 3535373 3437248 3398041 3494548 3393763 3379332
1554 3379332 3515643 3508505 3333707 3266083 3218563 3229172 3220506 3144548 3337395 3377988 3071520
1543 3071520 3064225 3083724 3065597 3101744 3165375 3157557 3043997 2965217 2808157 2839154 2867168
1532B867168M3131l1781L418q1719n5012j0254k2106q0334j20056J19149O8168
1521B699772l2773P8760j47422r0273j85863K6707L7603L3014r885k18529n5676
1510B135435P9901Q1793k8255O8504P390k0868j37322K3854R6571P8551J07048
1499B492602p9148q1168r8072J19998j5031N4402P1443j3962j19773m9728K01396
1488B482959J4149r4600R0893K7933j68842k4195k5220L2189K6229o2177R0177
1477B389495J46994J4594p2736K3898O3490p5644l5989J75235r1630Q0475k444
1466B615738j42734p6359j5517n1361k12373j3409J98798j22074l5044J38073
1456B283738N0897k00599q4218R6153n7561l0525R7905N3409k1599P2201J8778
$$ plain form
1532 2867168 2910299 2878518 2881936 2800217 2745205 2734951 2712845 2632511 2512455 2631604 2699772
1521 2699772 2666999 2745759 2598337 2508064 2322201 2348908 2386511 2419525 2409640 2191111 2135435
1510 2135435 2215336 2297129 2268874 2337378 2344768 2323900 2186578 2210432 2307003 2385554 2492602
1499 2492602 2413454 2332286 2234214 2354212 2339181 2393583 2465026 2451064 2331291 2281563 2482959
1488 2482959 2497108 2402508 2493401 2521334 2352492 2328297 2303077 2335266 2361495 2299318 2389495
1477 2389495 2536489 2551083 2478347 2502245 2565735 2490091 2454102 2629337 2537707 2618182 2615738
1466 2615738 2473004 2396645 2381128 2329767 2117394 2103985 2302783 2180709 2145665 2283738
1456 2283738 2334635 2134036 2049818 2145971 2088410 2057885 2155790 2209199 2187600 2259801 2278579
1445B278579K2913m3485l3778Q7636l3983j9971L7860J3277J28164J35286J91297
1434B763795L8844J94354J51170J77702K1689P5649J03671m6809r6748n7589k89323
1423C036405j86276j99751l02066p2673j07172q2656j06010j8918m036p5486q3194
1412A798167j55387j14324J13218n1442l0678j02361m4767J794r0421L1903j29266
1401A226436n717P1955M697o4328R983p5593Q8364K1345O8890j11816o6859K7107
1389A194464J715J2172Q5984j23307q8772J60050J4480j17344N0661L0028j15098
1378A105033L9331p0698K958O6815J17028j72340k95450N2313Q4297N5508o9584
1367I15211Q7203L2587m2830K28393o9452P8986j24223j3785l1989o6698M5255
$$ plain form
1445 2278579 2301492 2258007 2224229 2311865 2277882 2257911 2295771 2309048 2437212 2572498 2763795
1434 2763795 2802639 2996993 3148163 3325865 3347554 3423203 3526874 3480065 3383317 3325728 3036405
1423 3036405 2850129 2650378 2348312 2275639 2168467 2085811 1979801 1960883 1956847 1881361 1798167
1412 1798167 1642780 1528456 1641674 1590232 1559554 1457193 1412426 1414220 1323799 1355702 1226436
1401 1226436 1220719 1292674 1297371 1233043 1243026 1167433 1255797 1277142 1346032 1234216 1167357 1194464
1389 1194464 1196179 1208351 1294335 1171028 1082256 1242306 1256786 1139442 1190103 1220131 1105033
1378 1105033 1144364 1073666 1076624 1143439 1260467 1088127 792677 844990 929287 984795 915211
1367 915211 1002414 1035001 992171 1220564 1151112 1230098 1105875 1092090 1060101 993403 1038658
1356A038658K8189j85077O2427Q504j3429j00403k09j6382L1883J48075p9818
1345I22418L1096j689j59177N1031O9446r7273L3935l2594J26646n8939q9713
1334G95187m5254J73128j71575M3082R9901j86798Q0951p2925J9375k2445Q896
1323G21523J10278m7574o884K2406L5174q2261k07295j4653O9077j9664J43068
1312G23195O1852l5389J15587N7988P3490J2247p6414j07231j7193L8738J3943
1301H60813J10244k3902m3264j54640M1150J05343j03239J02332J5827Q8893j55883
1290H43674J09180r788j20240k269j2548j4097K7152J15337j44137q0956n4101
1279F57207r554o0122J7787J8745K7150L633J38365p4258o0696l9980P4594K76123
$$ plain form
1356 1038658 1066847 881770 944197 952701 939272 838869 838660 822278 854161 1002236 922418
1345 922418 953514 951825 792648 843679 913125 815852 849787 817193 943839 884900 795187
1334 795187 749933 923061 751486 794568 894469 707671 788622 715697 735072 712627 721523
1323 721523 831801 784227 777343 799749 834923 752662 545367 530714 599791 580127 723195
1312 723195 785047 749658 865245 923233 996723 1008970 932556 825325 808132 846870 860813
1301 860813 971057 947155 903891 749251 790401 895744 792505 894837 910664 999557 843674
1290 843674 952854 943066 822826 820557 808009 793912 821064 936401 792264 711308 657207
1279 657207 647653 587531 605318 624063 651213 654846 793211 718953 658257 618277 692871 968994
1267I68994q0065j41998K0342R2907o8621j18088p4257m0796J91958j03795j43615
1256E02966J54298J52740k9152j6233J61362O4787o1773j06064Q9814j1127O6849
1245I68467k3793p5023L2089L6688J09476j83062J6367j54443j08957m1651J1411
1234E87569Q9118k4556m6490R086J93422l5123k26914j2871O9961M9301p1652
1223E80851p0253N4148O7612K0741l1261j9765M8456k3081j38316K7902P0311
1212E87345j1703J01889k4374o0583K9045j8671L0906J0633k5864J59648k8919
1201G49352p9540L6552P9703p5427j92488J97855p8215j8708R3033K8352r1742
1190F48727J1677R5490n456l4293m1567m7352M4723m4693N1136J51328l3211n2623
$$ plain form
1267 968994 888929 746931 767273 860180 791559 673471 599214 558418 750376 646581 502966
1256 502966 657264 810004 780852 764619 925981 990768 928995 822931 912745 901618 968467
1245 968467 944674 869651 901740 938428 1047904 864842 881209 726766 617809 576158 587569
1234 587569 676687 652131 605641 614727 808149 773026 546112 533241 603202 652503 580851
1223 580851 510598 564746 632358 653099 621838 602073 650529 627448 489132 517034 587345
1212 587345 575642 677531 653157 592574 621619 602948 633854 644487 618623 778271 749352
1201 749352 669812 706364 786067 710640 518152 716007 637792 619084 712117 740469 648727
1190 648727 660404 755894 750438 716145 674578 627226 671949 627256 678392 829720 796509 743886
1178G43886o5969l0665R3962j25628M5251j8413Q1835m4038l557J6891j1162L9017
1166G21410j00259K8276N5274o5008r2981l8335K2957p4789J64231J65224o490
1155G79510j6959r0547L3684m277j07654Q0007k3213p6196Q6034l3257J32506
1144G59638j47334n5573l4455Q2821j1025l3769M0430J11465r314J0841k0651
1133F93074j24597l2454J23403L2901n3381L331N3036M9542r4970j20380j5695
1122E13810r664P2729K8975k7321J78393l6358p2524j23142J17458J02501j31825
1111F13032P9706M7778o1688J211Q875L9842J08693J6913j39261O302Q1010o0183
1099G42230J2572l4032M0188P4950k9508p0072K19819j18414j61301O556K3214
$$ plain form
1178 743886 677917 647252 741214 615586 660837 642424 724259 680221 676664 693555 682393 721410
1166 721410 621151 649427 704701 639693 546712 508377 531334 456545 620776 786000 779510
1155 779510 762551 672004 705688 701411 593757 673764 650551 574355 660389 627132 759638
1144 759638 612304 556731 522276 605097 594072 560303 600733 712198 702884 713725 693074
1133 693074 568477 536023 659426 692327 638946 642277 695313 744855 649885 529505 513810
1122 513810 504146 576875 605850 578529 756922 720564 648040 524898 642356 744857 613032
1111 613032 692738 740516 678828 680039 688914 728756 837449 854362 715101 721403 802413 742230
1099 742230 754802 720770 760958 835908 806400 736328 956147 837733 676432 682988 706202
1088G06202K31909P1488L9035J1586J3678q7520j1253L3242J12099p1136j49764
1077H99566J7224P1577l5449q1332l2065O3173J48094N3875O196j07734M8276
1066A051401K4753J31690J0710J8912O2606J49581p697j40221Q2251N4017N2726
1055A490729n1125m2263J17408J46611N7027R096K955O7861J85366m9285k52908
1044A681472J9025l8338K4763N629q0980j57790K8192J52410l1908j11370O5560
1033A556665N1881O6954m6932j1942J16387m1037m8047J08214r47r2240P4106
1022A733062O4670M3848n8777J04985J4997k108R6455k0867J36056P011N5597
1011B174929m6107m4554J70153J1131J1806K17364N7649J15625Q8989P0330r0417
$$ plain form
1088 706202 938111 1009599 1048634 1060220 1073898 986378 975125 1008367 1120466 1049330 899566
1077 899566 916790 988367 952918 871586 839521 902694 1050788 1104663 1110859 1003125 1051401
1066 1051401 1076154 1207844 1218554 1237466 1300072 1449653 1441956 1301735 1383986 1438003 1490729
1055 1490729 1439604 1397341 1514749 1661360 1718387 1727483 1730438 1798299 1983665 1934380 1681472
1044 1681472 1700497 1662159 1686922 1692551 1611571 1453781 1481973 1634383 1602475 1491105 1556665
1033 1556665 1608546 1675500 1628568 1616626 1733013 1691976 1643929 1752143 1751196 1658956 1733062
1022 1733062 1797732 1841580 1782803 1887788 1902785 1900677 1997132 1976265 2112321 2119332 2174929
1011 2174929 2128822 2084268 2254421 2265552 2277358 2494722 2552371 2667996 2756985 2827315 2736898
1000B736898J30700J67024J06425L3210J11399L61167K09692K03863J34710K47782
990D442870J65373L02949L06089J73837K54860M14179L85186K84590K82440N54982
980G567355O31702Q28432O31816N86897M63044L49026O56915Q38377R27403J201499
970A4682466J363621K139102K734691L711796M755446N237039N750455O721181
962D7095797O646318M647848k788361r903015r469134p122199m786672l437981
954B0882601k568454k012108j662641j411205j280983j088668p94115m81071m43113
945I140243m30198n49148q35754n79554l93938m77184m20945p481m33235k97441
935D715365k05401n9693l37285j77298k8702k07401q0195j49501j42447l9972
$$ plain form
1000 2736898 2867598 3034622 3141047 3174257 3285656 3646823 3856515 4060378 4195088 4442870
990 4442870 4608243 4911192 5217281 5391118 5645978 6060157 6445343 6729933 7012373 7567355
980 7567355 8199057 9027489 9659305 10246202 10709246 11058272 11715187 12553564 13480967 14682466
970 14682466 16046087 18185189 20919880 24631676 29387122 34624161 40374616 47095797
962 47095797 53742115 58389963 55601602 45698587 36229453 29107254 24320582 20882601
954 20882601 18314147 16302039 14639398 13228193 11947210 10858542 10064427 9583356 9140243
945 9140243 8710045 8160897 7325143 6745589 6351651 5874467 5453522 5446041 5012806 4715365
935 4715365 4509964 4450271 4112986 3935688 3906986 3699585 3619390 3469889 3327442 3287470
925C287470l8108k24776L859m7275q4226j23775q7944m8024l9908j84397j27280
914B285616k16252o6044n1165m8144j18020J67085p6051j63000K4165N1551o141
903A783600j04442J08943k2528j11588n1076k01237L2501O4542p0712O1129l3925
892A455207j41927q1040Q0493J3843K4592j26656J7212j74628L1185J93550J3758
881A305589m9991j61587O2930l4700O0205m500p9372l2035R5143K9949j21583
870A070048k14314o0168J49899j88488n2506J68087j14272J17521J1180k6677
860H60310j30257r0608J86204j562r0342r2010J09358O1893j34538l1516J5065
849F61997o3613K3285j07078J11486j4303l042j2786k110l8745j78158J03738
$$ plain form
925 3287470 3249362 3024586 3028445 2981170 2896944 2773169 2685225 2637201 2597293 2412896 2285616
914 2285616 2069364 2003320 1952155 1904011 1785991 1953076 1877025 1714025 1738190 1789741 1783600
903 1783600 1679158 1788101 1765573 1653985 1602909 1401672 1434173 1498715 1428003 1489132 1455207
892 1455207 1313280 1232240 1312733 1326576 1351168 1224512 1241724 1067096 1098281 1291831 1305589
881 1305589 1255598 1094011 1156941 1122241 1182446 1177946 1098574 1066539 1161682 1191631 1070048
870 1070048 855734 795566 945465 756977 704471 872558 758286 875807 886987 860310
860 860310 730053 639445 825649 824087 733745 641735 751093 812986 678448 646932 661997
849 661997 598384 621669 514591 626077 611774 608732 595946 593836 555091 376933 480671
838D80671Q8228m5641R4366K254j10643J04946k3513j2212L3136r7784J4291k196
826E25903j46751J4487J58232n0930J1697l6407p809M2807m735l0826p3645M3417
814D45440o9608K2469j9990P4430N7462j64225m3805Q2052K993p7256J43421Q8261
802E41644l5431o930m0985M7219j69351K7932J30554J6402q9973k6188J36330
791E31223k8708j52489k52931N4621J38809m6401k4729J72616K44725j20775M9039
780E65000k7349l112j51778o5210J87150M243j40983q1896K03080p8836p9186
769C31123l5366l7427J32819J04102m7203P21j57969K4661Q1197q7384m1231n182
757B62861k5204J9492l8476K13243J9603k01585q5459p5666R8861K2497k6663
$$ plain form
838 480671 568899 523258 617624 619878 509235 614181 590668 578456 611592 513808 528099 525903
826 525903 379152 393639 551871 500941 512638 476231 468422 511229 506494 475668 402023 445440
814 445440 375832 398301 378311 452741 510203 345978 302173 384225 387218 309962 453383 541644
802 541644 506213 499283 458298 505517 336166 364098 494652 511054 421081 394893 531223
791 531223 502515 350026 97095 151716 290525 244124 219395 392011 636736 515961 565000
780 565000 537651 534539 382761 317551 504701 508944 367961 286065 489145 410309 331123
769 331123 295757 258330 391149 495251 448048 448769 290800 315461 396658 309274 268043 262861
757 262861 237657 257149 218673 431916 451519 249934 164475 88809 187670 210167 183504
746A83504j2528M9243k062n5300m4548J474O4775q7378J01752M4110J2769m6091
734B09720m7514p7932L0431J35471M7645J04507J0023p9913p6590N512k2219J6376
722B55517L327J54644l0070r6532R938n6162r8700P8204m6269j9767L3717J9936
710B07783m0032R586J73629j67675r0511J59483O9503l7353N4159n055k796L4397
698C65118j35148M0974q8130J8548r310L3743L6234j32200n204q2399J46584J61439
686C50249j13926j795m1812P021R8822j37051N3745Q372Q243O0317q0649Q5579
674B97115R7741n9280p2913J16944q3162r5887n2002P5387N9798N0289K7410N8425
662D19865l8679l8643L2637K1697j73375P134O4346j34134M6086J330j7144R2731
$$ plain form
746 183504 170976 220219 218157 162857 118309 119783 184558 97180 198932 243042 255811 209720
734 209720 162206 84274 114705 250176 297821 402328 412351 332438 255848 261360 239141 255517
722 255517 258844 413488 383418 286886 296824 240662 141962 220166 173897 154130 187847 207783
710 207783 167751 177337 350966 183291 92780 252263 321766 284413 338572 333517 330721 365118
698 365118 229970 270944 182814 201362 192052 225795 262029 129829 124625 42226 188810 350249
686 350249 236323 234528 192716 199737 298559 161508 215253 223625 231868 292185 211536 297115
674 297115 394856 335576 262663 379607 296445 200558 148556 223943 283741 334030 361440 419865
662 419865 381186 342543 375180 396877 223502 230636 294982 160848 206934 208264 191120 283851
650B83851J412O896m3976n3333j00782P994o308m0540M7355J2338J74879p8520
638B11266J1216m4194m8127j6676J9774m4585j3405j8104K3334p6582j6726N2747
626C9938r3284l0316J77779N3758L429O9203J0323j31991m6083J84817P2332p575
614C02330P3017j24354K7216m2817R000j43854n4303p2126J7178k125J11251K90
602A00703o0568R6635O6613j06028p7034N1786N6241N312K4150p9934j02463P5715
590E1128M0592L3063o4359J5264l6835k674k5262M5003N0827m3084l4169L9102
578F8596N9850K05588k9589j05825n1029K1613n0428j04818J07992K8252j6127
567A34075K1219j59155q3360j17236o3284J29089O9949L0242K06679n1555j26223
$$ plain form
650 283851 285263 292159 248183 194850 94068 102062 95754 55214 102569 114907 289786 211266
638 211266 222482 178288 130161 113485 133259 88674 75269 57165 80499 3917 -12809 39938
626 39938 -53346 -83662 94117 147875 151304 220507 230830 98839 52756 237573 309905 302330
614 302330 375347 250993 278209 235392 244392 100538 46235 -25891 -8713 -10838 100413 100703
602 100703 40135 136770 203383 97355 20321 72107 128348 133660 157810 77876 -24587 51128
590 51128 91720 124783 60424 75688 38853 36179 10917 55920 106747 63663 29494 68596
578 68596 128446 334034 304445 198620 147591 169204 118776 13958 121950 150202 134075
567 134075 155294 -3861 -87221 -204457 -267741 -138652 -68703 -38461 168218 116663 -9560
556i560M1932N2778r7304J5334l5175J6125J46799K0611j72273Q3523O7067m5829
544H4028K6444K9844p7366J08009j11056n4168l3187P2250k733o4054j09138l9058
532a70185J68844J12810n5570j02182K4736J8440j2235M8133l4557p416N420Q8420
520H4658L6530j16370l5547K85N0021P2574R4249m3606p0770l6347k0878M6420
508F1219n78k9158j73404p976J97471R565j24393l8414J13854Q148n9677L3357
496i986L034j15089O270r5049P2067P2913M3414l361L2259k2334k8990N1824j6397
483i425K9661K7344l237M7168k0319k985j77631J31498k6097o781J20611J4558
471A24365k19029j4531J96873N384j16605k5156n3891k963K1171N0849m8425K7465
$$ plain form
556 -9560 32372 85150 -12154 3180 -31995 -15870 130929 151540 -20733 62790 129857 84028
544 84028 110472 140316 62950 170959 59903 5735 -27452 44798 42065 -21989 -131127 -170185
532 -170185 -1341 111469 55899 -46283 -21547 -3107 -15342 32791 -1766 -9182 -3762 84658
520 84658 121188 4818 -30729 -30444 19577 92151 186400 142794 72024 35677 14799 61219
508 61219 60641 31483 -141921 -149897 47574 57139 -67254 -105668 8186 16334 -43343 -9986
496 -9986 -6952 -122041 -115771 -210820 -138753 -65840 -22426 -25787 6472 -15862 -44852 6972 -9425
483 -9425 20236 47580 44343 91511 71192 68207 -109424 22074 -4023 -10804 109807 124365
471 124365 -94664 -109195 87678 93062 -23543 -48699 -102590 -105553 -84382 -33533 -81958 -54493
459e4493l9051k8045l9259L2957k3775J39083j8535K9594q51J8502r671o9451
447f2995J49590j4266j35075n7881J507L2534o0750l7605J19695n8171J7689Q190
435i7538R0712J83796j39676p2880P466n9985L2055n3422R8173n2247l5724k2887
423a22157O3303M3481p6733J0083J05883m424N035o6314K9016k8687j0790m7014
411i9318R3802K6725j21190k9665P144l8595O9473m138J0355m4411l6095l0150
399a96063J39112R7733L0536r56q6826n5466r2779Q6413P1305r3011K2534p1094
387a48562n591R6552P548m7132n2986L5258J41159J7498n3399N4424j02133j26443
375a83807K3758j10574k9392Q9236O7979j79308J57280R2113l9296o8081J35589
$$ plain form
459 -54493 -93544 -121589 -160848 -127891 -151666 -12583 -31118 -1524 -2375 16127 6456 -62995
447 -62995 86595 72329 -62746 -120627 -119120 -86586 -147336 -184941 -65246 -123417 -105728 -97538
435 -97538 -6826 176970 37294 -35586 -28120 -88105 -56050 -109472 -11299 -63546 -99270 -122157
423 -122157 -58854 -15373 -92106 -82023 23860 19436 24471 -41843 -12827 -41514 -52304 -99318
411 -99318 -5516 21209 -99981 -129646 -122502 -161097 -91624 -95762 -85407 -129818 -165913 -196063
399 -196063 -56951 40782 71318 70362 -16464 -71930 -164709 -78296 -6991 -100002 -77468 -148562
387 -148562 -154153 -57601 -50053 -97185 -150171 -114913 26246 43744 -9655 44769 -57364 -183807
375 -183807 -160049 -270623 -300015 -210779 -142800 -322108 -164828 -72715 -112011 -180092 -44503
364d4503K1611N9942O3988j62190k059p165O6062o9998J5414n925L0587p369J14654
351G3049j85277O9195J67961M6238j34980k59543O7206K19170l9750l5347M99
340a1579J29900j58919j04101M4407j11246N6968Q2623M3902Q5315j74179q0043
329a96952J25782K6867j62987k0496J50277p689p4983j9196J3814M6009p3323
318a92877j06526N6366k2506O1732J11072J05005k704l8880n9586M1437J19746
307G2279j61852q5881J34493m3941R5258j31866N4169j35895L1383J38137n3841
296h7557O0107l2231k9719J15780l1423m2015m5956l2699j098k0185J06290j03108
284a43814m3494L6113M6972n2535R8290r323m7095J1446K0823O5546q5507O3019
$$ plain form
364 -44503 -22892 37050 101038 -61152 -63211 -70376 -4314 -74312 -58898 -64823 -34236 -41605 73049
351 73049 -112228 -43033 124928 171166 36186 -223357 -156151 63019 23269 -12078 -11579
340 -11579 118321 -40598 -144699 -100292 -211538 -154570 -71947 -28045 57270 -116909 -196952
329 -196952 -71170 -44303 -207290 -227786 -77509 -85198 -160181 -179377 -165563 -119554 -192877
318 -192877 -299403 -243037 -265543 -203811 -92739 12266 9562 -29318 -88904 -47467 72279
307 72279 -89573 -175454 -40961 -84902 10356 -121510 -67341 -203236 -171853 -33716 -87557
296 -87557 -27450 -59681 -89400 26380 -5043 -47058 -93014 -125713 -126811 -146996 -40706 -143814
284 -143814 -187308 -151195 -104223 -156758 -58468 -67791 -114886 -103440 -82617 -17071 -102578 -39559
272c9559m8180M0376n7600p0156J12785j49520k8894O470L8750K9500J85518K2618
260D2108L106j88945J8973O0846q4373p4827J15926j25032m5786R5554M1682O2616
248g8152M2251L5729j56942q342J09444n8814l3257O525j16911R4321M7441q9429
236b06136R3923O6480L7025j30779j06212P6389q226N9221j3478r069q794L7374
224a12282J12026Q8042j05865j56237M9702J06584l1796j9131o4165R8247k9322
213f4197r7297O015l1673N1597K6302m7959O6475Q1725L7316r4542n0198J22424
201E988O9555L7392q3922k28565R9917l5061L2836O2935Q782j61359L0910K214
189a58378P4664R5300j15748p5449j16634j880k0608J62443L2710Q1583N0826
$$ plain form
272 -39559 -87739 -47363 -104963 -175119 -62334 -211854 -240748 -234278 -195528 -166028 19490 42108
260 42108 45214 -143731 -124758 -63912 -148285 -223112 -107186 -232218 -278004 -182450 -140768 -78152
248 -78152 -35901 -172 -157114 -165456 -56012 -114826 -148083 -141558 -258469 -164148 -116707 -206136
236 -206136 -112213 -45733 -8708 -139487 -245699 -169310 -177536 -118315 -131793 -140862 -149656 -112282
224 -112282 -256 87786 -18079 -174316 -124614 -18030 -49826 -68957 -133122 -34875 -64197
213 -64197 -161494 -155479 -187152 -135555 -109253 -157212 -90737 -9012 28304 -66238 -116436 5988
201 5988 75543 112935 29013 -199552 -99635 -134696 -101860 -38925 -30143 -191502 -160592 -158378
189 -158378 -83714 11586 -104162 -179611 -296245 -298125 -318733 -156290 -123580 -41997 8829
178H829R565r5746q142L1070l2058K7401K5383p4550j6525K2920P4400q2923Q477
165a01899p0126k9955J01117J31760N0650r0044K3535l8990p5566O1567R5804
154E7853q9861M8585n1230M7461k54437m055O1595J94221M3135j18827o9418n3744
142a88722J0347m30M8928L9204k6285j08189N097M26k0002K4695J29001K1564
130f4366q2718o4030R977r2093l3403J12734R2285n3608J29315j51913r5950O0917
118b32853j9238J01654K3181q1341J4536J1299k6366Q1123J02350m6353j2008
107h4016o0754K5808n7447K8811O5997l2230m2966O4315k0280J1098N4832q2326
95a29158O0836n7835Q6649J15899j20691l8325n2648p2271Q8959k3349P4959Q798
$$ plain form
178 8829 18394 -77352 -85494 -54424 -86482 -59081 -33698 -108248 -124773 -101853 -27453 -110376 -101899
165 -101899 -172025 -201980 -100863 30897 81547 -8497 15038 -23952 -99518 -37951 57853
154 57853 -32008 16577 -34653 12808 -241629 -245684 -184089 10132 53267 -65560 -134978 -188722
142 -188722 -178375 -178805 -129877 -90673 -116958 -225147 -220050 -219624 -239626 -214931 -85930 -64366
130 -64366 -147084 -211114 -201137 -293230 -326633 -213899 -121614 -175222 -45907 -197820 -293770 -232853
118 -232853 -252091 -150437 -127256 -208597 -194061 -182762 -209128 -128005 -25655 -72008 -84016
107 -84016 -144770 -118962 -176409 -147598 -81601 -113831 -156797 -92482 -112762 -101664 -46832 -129158
95 -129158 -68322 -126157 -39508 76391 -44300 -82625 -135273 -207544 -118585 -141934 -66975 -58177
83e8177L2564L5945m5060N6342j31232M1767J18914p7923j06404m1940L9438K9151
71a06615j284n4654K9911K265l2300m4036K2810P4198l0612J00496m406m5494
59h9721m7670K3259K4003r978j1827O4726j0550m3981K2056j11867K5767Q050
47a57733j1537l96r4434L6982L6796j8717O9815r4873l9871k3286J29221O0720
35a07313j6016o0912M164L8466k9388l5664q6819M8984R3807N4977Q1357k6030
23d0387r8042J7196L6548l0125N5908O4956j06675o3106k2411j8765J59506l0344
11g5741j19427P3307N1049j532q554P5902q5670j11244L8193J385L0837
0a31495
$$ plain form
83 -58177 -25613 10332 -34728 21614 -109618 -67851 51063 -26860 -133264 -175204 -135766 -106615
71 -106615 -107899 -162553 -132642 -130377 -162677 -206713 -183903 -109705 -140317 -39821 -44227 -89721
59 -89721 -137391 -114132 -90129 -100107 -111934 -47208 -57758 -101739 -79683 -191550 -165783 -157733
47 -157733 -169270 -169666 -264100 -227118 -190322 -209039 -139224 -234097 -273968 -297254 -168033 -107313
35 -107313 -123329 -184241 -180077 -141611 -170999 -206663 -293482 -244498 -150691 -95714 -14357 -40387
23 -40387 -138429 -121233 -84685 -114810 -58902 6054 -100621 -163727 -186138 -204903 -45397 -75741
11 -75741 -195168 -121861 -70812 -72344 -80898 -4996 -90666 -201910 -163717 -162332 -131495
0 -131495
$$ Imaginary data points
##PAGE= N=2
##DATA TABLE= (X++(I..I)), XYDATA
16383d502785Q4798M2932L8802L9890K712J42036L4196j7965J8168L5454L1889
16372d049873Q5272J39878Q1451O9450N9397J3217m6242J10348M4644K9356p1293
16361c534395J32399Q3198n4260R4120N8944Q8571K0030L6148J15640N735j529
16350b955399N1314J51832J11965n6879j7141J04238k9927n5649Q0391P9002L3309
16339b502944L9035R1628K2234M7991Q7452P2144Q8505J4392N0638L0344o1049
16328b019630J55470l4271O6342O3600j0996P4798Q2871p8810L6568J99177J07744
16317a357137k4792o3469j2052j3616J17366M2176Q3921k055K8969R5243P9358
16306a026088M9133N648n9445j3174P7957J70097M5036n6305P8935j5966J16890
$$ plain form
16383 -4502785 -4417987 -4375055 -4336253 -4296363 -4293651 -4151615 -4117419 -4135384 -4117216 -4081762 -4049873
16372 -4049873 -3964601 -3824723 -3743272 -3673822 -3614425 -3601208 -3647450 -3537102 -3492458 -3463102 -3534395
16361 -3534395 -3401996 -3318798 -3373058 -3278938 -3219994 -3131423 -3111393 -3075245 -2959605 -2953870 -2955399
16350 -2955399 -2904085 -2752253 -2640288 -2697167 -2714308 -2610070 -2639997 -2695646 -2615255 -2536253 -2502944
16339 -2502944 -2463909 -2372281 -2350047 -2302056 -2214604 -2142460 -2053955 -2039563 -1988925 -1958581 -2019630
16328 -2019630 -1864160 -1898431 -1832089 -1768489 -1779485 -1704687 -1621816 -1700626 -1664058 -1464881 -1357137
16317 -1357137 -1381929 -1445398 -1457450 -1471066 -1353700 -1311524 -1227603 -1229658 -1200689 -1105446 -1026088
16306 -1026088 -976955 -971307 -1030752 -1043926 -965969 -795872 -750836 -807141 -728206 -744172 -627282
16295f27282q3050M5758J44213O5528Q057j2675r4246L8080J3329j2768J86175
16284c28881J6458Q2626J22897k0442L4981Q7738Q3972N9426k6111M6701L6587
16273A95952n3776J6570J73338k6576j34775N2465N9714N6625p6348j6389J20273
16262C67073n303N0043P8431N1189P2514Q4618m7034q3842J61975N4186j9030
16251G64820Q6796N8319q0508J30971J1201M4733Q054p1693n8635O815k4510O84
16239H77047R9762R9515L7742P1693O2520n6277J76809j22800O4575J6105M1824
16228A368515k57051O0270J65514N6726Q6481n40q226J20033j1654l1461r9860
16217A448747m935R7227J32678n2474Q2315J3690p3453L2992O4666N3653l7786
$$ plain form
16295 -627282 -710332 -664574 -520361 -454833 -446776 -459451 -553697 -515617 -502288 -515056 -328881
16284 -328881 -312423 -229797 -106900 -127342 -92361 -4623 79349 138775 112664 159365 195952
16273 195952 142176 158746 332084 305508 170733 223198 282912 339537 263189 246800 367073
16262 367073 361770 411813 490244 541433 613947 698565 651531 567689 729664 783850 764820
16251 764820 851616 909935 829427 960398 971599 1016332 1024386 952693 894058 900873 876363 877047
16239 877047 976809 1076324 1114066 1185759 1248279 1192002 1368811 1246011 1310586 1326691 1368515
16228 1368515 1111464 1171734 1337248 1393974 1480455 1479915 1471689 1591722 1580068 1548607 1448747
16217 1448747 1443812 1541039 1673717 1621243 1703558 1717248 1643795 1676787 1741453 1795106 1757320
16206A757320J8185n1775K2038J16104J1062j24478L010L7183K3502o5242J23663
16195A870572P4681r3411N920J21573K4401P6346R4314R6235j14031k01427P5190
16184B030363J27658K4970n9122j09811J9212K0990Q6802R107k0262j94375N8074
16173A993606Q2683j2822l5898O5124O9053m55R7037P51m5735N6777P4839M1192
16161B386152j0980p3038j28467J15750Q6941J10352L4949j53568r8877r996M6871
16150B306089N4664n4975N4084O7935o975Q9900J01316j75633r358N3329m4304
16139B436072n3281j61200J33491J73947Q6488M4561n8795O5969Q307j05913k6664
16128B542982o5375K784M7877Q4677j28692q209J36329J0972p7350N3220p871
$$ plain form
16206 1757320 1775505 1723730 1745768 1861872 1872934 1748456 1751466 1788649 1812151 1746909 1870572
16195 1870572 1945253 1851842 1857762 1979335 2003736 2080082 2174396 2270631 2156600 1955173 2030363
16184 2030363 2158021 2182991 2123869 2014058 2033270 2054260 2141062 2150169 2129907 1935532 1993606
16173 1993606 2076289 2063467 2027569 2092693 2161746 2161291 2258328 2259079 2213344 2270121 2344960 2386152
16161 2386152 2375172 2302134 2173667 2289417 2376358 2486710 2521659 2368091 2269214 2259218 2306089
16150 2306089 2360753 2305778 2359862 2427797 2420822 2510722 2612038 2436405 2427047 2480376 2436072
16139 2436072 2382791 2221591 2355082 2529029 2615517 2660078 2601283 2667252 2675559 2569646 2542982
16128 2542982 2477607 2480391 2528268 2612945 2484253 2476044 2612373 2623345 2545995 2599215 2591344
16117B591344r7167O1630K4347j24239J94068J1759p1763M1113n960J8064J9245
16106B662441P4037r3798M8917J02735J6476j81401r7085R6374j7516j0967R4632
16095B694845j08323n6335j1518M0977Q507J47285J32108m2649o1812j47430O0744
16084B656399P0097J8038j6415m9201Q4640m0413J6109M9259K3769K1949j31642
16073B702589q7580n4352J93107M6005k2796l5132L1625j62217Q5719M4410J3524
16062B754902j18616L7110P3642p1447J14714q9809q1953Q6606k3016L9826K9780
16051B751739j3091n1222L0495n6501p2396K7520L6315P1602k3523P7423m8972
16040B729389j0578J05858N8974j07023j765k0086M5747J54516l4197o2946M5021
$$ plain form
16117 2591344 2494177 2555807 2580154 2455915 2649983 2661742 2589979 2631092 2625132 2643196 2662441
16106 2662441 2736478 2642680 2691597 2794332 2810808 2629407 2532322 2628696 2611180 2600213 2694845
16095 2694845 2586522 2530187 2518669 2559646 2568153 2715438 2847546 2804897 2743085 2595655 2656399
16084 2656399 2726496 2744534 2728119 2678918 2763558 2723145 2739254 2788513 2812282 2834231 2702589
16073 2702589 2615009 2560657 2753764 2799769 2776973 2741841 2773466 2611249 2696968 2741378 2754902
16062 2754902 2636286 2673396 2747038 2675591 2790305 2700496 2618543 2705149 2682133 2721959 2751739
16051 2751739 2738648 2687426 2717921 2661420 2589024 2616544 2652859 2724461 2700938 2778361 2729389
16040 2729389 2718811 2824669 2883643 2776620 2774855 2754769 2800516 2955032 2920835 2857889 2902910
16029B902910k5086r1928P9520j77826l4372K20535N7658o0006n234j88705r6043
16018B581423O9929l1749J29570N9085m3172m3308j50164J1823J40669J3802L5368
16007B773276j14703R5821j5965N4984n8001m2252J04691J83429R640j07121m9632
15996B834167L9948n6485n7108O7402o0757M6523J54221J8798q3086r8924j41115
15985B663584P6601n5745J19821J13324r5338J78432j11847j26102j40157J90705
15975B813278j04033K1845J28581q4919N432J5337P8597P1278q7597l1951r392
15964B816456j01343K87797P1836k38255q629M5691o8226J55347j7856q0392q5813
15953B776613Q2482m6597M98k05304P6812J71471q5087k8360n1120J27109r6818
$$ plain form
16029 2902910 2877824 2785896 2865416 2687590 2653218 2873753 2931411 2871405 2866171 2677466 2581423
16018 2581423 2651352 2619603 2749173 2808258 2765086 2721778 2571614 2583437 2724106 2737908 2773276
16007 2773276 2658573 2754394 2738429 2793413 2735412 2693160 2797851 2981280 2990920 2883799 2834167
15996 2834167 2874115 2817630 2760522 2827924 2767167 2813690 2967911 2986709 2903623 2804699 2663584
15985 2663584 2740185 2684440 2804261 2917585 2822247 3000679 2888832 2762730 2622573 2813278
15975 2813278 2709245 2731090 2859671 2774752 2780184 2795521 2874118 2945396 2857799 2825848 2816456
15964 2816456 2715113 3002910 3074746 2836491 2827862 2873553 2805327 2960674 2942818 2862426 2776613
15953 2776613 2859095 2812498 2812996 2607692 2684504 2855975 2770888 2742528 2691408 2818517 2721699
15942B721699k0158j166J20566n4981j8432J18721P538j08037q6223k0725J03685
15931B762487J38635N3985J3562n5492j08681p7457M3473j5216j1648K05983R3494
15920C043125j11069J9541n1535M9591j32231l6542j2921j43307n9331J46797
15910B712118k5731p4790j20057J93001O8856n3285M4340R0832l2138q4237J35697
15899B854606L4068r7069o6681p7612J53495J56917j03628j1350M9293l1614n2255
15888B808170N9818P2687M7551p1812j65241j42172K9187K6914N0459l2535N0951
15877B733977N5586J33052r2695q859J18217k0722m4583O2722M0640j44579j00142
15866B732614R3427j14879R2210N2040J34779M4116j56993m0053l9701o967j109
$$ plain form
15942 2721699 2701541 2700375 2820941 2765960 2747528 2866249 2873787 2765750 2679527 2658802 2762487
15931 2762487 2901122 2955107 2968669 2913177 2804496 2727039 2770512 2755296 2743648 2949631 3043125
15920 3043125 2932056 2951597 2900062 2949653 2817422 2780880 2767959 2624652 2565321 2712118
15910 2712118 2686387 2611597 2491540 2684541 2753397 2700112 2744452 2835284 2803146 2718909 2854606
15899 2854606 2888674 2791605 2724924 2647312 2800807 2957724 2854096 2842746 2892039 2860425 2808170
15888 2808170 2867988 2940675 2988226 2916414 2751173 2609001 2638188 2665102 2715561 2683026 2733977
15877 2733977 2789563 2922615 2829920 2821061 2939278 2918556 2873973 2936695 2977335 2832756 2732614
15866 2732614 2826041 2711162 2803372 2855412 2990191 3034307 2877314 2837261 2797560 2790593 2789484
15855B789484L5300k992m4431j00700J31252j7346N6327j51549p7081O0716K39468
15844B918448J6471j71465j4798l4075o5537J05367L912j14113L6763J9344l0265
15833B670052K24522K06j57086O7509j8668L7703O6940n5269k8753O8610L2275
15822B908041N3230j1608j71756k1280L1806P664p6809O3182q5101j1535Q5309
15811B771143L8069Q3755p6993j34273j00009J85925J7510k2710q0782M6285J1432
15800B739352J87399q0915o8261k1246R9243J10297j75961n950J51151J22038
15790C057147l6311j47536J05439m3866L2904j4449j13862J0855n0553l8424Q7268
15779B848612j38301R8104M1748m2975j6320j08173N7083j19354M5342J89158
$$ plain form
15855 2789484 2824784 2821792 2777361 2676661 2807913 2790567 2846894 2695345 2618264 2678980 2918448
15844 2918448 2934919 2763454 2748656 2714581 2649044 2754411 2758323 2644210 2680973 2700317 2670052
15833 2670052 2894574 2894780 2737694 2805203 2786535 2824238 2891178 2835909 2807156 2875766 2908041
15822 2908041 2961271 2949663 2777907 2756627 2788433 2796097 2719288 2782470 2697369 2685834 2771143
15811 2771143 2809212 2892967 2815974 2681701 2581692 2767617 2785127 2762417 2681635 2727920 2739352
15800 2739352 2926751 2845836 2777575 2756329 2855572 2965869 2789908 2783958 2935109 3057147
15790 3057147 3020836 2873300 2978739 2934873 2967777 2953328 2839466 2850321 2799768 2761344 2848612
15779 2848612 2710311 2808415 2850163 2807188 2790868 2682695 2739778 2620424 2665766 2854924
15769B854924R4230j28497j03976Q2080J65157K8437k14260j24172O355R2242
15759B752520K19483k1227n2208r9898L4102q34J06253l1528l1166m2286k3208
15748B810003P0918J35792J7301k54695J51737j15898p7389J24286p261O7515
15738B922309K7766j46449p4517J00014l5781R6872j37547p7456O3420n0616J48923
15727B836938K3534O4573j9719q1584m0573L1443J80588l8335n1419N4674N8055
15716C018175n757m3380j12755J19476K02879j22175j04443m77k05213L2830L9670
15705B818830L0485k8325J27781L5777j37371j4895k561Q066N3639l4322l136
15694B853968Q9535l799M8647R2763j19706K9051j1489j32808K1898r7095K14260
$$ plain form
15769 2854924 2949154 2820657 2716681 2798761 2963918 2992355 2778095 2653923 2660278 2752520
15759 2752520 2972003 2950776 2898568 2798670 2832772 2831938 2938191 2906663 2875497 2833211 2810003
15748 2810003 2880921 3016713 3034014 2779319 2931056 2815158 2737769 2862055 2854794 2922309
15738 2922309 2950075 2803626 2729109 2829123 2793342 2890214 2752667 2675211 2738631 2688015 2836938
15727 2836938 2860472 2925045 2905326 2823742 2783169 2814612 2995200 2956865 2905446 2960120 3018175
15716 3018175 3012418 2969038 2856283 2975759 3178638 3056463 2952020 2951543 2746330 2779160 2818830
15705 2818830 2849315 2820990 2948771 2984548 2847177 2832282 2829721 2837787 2891426 2857104 2853968
15694 2853968 2943503 2939704 2988351 3081114 2961408 2990459 2978970 2846162 2868060 2770965 2985225
15683B985225J524q8035q7417K9742P6080L5936J22796r3112q1811j19315n0523
15672B731090j8078M0128N1202j5195K8549l3254J07134o2569q0610j3966l0720
15661B703711L5340k2797J06504m0778k4655O6587k3492J45383K8128j57627n3715
15650B762589K3420Q3676J17975n7279l4936J3049n9560j6064j80048k0208L1368
15639B663982M4267J45920K04576j667j02394j05249p2837J40910j5838K766J08722
15628C013158q313l8355n8031J07280O9391j02975j12929r7940R2851Q0431j79292
15617B765276L5736P7765J7488P6851J2701J25532m6760L4317p5904j18630n720
15606B898652j8133p9841j15077J03583K21968P5753m2233o6563j89624K4314
$$ plain form
15683 2985225 2986749 2898714 2811297 2841039 2917119 2953055 3075851 2982739 2900928 2781613 2731090
15672 2731090 2713012 2753140 2804342 2789147 2817696 2784442 2891576 2829007 2748397 2734431 2703711
15661 2703711 2739051 2716254 2822758 2781980 2757325 2823912 2800420 2945803 2973931 2816304 2762589
15650 2762589 2786009 2869685 2987660 2930381 2895445 2908494 2848934 2832870 2652822 2632614 2663982
15639 2663982 2708249 2854169 3058745 3057078 2954684 2849435 2776598 2917508 2901670 2904436 3013158
15628 3013158 3004845 2966490 2908459 3015739 3085130 2982155 2869226 2771286 2864137 2944568 2765276
15617 2765276 2801012 2878777 2896265 2973116 2985817 3111349 3064589 3098906 3023002 2904372 2898652
15606 2898652 2880519 2800678 2685601 2789184 3011152 3086905 3044672 2978109 2788485 2812799
15596B812799N4562n2554L7301J50250L8307l8175K3272j95688k6904J22196O6105
15585B991471j09990p8706j70391J2057O4046l5804K28013M695K3330J96350j57986
15574B967085K1162m3144L123O8749l7741j27480N7831j01702j5953P4669m5382
15563B821217l268O7683n1926k2474J66767r403k08315K6243J21750m4744J14244
15552B977774j16536j08686K25685l9993l8764O151j17655l3871P3328N4075j65062
15541B716446M2712l768J3493N2137J07269o8801J34986j1485r2411O1612l3381
15530B918809n1063K09738o3381n4883J2429o1883L569n3271K998k7000o2952
15519B773110R1183J46582j18731K0988P5906l3461j1348p1828N2290m9443M1267
$$ plain form
15596 2812799 2867361 2814807 2852108 3002358 3040665 3002490 3025762 2830074 2803170 2925366 2991471
15585 2991471 2881481 2802775 2632384 2644441 2708487 2672683 2900696 2905391 2928721 3125071 2967085
15574 2967085 2988247 2945103 2948226 3016975 2979234 2851754 2909585 2807883 2791930 2866599 2821217
15563 2821217 2817949 2885632 2833706 2811232 2977999 2968596 2760281 2786524 2908274 2863530 2977774
15552 2977774 2861238 2752552 2978237 2938244 2899480 2905631 2787976 2754105 2827433 2881508 2716446
15541 2716446 2759158 2755390 2768883 2821020 2928289 2859488 2994474 2982989 2890578 2952190 2918809
15530 2918809 2867746 3077484 3014103 2959220 2971649 2909766 2913335 2860064 2863062 2836062 2773110
15519 2773110 2864293 3010875 2892144 2913132 2989038 2955577 2944229 2872401 2924691 2875248 2916515
15508B916515K0878N9720n038j05496Q7408l6479J15511l9370j00929k1979l594
15497B887147J44879L7880j21049k24297k1284J10642q2598k2082J27343P7946
15487B914527K7936r8878r1383n6072M1875J7212N3540J13763J2466L230J7570
15476B955786J05225l2649j988r6943p0081l546L196j01463J04546K9181n601
15465B885663J00630k1191K4386n6149J1649M6914M5383m3806J2737n8938p8672
15454B868606o6238J82154o0099l9933k1729n399J56751q0413Q0763j5081o022
15443B993360k2792J36632n68j43468R1762j04806Q431J76412j5230K679j17621
15432C004791j47789K235L0047K2319m0381M0449l4367p0396J37622r7089r7389
$$ plain form
15508 2916515 2937393 2997113 2992075 2886579 2973987 2937508 3053019 3013649 2912720 2890741 2887147
15497 2887147 3032026 3069906 2948857 2724560 2703276 2813918 2731320 2709238 2836581 2914527
15487 2914527 2942463 2843585 2752202 2696130 2738005 2755217 2808757 2922520 2934986 2938216 2955786
15476 2955786 3061011 3028362 3026374 2929431 2859350 2855804 2859000 2757537 2862083 2891264 2885663
15465 2885663 2986293 2965102 2989488 2933339 2944988 2991902 3037285 2993479 3006216 2947278 2868606
15454 2868606 2802368 2984522 2924423 2884490 2862761 2857362 3014113 2933700 3014463 2999382 2993360
15443 2993360 2970568 3107200 3106632 2963164 3054926 2950120 2958551 3134963 3119733 3122412 3004791
15432 3004791 2857002 2859237 2889284 2911603 2871222 2911671 2877304 2806908 2944530 2847441 2750052
15421B750052J83804M8894Q3277m9057j9158n6138Q569J7379M6008J4953j42004
15410B886579n559L7827j7476j0870R136m5161O994R4858j07860K2746L2763K1155
15398B925132q8049o3289Q0362n7701J85973l2686r1529J04244P5088K0850m971
15387C053424q1377M224j46873Q3122l0471J9020n5181p706q393L9269j7802p5586
15375B775670Q1278P9718M6457J5863J27013N2373M771j45228j9042K9390j23535
15364B924728m2000J34053r3267O1565J63749o7075j00489M2590Q931j39940k475
15353B890370O804j2991P7753J7854P3833k95k84762K1507J53433P0149l1996
15342B981659l2942J61972l2456n5244J29417q0309m7279o7293L6718J0185k5179
$$ plain form
15421 2750052 2933856 2982750 3066027 3016970 2997812 2941674 2950243 2967622 3013630 3028583 2886579
15410 2886579 2881020 2918847 2901371 2890501 2899637 2854476 2861470 2956328 2848468 2871214 2903977 2925132
15398 2925132 2837083 2773794 2854156 2796455 2982428 2949742 2858213 2962457 3037545 3058395 3053424
15387 3053424 2972047 2976271 2829398 2912520 2882049 2901069 2845888 2838182 2829789 2869058 2851256 2775670
15375 2775670 2856948 2936666 2983123 2998986 3125999 3178372 3183143 3037915 3018873 3048263 2924728
15364 2924728 2882728 3016781 2923514 2985079 3148828 3081753 2981264 3023854 3032785 2892845 2890370
15353 2890370 2897174 2884183 2961936 2979790 3053623 3053328 2768566 2790073 2943506 3013655 2981659
15342 2981659 2948717 3110689 3078233 3022989 3152406 3072097 3024818 2957525 2994243 3004428 2979249
15331B979249p3028O7893o723M1207N2904r557M1886o4762j2972l0950J49948
15320C135095J7506p9056o5927j35112r3219J0801J7865J15789Q4589L0411j31630
15309B907112M9282O3766K4797P762o1876k5942j56253n6170J06259J89701n3692
15298B994746j82209J58145J30173O5730j70546Q1470r8791j3938n8156j5324
15288B891300N0636J753q713k5320J45935O2418r064j47322L0752k2144p346J757
15276B964642Q0654j49505Q6474m7584l9553J03282j49088l5325P1159O4118M4779
15265B994053k960R0850L3693J2305J8962j98777K8077M8196l8859n1513m4916
15254B889111m7686O2513j8820M6635n420R4169m2919k4053j4678k9006K086J7866
$$ plain form
15331 2979249 2906221 2974114 2967391 3008598 3061502 3051945 3093831 3029069 3016097 2985147 3135095
15320 3135095 3152601 3073545 3007618 2872506 2779287 2790088 2807953 2923742 3008331 3038742 2907112
15309 2907112 2956394 3020160 3044957 3052719 2990843 2964901 2808648 2752478 2858737 3048438 2994746
15298 2994746 2812537 2970682 3100855 3166585 2996039 3077509 2978718 2964780 2906624 2891300
15288 2891300 2941936 2943689 2934976 2909656 3055591 3118009 3108945 2961623 2992375 2970231 2962885 2964642
15276 2964642 3045296 2895791 2982265 2934681 2895128 2998410 2849322 2813997 2885156 2949274 2994053
15265 2994053 2991093 3081943 3115636 3127941 3146903 2948126 2976203 3024399 2985540 2934027 2889111
15254 2889111 2841425 2903938 2885118 2931753 2926333 3020502 2977583 2953530 2938852 2909846 2911932 2929798
15242B929798M4550O7094M7388R2288q873K2232R3612j52010r1058J44895j85681
15231C004235j15141J62545m4544K7659m2658p0656j58052J90388o30K24829J28679
15220C306654j19087m4610l7052q9278j41092N4388l7054L9463l5025K5065P4881
15209B997253K1473M3475m4136m938l0327N66J3300J9927M4372j0497K2893N117
15197C078478n6151P7269R0432j39871L1316L0948N7607M482K0814l2032o2581
15186C100711l3727j7257m9141O3782L2808j0165R3741l7642J3597m7453k461
15175C106793j74516M967o1433O9216J70182P315n9839l1165k4529n9822j23348
15164B823821R9441J27825n5991O4520j20M7974J26093p1045j39729J8414q8142
$$ plain form
15242 2929798 2974348 3041442 3088830 3181118 3172245 3194477 3288089 3136079 3045021 3189916 3004235
15231 3004235 2889094 3051639 3007095 3034754 2992096 2921440 2763388 2953776 2953146 3177975 3306654
15220 3306654 3187567 3142957 3105905 3016627 2875535 2929923 2892869 2932332 2897307 2922372 2997253
15209 2997253 3018726 3062201 3018065 3013127 2982800 2983366 2996666 3016593 3060965 3050468 3073361 3078478
15197 3078478 3022327 3099596 3190028 3050157 3081473 3112421 3170028 3174510 3195324 3163292 3100711
15186 3100711 3066984 3049727 3000586 3064368 3097176 3087011 3180752 3143110 3156707 3109254 3106793
15175 3106793 2932277 2937244 2875811 2945027 3115209 3122524 3062685 3031520 3006991 2947169 2823821
15164 2823821 2923262 3051087 2995096 3059616 3059496 3107470 3233563 3162518 3022789 3041203 2953061
15153B953061k5547J3971Q7540P8468j8799R8474j13570l6902J14460M9295j73509
15142C026942j07102p5124P1040K7399J34439j2148p177l9682Q8162r5842j30452
15131B880455K12248P6503q0861j82321K3527l5602o7030M0773N8412J14328l8717
15120C001715j8034j84992J24380N9851q2819O1345p5849P0908L0561O665o0634
15109B933097l9998n7501M3282n7773J75082J50526j1371j03443n3749j10875
15099B867277J38244L5433n2562N5148K0186j30087j45677q053J97910Q8053P9803
15088C145675k2155o8830j10441N7945P3446M0034m6008K6714j79245J36790M9768
15077C103693k6747N7407N8743J2182l2741q7726j44520M9083M7258r457M8927
$$ plain form
15153 2953061 2927514 2941485 3029025 3107493 3088694 3187168 3073598 3036696 3151156 3200451 3026942
15142 3026942 2919840 2844716 2915756 2943155 3077594 3065446 3058269 3018587 3106749 3010907 2880455
15131 2880455 3092703 3169206 3088345 2906024 2929551 2893949 2826919 2867692 2926104 3040432 3001715
15120 3001715 2983681 2798689 2923069 2982920 2900101 2961446 2885597 2956505 2987066 2993731 2933097
15109 2933097 2893099 2835598 2878880 2821107 2996189 3146715 3135344 3031901 2978152 2867277
15099 2867277 3005521 3040954 2988392 3043540 3063726 2933639 2787962 2779909 2977819 3065872 3145675
15088 3145675 3123520 3054690 2944249 3002194 3075640 3115674 3069666 3096380 2917135 3053925 3103693
15077 3103693 3076946 3134353 3193096 3205278 3172537 3084811 2940291 2989374 3036632 3027175 3076102
15066C076102L0096l3313p991k07362J8074K6523J38672q47m9723m606J1181Q9808
15054C086614k9272j8415j7786n496L5015J6100n6579j02401j8454P4772J13656
15043C077754j6185P5724j22139J22776j73169q6927K7673L4432j8836P1765P0726
15032C063594O5906j14065O1299J13034p7041p192n282J03064r1123p6623P0737
15021C106308J30136N095j14682M2392P4707j23458j4049N2997L5892j23641r3823
$$ plain form
15066 3076102 3106198 3072885 3064894 2857532 2875606 2902129 3040801 3039954 2990231 2985625 2996806 3086614
15054 3086614 3057342 3038927 3021141 3015645 3050660 3066760 3010181 2907780 2889326 2964098 3077754
15043 3077754 3061569 3137293 3015154 3137930 2964761 2877834 2905507 2939939 2921103 2992868 3063594
15032 3063594 3129500 3015435 3076734 3189768 3112727 3105535 3100253 3203317 3112194 3035571 3106308
15021 3106308 3236444 3241539 3126857 3169249 3243956 3120498 3106449 3159446 3195338 3071697 2977874
$$ [...]
##END NTUPLES=NMR SPECTRUM
##END=
