##TITLE=1H_CG-1144-C1
 CDCl3, 8 sc, 
 6.07.2021
##JCAMPDX= 6.0         $$ Bruker NMR JCAMP-DX V2.0
##DATA TYPE= NMR SPECTRUM
##DATA CLASS= NTUPLES
##ORIGIN= UXNMR, Bruker Analytische Messtechnik GmbH
##OWNER= root
$$ XWIN-NMR		Version 3.5
$$ Tue Jul  6 10:37:05 2021 Russian Standard Time (UT+4h)  she@DPX200
##.OBSERVE FREQUENCY= 200.131506
##.OBSERVE NUCLEUS= ^1H
##.ACQUISITION MODE= SIMULTANEOUS
##.ACQUISITION SCHEME= undefined
##.AVERAGES= 8
##.DIGITISER RES= 18
##SPECTROMETER/DATA SYSTEM= spect
##.PULSE SEQUENCE= zg30
##.SOLVENT NAME= CDCl3
##.SHIFT REFERENCE= (INTERNAL, CDCl3, 0, 17.5032)
##AUDIT TRAIL= $$ (NUMBER, WHEN, WHO, WHERE, WHAT)
$$ ##TITLE= Audit trail, XWIN-NMR		Version 3.5
$$ ##JCAMPDX= 5.01
$$ ##ORIGIN= Bruker BioSpin GmbH
$$ ##OWNER= she
$$ F:/spectra/data/she/nmr/H-F/1/pdata/1/auditp.txt
$$ ##AUDIT TRAIL=  $$ (NUMBER, WHEN, WHO, WHERE, WHAT)
(   1,<2021-07-06 10:35:09.31 +0400>,<she>,<DPX200>,
      <created by zg, POWCHK disabled, PULCHK disabled
       configuration hash MD5:
       00 E9 B6 7A A2 85 ED C7 34 08 36 98 17 FE 4E 26
       data hash MD5: 16K
       65 F7 91 BA CC D6 D7 15 8F FB 64 1D 65 A8 96 38>)
(   2,<2021-07-06 10:35:12.07 +0400>,<she>,<DPX200>,
      <Start of raw data processing
       efp BC_mod = 2 LB = 0.24 FT_mod = 6 PKNL = 1 PHC0 = -11910.12 PHC1 = -2.199011 SI = 16K 
       data hash MD5: 16K
       A1 18 A4 6B 81 54 D4 BC 91 86 26 9C 84 76 3B A6>)
(   3,<2021-07-06 10:35:39.95 +0400>,<she>,<DPX200>,
      <pk PHC0 = -6.708922 PHC1 = 16.8 
       data hash MD5: 16K
       DD 24 EF 25 C9 46 D5 17 58 B0 0D 46 24 F7 A0 98>)
(   4,<2021-07-06 10:35:43.03 +0400>,<she>,<DPX200>,
      <abs ABSG = 5 
       data hash MD5: 16K
       EA 48 DC 87 A0 6A EF 00 01 79 A5 BA 84 68 82 C1>)
(   5,<2021-07-06 10:36:03.98 +0400>,<she>,<DPX200>,
      <pk PHC0 = -1.068169 PHC1 = 2 
       data hash MD5: 16K
       FF 68 06 81 57 75 71 0C 46 60 79 8A 75 A9 E8 5F>)
(   6,<2021-07-06 10:36:07.21 +0400>,<she>,<DPX200>,
      <abs ABSG = 5 
       data hash MD5: 16K
       58 86 7E 6D F9 C8 74 D2 8F 89 DE B2 58 E5 78 BF>)
$$ ##END=
$$ 
$$ hash MD5
$$ D1 28 35 E5 32 3C F5 31 3B 33 7A 1B FD 85 48 F0
##$RELAX= 
##$RELAX= 
##$RELAX= 
##$RELAX= 
##$RELAX= 
##$RELAX= 
$$ Bruker specific parameters
$$ --------------------------
##$DU= <F:/spectra>
##$EXPNO= 1
##$NAME= <H-F>
##$PROCNO= 1
##$TYPE= <nmr>
##$USER= <she>
##$AMP= (0..31)
100 100 100 100 100 100 100 100 100 100 100 100 100 100 100 100 100 100 
100 100 100 100 100 100 100 100 100 100 100 100 100 100 
##$AQSEQ= 0
##$AQ_mod= 1
##$AUNM= <au_zg>
##$AUTOPOS= <>
##$BF1= 200.13
##$BF2= 200.13
##$BF3= 200.13
##$BF4= 200.13
##$BF5= 200.13
##$BF6= 200.13
##$BF7= 200.13
##$BF8= 200.13
##$BYTORDA= 1
##$CFDGTYP= 0
##$CFRGTYP= 5
##$CHEMSTR= <none>
##$CNST= (0..31)
1 1 145 1 1 1 1 1 1 1 1 1 1 1 1 1 1 1 1 1 1 1 1 1 1 1 1 1 1 1 1 1 
##$CPDPRG= <>
##$CPDPRG1= <>
##$CPDPRG2= <>
##$CPDPRG3= <>
##$CPDPRG4= <mlev>
##$CPDPRG5= <mlev>
##$CPDPRG6= <mlev>
##$CPDPRG7= <mlev>
##$CPDPRG8= <mlev>
$$ [...]
##$SUBNAM3= <"">
##$SUBNAM4= <"">
##$SUBNAM5= <"">
##$SUBNAM6= <"">
##$SUBNAM7= <"">
##$SUBNAM8= <"">
##$SUBNAM9= <"">
##$SW= 20.0188882624521
##$SWIBOX= (0..15)
0 0 2 0 0 0 0 0 0 0 0 0 0 0 0 0 
##$SW_h= 4006.41025641026
##$TD= 16384
##$TD0= 1
##$TE= 0
##$TE2= 300
##$TE3= 300
##$TEG= 300
##$TL= (0..7)
0 120 120 120 120 120 120 120 
##$TP= (0..7)
150 150 150 150 150 150 150 150 
##$TP07= 0
##$TPNAME0= <>
##$TPNAME1= <>
##$TPNAME2= <>
##$TPNAME3= <>
##$TPNAME4= <>
##$TPNAME5= <>
##$TPNAME6= <>
##$TPNAME7= <>
##$TPOAL= (0..7)
0.5 0.5 0.5 0.5 0.5 0.5 0.5 0.5 
##$TPOFFS= (0..7)
0 0 0 0 0 0 0 0 
##$TUNHIN= 0
##$TUNHOUT= 0
##$TUNXOUT= 0
##$USERA1= <user>
##$USERA2= <user>
##$USERA3= <user>
##$USERA4= <user>
##$USERA5= <user>
##$V9= 5
##$VALIST= <valist>
##$VCLIST= <CCCCCCCCCCCCCCC>
##$VD= 0
##$VDLIST= <DDDDDDDDDDDDDDD>
##$VPLIST= <PPPPPPPPPPPPPPP>
##$VTLIST= <TTTTTTTTTTTTTTT>
##$WBST= 1024
##$WBSW= 4
##$XGAIN= (0..3)
0 0 0 0 
##$XL= 0
##$YL= 0
##$YMAX_a= 295252
##$YMIN_a= -430769
##$ZGOPTNS= <>
##$ZL1= 120
##$ZL2= 120
##$ZL3= 120
##$ZL4= 120
##$ABSF1= 17.5802
##$ABSF2= -2.438839
##$ABSG= 5
##$ABSL= 3
##$ALPHA= 0
##$AQORDER= 0
##$ASSFAC= 0
##$ASSFACI= 0
##$ASSFACX= 0
##$ASSWID= 0
##$AUNMP= <proc_1d>
##$AZFE= 0.1
##$AZFW= 0.1
##$BCFW= 0
##$BC_mod= 2
##$BYTORDP= 0
##$COROFFS= 0
##$CY= -3
##$DATMOD= 1
##$DC= 0
##$DFILT= <>
##$DTYPP= 0
##$F1P= 0
##$F2P= 0
##$FCOR= 1
##$FTSIZE= 16384
##$FT_mod= 6
##$GAMMA= 0
##$GB= 0
##$INTBC= 1
##$INTSCL= 1.334414e-10
##$ISEN= 128
##$LB= 0.24
##$LEV0= 0
##$LPBIN= 0
##$MAXI= 10000
##$MC2= 0
##$MEAN= 0
##$ME_mod= 0
##$MI= 1.114404
##$NCOEF= 0
##$NC_proc= -6
##$NLEV= 6
##$NOISF1= 3.799351
##$NOISF2= 2.8
##$NSP= 0
##$NTH_PI= 0
##$NZP= 0
##$OFFSET= 17.50322
##$PC= 1
##$PHC0= -11917.9
##$PHC1= 16.60099
##$PH_mod= 1
##$PKNL= yes
##$PPARMOD= 0
##$PSCAL= 0
##$PSIGN= 0
##$REVERSE= no
##$SF= 200.130006286742
##$SI= 16384
##$SIGF1= 3
##$SIGF2= 2
##$SINO= 5.538805
##$SIOLD= 16384
##$SREGLST= <1H.CDCl3>
##$SSB= 0
##$STSI= 16384
##$STSR= 0
##$SW_p= 4006.41025641026
##$SYMM= 0
##$S_DEV= 0
##$TDeff= 16384
##$TDoff= 0
##$TI= <>
##$TILT= no
##$TM1= 0
##$TM2= 0
##$TOPLEV= 0
##$USERP1= <user>
##$USERP2= <user>
##$USERP3= <user>
##$USERP4= <user>
##$USERP5= <user>
##$WDW= 1
##$XDIM= 16384
##$YMAX_p= 323695729
##$YMIN_p= -357640
$$ End of Bruker specific parameters
$$ ---------------------------------
##NTUPLES= NMR SPECTRUM
##VAR_NAME=  FREQUENCY,     SPECTRUM/REAL,   SPECTRUM/IMAG
##SYMBOL=    X,             R,               I
##VAR_TYPE=  INDEPENDENT,   DEPENDENT,       DEPENDENT
##VAR_FORM=  AFFN,          ASDF,            ASDF
##VAR_DIM=   16384,         16384,           16384
##UNITS=     HZ,            ARBITRARY UNITS, ARBITRARY UNITS
##FACTOR=    0.24454680195387, 1,            1
##FIRST=     3502.91944948525, 0,            0
##LAST=      -503.490806925013, 0,           0
##MIN=       -503.490806925013, -357640,     0
##MAX=       3502.91944948525, 323695729,    0
$$ Real data points
##PAGE= N=1
##DATA TABLE= (X++(R..R)), XYDATA
$$ [...]
5561B4313788J162143J253449J410549J042036M75183l21779j100800j824334
5553B6410235k074440k139688k101887j979588j570951j319421j319222j037320
5545A2867718j056085p94246o98866o60103n49162m65915m92208k56741l87301
5536G507091l91953k13190k88929l18089l22036k34979l31019k73236j22656k77012
5526D733992r4048j13802j62850j10427j18114m9940p8128r1533r3921p9166m8246
5515C693817P236j75245q4010p1933j06248k16660K8822r9130k31894q0950l1909
5504B631896p0477k7153j90926q9992l8919j03240L7094q8701j59168J8663N354
5493A924431N1096K6098j80250m3394N0630n144k0886o111J0672k8999q3731l4494
$$ y = [24313788, 25475931, 26729380, 28139929, 29181965, 29657148, 29335369, 28234569, 26410235, 24335795, 22196107, 20094220, 18114632, 16543681, 15224260, 13905038, 12867718, 11811633, 11017387, 10318521, 9658418, 9109256, 8643341, 8151133, 7894392, 7507091, 7115138, 6901948, 6613019, 6294930, 5972894, 5737915, 5406896, 5133660, 5011004, 4733992, 4639944, 4526142, 4363292, 4252865, 4134751, 4084811, 4006683, 3915150, 3821229, 3742063, 3693817, 3701053, 3525808, 3441798, 3369865, 3263617, 3046957, 3075779, 2976649, 2744755, 2663805, 2631896, 2561419, 2534266, 2343340, 2253348, 2214429, 2111189, 2148283, 2059582, 1900414, 1919077, 1924431, 1975527, 2001625, 1821375, 1777981, 1828611, 1823467, 1802581, 1796470, 1807142, 1778143, 1694412, 1659918]
5481A659918o6872M1219O9734l5223j7408J5027p8878o7907q1506p2415q2664
5470A283025K8746m1484j22723J4029r2908p4401j4809k5441j3540K4259Q8101
5459A052854j54536K3j2166O3349o8181k1128j29394J3750P8355L2430n2392k4934
5447G78030j55710o9540R9987M1605j2571O4454r0518j9608j9265n3341L4265
5436E97788J4595l0878q3695j4614O5353J412q4183J0703k9086O3455j7991N1213
5424E44072M2817J54902j71479n2278R9562j08265l5311J16230O053Q386r1810
5413E12879L7821m2145j97371J19715J08499n4643K0143q8056k4839J1892o539
5402C97356q485m0911L5703L2871k5507l8770J03158K2549n7830K4156L1343Q13
$$ y = [1659918, 1593046, 1634265, 1703999, 1668776, 1651368, 1666395, 1587517, 1519610, 1438104, 1365689, 1283025, 1311771, 1270287, 1147564, 1161593, 1068685, 994284, 979475, 954034, 940494, 964753, 1052854, 898318, 898341, 886175, 949524, 881343, 860215, 730821, 744571, 822926, 855356, 802964, 778030, 622320, 552780, 652767, 694372, 681801, 746255, 655737, 636129, 616864, 563523, 597788, 612383, 581505, 497810, 483196, 548549, 549961, 465778, 476481, 447395, 510850, 492859, 544072, 586889, 741791, 570312, 518034, 617596, 509331, 474020, 590250, 596303, 604689, 512879, 550700, 508555, 311184, 430899, 539398, 484755, 504898, 416842, 392003, 403895, 397356, 388871, 347960, 383663, 416534, 391027, 352257, 455415, 477964, 420134, 444290, 475633, 476446]
5390D76446n9962K5845n6687k4027j2827o3563l7885L9114q0215M1565J04303
5379C52107L7336K0362l972N003q2900o040J8851Q9375j91511P3955N7447o5251
5367C04762N8950j5526k2658R5665l9134l7705N1315K5202J1576N5444N9563q3660
5355D63794R3721k2049M3141K8079K2802R6161J17289j6349R1906m1853r8246
5344G78396Q2923j48041m0437N439K9130K5102k1993l0441J10297R295p3931L1638
5332G57377L4893j20550k675P7030R2715j8038P811n6972N5215N7620J23539m8557
5320I59408J4030J00470j81295l2113Q3719O1656j81037j68390l5227n3708Q9226
5309F56739K2380o8635L0524k0587j17563j0444J92853k5115m809n0520R6635
$$ y = [476446, 416484, 442329, 385642, 361615, 348788, 285225, 247340, 286454, 206239, 247804, 352107, 389443, 409805, 405833, 410836, 327936, 321896, 340747, 430122, 238611, 312566, 370013, 304762, 363712, 348186, 325528, 421193, 382059, 344354, 395669, 420871, 432447, 487891, 547454, 463794, 557515, 535466, 578607, 606686, 629488, 725649, 842938, 826589, 918495, 876642, 778396, 861319, 713278, 672841, 678280, 707410, 732512, 710519, 680078, 790375, 799670, 725739, 757377, 792270, 671720, 669045, 746075, 838790, 820752, 828563, 771591, 826806, 884426, 1007965, 959408, 973438, 1073908, 892613, 860500, 944219, 1005875, 824838, 656448, 621221, 567513, 656739, 679119, 610484, 641008, 620421, 502858, 492414, 685267, 660152, 655343, 604823, 701458]
5298G01458j7903q988J59969J06979q469j5704M3192n204n4716K1160N0620L1775
5286A004169O7368P0897j10055K8576p4739j6303J04834j20880J14418Q9513j34301
5275A023497N8411o7903m0937j158Q3367j39067o4815l8462n8753J31959M210
5264H90349R922m3612r7568M7079J08254j03305l9097N7915o2977j27412j44554
5253D94994j14229R5526m2092R236Q0404l3229j10989J2538L9410J2534O1836
5242E05939j03988j07621K0069j7652J67591J1170o4185m3571J3271q7486Q858
5231C02395L8234J28211r0984K0732k249N7280L9351r9957J8288l6468J110L9954
5219D15897N8614J1518K5257n5509r6465j44135J8826J5252j4678j0278J44464
$$ y = [701458, 683555, 674567, 834536, 941515, 933046, 917342, 960534, 955330, 900614, 921774, 972394, 1004169, 1071537, 1142434, 1032379, 1060955, 986216, 969913, 1074747, 953867, 1068285, 1157798, 1023497, 1081908, 1014005, 973068, 971910, 1055277, 916210, 851395, 812933, 754180, 886139, 890349, 900271, 856659, 759091, 806170, 914424, 811119, 772022, 829937, 766960, 639548, 494994, 380765, 476291, 434199, 443435, 523839, 490610, 379621, 392159, 431569, 444103, 505939, 401951, 294330, 314399, 296747, 464338, 475508, 411323, 367752, 381023, 293537, 302395, 340629, 468840, 377856, 398588, 396339, 453619, 492970, 393013, 411301, 374833, 375943, 415897, 474511, 486029, 511286, 455777, 359312, 215177, 234003, 249255, 234577, 224299, 368763]
5208C68763K1628K3254p38N1899Q402m5365n441o817j17859M0528J51867P042
5196D97163k7052M6846q4799M3285J25352o9416L4361l3704n8298r7134P0272
5185D46876P6691M1576l9343m2387Q2686J0539n202R2294M9013n5358J13194r7859
5173F72720Q6833P2098J19664Q0381p9816Q2215J21236O5320q8891k8049j3778
5162A089933J07005L9n7412M6200q960M5122O9208m5210m5798m0738Q063L5769
5150A203221n4338q7845P879j6110r917K6972o9096N0903J00767q9101r0039R4293
5138A067589J50689j6014o748R3135P6251n1645J31846M5353j8197O7527Q8438
5127A628224j61327m2684O663P0464k3139Q5475O8802O4999o202m4971J22457
$$ y = [368763, 390391, 413645, 412907, 464806, 473208, 427843, 422402, 415585, 297726, 338254, 490121, 497163, 470111, 516957, 432158, 475443, 600795, 531379, 565740, 532036, 473738, 376604, 446876, 523567, 565143, 525800, 483413, 566099, 576638, 571436, 663730, 712743, 657385, 770579, 672720, 759553, 831651, 951315, 1031696, 951880, 1034095, 1155331, 1220651, 1131760, 1103711, 1089933, 1196938, 1196977, 1139565, 1185765, 1176805, 1221927, 1291135, 1245925, 1200127, 1159389, 1167452, 1203221, 1148883, 1061038, 1068917, 1052807, 1042890, 1069862, 1000766, 1051669, 1152436, 1063335, 973296, 1067589, 1218278, 1202264, 1195516, 1288651, 1364902, 1313257, 1445103, 1490456, 1472259, 1539786, 1628224, 1466897, 1424213, 1430876, 1501340, 1478201, 1563676, 1632478, 1697477, 1691275, 1646304, 1768761]
5116A768761R2461O8267M9116K12528K47744M7382O2844M0419m5579J41974O1802
5105B747719L9631K3926N4688N9486N052q9059P6148o3071j21832q4369q9752
5094B558567l1222L2073n961l7842p9612J22911L3047o7162Q152J76222J09184
5083B818357M0432L6385J70434J93892R2629J55730K55146J44804L24592M07864
5073D640265L50038L72691K6014k0411q97p6569j07083o9118o2858k1125J2269
5062E043216l8883M4244K29707Q7981J92844J45004J30417J07142K33623L07417
5052F482712K43401K21723K76899K94152K32508M03011L94474N44958M60841L68068
5042I922747K94900K33381J58365J90785J5284J90333M28397L40741L38968M42251
$$ y = [1768761, 1861222, 1929489, 1978605, 2191133, 2438877, 2486259, 2549103, 2589522, 2543943, 2685917, 2747719, 2787350, 2811276, 2865964, 2925450, 2930502, 2841443, 2917591, 2854520, 2732688, 2648319, 2558567, 2527345, 2559418, 2553457, 2515615, 2436003, 2558914, 2591961, 2524799, 2532951, 2709173, 2818357, 2858789, 2895174, 3065608, 3259500, 3352129, 3507859, 3763005, 3907809, 4232401, 4640265, 4990303, 5362994, 5389008, 5368597, 5367700, 5291131, 5184048, 5114930, 5052072, 5030947, 5043216, 5004333, 5048577, 5278284, 5366265, 5559109, 5704113, 5834530, 5941672, 6175295, 6482712, 6726113, 6947836, 7224735, 7518887, 7751395, 8154406, 8548880, 9093838, 9554679, 9922747, 10217647, 10451028, 10609393, 10800178, 10815462, 11005795, 11434192, 11774933, 12113901, 12556152]
5032A2556152N64817P67477Q35513P40967Q98679J036916J101536J300697J520389
5023B1323143J683978J942138K279726K594797K980021L357526L858275M498170
5015D4517774N034934N327204O049325O323501O384071O444337O332116O042419
5007I2455681N425630M292573K490345O3916k231267l756702n178347n804515
4999H7757314o282109o479072o572485o319225o031525n576021n019104m331114
4991D1146659l843203l393059k917645k443934k347394k012387j666964j480625
4983B1041448j344238j113006j086085r13161q76185p56545o03572p45048n28162
4974A3075446n14052m45717n09509m19608m57515m75096m59070k76516l79290
$$ y = [12556152, 13120969, 13888446, 14723959, 15464926, 16363605, 17400521, 18502057, 19802754, 21323143, 23007121, 24949259, 27228985, 29823782, 32803803, 36161329, 40019604, 44517774, 49552708, 54879912, 60929237, 67252738, 73636809, 80081146, 86413262, 92455681, 97881311, 102173884, 104664229, 104728145, 102496878, 98740176, 93561829, 87757314, 81475205, 74996133, 68423648, 62104423, 56072898, 50496877, 45477773, 41146659, 37303456, 33910397, 30992752, 28548818, 26201424, 24189037, 22522073, 21041448, 19697210, 18584204, 17498119, 16584958, 15708773, 14952228, 14348656, 13603608, 13075446, 12561394, 12115677, 11606168, 11186560, 10729045, 10253949, 9794879, 9518363, 9139073]
4965I139073k95661l42058k80993k16728k40143l02392l23041j76184j61761k28851
4955F571261k00774k94028k15815j27418k48335k62363m1096r5850j99417k08235
4945D677930k49510j13674j81881p9577q3441q9230P8647j08543j23560n8723
4935C668438j59699o2602j09722J5846j03994o2387r140j30716q4347q473K2541
4924B975745q9912j87384m7047j04414l7688M9532N347o8401j20138m1005k2650
4913B311985j04409O3871N8106K4839n2707m325J2749k3301m5946J5267R1851
4902B347980P6165m9090M6637q6170o514p0496K5400M0485j55761p3115m9858
4891B045663j49765p7818J58917m6099q9952n821q2043r0806O1104j17685k05278
$$ y = [9139073, 8843412, 8501354, 8220361, 8003633, 7763490, 7461098, 7138057, 6961873, 6800112, 6571261, 6370487, 6076459, 5860644, 5733226, 5484891, 5222528, 5181432, 5085582, 4886165, 4677930, 4428420, 4314746, 4132865, 4053288, 3969847, 3880617, 3959264, 3850721, 3727161, 3668438, 3508739, 3446137, 3336415, 3352261, 3248267, 3185880, 3176740, 3046024, 2961677, 2953204, 2975745, 2885833, 2698449, 2651402, 2546988, 2509300, 2558832, 2564179, 2495778, 2375640, 2334635, 2311985, 2207576, 2271447, 2329553, 2354392, 2301685, 2297360, 2310109, 2286808, 2240862, 2256129, 2347980, 2424145, 2375055, 2421692, 2335522, 2329008, 2258512, 2283912, 2324397, 2168636, 2095521, 2045663, 1895898, 1818080, 1976997, 1930898, 1840946, 1835125, 1753082, 1662276, 1723380, 1605695, 1400417]
4880A400417J4685M0652q4779k6226l1744k1349j18678o9541M3867J8531j0603
4869A155232J64290p9831J36245L02o0934m4772O6105o1036J1563O3443K51951
4858A602558J3963j81696J28358L5269M7992J61568Q5730J35271J76694J91583
4848B397290J90466R9524K22093J62348j25573k2166j10162k24718q8349j34430
4838B366323k36002k07325o7228r5221k09845j34736j3004M2958O2223j37348
4828A370795q6904n1730M7508j27282j50280k4379o3424l1603j346K521J43530
4817A027406q7809m9362k9151k572l6139l4689K3572n9223n7950N9526n0327J33554
4805H36836o4679n220M1502j5011M1172j445j2281l4762m2215m4248p153o9537
$$ y = [1400417, 1415102, 1455754, 1370975, 1344749, 1313005, 1291656, 1172978, 1103437, 1147304, 1165835, 1155232, 1319522, 1239691, 1375936, 1376238, 1315304, 1270532, 1336637, 1275601, 1287164, 1350607, 1602558, 1616521, 1434825, 1563183, 1598452, 1646444, 1808012, 1893742, 2029013, 2205707, 2397290, 2587756, 2687280, 2909373, 3071721, 2946148, 2923982, 2813820, 2589102, 2500753, 2366323, 2130321, 1922996, 1855768, 1760547, 1550702, 1415966, 1402962, 1445920, 1508143, 1370795, 1283891, 1232161, 1279669, 1152387, 1002107, 977728, 914304, 882701, 881355, 883876, 1027406, 939597, 890235, 861084, 858512, 822373, 787684, 811256, 752033, 694083, 753609, 703282, 836836, 772157, 766937, 808439, 793428, 834600, 833155, 820874, 786112, 743897, 699649, 692496, 622959]
4793F22959q2093q0269J13254K5428p9023m0629k2532P001J51431O4593k6746
4782F53374k2987K4034k82p0134l1932L0116M6767N1359j44828O2699j7594R7219
4770F77811l0787r1099p9588O4901p5610L4077O6725j12709k2419P365J65741
4759F04408L7868j9939P7176r0813p9437J15955j08326J00598M0270N9268n5269
4748F81759m6734k1777J17577J0811M8120J06818N3888o4538j80686q619p468
4737F89151J572R2813k9289M3565O8979m7510M5159K3353m4378Q9453p829n2522
4725H72517O4639k0387L5899j38667k9535k0082m7016N1737o4680l1549j9476
4714F53400j23567L4616M0263l0843J41901n193l4545K4151Q300j2930M2651p6478
$$ y = [622959, 540866, 460597, 573851, 599279, 520256, 479627, 457095, 464096, 615527, 680120, 653374, 630387, 654421, 654139, 584005, 552073, 582189, 628956, 680315, 535487, 598186, 580592, 677811, 647024, 555925, 476337, 541238, 465628, 499705, 566430, 453721, 431302, 438667, 604408, 642276, 622337, 699513, 608700, 529263, 645218, 536892, 637490, 677760, 737028, 681759, 635025, 613248, 730825, 741636, 789756, 896574, 950462, 885924, 705238, 696619, 689151, 690723, 783536, 754247, 797812, 866791, 819281, 864440, 887793, 843415, 932868, 925039, 872517, 937156, 916769, 952668, 814001, 784466, 764384, 717368, 769105, 704425, 672876, 653400, 529833, 564449, 604712, 573869, 715770, 710577, 676032, 700183, 708483, 695553, 738204, 661726]
4702F61726p435K7644j21286R3917n3450j14652L1774R1540O6330o0567R903j1357
4690F14087K0775q3488N1418K19202j6073j3669k464m4155N165n0694K1207K0587
4678G41898L5408K1764K702r810r7842L9388R9259N9813O2406R344j38588k0405
4666H05337O9225n8952K0320K5782q0789q180Q7858M9968o3091J6514n6119O096
4654H13969P1068m5070J3445N5518r93N9863M2102n1376K2301P6775K07034j13366
4642A151270j17377Q3197p4612o5940J45909m9150j06645p4118j7471J22280m460
4631I92883m0046o3392J16426n018L8640M268j08199p2086J00587p6850J3477
4620I00690L1131M942J7220n4735j6551Q338l1927N569L30l5120P8964L3118n18
$$ y = [661726, 654291, 681935, 560649, 654566, 601116, 486464, 518238, 609778, 676108, 615541, 625444, 614087, 634862, 551374, 602792, 821994, 805921, 792252, 789788, 745633, 750798, 700104, 721311, 741898, 777306, 799070, 801772, 791962, 694120, 733508, 832767, 892580, 954986, 964330, 825742, 805337, 874562, 815610, 835930, 861712, 780923, 772743, 860601, 910569, 847478, 863992, 807873, 813969, 885037, 839967, 853412, 908930, 907937, 967800, 1009902, 958526, 980827, 1057602, 1264636, 1151270, 1033893, 1117090, 1042478, 976538, 1122447, 1073297, 966652, 892534, 875063, 997343, 992883, 952837, 889445, 1005871, 1000853, 1039493, 1043761, 935562, 863476, 964063, 887213, 900690, 931821, 936763, 953983, 899248, 882697, 891035, 859108, 864677, 865007, 829887, 908851, 941969, 941451]
4607I41451R2748k7490M474p3878j36070L2805L7852j1277j4522J00132k6971
4596I19254Q7396j4461o6929J3864K5348K1958k7755j7840J46938k4283p8913
4585I84577L6308N8952J4841P3644M7949q202J03303l41445n1953K30823L4230
4574A183027m7494M245J5360M9279k1523M5101j54973N8391Q5580R86P2599K1762
4562A312340m8129J08764J6786j5822K8443j7051R7458r1876K3831K6428o3756
4551A377416J7968L1102J17365O7840L2626M6219j5032L4479l8641J06666P026
4540A785034Q9388J55835R0545j46022O7415P6694Q8329N7693L1488N1466O0207
4529B408072j493J45257Q6761L4536l0030O9006J97035Q3802N0066J6470J01986
$$ y = [941451, 1034199, 1006709, 1011183, 937305, 801235, 834040, 871892, 860615, 846093, 946225, 919254, 1006650, 992189, 925260, 939124, 964472, 986430, 958675, 940835, 1087773, 1063490, 984577, 1020885, 1079837, 1094678, 1168322, 1216271, 1208069, 1311372, 969927, 917974, 1148797, 1183027, 1135533, 1139778, 1155138, 1204417, 1182894, 1227995, 1073022, 1131413, 1216993, 1217979, 1290578, 1312340, 1264211, 1372975, 1389761, 1373939, 1402382, 1385331, 1482789, 1390913, 1414744, 1441172, 1377416, 1395384, 1426486, 1543851, 1611691, 1644317, 1690536, 1675504, 1709983, 1671342, 1778008, 1785034, 1874422, 2030257, 2120802, 1974780, 2042195, 2118889, 2207218, 2264911, 2296399, 2347865, 2408072, 2406579, 2551836, 2638597, 2673133, 2643103, 2712109, 2909144, 2992946, 3043012, 3059482, 3161468]
4518C161468K53048N9021J68860R1159J25111J11048R7828N7329K2401Q3219J92537
4507D423029J47276J89455R4566k3709J79001J82348J24341J22241J03194J23972
4497E665714J28590L1714J12690K8860K30218J42934K37524L24626K89132K35426
4487G427428K64431K42177L03676L66448L32281M00117N85748N41699O01383Q17638
4477A1883026R05700J084723J352569J500379J691426J856610K171732K373006
4469B4819171L055831L990293M887437N608893M056290J645303j010095l535628
4461D3517495m342537m681353m535913l792245k687323j923846j472262j078014
4453A9004002p94583o59657n08383k75098l30889j31163N7564L7719K37006J63043
$$ y = [3161468, 3414516, 3473537, 3642397, 3733556, 3858667, 3969715, 4067543, 4124872, 4147273, 4230492, 4423029, 4570305, 4759760, 4854326, 4830617, 5009618, 5191966, 5316307, 5438548, 5541742, 5665714, 5794304, 5826018, 5938708, 5967568, 6197786, 6340720, 6578244, 6902870, 7192002, 7427428, 7691859, 7934036, 8237712, 8604160, 8936441, 9336558, 9922306, 10464005, 11065388, 11883026, 12788726, 13873449, 15226018, 16726397, 18417823, 20274433, 22446165, 24819171, 27875002, 31865295, 36752732, 42361625, 46417915, 48063218, 47053123, 43517495, 39174958, 34493605, 29957692, 26165447, 23478124, 21554278, 20082016, 19004002, 18209419, 17549762, 17041379, 16766281, 16435392, 16304229, 16361793, 16399512, 16636518, 16799561]
4443A6799561J48150K26491K33866J76917K94851L79633L47872M21937L90671
4434A9419949L95347M55165N07282Q18690P33256N86507M19270O95458P05107
4425B4736031P46328P01192Q15507Q95787Q90759J200688J166772J581107J923848
4416C4658019K133610K354228K714441K945688L408658L818200M002877M464217
4408F0499938M999704N845590O757258P387830N775827M008810L298275p5450
4400I8497782j897420j712055j546843j049711o7529J018513J744166K372389
4392I7359292K723435K868556K758795K337353K119153J707823J202981L95867
4384A13473255m85479j846652l109405m216500m961038n128073n114550m408393
$$ y = [16799561, 16947711, 17174202, 17408068, 17584985, 17879836, 18259469, 18607341, 19029278, 19419949, 19815296, 20270461, 20777743, 21596433, 22329689, 22916196, 23335466, 24030924, 24736031, 25482359, 26183551, 26999058, 27894845, 28785604, 29986292, 31153064, 32734171, 34658019, 36791629, 39145857, 41860298, 44805986, 48214644, 52032844, 56035721, 60499938, 65499642, 71345232, 78102490, 85490320, 91266147, 95274957, 98573232, 98497782, 96600362, 94888307, 93341464, 92291753, 92224224, 93242737, 94986903, 97359292, 100082727, 102951283, 105710078, 108047431, 110166584, 111874407, 113077388, 113473255, 112987776, 111141124, 108031719, 103815219, 98854181, 93726108, 88611558, 84203165]
4376H4203165l589196k569345j816600j178112q63216j167229k213847l130219
4368F7675401l792779m124315m078227l693618l221019k710194k219955j931300
4360D1903994j562088j116886r15817o84632l81260k44956J30486K82340N73348
4351C7984529O77826Q45684J046581J153225J415743J676523J804833K311500
4343D8916444K561511K764747K973275K944378K648843J953435J333716P9434
4335F6175783r70532k004514l302693m130614m384871m563614m455241l967843
4327C8395861l469799k975489k599978k226382j875556j616305j308854j295838
4319B1027660j127728j098503q47161q16444n72606o65158o59588p12233n14982
$$ y = [84203165, 80613969, 78044624, 76228024, 75049912, 74186696, 73019467, 70805620, 67675401, 63882622, 59758307, 55680080, 51986462, 48765443, 46055249, 43835294, 41903994, 40341906, 39225020, 38309203, 37624571, 37243311, 36998355, 37128841, 37411181, 37984529, 38662355, 39508039, 40554620, 41707845, 43123588, 44800111, 46604944, 48916444, 51477955, 54242702, 57215977, 60160355, 62809198, 64762633, 66096349, 66175783, 65205251, 63200737, 59898044, 55767430, 51382559, 46818945, 42363704, 38395861, 34926062, 31950573, 29350595, 27124213, 25248657, 23632352, 22323498, 21027660, 19899932, 18801429, 17954268, 17137824, 16565218, 15900060, 15240472, 14528239, 14013257]
4310A4013257l70603l85897n08555m07552j66714k35400k87771k64890l89615
4301A0996260l37614j92760l70188k86065j87557p9986k03894j96601k13191j94051
4291H734353j58078j15377k53005j01281k37465j47277o4197j11918j23658O6902
4281G488999j48630j20667r4307n7513j62186j63037n2916k4336p6783l8982q3066
4270F466576o6710o0759j4986P8120r3597N3220n5403p3377j9419j45598n78j20579
4258E946910n5801m3268j02661j7442j6762L5790j2048k101N405K0085l5213j88572
4246E534322Q2284Q9428L8782o0067N3021L3945k8427J12818N8373l0342l1704
4235E852433P0641k7036p0575M043K4424r7845O8904J4357J04406Q8942K2671
$$ y = [14013257, 13642654, 13256757, 12748202, 12340650, 12173936, 11938536, 11650765, 11385875, 10996260, 10658646, 10465886, 10095698, 9809633, 9622076, 9542090, 9338196, 9141595, 8928404, 8734353, 8576275, 8460898, 8207893, 8106612, 7869147, 7721870, 7657673, 7545755, 7422097, 7488999, 7340369, 7219702, 7125395, 7067882, 6905696, 6742659, 6689743, 6665407, 6588624, 6549642, 6466576, 6399866, 6339107, 6324121, 6402241, 6308644, 6361864, 6306461, 6233084, 6213665, 6068067, 6067489, 5946910, 5891109, 5847841, 5745180, 5727738, 5710976, 5746766, 5734718, 5732617, 5738022, 5758107, 5722894, 5534322, 5616606, 5706034, 5744816, 5684749, 5737770, 5771715, 5743288, 5856106, 5914479, 5884137, 5852433, 5923074, 5896038, 5825463, 5829506, 5853930, 5756085, 5824989, 5839346, 5943752, 6032694, 6055365]
4224F055365n1486Q6433n824R6446J21784L357M5152J30826P7261J13265Q0000
4213F752579R7684J73975J60305L9203P3787K49009L06924J54301J20144K36522
4203H364433J93551J10378K22121J66593K38906J21532K00440J82962J87426K86795
4193A0275137K34125L35566L81861K05133J50305K95467L69948L99014M37575
4184A3084131L43742L22470M67404L79662L77607L81448M88957M37959M30989
4175A6714369N23998N31118Q05711P97048Q87707Q91679J010734J141593J101513
4166B4405470J234418J403254J438549J635618J664996J961307K354773K555256
4158C8653641L019537L603486M237883M762599N468241O114282O989181P994486
$$ y = [6055365, 6003879, 6090312, 6084488, 6180934, 6302718, 6306075, 6351227, 6482053, 6559314, 6672579, 6752579, 6850263, 7024238, 7184543, 7223746, 7297533, 7546542, 7853466, 8007767, 8127911, 8364433, 8557984, 8668362, 8890483, 9057076, 9295982, 9417514, 9617954, 9800916, 9988342, 10275137, 10509262, 10844828, 11226689, 11431822, 11582127, 11877594, 12247542, 12646556, 13084131, 13427873, 13750343, 14217747, 14597409, 14975016, 15356464, 15845421, 16283380, 16714369, 17238367, 17769485, 18575196, 19372244, 20259951, 21151630, 22162364, 23303957, 24405470, 25639888, 27043142, 28481691, 30117309, 31782305, 33743612, 36098385, 38653641, 41673178, 45276664, 49514547, 54277146, 59745387, 65859669, 72848850, 80843336]
4150H0843336Q881210J0052442J1779336J3836598J6316619J8262135J8957511
4143A78929187J6038579Q365272P4928o261649j2958533j7576177j8383894j7350844
4135A30876869j5860498j3432554j0965940q921932p339111o387099n395936m553354
4127E8020445m150826l737567l044578k601780k438531k093796j869814j619809
4119C6463744j509611j257152j172805r98873q45942q15169p53790l92920m02609
4110B8314873m51001n00629n33692m14292o09646n37514m81198m82241m68022
4101B3836638m96214l97463k93041l13053l79718k27841n4172k29403o5275j73242
4091B1207216M1900J66868J78516K81433L05873L58383K05224J25943L0221J90770
$$ y = [80843336, 89724546, 99776988, 111556324, 125392922, 141709541, 159971676, 178929187, 194967766, 203333038, 203407966, 197146317, 184187784, 166611607, 148227713, 130876869, 115016371, 101583817, 90617877, 81695945, 74356834, 67969735, 62573799, 58020445, 53869619, 50132052, 47087474, 44485694, 42047163, 39953367, 38083553, 36463744, 34954133, 33696981, 32524176, 31525303, 30679361, 29864192, 29110402, 28717482, 28314873, 27863872, 27363243, 26829551, 26415259, 25805613, 25268099, 24786901, 24304660, 23836638, 23340424, 22942961, 22649920, 22336867, 21957149, 21729308, 21675136, 21445733, 21380458, 21207216, 21249116, 21415984, 21594500, 21875933, 22181806, 22540189, 22745413, 22871356, 22901577, 23092347]
4081B3092347J30316L35136L26030K48743M65796N67667O80441R72052J162293
4072B7980821J197984J444506J723505K130010K046811J856970J324655N31456
4064D0236718m12968q66507j487350j575283j432135j382648j195004q79803q86949
4055C0118071n67345k52750q8810K00715M85383P21017R67044J376772J536006
4046C4496103J980256K159550K669431L330457L790069M147596L836397K734651
4038E9144510O10939j397299l067596l930647m358545m397685l854551l229564
4030C5519562k625254k184603j588202j349819j021801p20070o26481k17174j50679
4021B5035479o2047J60968L89394N96777P72701J027140J190606J325864J230110
$$ y = [23092347, 23222663, 23557799, 23883829, 24132572, 24598368, 25166035, 25846476, 26818528, 27980821, 29178805, 30623311, 32346816, 34476826, 36523637, 38380607, 39705262, 40236718, 39823750, 38957243, 37469893, 35894610, 34462475, 33079827, 31884823, 31005020, 30118071, 29550726, 29297976, 29209166, 29409881, 29895264, 30616281, 31583325, 32960097, 34496103, 36476359, 38635909, 41305340, 44635797, 48425866, 52573462, 56409859, 59144510, 59755449, 58358150, 55290554, 51359907, 47001362, 42603677, 38749126, 35519562, 32894308, 30709705, 29121503, 27771684, 26749883, 26029813, 25403332, 25186158, 25035479, 24973432, 25134400, 25523794, 26120571, 26893272, 27920412, 29111018, 30436882, 31666992]
4012C1666992R02856J03510p16844j352654j818973k134903k226772k159922j658728
4003B0604562j386093j348817j166907j032456r38938q92759o30688o32909n45072
3994A2029923n26412n02010m08342k98988l68051l43195l61235l13093k11449
3985H697148k08332j01149j48419k56002j48511j37708p3776j24808j40380o2173
3975G295890j60692k27166r8577k56937j72764o8135k25248o7565p1980K7523
3965E974349j56011j53600o6727q4151j09270K2571j57778n8841q67J0380r1602
3954E128453n8447o3343N6744J1679L7312j38473j7335m2689j6844K2387o495
3943D912949p2173O076N6565j61230n8068o6621P5006K259R5402J44528Q813N765
$$ y = [31666992, 32569848, 32673358, 31956514, 30603860, 28784887, 26649984, 24423212, 22263290, 20604562, 19218469, 17869652, 16702745, 15670289, 14731351, 13838592, 13207904, 12574995, 12029923, 11503511, 11001501, 10593159, 10294171, 9926120, 9582925, 9221690, 8908597, 8697148, 8488816, 8387667, 8239248, 7983246, 7834735, 7697027, 7623251, 7498443, 7358063, 7295890, 7135198, 6908032, 6809455, 6552518, 6379754, 6311619, 6086371, 6018806, 5946826, 5974349, 5818338, 5664738, 5598011, 5513860, 5404590, 5427161, 5269383, 5210542, 5209675, 5220055, 5128453, 5070006, 5006663, 5063407, 5075086, 5112398, 4973925, 4956590, 4913901, 4897057, 4919444, 4912949, 4840776, 4846852, 4903417, 4742187, 4684119, 4617498, 4692504, 4694763, 4790165, 4934693, 4943506, 4949271]
3931D949271j6649k6959M0715N718j9490J22099J5970N5549j13656L2488P9573
3920E124629R5896M4677m123J16713J51927J25534J94910J34179R6696L16096
3910F397134J74654J98189K71259L66650M84535N45074L90293N27517O80803P18954
3900A0755062Q62329P91900O67218R09478Q00466Q95688J009150J127872J566238
3891A9385401J913995K342320L175421L478613L351756J436373j010132k172329
3883C1901418k737293l261375l141114k382349j870372j235399q76551p54810
3875A5642155o12657n43064n07749n37441n99174o21974o25653n15936n10286
3866A0568221n02224n91241l82567l02505l16571j12280j67391j42099L0295j454
$$ y = [4949271, 4932622, 4905663, 4946378, 4952096, 4932606, 5054705, 5070675, 5126224, 5012568, 5045056, 5124629, 5220525, 5265202, 5261079, 5377792, 5529719, 5655253, 5850163, 5984342, 6081038, 6397134, 6571788, 6769977, 7041236, 7407886, 7892421, 8437495, 8827788, 9355305, 10036108, 10755062, 11617391, 12409291, 13076509, 13985987, 14786453, 15682141, 16691291, 17819163, 19385401, 21299396, 23641716, 26817137, 30295750, 33647506, 35083879, 34073747, 31901418, 29164125, 25902750, 22761636, 20379287, 18508915, 17273516, 16396965, 15642155, 15029498, 14486434, 13978685, 13441244, 12842070, 12220096, 11594443, 11078507, 10568221, 10065997, 9474756, 9092189, 8789684, 8473113, 8360833, 8193442, 8051343, 8081638, 8080184]
3856H080184j13981M2909J41874L3121J58795J19630M5266P844j2976j08531k0882
3845H373253k4698M2532J44568J40359L02449K21390M65272M93389O29037O75768
3835A1463319Q01343R59797J362145J901409K516008L008555K995819l57312j829619
3826B2821464j592768k206468k767149k224250j201771j019544p20382n79281
3818A0509851m01775k71850k02175k34119j17871k36778k26102j0498k11354j19759
3808H477570j0488J07172Q6416J6503J28571K21429J17648J48744N2941k14342
3798I132164O8320m5454L3054J4788J07523n4144J14454J45016J91395J04956
3788I812072J45842P7209P9832J44251J47985M4564J68583J00795K56756J84869
$$ y = [8080184, 7966203, 8009112, 8150986, 8184107, 8342902, 8462532, 8507798, 8515642, 8502666, 8394135, 8373253, 8348555, 8391087, 8535655, 8676014, 8978463, 9199853, 9665125, 10158514, 10787551, 11463319, 12264662, 13224459, 14586604, 16488013, 19004021, 22012576, 25008395, 24651083, 22821464, 21228696, 19022228, 16255079, 14030829, 12829058, 11809514, 11089132, 10509851, 10108076, 9836226, 9634051, 9399932, 9282061, 9045283, 8819181, 8808683, 8597329, 8477570, 8467082, 8574254, 8660670, 8677173, 8805744, 9027173, 9144821, 9293565, 9346506, 9132164, 9200484, 9155030, 9188084, 9202872, 9310395, 9256251, 9370705, 9515721, 9707116, 9812072, 9957914, 10035123, 10114955, 10259206, 10407191, 10451755, 10620338, 10721133, 10977889, 11162758]
3778A1162758J92683K94086L38210L46373M17007L43028N43529M37263L21121
3769A4396058M42050M32082K47651J93009K11582L07558M43520M75780O11467
3760A7760757Q13438Q09529J006867Q77489M62634K81955K96738Q061J41658J7048
3750B2476174M8442K89999L71689P35022Q86382Q78465Q38584L45106n2799l38562
3740B6478502n90904q45686p10630m81274m70280k25315n1673O8940K6581Q2200
3730B3280461j82932m87359q94698r43515r71700j001934r65623p65034n49166
3721A6518500m31867m41451l39832l37698m29829m38927m45430o29703o76179
3712A2347584o73290n66124n53524m98891n01153m36672l67631l95725l54028
$$ y = [11162758, 11355441, 11649527, 11987737, 12334110, 12751117, 13094145, 13637674, 14074937, 14396058, 14838108, 15270190, 15517841, 15710850, 15922432, 16229990, 16673510, 17149290, 17760757, 18574195, 19383724, 20390591, 21268080, 21730714, 22012669, 22309407, 22317468, 22459126, 22476174, 22524616, 22814615, 23186304, 23921326, 24807708, 25686173, 26524757, 26869863, 26817064, 26478502, 25887598, 25041912, 24331282, 23850008, 23379728, 23154413, 23102740, 23171680, 23198261, 23280461, 23097529, 22610170, 21715472, 20771957, 19800257, 18798323, 17832700, 17067666, 16518500, 16086633, 15645182, 15305350, 14967652, 14537823, 14098896, 13653466, 13023763, 12347584, 11674294, 11108170, 10554646, 10055755, 9554602, 9117930, 8750299, 8354574, 8000546]
3703H000546m22507m09547l00307l59213k24206j63088l04771k79214j27545k33442
3693E176706k02791k17774p1542k08364q7858j29946p8941k46767j05028l1441
3683C796254m4555n9956j15954j59203j52047P0329P4098j05169j06315L155J813
3672C202450q4393j38285J3491Q3166J9017r2857j35988N8728j01745K9256J323
3661B854163j5781L0233n2555j01327j1570m6002m6048L7508p5089l6968j8001
3650B518563Q387m9224P680O830j8152m5141R4939o9927L1438l9275K9595M3697
3638B519410k963J1817J8229o5810k8789J15908p5029N2069M4109n4523Q5548
3627B619976J06540j08780k591o1897o7144N3594N1537n3858m4126J90995j3742
$$ y = [8000546, 7578039, 7168492, 6868185, 6508972, 6284766, 6121678, 5816907, 5537693, 5410148, 5176706, 4973915, 4756141, 4684599, 4476235, 4388377, 4258431, 4179490, 3932723, 3827695, 3796254, 3751699, 3691743, 3575789, 3416586, 3264539, 3334868, 3408966, 3303797, 3197482, 3200637, 3202450, 3118057, 2979772, 2993263, 3076429, 3095446, 3002589, 2866601, 2925329, 2823584, 2852840, 2854163, 2838382, 2868615, 2816060, 2714733, 2703163, 2657161, 2611113, 2648621, 2573532, 2536564, 2518563, 2526950, 2477726, 2485406, 2492236, 2474084, 2428943, 2523882, 2453955, 2485393, 2446118, 2475713, 2519410, 2516447, 2528264, 2546493, 2480683, 2451894, 2567802, 2492773, 2544842, 2588951, 2534428, 2619976, 2726516, 2617736, 2615145, 2553248, 2486104, 2539698, 2591235, 2537377, 2493251, 2684246, 2670504]
3616B670504R398M5639j40915q476Q0109J6773j6515o701O9488q654j2642j32287
3604B565721J44924J80447M3173O48o218L5202J96357Q4255J52630N9885L6826
3593C493850N9172K03440O8295K15314R0672k0798P0767j0216Q9570k4921M3219
3582D278364J01502J4645N9235J05995l8651l6936n4940k206J12417n6442M9873
3571D532856L301k1349L3782p8706l0823J02763J7892p5638N2460N5896J19693
3560D712127J17736J25969J13676K25394K33510K03261K83853L57618K91082K99709
3550F963935N20575N80670L88038L12409L43053K37889K43371K84592J87656J96521
3540A0258709j1858o1535k1724k8705q8700r6158O6329O3591j56086j88583k05340
$$ y = [2670504, 2679902, 2725541, 2584626, 2576150, 2656259, 2673032, 2656517, 2649816, 2719304, 2710650, 2698008, 2565721, 2710645, 2891092, 2934265, 2934913, 2928695, 2963897, 3160254, 3244509, 3397139, 3457024, 3493850, 3553022, 3756462, 3824757, 4040071, 4130743, 4109945, 4180712, 4170496, 4260066, 4235145, 4278364, 4379866, 4394511, 4453746, 4559741, 4521090, 4484154, 4429214, 4427008, 4539425, 4482983, 4532856, 4536157, 4514808, 4548590, 4469884, 4439061, 4541824, 4559716, 4484078, 4536538, 4592434, 4712127, 4829863, 4955832, 5069508, 5294902, 5528412, 5731673, 6015526, 6373144, 6664226, 6963935, 7484510, 8065180, 8453218, 8765627, 9108680, 9346569, 9589940, 9874532, 10062188, 10258709, 10246851, 10185316, 10163592, 10134887, 10046187, 9950029, 10016358, 10079949, 9923863, 9735280, 9529940]
3529I529940k09106j41107l61995l39252k81222l98664l83208k68054k68049k90040
3519F589243l53040j11404k34475k79255j84791j21018j68239j54055q6896r0329
3509D805741N1343j40713r5728m9009r6494j08651l2258q6595q7589k4182Q667
3498D144532p4009J7876J0953j26114K5869l9111J3752K2706n2669P1429n1651
3487C963563M3319m9126M8962K1068M7894M5004P0564M2271J21736O6606K5699
3476D447560J07848M5227K7407J17297R0339O0733J64401P8749J04921o325m8792
3465E189365k8433R5919J35336K1325K3197J23702J71457Q9102L5628J6260K62116
3454F134974R1448J2890J43904J18906J69400K14518J40866J93793L38847J86035
$$ y = [9529940, 9320834, 9179727, 8817732, 8478480, 8197258, 7798594, 7415386, 7147332, 6879283, 6589243, 6236203, 6124799, 5890324, 5611069, 5426278, 5305260, 5137021, 4982966, 4896070, 4805741, 4857084, 4716371, 4620643, 4571634, 4475140, 4366489, 4334231, 4247636, 4160047, 4135865, 4144532, 4070523, 4088399, 4099352, 3973238, 3999107, 3959996, 3973748, 3996454, 3943785, 4015214, 3963563, 4006882, 3957756, 4006718, 4027786, 4075680, 4120684, 4191248, 4233519, 4355255, 4421861, 4447560, 4555408, 4600635, 4628042, 4745339, 4835678, 4896411, 5060812, 5139561, 5244482, 5238157, 5189365, 5160932, 5256851, 5392187, 5413512, 5436709, 5560411, 5731868, 5820970, 5856598, 5872858, 6134974, 6226422, 6239312, 6383216, 6502122, 6671522, 6886040, 7026906, 7220699, 7559546, 7745581]
3444G745581P6190K63937J92671K17759K13233M04425M36366L76996M92102L90612
3434A0809872K86303M27530L05552J30576O208J2382P278L2226j81353l04229
3424A1532345r8349k49164j11157q6224o6302r9405K4173j3459J15088J25237
3414A1072783Q7591P9059J66831K64563J73836K80061M36302K52928L87592M22110
3404A3623656L09482L93545O66310P47050O62806N62024P34757P28316R05956
3395A9333902R18503R07705J136356J209862J357309J592958J719302J927314
3387C0103211K340060K295949K452504K753095K887822L291076L325279L526061
3379E2975057L648722L729798L592649L252016K945989K193931J373968O75351
$$ y = [7745581, 7821771, 8085708, 8278379, 8496138, 8709371, 9113796, 9550162, 9927158, 10419260, 10809872, 11096175, 11523705, 11829257, 11959833, 11966041, 11978423, 11985701, 12017927, 11836574, 11532345, 11433996, 11184832, 11073675, 10987451, 10921149, 10821744, 10845917, 10832458, 10947546, 11072783, 11160374, 11239433, 11406264, 11670827, 11844663, 12124724, 12561026, 12813954, 13201546, 13623656, 13933138, 14326683, 14992993, 15740043, 16402849, 16964873, 17699630, 18427946, 19333902, 20252405, 21160110, 22296466, 23506328, 24863637, 26456595, 28175897, 30103211, 32443271, 34739220, 37191724, 39944819, 42832641, 46123717, 49448996, 52975057, 56623779, 60353577, 63946226, 67198242, 70144231, 72338162, 73712130, 74387481]
3371G4387481M567n58678r43547j309982j227551j137077q53563p28437n16813
3362F7116400n19694o57204j179824j771730k235510k837527l323270l652530
3354E0939111l790972l556603l453475l260250k757164k513486k239466j943856
3346B7423839j526889j364191j202292j260576j005649q63684q05226o96222o58625
3337A8040485n85614o05628n67858l33425l61984l99244m02221k73269n0455j43158
3327A4317629j94472k53728k20134l87774p4674R8100j49576j20230K5685l8605
3317A3002221l0306Q458j23904N9632K08343L0379J2941n5973n7450J34428R983
3306A3198752m5122k7434O9670r3733j46169q3456o9147j55150j15066o0219k26984
$$ y = [74387481, 74392048, 73833370, 72889823, 71579841, 70352290, 69215213, 68361650, 67633213, 67116400, 66596706, 65939502, 64759678, 62987948, 60752438, 57914911, 54591641, 50939111, 47148139, 43591536, 40138061, 36877811, 34120647, 31607161, 29367695, 27423839, 25896950, 24532759, 23330467, 22069891, 21064242, 20200558, 19395332, 18699110, 18040485, 17454871, 16849243, 16281385, 15947960, 15585976, 15186732, 14784511, 14511242, 14460787, 14317629, 14123157, 13869429, 13649295, 13261521, 13186847, 13284947, 13135371, 13015141, 13040826, 13002221, 12971915, 12980373, 12856469, 12916101, 13124444, 13154823, 13167764, 13111791, 13054341, 13188769, 13198752, 13153630, 13126196, 13195866, 13102133, 12955964, 12872508, 12803361, 12648211, 12533145, 12472926, 12245942]
3295A2245942j82975l24960k86956k53765l60426k10284r8477k84992k32082k59323
3285I751702o3132q4964j47196q8956P2009N2015P4693J09062K3894J16878J32550
3274I948555J76955L06750K06135K11139K91704J67460K40328L38975K80074L59454
3264A2527529J63328K20909M27276L05278L28718J62339K35589K77336K84820
3255A4933122K35936K95994K03001L02916M02296L02267K33834L49261K81560
3246A7540187K64756M59859L95003M31853L33461N03866O62397P77061R66600
3237B2335043R08086J022534J179485J413136J369827J589583K017626K064857
3229C3900177K523670K893713L214333L708589M275991M900038N613016O308075
$$ y = [12245942, 12062967, 11738007, 11451051, 11197286, 10836860, 10626576, 10528099, 10243107, 10011025, 9751702, 9688570, 9603606, 9456410, 9367454, 9439463, 9491478, 9566171, 9675233, 9699127, 9816005, 9948555, 10125510, 10432260, 10638395, 10849534, 11141238, 11308698, 11549026, 11888001, 12168075, 12527529, 12690857, 12911766, 13339042, 13644320, 13973038, 14135377, 14370966, 14648302, 14933122, 15169058, 15465052, 15668053, 15970969, 16373265, 16675532, 16909366, 17258627, 17540187, 17804943, 18264802, 18659805, 19091658, 19425119, 19928985, 20591382, 21368443, 22335043, 23243129, 24265663, 25445148, 26858284, 28228111, 29817694, 31835320, 33900177, 36423847, 39317560, 42531893, 46240482, 50516473, 55416511, 61029527, 67337602]
3221F7337602O936745P982121Q841221R591948J0397950J1018603J1451539J1283552
3213A44841281J0498273Q815056O177158K944011r26284m477375p431315r837423
3205A50603382j1425499j1970604j1624519j0971726r916445q833693p613433
3198G8247463o613287n678535m904863m302279l736312l323731k915982k425404
3190D4347070k155260j917976j716540j472167j310150j087262j046692j002165
3182C2638858r34400o63779n49566n37552k05073l42659j97226j12529j6543Q2026
3172B9161557l6277N4519o827O4359J64969J84386J26382J73304J99089L02385
3162C0387846J60110K18767J09638Q444K12733R9668K01469J57641J13128J82429
$$ y = [67337602, 74274347, 82256468, 91097689, 100689637, 111087587, 122106190, 133557729, 144841281, 155339554, 164154610, 170331768, 173275779, 172349495, 167872120, 160440805, 150603382, 139177883, 127207279, 115582760, 104611034, 94694589, 85860896, 78247463, 71634176, 65955641, 61050778, 56748499, 53012187, 49688456, 46772474, 44347070, 42191810, 40273834, 38557294, 37085127, 35774977, 34687715, 33641023, 32638858, 31704458, 31040679, 30491113, 29953561, 29748488, 29405829, 29208603, 29096074, 29079531, 29161557, 29125280, 29179799, 29172972, 29237331, 29402300, 29586686, 29713068, 29886372, 30085461, 30387846, 30547956, 30766723, 30876361, 30884805, 31097538, 31197206, 31398675, 31556316, 31669444, 31851873]
3152C1851873J97850K11615R8562j13976p4129m6730j29823K648n2490M855Q1376
3141C2031631L3291K20775J10861k721l8296L6192o0189n6061j79805N5395K328
3130C2153401L9187K43848J98098J80341L64490K79909M63805L13584K78730L77955
3120C4893348N03330P21310N26482O88681R74919J005548J206419J375455J637006
3111D3532498J797773K000333K254854K626194K736681K953616L322380L217218
3103F4441547L064330K723537K397189K334101K011505J644625J533387J472030
3095H1622251J537082J591412J916704K213369K382565K371451K331772J913503
3087I7880109J636310J180209N64693j94067j048390j557546j820491k286211
$$ y = [31851873, 32049723, 32261338, 32359900, 32245924, 32171795, 32125065, 31995242, 31997890, 31945400, 31950255, 32031631, 32064922, 32285697, 32396558, 32393837, 32355541, 32391733, 32331544, 32275483, 32095678, 32151073, 32153401, 32192588, 32436436, 32634534, 32814875, 33179365, 33459274, 33923079, 34236663, 34515393, 34893348, 35396678, 36117988, 36644470, 37333151, 38308070, 39313618, 40520037, 41895492, 43532498, 45330271, 47330604, 49585458, 52211652, 54948333, 57901949, 61224329, 64441547, 67505877, 70229414, 72626603, 74960704, 76972209, 78616834, 80150221, 81622251, 83159333, 84750745, 86667449, 88880818, 91263383, 93634834, 95966606, 97880109, 99516419, 100696628, 101261321, 101067254, 100018864, 98461318, 96640827, 94354616]
3079I4354616k304514k101034k160821j822751j564227j234997j135173j511380
3071H0519719j839715k194773k447493l127891l288927l405927l497778l489134
3063E7228081l447057l284524l003301k641776k392840k198721k105216j804916
3055C6349730j652724j284332j177883j050980r32292p86693n81731m88246k46625
3046B8148224k58414L1552j26169n23990n71857n61432n72721n90494l95337l38102
3036B4241260j10261j54205k90613p5437j12045j25124j95554j85251l00373j75276
3026B2517121j81707K3549k33100r4802P4214P91Q4982L0733q940j15607R043
3015B2106277q8744l69321l65806l83351l89730k82372l05737j95035P2583Q2787
$$ y = [94354616, 92050102, 89949068, 87788247, 85965496, 84401269, 83166272, 82031099, 80519719, 78680004, 76485231, 74037738, 70909847, 67620920, 64214993, 60717215, 57228081, 53781024, 50496500, 47493199, 44851423, 42458583, 40259862, 38154646, 36349730, 34697006, 33412674, 32234791, 31183811, 30251519, 29464826, 28883095, 28394849, 28148224, 27889810, 27921362, 27795193, 27271203, 26699346, 26137914, 25565193, 24974699, 24579362, 24241260, 24130999, 23976794, 23686181, 23610744, 23498699, 23373575, 23178021, 22992770, 22692397, 22517121, 22335414, 22358963, 22125863, 22031061, 22105275, 22106066, 22191048, 22221781, 22212841, 22097234, 22106277, 22017533, 21648212, 21282406, 20899055, 20509325, 20226953, 19921216, 19726181, 19798764, 19881551]
3005A9881551R342L3315J65887J96124J22251K09320J01264K85725K04655J47346
2995B1356780o7399R9132J47258J09181J5703J84533J45993j07775n8848K9974
2985B1854532K6111j25301m1254j77805l83885k83394j94973m62009m79683m63219
2975A9269120l00352q7977l48623l06887j12229l0794R7311J14675R6778L91022
2965A8782044L82234M28126M31492N33511Q40271O06384Q29224J010716J145043
2956B4989045J459534J752455J788001K090626K585103L005976L411337L820800
2948D4902877M207993M531135M951399N003398N051677M686602M277402L501600
2940H1114083K507465J281628n2742j417628k626684l756177m602463n060108
$$ y = [19881551, 19890893, 19924208, 20090095, 20286219, 20408470, 20617790, 20719054, 21004779, 21209434, 21356780, 21289381, 21388513, 21535771, 21644952, 21660655, 21845188, 21991181, 21883406, 21824558, 21854532, 21880643, 21755342, 21714088, 21536283, 21152398, 20869004, 20674031, 20212022, 19732339, 19269120, 18968768, 18880791, 18532168, 18225281, 18113052, 18082258, 18179569, 18294244, 18391022, 18782044, 19164278, 19592404, 20023896, 20557407, 21397678, 22004062, 22833286, 23844002, 24989045, 26448579, 28201034, 29989035, 32079661, 34664764, 37670740, 41082077, 44902877, 49110870, 53642005, 58593404, 63596802, 68648479, 73335081, 77612483, 81114083, 83621548, 84903176, 84850434, 83432806, 80806122, 77049945, 72447482, 67387374]
2932F7387374n222568n068880m909857m679755m169873l655230l023932k601607
2924C4055672k357444k109824j941920j758546j293246j244159j188715j082762
2916B1079056j170711r16984r11666q67688p58376o94198p38440n18556n81133
2907A3921304n26937n13293m35095l65781l64330m93343l01870k72444l97123
2898A0251088o0024k61876l42040j59139j64812p1067k06357j72003j80818k16218
2888H416734k49715j28667n2385j34449k64597k91610k25695k09100n2014q7542
2878F720960j54628j23239j38252j14649j62476k01603p4477j4504M32q5150m4033
2867E608381m8311l1136p2816k1600k4893j51235j2515l9560M8678m2310r2634
$$ y = [67387374, 62164806, 57095926, 52186069, 47506314, 43336441, 39681211, 36657279, 34055672, 31698228, 29588404, 27646484, 25887938, 24594692, 23350533, 22161818, 21079056, 19908345, 18991361, 18079695, 17212007, 16453631, 15759433, 15020993, 14502437, 13921304, 13394367, 12881074, 12445979, 12080198, 11715868, 11222525, 10920655, 10648211, 10251088, 10191064, 9929188, 9587148, 9428009, 9263197, 9192130, 8985773, 8813770, 8632952, 8416734, 8167019, 8038352, 7985967, 7851518, 7586921, 7295311, 7069616, 6860516, 6808502, 6720960, 6566332, 6443093, 6304841, 6190192, 6027716, 5826113, 5751636, 5737132, 5737564, 5652414, 5608381, 5560070, 5528934, 5456118, 5434518, 5409625, 5258390, 5245875, 5206315, 5254993, 5212683, 5120049]
2856E120049k5091N4343j9738o3102k00183n50P8102q2710O3927j5043N7290M9645
2844E016939L3034M4092n6034J12738J13616j20404Q1395L1425l7039J4550M5632
2833E279944n8755J69045M7884q6508L0183p3116P4132J42467J02654j4520L8967
2822E652377r599Q2019J05103m0095J38972l9040O8151P5018J25882J17964M2900
2811F319652J47453j9455Q3745J40717J15689J94147J40127m9423K21369J40086
2801G434107O5172K01282P5267J85350K81368J40171J57471N8420J22559K69643
2791H990810L50587K55090K45799L44994K77362L00528K88135K69678M08374M98766
2781A2230123L79942M09497M57054N44350N47722O41210N86294N53285O89537
$$ y = [5120049, 5094958, 5149301, 5129563, 5066461, 4866278, 4865728, 4943830, 4861120, 4925047, 4910004, 4967294, 5016939, 5049973, 5094065, 5038031, 5150769, 5264385, 5143981, 5225376, 5256801, 5219762, 5234312, 5279944, 5221189, 5390234, 5438118, 5351610, 5381793, 5308677, 5382809, 5525276, 5627930, 5613410, 5652377, 5642778, 5724797, 5829900, 5789805, 5928777, 5889737, 5957888, 6032906, 6158788, 6276752, 6319652, 6467105, 6447650, 6531395, 6672112, 6787801, 6981948, 7122075, 7072652, 7294021, 7434107, 7499279, 7700561, 7775828, 7961178, 8242546, 8382717, 8540188, 8598608, 8721167, 8990810, 9341397, 9596487, 9842286, 10187280, 10464642, 10765170, 11053305, 11322983, 11731357, 12230123, 12610065, 13019562, 13476616, 14020966, 14568688, 15209898, 15796192, 16349477, 17039014]
2772A7039014O13135P09185Q62077P33924P19060R73681J066457J039569J197887
2763B4953989J447933J280233J655210J962968J945349K216890K226293K412580
2755D0101445K482759K597808K800719K742428K653731K927246K922880L329283
2747F2558299L750467M055833M438110M208100K826176M31677j895852l396074
2739G6976736l857615m097510l724625k791668j906914j209261n79277k07734
2731E8602132L41063Q91304J441395J985870K419850L321342M354615N193481
2723G8551052O256698P448528Q804530J0090534J1134714J2651618J4219135J6300642
2715A65457451J9025930K2850609K7194718L0277628K9973189K2382364O533840
$$ y = [17039014, 17652149, 18361334, 19223411, 19957335, 20676395, 21650076, 22716533, 23756102, 24953989, 26401922, 27682155, 29337365, 31300333, 33245682, 35462572, 37688865, 40101445, 42584204, 45182012, 47982731, 50725159, 53378890, 56306136, 59229016, 62558299, 66308766, 70364599, 74802709, 79010809, 81836985, 82268662, 80372810, 76976736, 73119121, 69021611, 65296986, 62505318, 60598404, 59389143, 58809866, 58602132, 58943195, 59834499, 61275894, 63261764, 65681614, 69002956, 73357571, 78551052, 84807750, 92256278, 101060808, 111151342, 122286056, 134937674, 149156809, 165457451, 184483381, 207333990, 234528708, 264806336, 294779525, 317161889, 323695729]
2708C23695729j0167059k1274510k7660584l0263655k9030248k5001708j9950309
2701A60347656j5908564j3087328j0983008r718946q980485q086855p388988o845611
2693G9347871o064447n335861m689640m171066l633144l244581k938866k720791
2685D6549475k366560j923772j869885j656820j498345j535672j330642j309355
2677C3058424j168085j077374j118055j076540j001418r70604q99055q31315q90878
2668B4025100q29674o91779o37773q84100o90000n98055p90064o37939p66655
2659A7499061n95695n00508n09266n80027l55387l83738l96211m16480m15855
2650A3345894l63912l57965m63029k96131k44608k51123l29960j87882j42576
$$ y = [323695729, 313528670, 292254160, 264593576, 234329921, 205299673, 180297965, 160347656, 144439092, 131351764, 120368756, 110649810, 101669325, 93582470, 86193482, 79347871, 73283424, 67947563, 63257923, 59086857, 55453713, 52209132, 49270266, 46549475, 44182915, 42259143, 40389258, 38732438, 37234093, 35698421, 34367779, 33058424, 31890339, 30812965, 29694910, 28618370, 27616952, 26646348, 25747293, 24915978, 24025100, 23195426, 22503647, 21865874, 20981774, 20291774, 19693719, 18903655, 18265716, 17499061, 16903366, 16402858, 15893592, 15313565, 14958178, 14574440, 14178229, 13761749, 13345894, 12981982, 12624017, 12160988, 11864857, 11620249, 11369126, 11039166, 10851284, 10708708]
2641A0708708k00343k88480j94749j07402k81788k18085l16244r3815k41287j91633
2631H574882j57007k15463k44914j98986k38931j89317j82741j38514o2951k73500
2621F672558k36703L9732j14473k30142j41513p4154p6307q6303j39050k56299
2611E357346q6858J0813k80218q2324Q1274j44436j32957q9881r8071J6412j12814
2600D438286j13780j02153j20599n5627J5635j01263j42869o2134l5941o9692
2590C649863N3308k4510j43218j24417p668j0839l6397j45449k042p1007q8433
2579C049191O4113j10592P3938j05437q9125J9480L8357n8430j4611l9491L7298
2568B864691o3109p9392q348j32072P0349m9602m0953o8535n4175O4077n2768
$$ y = [10708708, 10508365, 10219885, 10025136, 9917734, 9635946, 9417861, 9101617, 9007802, 8766515, 8574882, 8417875, 8202412, 7957498, 7758512, 7519581, 7330264, 7147523, 7009009, 6946058, 6672558, 6435855, 6475587, 6361114, 6130972, 5989459, 5915305, 5838998, 5752695, 5613645, 5357346, 5270488, 5281301, 5001083, 4918759, 5000033, 4855597, 4722640, 4632759, 4534688, 4551100, 4438286, 4324506, 4222353, 4101754, 4046127, 4061762, 3960499, 3817630, 3755496, 3719555, 3649863, 3703171, 3678661, 3535443, 3411026, 3403358, 3392519, 3356122, 3210673, 3208631, 3137624, 3049191, 3113304, 3002712, 3076650, 2971213, 2882088, 2901568, 2939925, 2881495, 2866884, 2827393, 2864691, 2801582, 2722190, 2713842, 2581770, 2652119, 2602517, 2561564, 2493029, 2438854, 2502931, 2450163]
2557B450163M7103q7487j31599M4886R9606m6368n3545N9543l0475j09052j38448
2546B104327n0797R9504K910q7160p1191L5260j17950j4954J01240j54624K7198
2535A873763M7634q0102k68K5749N0436j04457k556O8547j31356J4703l1923r4464
2523A635706M3148J2099K4230j10861j8003P3873K4661Q1767j24281n6851M0305
2512A625793j26243R5202O1546k9707j0017m3163p489q2050O5979k3795N8657
2501A584713n2570q1020M9097k2046P3267n9492k3735K4901m3432k0186J06940
2490A536437N5972m0958N8136R5811k1538J0618p6582j27554m0362J6831k7308
2479A439503l8926k6232R015M7711n1700K4358m6805K7098K4969R828M7553n1734
$$ y = [2450163, 2497266, 2409779, 2278180, 2323066, 2422672, 2376304, 2322759, 2382302, 2351827, 2242775, 2104327, 2053530, 2153034, 2155944, 2068784, 1997593, 2032853, 1914903, 1899949, 2001189, 1846565, 1873763, 1921397, 1841295, 1841027, 1866776, 1917212, 1812755, 1810199, 1878746, 1747390, 1762093, 1730170, 1635706, 1678854, 1690953, 1715183, 1604322, 1586319, 1660192, 1684853, 1766620, 1642339, 1585488, 1625793, 1499550, 1594752, 1656298, 1626591, 1616574, 1573411, 1565922, 1483872, 1549851, 1526056, 1584713, 1532143, 1451123, 1500220, 1478174, 1551441, 1491949, 1468214, 1493115, 1449683, 1429497, 1536437, 1592409, 1551451, 1609587, 1705398, 1683860, 1694478, 1617896, 1490342, 1449980, 1466811, 1439503, 1400577, 1374345, 1383360, 1431071, 1379371, 1403729, 1356924, 1384022, 1408991, 1418819, 1466372, 1414638]
2467A414638o7524P2526Q680R5044M1345K1380J41155Q6192k5750J84272J46886
2456B118844J58366R4437R3745k7040j41122R5719k46605p6861j63651j05795
2446A800037j73968J0086j0470r7376m2986j34865j38845n786M2363r5058L181
2435A156313m1451j1044l5747o476r0164o1263Q7380J12110q0500j15170J27123
2424A041111j00705o9792J0428m8715M9307j7920j21817J20589r64n5895l8698
2413G66929r6561P5906K6973n9902m385n582p8918n8355R0615k4993m0432M635
2401E95930q5193n98R3083M7262K4699Q4299J1303j37269q7011R9677q9586N7243
2389F13839l859K6166j34867l6732O3917Q9376n1082k4907r636Q2457k8006r0872
$$ y = [1414638, 1347114, 1419640, 1428320, 1523364, 1564709, 1586089, 1727244, 1813436, 1787686, 1971958, 2118844, 2277210, 2371647, 2465392, 2438352, 2297230, 2392949, 2146344, 2069483, 1905832, 1800037, 1626069, 1636155, 1625685, 1528309, 1485323, 1350458, 1211613, 1205827, 1248190, 1153132, 1156313, 1114862, 1103818, 1068071, 1061595, 971431, 910168, 997548, 1109658, 1029158, 913988, 1041111, 940406, 870614, 881042, 832327, 881634, 863714, 741897, 862486, 861522, 805627, 766929, 670368, 746274, 773247, 713345, 708960, 703378, 624460, 566105, 656720, 631727, 591295, 595930, 510737, 510139, 603222, 650484, 675183, 759482, 770785, 633516, 546505, 646182, 556596, 613839, 609980, 636146, 501279, 464547, 528464, 617840, 566758, 541851, 532215, 614672, 586666, 495794]
2377D95794l2977P1222J34759P09j12392M1615j5670j49781J19473J4888r2401
2366D75239M9598J35244k5601p2298K9188J4625o9600J3735l7442m9169J54530
2355F18049p278o0197l0825N255Q2416K3898r333j39473j5816L186L1270J3128
2343E14280m7890o6254N8493j04275L9324O0025j22812l951O8418j8112M4857
2332D22103p0936O4891m1037O0627j1185k7450J08920j4774Q409j37017N0802
2321D13353r2608P6127K11572o8416j33940l6399J60883N1783j83615J0025L4692
2310D43457K7980O296o2691J1041M8539n0733l6410J9524n472K14456K3488j56258
2298D83217j24431N1040J21865J30726q3204k25677P5009L7512j9020n1909n1858
$$ y = [495794, 462817, 534039, 668798, 669507, 557115, 598730, 583060, 433279, 552752, 567640, 475239, 524837, 660081, 634480, 562182, 591370, 605995, 536395, 550130, 512688, 463519, 618049, 610771, 550574, 519749, 525004, 607420, 631318, 621985, 482512, 466696, 469882, 501152, 514280, 466390, 400136, 458629, 354354, 393678, 453703, 330891, 326940, 395358, 377246, 422103, 351167, 416058, 375021, 435648, 424463, 397013, 505933, 491159, 499568, 362551, 413353, 320745, 396872, 608444, 540028, 406088, 369689, 530572, 582355, 398740, 408765, 443457, 471437, 477733, 415042, 426083, 474622, 423889, 387479, 407003, 401531, 615987, 639475, 483217, 358786, 409826, 531691, 662417, 579213, 353536, 428545, 466057, 447037, 395128, 343270]
2287C43270L8762J15355p8902j9126K0736l748m0851J50644M0302j32772m6254
2276C87416k5821p259J6506k2697j25670R0287M2971P3561J04578l1502r1715
2265D10655l4085K8978j15421J13928j4347n6211n443L5731p1058L1364J02630
2254D26721n5361K9046j06483J30151j02594l9258K9141j46796M8400k7064R0941
2243B76844O294r7581J0546K3248M4675O7665p2584O5886M2259M7408P7350j50968
2231C41042R804p2357M2853p26j0335k5983Q8900j22467K7688P3463J5309M9562
2219D16753j182p3208o6885n32J92673o6381Q483Q4588j01941j11105J18117J275
2207D00655n162q0672O038J45964k4130m468j61195M1545O1298q5060k1960M0317
$$ y = [343270, 382032, 497387, 418485, 399359, 420095, 416347, 375496, 526140, 566442, 433670, 387416, 361595, 354336, 370842, 348145, 222475, 312762, 355733, 429294, 533872, 502370, 410655, 376570, 405548, 290127, 404055, 389708, 333497, 328054, 363785, 292727, 324091, 426721, 371360, 400406, 293923, 424074, 321480, 282222, 311363, 164567, 212967, 185903, 276844, 283138, 185557, 196103, 219351, 264026, 331691, 259107, 324993, 367252, 414660, 492010, 341042, 350846, 278489, 321342, 320616, 310281, 284298, 373198, 250731, 278419, 351882, 367191, 416753, 415571, 342363, 275478, 274946, 467619, 401238, 409721, 494309, 392368, 281263, 399380, 400655, 395493, 314821, 320859, 466823, 442693, 438225, 277030, 318575, 379873, 294813, 272853, 313170]
2195C13170j34966J9080J30067N1068m1146O1522j9607K5696P591l8284J30913
2184E05104k5584l4452n2442o3948n258O9219J58666p5629m4210L05j0017p3006
2172C48748l72P3374N2182j631k3557o7323q123L9063M6543M6427q701q3823J04420
2159E17227k1354k694K3122N4597k9312p7540P3317k0793k8459Q9894o0622O7050
2147E84433q0388M9043K3440l767l3142K7250P592n4285O929m0443R8777l047
2135E82392q5496L0142K1026q215O1499J01712N8304P3054k2629Q487N539J29834
2123I55649p6737Q452K9420k5887Q1823N6292q508j16344m5454J07342J00619
2112A066667j12751P720J02253J3930J8583J18020k1518n5033k9505l2806J13568
$$ y = [313170, 178204, 197284, 327351, 378419, 337273, 398795, 379188, 404884, 412475, 374191, 505104, 479520, 445068, 392626, 328678, 323420, 392639, 551305, 475676, 431466, 431771, 421754, 348748, 348376, 421750, 473932, 472301, 448744, 381421, 373298, 412361, 458904, 505331, 496630, 412807, 517227, 495873, 493179, 516301, 570898, 541586, 464046, 537363, 516570, 488111, 578005, 517383, 584433, 504045, 553088, 576528, 572761, 539619, 566869, 574461, 520176, 527105, 486662, 585439, 582392, 496896, 527038, 548064, 539849, 601348, 703060, 761364, 834418, 811789, 820276, 825815, 955649, 878912, 887364, 916784, 890897, 972720, 1029012, 1020504, 904160, 858706, 966048, 1066667, 953916, 961636, 1063889, 1077819, 1096402, 1214422, 1192904, 1137871, 1108366, 1075560, 1189128]
2101A189128J01492J46684l3567q2939J65976K6112M0806P4257O1286L6144L0218
2090A755597Q1513J76725K52312r0258N0997L67215K12756l3691l4122L56379
2080C095423K31791K68092K10421K76792K28039M87519M44489N74440N53102P57159
2070G127267O81614P46692Q99086J023015J267243J610242J846397K217545K952681
2061B0371782M189529M871595N928764J789504l187834l743288l453281m328694
2053B2438077m437191k970611k234667j455928j346968q99636o33099m82324o06087
2044G371566o69258m80239m00852m22624m19204l39380l91663j54324j31096k43693
2034C719233k18790k47601p0978j31850j32750l4600J60785k45392r4684j86945
$$ y = [1189128, 1290620, 1437304, 1403737, 1320798, 1486774, 1512886, 1553692, 1627949, 1689235, 1725379, 1755597, 1837110, 2013835, 2266147, 2175889, 2226886, 2594101, 2806857, 2773166, 2739044, 3095423, 3327214, 3595306, 3805727, 4082519, 4310558, 4798077, 5242566, 5817006, 6370108, 7127267, 7808881, 8555573, 9454659, 10477674, 11744917, 13355159, 15201556, 17419101, 20371782, 24561311, 29432906, 35361670, 37151174, 33963340, 30220052, 26766771, 22438077, 18000886, 15030275, 12795608, 11339680, 9992712, 9093076, 8459977, 7977653, 7371566, 6702308, 6222069, 5821217, 5398593, 4979389, 4640009, 4248346, 4094022, 3962926, 3719233, 3500443, 3252842, 3181864, 3050014, 2917264, 2882664, 3043449, 2798057, 2703373, 2516428]
2024B516428r4548r5824l8789j58137q9637p47j02460n457q047k3570j23465m4922
2012A730825J3159n5297j24520n5451n032r8775K6616R82l7901m55p8423O360
2000A322088j14531p733J19314m8881j62981r547M6691j19962Q410j29565R316
1989I12619k0494o0184J25369N104q5652L3374J1587J5237Q919r1809k37680J23839
1977G40229q1961q655Q7513n8683R2803k9885l2389p6888n8856M0921m0850J10823
1965F84122P348j95056Q0243N903N9063r0332j04834n1356J4770R8428m9449q7566
1953C71284R7803l257J0636N0173n9103K0930r798j02681L7409k7118j1189J341
1941C76430l4929j5086J7235l387L2317O4713J6447r0813l277J2962R807m6585
$$ y = [2516428, 2421880, 2326056, 2287267, 2129130, 2039493, 2038746, 1936286, 1930829, 1922782, 1899212, 1775747, 1730825, 1743984, 1688687, 1564167, 1508716, 1503684, 1404909, 1431525, 1432507, 1394606, 1394151, 1315728, 1322088, 1207557, 1199824, 1319138, 1270257, 1107276, 1097729, 1144420, 1024458, 1032868, 903303, 912619, 892125, 831941, 957310, 962414, 876762, 910136, 921723, 936960, 945879, 854070, 616390, 740229, 658268, 649613, 737126, 678443, 771246, 741361, 708972, 632084, 573228, 614149, 573299, 684122, 691470, 496414, 576657, 582560, 641623, 551291, 446457, 395101, 409871, 508299, 458850, 371284, 469087, 465830, 476466, 526639, 467536, 488466, 478668, 375987, 413396, 386278, 375089, 376430, 341501, 326415, 343650, 340263, 372580, 437293, 453740, 362927, 359650, 372612, 382419, 335834]
1929C35834l6403J5875P950n7394n4756R2362J31270j086p1907o0002k5668j1378
1917B64697O0295l2305m4988R5870O115J3796l4354l1607K1701P7833p1129k6017
1905B99907k6360Q2287Q0278j1762j25101r535j8893l4318j03625M0563J02093
1894B75534K4758L745O5261J7713q4942k5565O563j05198j07525R7576J1468o779
1882A72609O4210L5916J12497k3709n2452r1284P7651Q6993k5186j15990n4270
1871A86985K9522N5250J16892j07557l4203j03996p429J21557O966r3145J6285
1860A87127j1421K4591J6489J559o9335J24464p9058k1586j2900J12007P5686
1849C47623r0699K5398K1263m2556l684P658k9839k1315k7358n7106J13489L8859
$$ y = [335834, 299431, 315306, 323256, 265862, 211106, 303468, 434738, 433652, 361745, 301743, 276075, 264697, 324992, 292687, 247699, 343569, 349684, 363480, 329126, 297519, 319220, 397053, 325924, 299907, 273547, 355834, 436112, 424350, 299249, 289714, 270821, 236503, 132878, 173441, 275534, 300292, 304037, 369298, 387011, 302069, 276504, 283067, 177869, 70344, 167920, 179388, 172609, 236819, 272735, 385232, 361523, 309071, 217787, 295438, 382431, 357245, 241255, 186985, 216507, 271757, 388649, 281092, 246889, 142893, 135464, 257021, 263987, 170842, 187127, 175706, 200297, 216786, 218345, 149010, 273474, 194416, 172830, 159930, 271937, 347623, 256924, 282322, 303585, 261029, 257345, 265003, 235164, 213849, 186491, 129385, 242874, 281733]
1837B81733r950J7125j57574q6039J40409J00159N5842r3454Q6461k0413j14566
1826A99733p118M8968n8985p2078Q9282L2416O9201j01483N2191J14424n7495
1815C09056j07612J28437n6799l76j9414N8434j33152j50511J40534m5946J43366
1804B66017k3527j11517l3834P820K4708P2667L6863o410P8482j35484j07579
1793F8206O0965M28R4091k7510l7580k535j38097R6505N2821o3597N7479J34644
1781B95820l1610k1741J3966K8348K2882p3961n2272n9980m5142K6627J8165M8375
1769A69477L6247m249J2045n5968l9301m6413l0695L9862L143J0856N1135N8296
1757B04435k2826k5081l6637l5786R0467n7321M9950k589j06620m1186J51507
$$ y = [281733, 271783, 288908, 131334, 45295, 185704, 285863, 341705, 248251, 334712, 314299, 199733, 192615, 241583, 182598, 110520, 199802, 232218, 301419, 199936, 252127, 366551, 309056, 201444, 329881, 273082, 272706, 253292, 311726, 178574, 28063, 168597, 122651, 266017, 242490, 130973, 97139, 104959, 129667, 202334, 239197, 232787, 311269, 175785, 68206, 129171, 129599, 223690, 196180, 158600, 156065, 17968, 114473, 167294, 103697, 161176, 295820, 264210, 242469, 256435, 284783, 307665, 233704, 181432, 121452, 76310, 102937, 121102, 169477, 205724, 201475, 213520, 157552, 118251, 71838, 41143, 81005, 84148, 95004, 146139, 204435, 181609, 156528, 119891, 84105, 174572, 117251, 167201, 164612, 57992, 16806, 168313]
1746A68313J06935j41469k0971Q1581J6526o9578K1141j06818M1838N2703J1715
1735A61916n4175N713J8646J63934o8591o7773j00045j9491P1939N0873M0845
1724B03791P591o8172q0312M5121J7934N083q7888N7082K8101J0645L4791r8741
1712G5026L579j8009l349L30Q7062J9448j6888P2471n2508m1256q2333L9466J31133
1699B14172n1843N593N0673j683k2951o1866k371m1240j935q7440l4172J049K8742
1686e272J30159j09397q1382K5736J00333J26868l2365j0570N529j89200L1752
1675g809J28674m2218M7052O3569L6605r935k7435M0298p5982j51265m4031K43070
1663B00593Q9169j26268M6042R964l9372n8369J1129L6764m3972p6546P8645j04542
$$ y = [168313, 275248, 133779, 112808, 194389, 210915, 141337, 162478, 55660, 97498, 150201, 161916, 107741, 113454, 132100, 296034, 227443, 159670, 59625, 40134, 112073, 162946, 203791, 211382, 143210, 62898, 108019, 125953, 131036, 43148, 100230, 128331, 138976, 173767, 75026, 78605, 60596, 57247, 57577, 144639, 164087, 147199, 219670, 167162, 125906, 43573, 83039, 214172, 162329, 167922, 218595, 216912, 193961, 132095, 129724, 88484, 86549, -891, -35063, -34014, -5272, 124887, 15490, -65892, -40156, 60177, 187045, 154680, 144110, 149639, -39561, -7809, 120865, 78647, 125699, 189268, 225873, 215938, 188503, 228801, 152819, 1554, -42477, 200593, 289762, 163494, 209536, 219500, 180128, 121759, 132888, 169652, 125680, 49134, 127779, 23237]
1651B3237m2601N7447P3390m3359K9897O2474n8840l9029J8924M488K5021j12541
1639a492l2975J4751O1782K1775L8879m2067n135r3614l1053J42203K5179j09699
1627a1466P0547n6258Q0082M5776r7431m8940K6067N9863R7362M5567r7224r8466
1615A5479N3751J01352p1197l8132n4999j2423R9473q7178L7997N6406q9877L6383
1603D7035J4698P5592o1378J36130O0248p2584j77392o0851J06884J17187j05237
1592H0332n5263P6851p5046O7038P4858j8372l3693J3328M6261j21108P3443P3720
1580B02349k7145j27344l2866J18902r4373k1954K0488Q3362l4692j62515L5396
1569d0392Q4353R7592n0265J1267J08664r6836k5365K8122l1544q3024J01182
$$ y = [23237, -19364, 38083, 111473, 68114, 98011, 160485, 101645, 62616, 81540, 86028, 111049, -1492, -34467, -19716, 42066, 63841, 102720, 60653, 55518, -38096, -69149, 73054, 98233, -11466, 59081, 2823, 82905, 128681, 31250, -17690, 8377, 68240, 165602, 211169, 113945, 15479, 69230, 170582, 99385, 61253, 6254, -6169, 93304, 6126, 44123, 100529, 10652, 47035, 61733, 137325, 75947, 212077, 272325, 199741, 22349, -38502, 68382, 185569, 80332, 25069, 101920, 26874, 93912, 168770, 150398, 116705, 130033, 176294, 55186, 128629, 202349, 175204, 47860, 14994, 133896, 39523, 17569, 38057, 121419, 86727, -75788, -40392, 43961, 141553, 91288, 102555, 211219, 114383, 89018, 117140, 85596, 2572, 103754]
1558A03754J12641j52730Q9818P7099j4346N300p9677j9605Q3650m0295j34908
1547C0701j4687j015k6914M4023J0684P1355k968P8625j6569q2188R748K185j19793
1534a6813q3947J33114J8082J2553J86043j957j74799j16204N2838P2690N5296
1523A36896r26q7133J7167o5797r935M0654Q313J36109R010j09446L5139N2031
1511A62082l3285j05428P5055M1279p9161M7707L6152l3943q5853l4731k8025
1500c8151j7487M7122J41529O7792j17169N4886k5165q8306P1196m056p5959n4429
1488c8197J26971K1121k4914r9479L8546O5893o7711l0135P1487J2586m2970k2819
1476A0379K4516o954O700P3899J5100n5642p0988p7544M27L2043L6253K1697J6660
$$ y = [103754, 216395, 63665, 153483, 230582, 216236, 221536, 141859, 122254, 205904, 165609, 30701, 16014, 14999, -11915, 32108, 42792, 114147, 111179, 189804, 173235, 91047, 100795, 102980, -16813, -100760, 32354, 50436, 62989, 249032, 247075, 72276, -43928, 8910, 81600, 136896, 135970, 48837, 66004, 207, -9728, 30926, 39239, 175348, 184358, 74912, 110051, 162082, 128797, 23369, 98424, 139703, 60542, 108249, 144401, 110458, 24605, -10126, -38151, -55638, -8516, 133013, 200805, 83636, 138522, 113357, 25051, 96247, 92191, 16232, -38197, 88774, 109895, 84981, -14498, 24048, 89941, 22230, -7905, 63582, 76168, 33198, 10379, 34895, 27941, 34641, 108540, 123640, 67998, -2990, -80534, -80107, -48064, -11811, 9886, 26546]
1463B6546L5485O0541N3053j66187L2312O908K8215P6566p3292N2127k3709j49140
1451d0575J32848J52294j85305R820J9527o7532R7717n9275K291N0261l5231o8108
1439H732M3616J39997K3486p5361r9245J4751K0099q7815J15265J0233k2571m0337
1427E0850j0054l9636O8585K6676p4822M375l2446q2352M7184J26562J04485L3186
1415B22593j13070k2003L4555L3432k5094n7064P9940m1674p5834J000O779o1679
1403a8119M333R4165p5002j2107M4833k1115K9036K4210J3597n7532K0645l7440
1391I504J2520n9227J27520j1848J8452J10742j00341j6285l2367n9801m2767
1380d3898P0482K7889N3182J3020k11380O6029K7300q344j21549q7760J30691
$$ y = [26546, 62031, 122572, 175625, 9438, 41750, 48658, 76873, 153439, 80147, 132274, 108565, -40575, 92273, 244567, 59262, 69082, 88609, 21077, 118794, 59519, 61810, 112071, 76840, 8732, 52348, 192345, 215831, 140470, 41225, 55976, 76075, -11740, 103525, 113758, 91187, 50850, 40796, 1160, 69745, 96421, 21599, 25974, -6472, -88824, -41640, 84922, 189407, 222593, 109523, 87520, 122075, 155507, 130413, 73349, 153289, 111615, 35781, 36781, 43560, -18119, -13786, 80379, 5377, -6730, 38103, 16988, 46024, 70234, 83831, 26299, 46944, 9504, 22024, -37203, 90317, 78469, 96921, 207663, 107322, 91037, 58670, -1131, -43898, 26584, 54473, 107655, 120675, -90705, -24676, 2624, -5720, -127269, -215029, -84338]
1369h4338R9235Q3598o4322L9376J7k2353L113Q3885J2507q0595p4437N7777l3410
1356B0053K2734r6529n9999J7716P4868M6737m9610O2452l9549m1690O2065K6319
1344D5567M7350R5221p4918j51350J11888K4404k5748O683N7704j41044M0098
1333C5855J0214j4195J4582l2361N5586j34949M4298J24078K7699j57514N9017
1322C2310k8870n099l4329J9769J40256m7275n9935o7559O3529L0044K0957j14667
1310e0869j5668P0098L1140P0877j973m1217j8721j2210K9139J10216n5397o8945
1298D6470K3385l1980J1220k1282L0194k0161J09601j9507m2598m2322j9079K9477
1286E3418n1843J4005K4505q2696j1938M6746L1958o7936R3891K6612J40736J9583
$$ y = [-84338, 14897, 98495, 34173, 73549, 73566, 51213, 54326, 138211, 150718, 70123, -4314, 53463, 20053, 42787, -53742, -113741, -96025, -21157, 25580, -24030, 38422, -1127, -42817, 19248, 45567, 92917, 188138, 113220, -38130, 73758, 98162, 72414, 79097, 136801, -4243, 35855, 46069, 31874, 46456, 14095, 69681, -65268, -20970, 103108, 130807, -26707, 32310, 3440, -1659, -35988, -16219, 124037, 76762, 16827, -50732, 12797, 42841, 63798, -50869, -66537, 3561, 34701, 105578, 103605, 62388, 43667, 31457, 60596, 170812, 115415, 46470, 69855, 37875, 49095, 27813, 58007, 37846, 147447, 127940, 85342, 43020, 23941, 53418, 1575, 15580, 40085, -42611, -54549, -7803, 24155, -43781, 50110, 76722, 217458, 237041]
1274B37041k1341L9130j11142j05716J6696j03513k424J96291j06786p3374m8364
1263h3502L598K4062q793n4254M0551M8043Q1876k6064j6994j7797O9184j26685
1251f6775J0538Q9761R786o3029l222n2721L7083J3384P8510M8760j88135J2951
1239g3109N6306K4404L7312P4136q2790k844k1107j6800R3196j30219N2144R9351
1227A09980P5456o0968p3195k2313m9596L2690J4050P1787j23338m0677M4404
1216b1720Q4305j56337l1374K6549R176R8853K3057J5645l3251J7256o9296N2728
1204A5591J02757l3892N5446j19231p3335J19927m202L9209o9906r8235m8091
1193a13962M6300M5633K4528K1361p9739j4753Q8715o6204J7476J07608j1182
$$ y = [237041, 215700, 254830, 143688, 37972, 54668, -48845, -51269, 145022, 38236, -35138, -83502, -79904, -55842, -64635, -118889, -78338, -30295, 51581, 25517, 8523, -9274, 59910, -66775, -56237, 33524, 43310, -19719, -22941, -75662, -38579, -25195, 53315, 102075, -86060, -73109, -16803, 7601, 44913, 119049, 36259, 33415, 12308, -4492, 88704, -41515, 10629, 109980, 185436, 124468, 51273, 28960, -20636, 12054, 26104, 97891, -25447, -66124, -21720, 62585, -93752, -125126, -98577, -89401, 9452, 32509, 48154, 14903, 32159, -37137, 15591, 118348, 84456, 139902, 20671, -52664, 67263, 63061, 102270, 32364, -65871, -113962, -67662, -22029, 2499, 23860, -55879, -70632, 18083, -48121, -30645, 76963, 65781]
1182F5781n8969l5090m4230L4712p4481L9563Q4047j0911k9479J5642k1828j3926
1170d9169k7793P5641m7523j3471N9471N4754N6097l2175m7160n6874Q4951Q9358
1158A46107j9989p6276p7321k952J2156J815o7267L4101Q2590m3462O9821j17163
1146e7840P3564L8535M4386p4143N8830r5231q5046R1904l0962r730m3569R0963
1134A661L6130L1765j0103l1404Q1309j6980o3901j18096n4111M5043o7892J15123
1122e1456n1324n7349j5573K19842J7343j9516l8254j14350m1756J53061o7755
1111f7087j60143J02507J7067J00419l2775J09831o5033P4089n1193j7317O0671
1100G1036O2970p4232j8353O9052r5653K4757p7943l1781J22519q1962o3252J27706
$$ y = [65781, 6812, -28278, -72508, -37796, -112277, -72714, 11333, 422, -29057, -13415, -35243, -49169, -76962, -1321, -48844, -62315, -2844, 51910, 108007, 75832, 28672, -28202, 56749, 146107, 126118, 49842, -27479, -30431, -18275, -16460, -83727, -49626, 32964, -10498, 59323, -57840, 15724, 54259, 98645, 24502, 83332, -11899, -96945, -5041, -36003, -45733, -89302, 1661, 37791, 69556, 59453, 28049, 109358, 92378, 28477, -89619, -143730, -98687, -166579, -51456, -102780, -160129, -175702, 44140, 61483, 41967, 3713, -110637, -152393, 668, -67087, -227230, -124723, -107656, -7237, -40012, 69819, 4786, 78875, 27682, 10365, 71036, 134006, 59774, 41421, 110473, 14820, 39577, -38366, -70147, 52372, -29590, -92842, 34864]
1088C4864O464o4576j240O6932L3862Q159q8673r3638J19515J516r8113M0862
1076c4066m7397M3627L7498N0798K1094j15203P5207Q6143J39718j34263j37015
1065a3859N8843q205j25544k1228R5393M4196k8156j38665L5129J89737q2105
1054E536k17M1626p4312n0341J5158P3259m4066N7746n743J6905j8491N0249l5800
1041C1509q3574l4213m0258L0783J00243N8941j18295O8857r2665Q5267n545l3680
1029c2630p0472j1981R2971P2009J07341l8112O615m9851r0282n8282l4262m42
1017a07378O6310L9916k5123k9946K9365L6307j1737K5045M3257l7694P5405L8126
1005A41853j56335L3892N6131m7173r7212k0430R531l1179J75854o7362r538n0348
$$ y = [34864, 41328, -23248, -24488, 42444, 76306, 84465, -4208, -97846, 21669, 23185, -74928, -34066, -81463, -37836, -338, 50460, 71554, -43649, 31558, 117701, 257419, 123156, -13859, 44984, 36779, -88765, -109993, -14600, 29596, 1440, -137225, -102096, 87641, 5536, 5319, 46945, -27367, -77708, -62550, 10709, -33357, 24389, 18646, 35551, 17060, 67309, 31509, -52065, -86278, -126536, -95753, 4490, 63431, -54864, 13993, -78672, 6595, 1050, -32630, -103102, -115083, -22112, 49897, 157238, 119126, 125741, 75890, -14392, -72674, -106936, -107378, -41068, -1152, -26275, -56221, -26856, 9451, -2286, 22759, 66016, 28322, 103727, 141853, -14482, 19410, 75541, 28368, -68844, -89274, -79743, -110922, 64932, -2430, -11968, -62316]
993f2316J0149J87918l1370j6470J7246l8881o6496K9670Q8645j33071J77006
982A62030j7599n7849M1212m2667r1195N4316o1075K6083n0684n9197o813L3269
970g0169N1619M8422l3927J50982n3945k5532k319o5248J2966N1888J01702m3547
958A22892N412j29593J6040l9414L2331L1278p3819O7358J27933r5366j739l2024
946C1289p73N3508l2341r383n0859l6474l6665p8123J3768l242K52096j9181j01090
933a7470o746l4066O5640j21825p9117J95607P3353m3070K136J25701k5089o3725
921G1329j3572j07675K0938J4592q2903O2503j3931j0917Q802P9714R1156j0674
909A09362q1429m759J21502p2830q1313o3636P9812N6392K2854J4687J2415m1987
$$ y = [-62316, -52167, 135751, 104381, 87911, 105157, 66276, -220, 29450, 118095, -14976, 162030, 144431, 86582, 127794, 85127, -6068, 48248, -12827, 13256, -37428, -96625, -103438, -70169, -18550, 29872, -4055, 146927, 92982, 67450, 65131, -117, 12849, 64737, 166439, 122892, 128304, -1289, 14751, -24663, 7668, 38946, -34873, 32485, 160418, 65052, 63313, 31289, 30516, 84024, 51683, 42300, -8559, -45033, -81698, -159821, -146053, -149295, 102801, 83620, -17470, -24216, -58282, 7358, -114467, -193584, 2023, 75376, 32306, 34442, 160143, 135054, 71329, 57757, -49918, -28980, -14388, -97291, -34788, -48719, -59636, -50834, 28880, 120036, 109362, 27933, 23174, 144676, 71846, -9467, -73103, 6709, 63101, 85955, 100642, 113057, 71070]
897G1070j6193L331j30243J00059K9471n2757L8121n3590K5752o4881n710r1409
885a46979J52811J96615o1715j07323l2983r1872k066o929q973P6115J9796j3798
873b7301J6724L5181r7154K3170L6532J23886q7316n9731r6706K14408O9616j88388
861c7079N9593R5421o395r7169j7293O5573r4345l2341K0484j445j5424l8807
849i9227N6639K0811o1635Q003n5975R715J11737q0447L138R5534L460m9000J00588
836F3341k175m9715M6314m9617j18272L8952J8840p3048J16941O9945r495k0664
824C1347m2057l3337l347r4375n0931J21031J6641n105k1553J288j9166M9084
812e0480Q2959n2342L2483o2692m3230M6858m7668k7563R2107L251j2012L5604
$$ y = [71070, 54877, 58208, -72035, 28024, 57495, 4738, 42859, -10731, 15021, -49860, -55570, -146979, 5832, 202447, 140732, 33409, 426, -91446, -93512, -100441, -109414, -33299, -13503, -27301, -10577, 24604, -72550, -49380, -12848, 111038, 23722, -36009, -132715, 81693, 151309, -37079, 22514, 117935, 111540, 14371, -2922, 62651, -31694, -64035, -43551, -44996, -60420, -99227, -42588, -21777, -83412, -75409, -131384, -121669, -9932, -90379, -87241, 8293, 11753, -37247, 63341, 61166, 11451, 57765, 8148, -110124, -71172, -52332, -125380, -8439, 61506, 52011, 31347, -10710, -44047, -47394, -141769, -192700, -71669, -55028, -60133, -81686, -80398, -99564, -50480, 32479, -19863, 12620, -50072, -93302, -46444, -94112, -121675, -29568, -26317, -38329, -2725]
800b725j80603N1451R6577r1836o5758J33113M4587K7047n1650R9953q6397j49284
788a75525J08839K4909M0244q0850O9407J07049n676m2287M4109L70r7581P241
776B49J03485j51773k902M5585j27704M1240o2335l115J85667p3631J9559k9071
764e4746R470N0881o7055R006L7339N6233j08602p5840J61812j7565o8839O4037
752c869l9844K1509J4417L1923p8265R5346M5800j84038L2722J56965p3408j6597
740B661L4483l0771n0766K2460M1846n921P0643M9835q8224p6622l8979M2223
728b7132j1484L908l7542j3661J32957P759J3892q6573n4000P3913l8777P0491
716C3751l3137K5225n3201M2215o4385L4435L2721j9868L1397j55772P126Q5045
$$ y = [-2725, -183328, -131877, -35300, -127136, -192894, -59781, -15194, 11853, -39797, 60156, -26241, -175525, -66686, -41777, -1533, -82383, -12976, 94073, 88397, 46110, 90219, 90589, -6992, 249, 103734, -48039, -50941, -5356, -133060, -91820, -154155, -157270, 28397, -45234, -25675, -54746, -45276, 5605, -61450, -52444, -15105, 41128, -67474, -143314, 18498, 933, -67906, -3869, -43713, -22204, -7787, 24136, -54129, 41217, 87017, -97021, -64299, 92666, 19258, 2661, 37144, 6373, -44393, -21933, 19913, 13992, 84635, 134470, 46246, -30376, -69355, -27132, -38616, -34708, -72250, -85911, 47046, 54805, 68697, -17876, -71876, 2037, -36740, 33751, 614, 25839, -27362, 14853, -49532, -15097, 17624, -2244, 29153, -126619, -119493, -34448]
704c4448K8348P2605l0724m0469J3419o8915j04311O8560P8431o4349K8720N9760
692F627k196j03654Q150K6184K8169P5362m6985O074M819L6594L5272j19623l6029
679h1236J67591L3329o5792p2524j30043J3349P5528O0481j14301j2367n0502
668a76487o376Q8911L054j5616O6944j8751K8748K1055N4392p4316L2403O525
656A0486j04145J2697O7165l7872j71620q9510J64823Q4754l6780N3683K4799
645b1520k3220K0401P9077P4771p4430J5000j04393n4014N4125P585k8546m9069
633a04233L0300N9001l5640j3559O738K6546j9198O8432q0200J8190J1138N2794
621B0309K4904r6742n6492M2400J08165j38965L9888J53357m3557l8680p7596
$$ y = [-34448, -6100, 66505, 35781, -4688, 8731, -60184, -164495, -95935, -17504, -81853, -53133, 6627, 4431, -99223, -91073, -64889, -36720, 38642, -8343, -2269, 2550, 39144, 74416, -45207, -81236, 86355, 119684, 53892, -18632, -148675, -135326, -59798, 683, -113618, -125985, -176487, -182863, -93952, -90898, -106514, -39570, -58321, -29573, -8518, 45874, -28442, 3961, 10486, -93659, -80962, -13797, -51669, -223289, -312799, -147976, -63222, -100002, -46319, -21520, -44740, -24339, 54738, 129509, 55079, 70079, -34314, -88328, -34203, -26618, -55164, -104233, -73933, -14932, -50572, -64131, -57393, -30847, -50045, 18387, -61813, -43623, -32485, 20309, 45213, -51529, -108021, -65621, 42544, -96421, -56533, 96824, 53267, 14587, -63009]
610f3009P1652k2576o4115N436l048p4459J14769N5449l6264J08880p9368l9188
598b5841l1945J8261j7319J7073n9525j5948j9315N2004j3844r538P3728J6961
586a5248j03135O803P2888p8197J27994J60967j42710J6192p9572o1091K8735
575f6374j5892m3865N4298j15974J10691J45975n2831j08177J34158O17n5009
564a2383j07246r3689O8954M4894m0275j8898J10537r6408p5547J58973k0505
553h1593J3035p627L7616Q6658j04507j7705j02889M9123L3917j8942K4925q904
541i6893m7486j9093J71185k0833q4941P1957k5947k3478J46332l5416o7956j583
529c4152k1338L3301k6159o5017J01449L325l4957J5944k1938P6453M8885l9195
$$ y = [-63009, 8643, -13933, -78048, -72612, -75660, -150119, -35350, 20099, -16165, 92715, 13347, -25841, -57786, -39525, -56844, -39771, -99296, -115244, -134559, -82555, -96399, -105937, -32209, -15248, -118383, -111580, -38692, -116889, 11105, 172072, 29362, 45554, -34018, -95109, -66374, -82266, -126131, -71833, -187807, -77116, 68859, 16028, -92149, 42009, 42626, -12383, -119629, -213318, -144364, -99470, -139745, -158643, -48106, -144514, -220061, -61088, -81593, -68558, -76185, -38569, 48089, -56418, -74123, -177012, -127889, -93972, -112914, -87989, -96893, -144379, -163472, 7713, -13120, -98061, -26104, -52051, -75529, 70803, 35387, -32569, -34152, -55490, -22189, -48348, -113365, -11916, -8591, -43548, -27604, -49542, 26911, 75796, 36601]
517C6601L1626j09944p1534N1938q3914L0258L2890O4020M1516M244q6459j6458
505g5216L4480j44803P7973K5520O8245k1463j08006o2163J00452O1546j16578
494a60013N9898L1312K5856P5977O8180j07466L9020P171j33526j20878J41895
483g2574k2281m5610N0005M2429M3572q9318P171o2194K2331J28342j04812k0760
471a23699k4058R7391j4785N4014o7843J04915q4967M7153N0949j6750m5228O6858
459D3950N1975K2086j5671k5644m1930k8971r421J9746M523r04L6671j16255O1320
446A475J9589o7146k9698l1253j2376K32803k4828q8639o6471l3043M2666o3659
434a20580P6483P9737r0993L1969n69o0263M8609L1727j00218M3337j13528o2513
$$ y = [36601, 68227, -41717, -113251, -61313, -145227, -114969, -82079, -18059, 23457, 27701, -58758, -75216, -40736, -185539, -107566, -82046, -13801, -35264, -143270, -205433, -104981, -43435, -160013, -100115, -68803, -42947, 33030, 101210, -6256, 32764, 39935, -93591, -214469, -72574, -94855, -140465, -90460, -48031, -4459, -93777, -86606, -148800, -126469, 1873, -102939, -123699, -147757, -50366, -65151, -11137, -78980, 25935, -59032, -11879, 39070, 22320, -22908, 43950, 95925, 118011, 102340, 76696, 34766, 5795, -3626, 16120, 20643, 19739, 56410, -59845, 1475, 21064, -46082, -75780, -107033, -119409, 113394, 88566, -73, -66544, -99587, -56921, -120580, -44097, 35640, -55353, -23384, -23953, -84216, -35607, -3880, -104098, -60761, -174289, -236802]
422b36802O8133J69868j8744L0167l4125j9645p2126K9622L8737l5428J34294
411E3951J463P1030n0269j44453j11546J20981k2464J4456l7265L4918M4088n1874
399g6984k2721m2895L2465J188N5329P18K4054n0251N5241j14037J3560K5283
387i9050R9113O4707p0381j10966n831P2677n3369J8022K1304L6399o019M5626
375A2232L4307p1161l5901P1818m3280m264O826m5428R4880o1181j002j9805p7314
362a39273J01455J3715q3034K7003M050L3816p5308P149n7808o2958P365N4461
350a69367P0899m1416K1256o8547M2665J38355o5188r588l5113o6060O6140m9028
338a64992m3742J39135Q4277N9033p3562j4169k532r579n8525o7160J22938P8318
$$ y = [-236802, -168669, 1199, -17545, 12622, -21503, -41148, -113274, -83652, -44915, -80343, 53951, 55414, 126444, 76175, -68278, -179824, -58843, -81307, -66851, -104116, -69198, -25110, -76984, -99705, -142600, -110135, -108947, -53618, -52900, -28846, -79097, -23856, -137893, -124333, -99050, 63, 64770, -5611, -116577, -122408, -49731, -103100, -85078, -63774, -27375, -33394, 12232, 46539, -24622, -60523, 11295, -31985, -36249, -29423, -74851, 20029, -41152, -42154, -61959, -139273, -37818, -24103, -107137, -80134, -76084, -42268, -117576, -110427, -168235, -231193, -223828, -169367, -98468, -139884, -118628, -187175, -144510, -6155, -71343, -80931, -116044, -182104, -115964, -164992, -208734, -69599, 14678, 73711, 149, -14020, -16552, -26131, -84656, -151816, -28878, 49440]
326D9440r5092n4687J0178N6861k197j65684N2056O3587k8738O1478l172r4720
314a50690m4420R1802K46861j48185k3931j6688M986o5069J5278N5757O9401L391
302C8493j9532j30710K3719O9315J7343l7715Q685q3127n3461J39460Q3840r3639
290c7329L348j22094Q7803O0499p8249N4262l6213M2419J2528N1753j19930J13887
278C2684j28021l8380K9550N7984O0545r7672l4610j251M852j00911J44215J38956
266F7941j23593k775M7581j4620n6574l8970j2063n9982J1606J1741J18873j594
254e2429q9716O2769L9449l74r4984J7832j7205r2213j1352J64168o1295R92K3174
241a11184M4134J13052q5186j11862n3865J13293J06332j07027J2738P9095r439
$$ y = [49440, -45652, -100339, -90161, -33300, -35497, -201181, -149125, -85538, -114276, -52798, -55970, -150690, -195110, -103308, 143553, -4632, -28563, -45251, -40265, -105334, -90056, -34299, 35102, 38493, 18961, -111749, -88030, -18715, -1372, -39087, -30402, -113529, -166990, -27530, 56310, -37329, -33981, -156075, -68272, -7773, -86022, -31760, -67973, -25554, -13026, 38727, -81203, 32684, -95337, -133717, -104167, -46183, 14362, -83310, -117920, -119171, -114319, -215230, -71015, 67941, -55652, -58427, -10846, -25466, -82040, -121010, -133073, -193055, -181449, -169708, -50835, -52429, -142145, -79376, -39927, -40301, -135285, -117453, -134658, -226871, -238223, -74055, -135350, -134358, -111184, -67050, 46002, -39184, -151046, -204911, -91618, 14714, -92313, -79575, -480, -9919]
230i919p1488J5637q0274j9587O4293J33844n4801j18376Q6011n307n7559m6066
218a63592J22410J05552o5299l2672m390r9923k7617K1438J5678R0305O8553j717
206B8726N4628J4968n2042j4091j11380j4526P7629j58086q2844N6570R7355J09409
194F316q7144l3845J99882p8044j82184n8751N7271O9282M3660K124K1746M0648
182I61m4385q6196P686N3823j7291j7333o6939N4139R0878M9661L8204r0512Q719
169a8585j64510M9197J50543m0804J4357m0066o6056m2362J1007P8623r792l7787
157a16235p7480R3223j8110m0722O5120n0634Q9051P166m324J906k7149m8138
145a26326M2621j019J00924n1710n694K198p560q58j05283p7433J03676N8436
$$ y = [-9919, -81407, -65770, -146044, -165631, -101338, 32506, -22295, -140671, -54660, -59967, -117526, -163592, -41182, 64370, -929, -33601, -37991, -137914, -165531, -144093, -128415, -38110, 30443, 28726, 83354, 98322, 46280, 32189, -79191, -93717, -16088, -174174, -257018, -200448, -103093, 6316, -80828, -114673, 85209, 7165, -175019, -233770, -176499, -107217, -63557, -61433, -39687, 961, -43424, -129620, -121934, -68111, -85402, -102735, -169674, -115535, -24657, 25004, 63208, -27304, -18585, -183095, -133898, 16645, -24159, -9802, -49868, -115924, -158286, -147279, -68656, -78448, -116235, -193715, -100492, -118602, -159324, -94204, -144838, -55787, -48621, -52945, -51039, -78188, -126326, -83705, -84724, 16200, -35510, -41204, -39006, -46566, -47424, -152707, -230140, -126464, -68028]
133f8028n0713J17687L404r534n2886j01258j04830J29204k8730O8518J5095n778
121h7849kR1164m473n8513N5185J4765j30994m2727P3765k7171Q6865j0130L9799
108c16p9763j3945l7207J00894L0379n4462p5588j9627K6648J27417p4668m0703
96a10941N2036l1792J0993K4090j3324r5349J03040K4776p7036L804M5418q1943
84a46228Q054o58k9865P0519r592p226Q6993j45920j7777M9593J9514K0540j4648
71a16701K1903L8217Q3053r0427j7038K7764O6054J2845N902j18018K1942o5784
59a30288P4249R7263K3069q2505J8082o0914n3890q4388L0712J11241j7462n6220
47a31051J4880K0635n3079O283l814N4646k3625K2600L3360L5824p9178R161l7323
$$ y = [-68028, -118741, -1054, 2350, -7184, -60070, -161328, -266158, -136954, -165684, -97166, -82071, -87849, -87851, 3313, -1160, -59673, -4488, 10277, -120717, -163444, -89679, -116850, -29985, -40115, -316, -80079, -94024, -131231, -30337, 42, -54420, -130008, -149635, -122987, 4430, -70238, -110941, -58905, -90697, -79704, -55614, -68938, -164287, -61247, -36471, -113507, -109703, -64285, -146228, -138174, -138832, -168697, -98178, -107770, -114996, -28003, -173923, -191700, -142107, -122593, -102053, -116701, -94798, -56581, 26472, -63955, -80993, -53229, 12825, 25670, 31572, -86446, -64504, -130288, -56039, 41224, 64293, -18212, -130, -61044, -114934, -199322, -168610, -57369, -74831, -131051, -116171, -95536, -148615, -142332, -146146, -91500, -115125, -92525, -59165, -23341, -102519, -93358, -130681]
34a30681k9337K3570J13794J5415K7123n0450n182M1405m8765j0779j8122j28734
22b00743K4705N8558L9610l6547J8200m0220N3583J0935j8149j27880J62919J3173
10d1856L1330o83r0770N4719Q214k0550o7622K0056j3575k6968
0a47705
$$ y = [-130681, -160018, -136448, -22654, -7239, 19884, -30566, -35748, 5657, -43108, -53887, -72009, -200743, -176038, -117480, -77870, -114417, -96217, -136437, -82854, -71919, -90068, -217948, -55029, -41856, -10526, -11209, -101979, -47260, -39046, -59596, -127218, -107162, -120737, -147705]
$$ Imaginary data points
##PAGE= N=2
##DATA TABLE= (X++(I..I)), XYDATA
16383a918176O2566J00469N3125j7784N8202J5909p5372j2769K0389K9593M7853
16372a635995J00022K4117K6213m8261k6283Q0527Q0074N049L0358J9159K6353
16361a318667m9399Q165P516R6021L0612m403j4922K5263J00127L3340l3391m9111
16349a168849R095R9756J9348J1597j9721L1579L2363M6428R5358l5672L9368
16338h39350O7760j0816l7975M2889J00904K776j082J3407M3214Q0194n0401L1
16326e88449J01278J6778K0501R4431M6292q1078N712J0455P4983k1068j2763
16315c32928K2509k8569O3157J6764l7909M2793L417N9987O1752M472O2678p2263
16303a34140R749K9193N0293k0580J38459p058l5378O6498J5120m179O2454K5536
$$ y = [-1918176, -1855610, -1755141, -1702016, -1719800, -1661598, -1645689, -1721061, -1733830, -1713441, -1683848, -1635995, -1535973, -1511856, -1485643, -1533904, -1560187, -1479660, -1399586, -1394537, -1364179, -1345020, -1318667, -1368066, -1359901, -1352385, -1256364, -1225752, -1230155, -1245077, -1219814, -1119687, -1086347, -1119738, -1168849, -1159754, -1059998, -1040650, -1029053, -1048774, -1017195, -984832, -938404, -843046, -878718, -839350, -771590, -782406, -820381, -777492, -676588, -673812, -674894, -661487, -618273, -538079, -588480, -588449, -487171, -470393, -449892, -355461, -309169, -390247, -384535, -374080, -299097, -320165, -332928, -310419, -338988, -275831, -259067, -296976, -254183, -250766, -190779, -129027, -124555, -61877, -134140, -124391, -95198, -44905, -65485, 72974, 65916, 30538, 97036, 112156, 107977, 170431, 195967]
16291A95967o39k134n154J380O6360p7606N5451J2940R0875N999q2643M3818K0725
16278C25339M6732N2258R626J01260l9665Q392J1424l5955O0819Q3583J4537k1094
16266F17256R9489l4864r9372J6814m7131K4502J12016J11665J3381r2216N644
16255G27184J06021m6402l3751J76249k3916j65940j5211N1087N6278L6333R369
16244H77301L1133K1874N1686p039k177J3504M5066J5048j8028o6747J43088M647
16232A109356l7792R62P1056L5598L8356O1588N8708n7849j27967J00579N5109
16221A307704l5947l7690o7203Q9108r5617N9564J80239j46461j6787N8313o7399
16210A227824k6159R0222M5967j4656R3051j7946J4693l686K2032j2489K4039
$$ y = [195967, 195328, 193194, 188040, 189420, 255780, 178174, 233625, 246565, 337440, 343439, 260796, 304614, 325339, 372071, 424329, 433955, 535215, 495550, 503942, 515366, 479411, 540230, 623813, 638350, 617256, 716745, 681881, 582509, 599323, 552192, 576694, 688710, 800375, 813756, 721540, 727184, 833205, 786803, 753052, 929301, 905385, 739445, 724234, 775321, 831599, 867932, 877301, 908434, 930308, 981994, 974955, 972778, 986282, 1031348, 1046396, 1028368, 961621, 1104709, 1109356, 1071564, 1072526, 1143582, 1179180, 1217536, 1279124, 1337832, 1279983, 1152016, 1252595, 1307704, 1271757, 1234067, 1166864, 1255972, 1160355, 1219919, 1400158, 1253697, 1236910, 1295223, 1227824, 1201665, 1291887, 1337854, 1323198, 1416249, 1398303, 1412996, 1409310, 1431342, 1418853, 1442892]
16199A442892O2944o0230q7046l9955J18098J71288j8493r9703N510J0849O0928
16188A567082L2457n8335m897J5320p7562J43509q4686m3825P1530K3303j2365
16177A571531m1658R600l6121P5422n3022j3038Q5396j4760J3074j0800J07110
16166A692734L5173j09239L3456m2301o622Q9014l3513q5658J45721k482n096
16155A711187k1094m4394J06781J8386J4024j41329K4503R879j6260J4607L3941
16144A710231J24522m1798P910p380m6328k8072N251L7458m6550m9328p0861N5677
16132A650732J07524K9459J9139L0670J1630K1753O4862o7720m8963R1686p0027
16121A840745P0841P1515j35338r3226R5300N809l9009J9959m9665N8072O0719
$$ y = [1442892, 1505836, 1445606, 1358560, 1318605, 1436703, 1607991, 1589498, 1489795, 1495305, 1506154, 1567082, 1599539, 1541204, 1536307, 1551627, 1474065, 1617574, 1532888, 1489063, 1560593, 1583896, 1571531, 1529873, 1539473, 1503352, 1578774, 1525752, 1512714, 1598110, 1583350, 1596424, 1585624, 1692734, 1727907, 1618668, 1652124, 1609823, 1603201, 1692215, 1658702, 1573044, 1718765, 1716283, 1711187, 1690093, 1645699, 1752480, 1770866, 1784890, 1643561, 1668064, 1677943, 1661683, 1676290, 1710231, 1834753, 1792955, 1800865, 1793485, 1747157, 1719085, 1724336, 1761794, 1715244, 1665916, 1595055, 1650732, 1758256, 1787715, 1806854, 1837524, 1849154, 1870907, 1935769, 1868049, 1819086, 1910772, 1840745, 1911586, 1983101, 1847763, 1754537, 1849837, 1855646, 1816637, 1836596, 1786931, 1845003, 1905722]
16110A905722o3550o7355J4417o8555M2578J5089Q210l5423O3226k5100L4535
16099A823794M3296n772Q4657n1P0691J056k20150p830L9697N5301J44338j55362
16087A873665L8293k1445K8625p6899l7005M0261K4835o3132Q8611J854l4771
16076A862892O5474Q7675j27783r733K0446l0503J1073p0405K03919j6093k1926
16065A975036l7184k8739j6555k2593M7229J03070j17591j27342N2674O0554N480
16054A894039K6108l9513O8156q5832K3440P0505O9462N1161p4744k7936J2976
16043A987822N508J1037K5859k8685J0732J4423n4533O0792n2545m9857P6351
16032B006904l9940j05196k0111M3542M2306N1974q8751M6782L2137j69058M0082
$$ y = [1905722, 1842172, 1774817, 1789234, 1720679, 1763257, 1778346, 1786556, 1751133, 1814359, 1789259, 1823794, 1867090, 1861318, 1945975, 1945924, 2016615, 2017671, 1797521, 1789691, 1829388, 1884689, 2029027, 1873665, 1911958, 1890513, 1919138, 1842239, 1805234, 1845495, 1870330, 1807198, 1895809, 1897663, 1862892, 1928366, 2016041, 1888258, 1878525, 1898971, 1868468, 1879541, 1809136, 2013055, 1996962, 1975036, 1937852, 1909113, 1892558, 1869965, 1917194, 2020264, 1902673, 1775331, 1828005, 1888559, 1894039, 1920147, 1880634, 1948790, 1862958, 1886398, 1956903, 2026365, 2077526, 2002782, 1974846, 1987822, 1993330, 2004367, 2030226, 2001541, 2012273, 2026696, 1972163, 2032955, 1980410, 1930553, 2006904, 1966964, 1861768, 1841657, 1885199, 1927505, 1979479, 1890728, 1937510, 1969647, 1800589, 1840671]
16021A840671J96850l613n8193l5482K7096l9851Q3018p7790M7395O9938j52178
16010A897861Q712R3797j03997k2171P2063k7523J95075n185p9448N8138j9495
15999B067827r6729n7874n5552L9472O4022j52762O9846l009J13813O2511n7499
15988A994066R88o306q3244m8023J07366r8320l7707J36783J4409J2209N9030
15977B051251n0873j43361q2666J98399J260O2217J33294j78964O1103N2931r9975
15966B004616m582j03012m6011P3132L011j3553L1241N7451P5773r8149n1538
15955A928379N7906Q4119p9956m3938M881p700l8418M3453n6251N1098L1711j58868
15943A816416L8538J01975J7333k0548J8052K0971J7926k1580l2883q4206j9401
$$ y = [1840671, 2037521, 2033908, 1975715, 1940233, 1967329, 1927478, 2010496, 1932706, 1980101, 2050039, 1897861, 1906573, 2000370, 1896373, 1874202, 1946265, 1918742, 2113817, 2108632, 2029184, 2087322, 2067827, 1971098, 1913224, 1857672, 1897144, 1961166, 1808404, 1878250, 1875241, 1989054, 2051565, 1994066, 1995054, 1988748, 1905504, 1857481, 1964847, 1866527, 1828820, 1965603, 1980012, 1992221, 2051251, 2000378, 1857017, 1774351, 1972750, 1974010, 2036227, 2169521, 1990557, 2051660, 2104591, 2004616, 2000034, 1897022, 1851011, 1924143, 1927154, 1913601, 1944842, 2002293, 2078066, 1979917, 1928379, 1986285, 2070404, 1990448, 1946510, 1951391, 1943691, 1905273, 1948726, 1892475, 1943573, 1975284, 1816416, 1854954, 1956929, 1974262, 1953714, 1971766, 1992737, 2010663, 1989083, 1956200, 1871994, 1852593]
15932A852593o944k3172K3728n023M5859l2932K6536M6854k6558K8104P116P1307
15920B007468K5460k6159K4526j47018N7597N5q8857J24574k7778O5324K2555
15909B037747j21363j1339J79689j19167k777J03463o2864l356K5191K2956n0086
15898A998094o9927J0880K8462J04672L3297r9848O8865n9123M2471j2212k02665
15887A842966J7646J654j6067q691N5113l8467J09279J57766o8405J6566j67661
15876A901699J35252n8186p9317R6793J9318M9757j33515p3893J7547J01356p5252
15865A901559j45615J26637J46747p6514J6665O1784q1195j0781P5172j552l9418
15854A973489O5134r380p0862O9681p8243m9812R14Q2769m9281K7744P8233k1215
$$ y = [1852593, 1845649, 1822477, 1846205, 1841182, 1887041, 1854109, 1880645, 1927499, 1900941, 1929045, 1936161, 2007468, 2032928, 2006769, 2031295, 1884277, 1941874, 1941929, 1853072, 1977646, 1949868, 2015192, 2037747, 1916384, 1905045, 2084734, 1965567, 1962790, 2066253, 2003389, 2000033, 2025224, 2048180, 1998094, 1928167, 1939047, 1967509, 2072181, 2105478, 2005630, 2074495, 2015372, 2057843, 2045631, 1842966, 1860612, 1862266, 1846199, 1837508, 1892621, 1854154, 1963433, 2121199, 2052794, 2069360, 1901699, 2036951, 1978765, 1899448, 1996241, 2015559, 2065316, 1931801, 1857908, 1875455, 1976811, 1901559, 1755944, 1882581, 2029328, 1952814, 1969479, 2031263, 1950068, 1939287, 2014459, 2012907, 1973489, 2038623, 2029243, 1958381, 2028062, 1949819, 1900007, 1900921, 1983690, 1934409, 1962153, 2040386, 2019171]
15842B019171j17861p0183M9820J03721l3621P9385m1190k8344K3336K5837p4022
15831A936049j7656j1163o6037M5210N0780l5054n8297J94634m7439m0527j27674
$$ y = [2019171, 1901310, 1831127, 1880947, 1984668, 1951047, 2030432, 1989242, 1960898, 1984234, 2010071, 1936049, 1918393, 1907230, 1841193, 1886403, 1937183, 1902129, 1843832, 2038466, 1991027, 1950500, 1822826]
$$ [...]
##END NTUPLES=NMR SPECTRUM
##END=
