##TITLE=1H_CG-1144-C
 CDCl3, 8 sc, 
 6.07.2021
##JCAMPDX= 6.0         $$ Bruker NMR JCAMP-DX V2.0
##DATA TYPE= NMR SPECTRUM
##DATA CLASS= NTUPLES
##ORIGIN= UXNMR, Bruker Analytische Messtechnik GmbH
##OWNER= root
$$ XWIN-NMR		Version 3.5
$$ Tue Jul  6 10:43:44 2021 Russian Standard Time (UT+4h)  she@DPX200
##.OBSERVE FREQUENCY= 200.131506
##.OBSERVE NUCLEUS= ^1H
##.ACQUISITION MODE= SIMULTANEOUS
##.ACQUISITION SCHEME= undefined
##.AVERAGES= 8
##.DIGITISER RES= 18
##SPECTROMETER/DATA SYSTEM= spect
##.PULSE SEQUENCE= zg30
##.SOLVENT NAME= CDCl3
##.SHIFT REFERENCE= (INTERNAL, CDCl3, 0, 17.513)
##AUDIT TRAIL= $$ (NUMBER, WHEN, WHO, WHERE, WHAT)
$$ ##TITLE= Audit trail, XWIN-NMR		Version 3.5
$$ ##JCAMPDX= 5.01
$$ ##ORIGIN= Bruker BioSpin GmbH
$$ ##OWNER= she
$$ F:/spectra/data/she/nmr/H-F/1/pdata/1/auditp.txt
$$ ##AUDIT TRAIL=  $$ (NUMBER, WHEN, WHO, WHERE, WHAT)
(   1,<2021-07-06 10:42:18.84 +0400>,<she>,<DPX200>,
      <created by zg, POWCHK disabled, PULCHK disabled
       configuration hash MD5:
       00 E9 B6 7A A2 85 ED C7 34 08 36 98 17 FE 4E 26
       data hash MD5: 16K
       78 0E C0 46 4D 30 0E 67 52 68 4C DC 71 BA F2 0C>)
(   2,<2021-07-06 10:42:21.17 +0400>,<she>,<DPX200>,
      <Start of raw data processing
       efp BC_mod = 2 LB = 0.24 FT_mod = 6 PKNL = 1 PHC0 = -11917.9 PHC1 = 16.60099 SI = 16K 
       data hash MD5: 16K
       E4 A9 11 65 76 E9 61 DF 36 28 AA 3B 2D DC E4 93>)
(   3,<2021-07-06 10:42:49.42 +0400>,<she>,<DPX200>,
      <pk PHC0 = 4.45278 PHC1 = -5 
       data hash MD5: 16K
       90 01 20 A3 83 A0 3F 0C 02 6E 30 8B A4 56 C8 41>)
(   4,<2021-07-06 10:42:53.32 +0400>,<she>,<DPX200>,
      <abs ABSG = 5 
       data hash MD5: 16K
       10 C5 51 0E 69 E5 CC F6 EC 15 71 0F 61 E6 BF 46>)
$$ ##END=
$$ 
$$ hash MD5
$$ 5B 73 0E 07 C7 4A 3F FC 05 BF B7 45 62 FC 2A 74
##$RELAX= 
##$RELAX= 
##$RELAX= 
##$RELAX= 
##$RELAX= 
##$RELAX= 
$$ Bruker specific parameters
$$ --------------------------
##$DU= <F:/spectra>
##$EXPNO= 1
##$NAME= <H-F>
##$PROCNO= 1
##$TYPE= <nmr>
##$USER= <she>
##$AMP= (0..31)
100 100 100 100 100 100 100 100 100 100 100 100 100 100 100 100 100 100 
100 100 100 100 100 100 100 100 100 100 100 100 100 100 
##$AQSEQ= 0
##$AQ_mod= 1
##$AUNM= <au_zg>
##$AUTOPOS= <>
##$BF1= 200.13
##$BF2= 200.13
##$BF3= 200.13
##$BF4= 200.13
##$BF5= 200.13
##$BF6= 200.13
##$BF7= 200.13
##$BF8= 200.13
##$BYTORDA= 1
##$CFDGTYP= 0
##$CFRGTYP= 5
##$CHEMSTR= <none>
##$CNST= (0..31)
1 1 145 1 1 1 1 1 1 1 1 1 1 1 1 1 1 1 1 1 1 1 1 1 1 1 1 1 1 1 1 1 
##$CPDPRG= <>
##$CPDPRG1= <>
##$CPDPRG2= <>
##$CPDPRG3= <>
##$CPDPRG4= <mlev>
##$CPDPRG5= <mlev>
##$CPDPRG6= <mlev>
##$CPDPRG7= <mlev>
##$CPDPRG8= <mlev>
##$CPDPRGB= <>
##$CPDPRGT= <>
##$D= (0..31)
0 1.2 0 0 0 0 0 0 0 0.06 0 0.03 0 0 0 0 0.0002 0 0 0 0 0 0 0 0 0 0 0 0 
0 0 0 
##$DATE= 1625553738
##$DBL= (0..7)
120 120 120 120 120 120 120 120 
##$DBP= (0..7)
150 150 150 150 150 150 150 150 
##$DBP07= 0
##$DBPNAM0= <>
##$DBPNAM1= <>
##$DBPNAM2= <>
##$DBPNAM3= <>
##$DBPNAM4= <>
##$DBPNAM5= <>
$$ [...]
##$SUBNAM3= <"">
##$SUBNAM4= <"">
##$SUBNAM5= <"">
##$SUBNAM6= <"">
##$SUBNAM7= <"">
##$SUBNAM8= <"">
##$SUBNAM9= <"">
##$SW= 20.0188882624521
##$SWIBOX= (0..15)
0 0 2 0 0 0 0 0 0 0 0 0 0 0 0 0 
##$SW_h= 4006.41025641026
##$TD= 16384
##$TD0= 1
##$TE= 0
##$TE2= 300
##$TE3= 300
##$TEG= 300
##$TL= (0..7)
0 120 120 120 120 120 120 120 
##$TP= (0..7)
150 150 150 150 150 150 150 150 
##$TP07= 0
##$TPNAME0= <>
##$TPNAME1= <>
##$TPNAME2= <>
##$TPNAME3= <>
##$TPNAME4= <>
##$TPNAME5= <>
##$TPNAME6= <>
##$TPNAME7= <>
##$TPOAL= (0..7)
0.5 0.5 0.5 0.5 0.5 0.5 0.5 0.5 
##$TPOFFS= (0..7)
0 0 0 0 0 0 0 0 
##$TUNHIN= 0
##$TUNHOUT= 0
##$TUNXOUT= 0
##$USERA1= <user>
##$USERA2= <user>
##$USERA3= <user>
##$USERA4= <user>
##$USERA5= <user>
##$V9= 5
##$VALIST= <valist>
##$VCLIST= <CCCCCCCCCCCCCCC>
##$VD= 0
##$VDLIST= <DDDDDDDDDDDDDDD>
##$VPLIST= <PPPPPPPPPPPPPPP>
##$VTLIST= <TTTTTTTTTTTTTTT>
##$WBST= 1024
##$WBSW= 4
##$XGAIN= (0..3)
0 0 0 0 
##$XL= 0
##$YL= 0
##$YMAX_a= 375464
##$YMIN_a= -498054
##$ZGOPTNS= <>
##$ZL1= 120
##$ZL2= 120
##$ZL3= 120
##$ZL4= 120
##$ABSF1= 17.50321
##$ABSF2= -2.515829
##$ABSG= 5
##$ABSL= 3
##$ALPHA= 0
##$AQORDER= 0
##$ASSFAC= 0
##$ASSFACI= 0
##$ASSFACX= 0
##$ASSWID= 0
##$AUNMP= <proc_1d>
##$AZFE= 0.1
##$AZFW= 0.1
##$BCFW= 0
##$BC_mod= 2
##$BYTORDP= 0
##$COROFFS= 0
##$CY= -3
##$DATMOD= 1
##$DC= 0
##$DFILT= <>
##$DTYPP= 0
##$F1P= 0
##$F2P= 0
##$FCOR= 1
##$FTSIZE= 16384
##$FT_mod= 6
##$GAMMA= 0
##$GB= 0
##$INTBC= 1
##$INTSCL= 1.334414e-10
##$ISEN= 128
##$LB= 0.24
##$LEV0= 0
##$LPBIN= 0
##$MAXI= 10000
##$MC2= 0
##$MEAN= 0
##$ME_mod= 0
##$MI= 1.114404
##$NCOEF= 0
##$NC_proc= -6
##$NLEV= 6
##$NOISF1= 3.799351
##$NOISF2= 2.8
##$NSP= 0
##$NTH_PI= 0
##$NZP= 0
##$OFFSET= 17.51299
##$PC= 1
##$PHC0= -11913.45
##$PHC1= 11.60099
##$PH_mod= 1
##$PKNL= yes
##$PPARMOD= 0
##$PSCAL= 0
##$PSIGN= 0
##$REVERSE= no
##$SF= 200.130004328904
##$SI= 16384
##$SIGF1= 3
##$SIGF2= 2
##$SINO= 5.538805
##$SIOLD= 16384
##$SREGLST= <1H.CDCl3>
##$SSB= 0
##$STSI= 16384
##$STSR= 0
##$SW_p= 4006.41025641026
##$SYMM= 0
##$S_DEV= 0
##$TDeff= 16384
##$TDoff= 0
##$TI= <>
##$TILT= no
##$TM1= 0
##$TM2= 0
##$TOPLEV= 0
##$USERP1= <user>
##$USERP2= <user>
##$USERP3= <user>
##$USERP4= <user>
##$USERP5= <user>
##$WDW= 1
##$XDIM= 16384
##$YMAX_p= 352171414
##$YMIN_p= -640240
$$ End of Bruker specific parameters
$$ ---------------------------------
##NTUPLES= NMR SPECTRUM
##VAR_NAME=  FREQUENCY,     SPECTRUM/REAL,   SPECTRUM/IMAG
##SYMBOL=    X,             R,               I
##VAR_TYPE=  INDEPENDENT,   DEPENDENT,       DEPENDENT
##VAR_FORM=  AFFN,          ASDF,            ASDF
##VAR_DIM=   16384,         16384,           16384
##UNITS=     HZ,            ARBITRARY UNITS, ARBITRARY UNITS
##FACTOR=    0.24454680195387, 1,            1
##FIRST=     3504.87495494337, 0,            0
##LAST=      -501.535301466886, 0,           0
##MIN=       -501.535301466886, -640240,     0
##MAX=       3504.87495494337, 352171414,    0
$$ Real data points
##PAGE= N=1
##DATA TABLE= (X++(R..R)), XYDATA
$$ [...]
5536G857011n08217m59719l79415j97188k85504k34736k77998k07691j95727j28516
5526D982300k80401k08037n0718k27548j24552j62663j01797o7845j68234j35668
5516C454837Q0320j96687j48017j52353j68490N1639j39414q8146P8316r1695
5506B680310p3233j29281J4576r8050m4207r0539l0806q4278j36419n7239r6061
5495A854773Q5407o8860l4099L0637J7022o453j23898p1907k2351J9426n6765
5484A622932j3102q3780k03269j0263M063m0790j3413M557j0153r196p4132P9296
5472A252750K3801m3810m6839l8823m787o5042j07967j3092J9745J7807k6015
5461I67728n0949n2521o3644n3176P8221M8578l3942r149O0251n4075n5734j0449
$$ plain form
5536 7857011 7348794 6889075 6509660 6312472 6026968 5792232 5514234 5306543 5110816 4982300
5526 4982300 4701899 4493862 4443144 4215596 4091044 3928381 3826584 3758739 3590505 3454837
5516 3454837 3535157 3338470 3190453 3038100 2869610 2921249 2781835 2693689 2772005 2680310
5506 2680310 2607077 2477796 2492372 2394322 2350115 2259576 2228770 2144492 2008073 1950834 1854773
5495 1854773 1940180 1871320 1837221 1867858 1884880 1878427 1754529 1682622 1660271 1679697 1622932
5484 1622932 1609830 1526050 1322781 1312518 1316581 1275791 1262378 1266935 1256782 1247586 1173454 1252750
5472 1252750 1276551 1232741 1185902 1147079 1142292 1077250 969283 956191 975936 993743 967728
5461 967728 916779 864258 800614 747438 825659 874237 840295 831146 891397 837322 781588 771139
5449G71139j23259N1132k6382m6682J04555j38539M5373k7764m1154Q7622n3325
5438F02716o5067k3069J22385l3571m4769j75714P8448J3838K8833j18340J0926
5427C96616K4556n0422k8136J131P5151O1311K1082p9532K6686K5330m9330k4294
5415D00149j02096m7157P2880K6762m6601N4774k4912k6404l3737Q561M8606j13002
5403B17823P1021m8394J2102j28376P8308Q1900O5881m149M1097L7113j50513
5392B73813P6604p6519l0836m654j2147J05087o4823n5111J11405l4566j9636
5381B68617J5765l1640j7336R1050k4470n8718n1550M71P7014K1851k379o5703
5369B22972n5131J9933J8380j31061J0458L8669k2837J02668O8693n7204L631
$$ plain form
5449 771139 647880 699012 672630 625948 730503 591964 637337 609573 568419 656041 602716
5438 602716 537649 514580 636965 603394 558625 382911 461359 475197 504030 385690 396616
5427 396616 421172 370750 342614 343745 418896 480207 501289 421757 448443 473773 424443 400149
5415 400149 298053 250896 323776 350538 303937 358711 333799 307395 273658 282219 330825 217823
5403 217823 288844 240450 252552 124176 202484 284384 350265 346116 387213 424326 273813
5392 273813 350417 273898 243062 238408 226261 331348 266525 211414 322819 288253 268617
5381 268617 284382 252742 235406 326456 301986 243268 191718 192189 269203 291054 288675 222972
5369 222972 167841 187774 206154 75093 85551 124220 101383 204051 272744 215540 219171
5358B19171p048N9907o7391L9040j5644j2119Q2726j4434K1403P1521j3488J24054
5346D87698j47106q4212l3061P7278M0127Q8205j71265j7758J10982n0402N576
5335C06062J1496k5535j6245m6053N6511J35103j39260M2787l7807N9953m0478
5324C06534Q6213P5300o1957l6618N4291O0078j377K3746q1091K4321K3695q007
5312D65128r0979L1832j00320l4375K02973l5793n029k1843m9360M4351N25k8033
5300C79077K5492K8654K4696J8350J1602N1937n7786L5092R1085n0313J6633R111
5288E83630O8558m7411r8657q2016o3324J20808K0349R925M0286p5249J2048P2980
5276E61927p2362Q2023R7225K586J40110p3251o993J5191l6514j7717J05729n2896
$$ plain form
5358 219171 212123 272030 204639 243679 228035 215916 298642 284208 305611 377132 363644 487698
5346 487698 340592 256380 223319 300597 340724 428929 257664 239906 350888 300486 306062
5335 306062 317558 292023 275778 229725 286236 421339 282079 324866 287059 347012 306534
5324 306534 392747 468047 406090 369472 423763 483841 482464 506210 425119 449440 473135 465128
5312 465128 374149 405981 305661 271286 474259 438466 433437 411594 362234 406585 407110 379077
5300 379077 404569 433223 457919 476269 487871 539808 482022 517114 608199 557886 574519 583630
5288 583630 652188 604777 506120 424104 360780 481588 501937 511862 552148 476899 488947 561927
5276 561927 489565 571588 668813 671399 811509 738258 731265 746456 709942 692225 797954 745058
5264G45058j766l1535R6234J8470q3770P2232j69499n2415K3172l4675j00760
5253D80746n6163K589o2238R7726o5361k8611J8761O3832m6367M6607j01075J7905
5241C68351J9057j32950M9136M347j3461R0004o2552L3298k7311p7900k5308R0115
5229C14826J0373n2875j06644J74386L0089o2639j28527m4015R3978J15928M006
5218C48886j66915O4829l6931R6031r3614N1311R1431J55979r0607j33905k833
5207B83662J33927l632K276P305j0823l9523j9184o9312K1397o440j1103J86037
5195D74587j6040j47535M8870o401N5880j05208O6784J37872r6685o0596L2349
5184C83877N3496k6431J02173o0837r2532J24640l9722r3881O7572M0279O7830
$$ plain form
5264 745058 743292 711757 807991 826461 742691 814923 645424 593009 616181 581506 480746
5253 480746 424583 427172 364934 462660 397299 368688 387449 451281 404914 451521 350446 368351
5241 368351 387408 254458 303594 307941 294480 384484 321932 355230 327919 250019 224711 314826
5229 314826 325199 272324 165680 340066 370155 307516 178989 134974 228952 344880 348886
5218 348886 181971 246800 209869 305900 212286 263597 355028 511007 420400 286495 283662
5207 283662 417589 413957 416233 423538 412715 373192 354008 284696 306093 299653 288550 474587
5195 474587 458547 311012 359882 353481 409361 304153 370937 508809 412124 351528 383877
5184 383877 437373 410942 513115 452278 359746 484386 444664 350783 418355 458634 526464
5173E26464j9977j40477P9854N3641r1731N6690j8085J2278R3690j0929J043l0600
5161E11861J72517j1754J6669J18003j0795P429J8940L613m1128j41623O956J24305
5149G74993O1543m2175j99649J47356p311J0992M9030r35j9940P4032o5223P0805
5137H53518M4835L8263j3699K5338J8240J4447o4389M7274J35554r2188K6494
5126A033687m5227O0645o1293r4484O3358j722q269Q3905p0572L3286p509j6644
5114I69161r962J08378j04467J18265O7528j2593Q3669n550J14822M0972j9752
5103A350471R1451j40544J10882J28965l1530P3626m4861l744O2626o0479O9290
5092A606153o1154j13590P2537K1293p4141n2397Q597Q0055J01390M2292K8086
$$ plain form
5173 526464 506487 366010 445864 499505 407774 464464 446379 458657 552347 541418 542461 511861
5161 511861 684378 672624 689293 807296 796501 803930 822870 826483 785355 643732 650688 774993
5149 774993 836536 794361 594712 742068 734757 745749 794779 793844 773904 847936 782713 853518
5137 853518 898353 936616 922917 948255 966495 980942 916553 963827 1099381 1007193 1033687
5126 1033687 988460 1049105 987812 893328 956686 954964 946695 1030600 960028 993314 985805 969161
5114 969161 959199 1067577 963110 1081375 1148903 1136310 1219979 1214429 1329251 1370223 1350471
5103 1350471 1441922 1301378 1412260 1541225 1509695 1583321 1538460 1534716 1597342 1536863 1606153
5092 1606153 1544999 1431409 1503946 1525239 1451098 1398701 1407298 1487353 1588743 1631035 1659121
5081A659121o5638R1783K21842J10556L3912P0284L9111L6170L6991K87075J99860
5070B721067R9844Q8363J41101J8068J0627m6798q965K9000Q1159M3537J35792
5059C312795R8429J37624K1377J18345J55172J14526J49199L2194J53643J35807
5049D429111J66237K22923K68288J27950L6353J81255L74412K94914R5726K49601
5039F446770K29289O3385J90349J75561J59775K15753L53320K71170J17988K81223
5029H504583M00346K65655M46796M65799M06076N00213N95675Q04392P29762P44863
5019A3864160Q24842R26410J008595J097303J283300J494092J598214J963828
5011B4060744K143314K350261K866624L227114L693832M089129M586867N107703
$$ plain form
5081 1659121 1593483 1685266 1907108 2017664 2051576 2121860 2160971 2197141 2234132 2521207 2721067
5070 2721067 2820911 2909274 3050375 3068443 3079070 3032272 3023307 3052307 3133466 3177003 3312795
5059 3312795 3411224 3548848 3570225 3688570 3843742 3958268 4107467 4139661 4293304 4429111
5049 4429111 4595348 4818271 5086559 5214509 5250862 5432117 5806529 6101443 6197169 6446770
5039 6446770 6676059 6739444 6929793 7105354 7265129 7480882 7834202 8105372 8223360 8504583
5029 8504583 8904929 9170584 9617380 10083179 10489255 10989468 11585143 12389535 13119297 13864160
5019 13864160 14689002 15615412 16624007 17721310 19004610 20498702 22096916 24060744
5011 24060744 26204058 28554319 31420943 34648057 38341889 42431018 47017885 52125588
5003E2125588N479914N598507N574848N479242M929205M253754L508660K267555
4995H9217273P13415j217927l133762m351030n183893n603679n573008n344730
4987E9522659n550882n254586n085982m520127m086485l643202k938102k626067
4979B5817226k324761j973598j659353j423971j306955j179572j015575q08154
4971A4125287p21218q41912p75492n55561m83282n23508n02751l53392m38679
4962H929492l71305l68361l37729l22316k82141j79225l74633k33044j99716k81182
4952E979840l33403K0672j36552k64459j67836k02103k00263j1899o057j88896
4942D489044j94661j10913j28568j7093k06216q2303k6831n4733j15040k7634
$$ plain form
5003 52125588 57605502 63204009 68778857 74258099 79187304 83441058 86949718 89217273
4995 89217273 89930688 88712761 85578999 81227969 76044076 70440397 64867389 59522659
4987 59522659 53971777 48717191 43631209 39111082 35024597 31381395 28443293 25817226
4979 25817226 23492465 21518867 19859514 18435543 17128588 15949016 14933441 14125287
4971 14125287 13404069 12562157 11786665 11231104 10747822 10224314 9721563 9368171 8929492
4962 8929492 8558187 8189826 7852097 7529781 7247640 7068415 6693782 6460738 6261022 5979840
4952 5979840 5646437 5667109 5530557 5266098 5098262 4896159 4695896 4683997 4677940 4489044
4942 4489044 4294383 4183470 4054902 4037809 3831593 3749290 3722459 3667726 3552686 3525052
4932C525052k2142j54496p1737n1377P900k24986r5973K6284k2506Q8567j92651
4921B811935p3039j1191J7020j88259R635r2662n2325P5909j83844m1323n394
4910B266462j18766p6869M5425J26664o0866k08170n5736O0167Q0110r4051L623
4899A967993m1257O2826p2760j41518M1503j367J12762q5891n2208j03267N6533
4888A743349Q3975q8130K1764k6806R2130J383j82450q3860P2904p5249M6481
4877A605491j7184l8388r0335J8990M6998m1872R152j9336J07826p4048J2740
4866A520034L2944n9056O5599P0709L2287O5360L3165J81523J51259Q0821J51708
4855B326353J54892K22885L07219K48678K30765M47150O99429N74778N53264M65352
$$ plain form
4932 3525052 3502910 3348414 3276677 3225300 3233200 3008214 2912241 2938525 2916019 3004586 2811935
4921 2811935 2738896 2727705 2744725 2556466 2566101 2473439 2421114 2497023 2313179 2271856 2266462
4910 2266462 2147696 2070827 2116252 2242916 2182050 1973880 1918144 1978311 2058421 1964370 1967993
4899 1967993 1926736 1989562 1916802 1775284 1816787 1815420 1928182 1842291 1790083 1686816 1743349
4888 1743349 1827324 1739194 1760958 1734152 1826282 1827665 1645215 1561355 1634259 1559010 1605491
4877 1605491 1588307 1549919 1459584 1478574 1525572 1483700 1492852 1473516 1581342 1507294 1520034
4866 1520034 1552978 1493922 1559521 1630230 1662517 1727877 1761042 1942565 2093824 2174645 2326353
4855 2326353 2481245 2704130 3011349 3260027 3490792 3937942 4637371 5212149 5765413 6230765
4845F230765N80295P78727K83796o39527j206721j242779q62023o10692m23860
4836B887981k77678l18265r4404j81089j61701j41340N120j37592r281r5862j83794
4825A292095k3742p7026K3187M640j18938M3633o9289j7974j8686K6949p5165
4814I89684R454r8076j1945L3058o7326j22393J5605K7963m6683o109J10900l8540
4802G95592o6559q8300l8271J24508J7429p6487o1702K1560l6773j5609M7459
4791F22847M8206k7682o5632J20164j07417j42111L8154J00891j00677Q7350J38294
4780G12387j81205p4215r825K8067k1254J6705q1067K19462L4847J6987j18337
4769E42552m9241J07514j3922q9637O9136P8478m6236k8381r270j09742L4162
$$ plain form
4845 6230765 6811060 7589787 7873583 7234056 6027335 4784556 3922533 3311841 2887981
4836 2887981 2610303 2292038 2197634 2016545 1854844 1713504 1718624 1581032 1571751 1475889 1292095
4825 1292095 1268353 1191327 1214514 1219154 1100216 1143849 1074560 1056586 1037900 1064849 989684
4814 989684 999138 901062 889117 922175 854849 732456 748061 776024 729341 723232 834132 795592
4802 795592 729033 640733 602462 726970 744399 667912 606210 627770 590997 575388 622847
4791 622847 671053 643371 577739 697903 590486 448375 486529 587420 486743 574093 712387
4780 712387 531182 456967 447142 475209 453955 470660 389593 609055 643902 660889 542552
4769 542552 493311 600825 586903 497266 566402 644880 598644 570263 560993 451251 485413
4758D85413Q3667M4841k3749l1390K856o4548R891Q4149N8873J4919q2407q304
4746E74211K2R3370N5516N2417O1991j0915o7507M6113k9165K6918l1125n1468
4734G20378M3706q3485P976K6819K6128K2300l7411o5819n5768M6259J26739R126
4722G86948J25959n2828N8708Q0743q2354rJ75096k15714r9462J820l7358j0943
4710G30606L9520Q354j18704P6178r0897L6074K0876J1827m1728P4178j9874j7336
4698G09074l2723o4293O6700Q6556J4753m4208l799n3735k1394O8353j8504p3582
4686F33198L7156K16591l3017K3067L1877j936j2082O6412j3257l1461j0958m0862
4674H64728Q6128j38304j7872J17688j68447J17167J05338k3502q9926p155K4221
$$ plain form
4758 485413 569080 613921 590172 558782 561638 497090 506981 591130 650003 664922 582515 574211
4746 574211 574233 667603 723119 775536 837527 826612 759105 805218 776053 802971 771846 720378
4734 720378 764084 680599 688575 715394 741522 763822 726411 660592 604824 651083 777822 786948
4722 786948 912907 860079 918787 999530 917176 917167 1092263 876549 777087 778907 741549 730606
4710 730606 770126 778480 659776 735954 645057 681131 702007 713834 672106 746284 726410 709074
4698 709074 676351 612058 678758 765314 780067 735859 732060 678325 656931 725284 706780 633198
4686 633198 670354 886945 853928 876995 908872 906936 894854 961266 948009 916548 905590 864728
4674 864728 950856 812552 794680 912368 743921 861088 966426 942924 852998 845843 870064
4663H70064J327O4042M5673K1992m0160q8638Q1293k576j03324R484j35692n8314
4651F65171J16019R3817j7939J11270l2857l3756n026P9394J6777J31957n3721
4640A071106m1094n8905J26586M0802j6743P8997p4884o6091L1696o7866l8130
4629I85474j35236R474Q0047J48920p2701K8581j21328r36Q0651k8666j49028
4618H25252R5945J0502J1802p6181K2799Q8018K1805O8923l5439k6015j17099
4607H90312Q2485k6697J2586q4198J13710j1500J7488q9677o2693J36999n851
4596I72964K0212k3550k4555J06111P172o9066l444N9004J6569J4318l9575Q7447
4584A123607m4177M7247J1685J1743m8272P421J23850L4515k10740L8119M060
$$ plain form
4663 870064 871391 935433 981106 1003098 962938 874300 955593 953017 849693 859177 723485 665171
4651 665171 781190 875007 857068 968338 935481 901725 896699 976093 992870 1124827 1071106
4640 1071106 1030012 971107 1097693 1138495 1121752 1200749 1125865 1059774 1091470 1023604 985474
4629 985474 850238 859712 939759 1088679 1015978 1044559 923231 922295 1002946 974280 825252
4618 825252 921197 931699 943501 867320 890119 978137 999942 1068865 1033426 1007411 890312
4607 890312 972797 946100 958686 874488 988198 976698 994186 904509 841816 978815 972964
4596 972964 993176 969626 945071 1051182 1058354 989288 985844 1044848 1061417 1075735 1036160 1123607
4584 1123607 1079430 1126677 1138362 1150105 1101833 1109254 1233104 1267619 1056879 1094998 1099058
4573A099058n1772N3862K4077p5042N2067L9175J08737J06596O425p7073k2303
4562A263807M3353p7436O1190K27853j4227Q0767m8687K8180L9448q879l4945
4551A560424r7775R4559K9720J10943J33316n6117k05551O2187J27871J43916
4541A903493K6219n5274p5835p4097J52805M5444K627J22905L1292J06500M5221
4530B231300J30520Q1653j4008L744O2253N5525J19764n3085J19424J19081P3082
4519B929253N7338m9841K2083J07345O0437K13928R0513J7666M2298M1307K03130
4508C735457R0518J15481K5278J1475J79496m3515J68187J28423J49907J98311
4498D759018R7896N3712R6238J20533K85567J14252J69380K65688J95554K44897
$$ plain form
4573 1099058 1047286 1101148 1125225 1050183 1102250 1141425 1250162 1356758 1363183 1286110 1263807
4562 1263807 1307160 1229724 1290914 1518767 1504540 1585307 1536620 1564800 1604248 1595369 1560424
4551 1560424 1462649 1557208 1586928 1697871 1831187 1775070 1569519 1631706 1759577 1903493
4541 1903493 1929712 1874438 1798603 1724506 1877311 1922755 1925382 2048287 2079579 2186079 2231300
4530 2231300 2361820 2443473 2429465 2433209 2495462 2550987 2670751 2617666 2737090 2856171 2929253
4519 2929253 2986591 2936750 2958833 3066178 3126615 3340543 3431056 3448722 3491020 3532327 3735457
4508 3735457 3825975 3941456 3966734 3978209 4157705 4114190 4282377 4410800 4560707 4759018
4498 4759018 4856914 4910626 5006864 5127397 5412964 5527216 5696596 5962284 6157838 6402735
4488F402735K15772L30463L01960L35535L77635L68659L34702L16452L31794M94873
4478I810580N34987O76850Q16283Q23353R17011J302924J315902J724016J776357
4469A9698263K228810K582037L084520L617175M523501N576637O138706O333035
4461E3782684O416087L391638r77056m641914q363730q068970o713439n134813
4453B9690487l504274k317978j722374j244800r46913q41770o05327l33831k17592
4444A7955628k9125k875q0743J10792K24064K16398J45503L70521L72394N65354
4434A9847911L75515M42900N48565N44599N82991N88111P15987O61569O09560
4425B4917708O39367O79575R54593Q95236O91795Q61890Q02220P00052J015548
$$ plain form
4488 6402735 6618507 6948970 7250930 7586465 7964100 8332759 8667461 8983913 9315707 9810580
4478 9810580 10345567 11022417 11838700 12662053 13579064 14881988 16197890 17921906 19698263
4469 19698263 21927073 24509110 27593630 31210805 35734306 41310943 47449649 53782684
4461 53782684 60198771 63590409 62613353 57971439 49607709 41538739 34825300 29690487
4453 29690487 26186213 23868235 22145861 20901061 19954148 19112378 18507051 18173220 17955628
4444 17955628 17926503 17923628 17842885 17953677 18177741 18394139 18539642 18910163 19282557 19847911
4434 19847911 20223426 20666326 21214891 21759490 22342481 22930592 23646579 24308148 24917708
4425 24917708 25557075 26236650 27191243 28086479 28778274 29640164 30442384 31142436 32157984
4416C2157984J171975J277097J444741J758029K145891K425911K868912L031294
4408D8281834L500385L923906M229534M617194M973674N498406O450614P184550
4400H8660097P351832P621346P533776L177573q4167j189180n316493o024183
4392A01730601m388850l088070j351115j69053M95695R73447J029295J098240
4384I6330190R68969Q64082P80063O07267N02031K71818k39628m67444j280868
4375I8336480k296944l388517m111707m577111m683904m369339l644578k786376
4367F8478004j921924r39812j37491L63523M20360p3696p85916k258949l590320
4358E9553779m054034m376295l926490l438558k662979k020199j591097j337386
$$ plain form
4416 32157984 33329959 34607056 36051797 37809826 39955717 42381628 45250540 48281834
4408 48281834 51782219 55706125 59935659 64552853 69526527 75024933 81475547 88660097
4400 88660097 96011929 103633275 111167051 114344624 114260457 113071277 107754784 101730601
4392 101730601 97341751 94253681 92902566 92733513 93229208 94202655 95231950 96330190
4384 96330190 97299159 98163241 98943304 99550571 100052602 100324420 100084792 99617348 98336480
4375 98336480 96039536 92651019 88539312 83962201 79278297 74908958 71264380 68478004
4367 68478004 66556080 65616268 65478777 65842300 66262660 66188964 65403048 63144099 59553779
4358 59553779 55499745 51123450 47196960 43758402 41095423 39075224 37484127 36146741
4350C6146741j020557q29779n30333l72624k71015j36574N8661j02744j76965
4341C2764811m45155o09328r91817j211565j375496j350420j341905j163017r77629
4332B3298479r62912p90733o66138p97650p07549p15903p72065p88990p96968
4323A6299571q23945p77124p09355o48588n58385l97728m70917m32478l56551
4314A1124500k93890k90122m19041k76189j45132k17624l05565j47323k76421
4305H753193k55120k16020q1951j30736k08488k52276j37967m1769k46718j29945
4295G052203q4989k13085p2400j24210j57235q3113p332n2245j17075j64752j27053
4284E848714L3477P0156j79294O7280o5020q4644j79818j1763M5346m3748j49297
$$ plain form
4350 36146741 35126184 34296405 33766072 33393448 33122433 32985859 33044520 32941776 32764811
4341 32764811 32319656 31710328 30718511 29506946 28131450 26781030 25439125 24276108 23298479
4332 23298479 22335567 21544834 20878696 20081046 19373497 18657594 17885529 17096539 16299571
4323 16299571 15475626 14698502 13989147 13340559 12782174 12384446 11913529 11481051 11124500
4314 11124500 10830610 10540488 10121447 9845258 9700126 9482502 9176937 9029614 8753193
4305 8753193 8498073 8282053 8200102 8069366 7860878 7608602 7470635 7428866 7182148 7052203
4295 7052203 6967214 6754129 6681729 6557519 6400284 6317171 6309839 6257594 6140519 5975767 5848714
4284 5848714 5882191 5952347 5773053 5840333 5775313 5690669 5510851 5499088 5544434 5500686 5351389
4273E351389j04407J4077l7793o2248O0890R73j51645j10691O4212k6195q4768
4262D913794K5615k03009p801m0489o076q5371Q3289l8809K4190n6630q8155j776
4250D518772M9297k8862N544M6798J53776M4594j42642j8642P9843M8703O0693
4239D817874J07283k1904j16244K6927P9622j8310J81248K5461J5707J9896n9337
4228E058223J8837N3125K21476k057L4510m66k2412J50655P7415j5812O4854L8224
4216E676572J2846L17734R6530J54210J63896J58191J41761J55742J72133K36555
4206G286170K14601K91987K18903J90461P0443J75924K18753K40751J52523J49959
4196I210475L13804L22172J11836K63676K30328L00506L20218K16006L65758M36213
$$ plain form
4273 5351389 5246982 5261059 5223266 5161018 5221908 5222881 5071236 4960545 5024757 4998562 4913794
4262 4913794 4939409 4736400 4728599 4688110 4682034 4596663 4679952 4641143 4665333 4608703 4520548 4518772
4250 4518772 4568069 4539207 4544751 4591549 4745325 4789919 4647277 4628635 4708478 4757181 4817874
4239 4817874 4925157 4903253 4787009 4813936 4893558 4875248 5056496 5081957 5097664 5117560 5058223
4228 5058223 5077060 5130185 5351661 5349604 5384114 5383648 5361236 5511891 5589306 5573494 5638348 5676572
4216 5676572 5689418 6007152 6103682 6257892 6421788 6579979 6721740 6877482 7049615 7286170
4206 7286170 7500771 7792758 8011661 8202122 8272565 8448489 8667242 8907993 9060516 9210475
4196 9210475 9524279 9846451 9958287 10221963 10452291 10752797 11073015 11289021 11654779 12090992
4186A2090992L14073L28332M83831L53066L11244L41237M61114M11057M74438
4177A5569384K91917N31844M94954M08222N42276N55605N24743O12181O17646
4168B0148772O64370P39786Q31612P12370Q45187R75512J007385J027480J050255
4159B8002729J268658J283231J330710J286574J485016J636423J844950K019217
4151D0157508K330275K637242K953224L523536M001678M675984N412734O009925
4143G1702106O794113P948559R349037J0897444J2917844J5036908J6306969J5790458
4135A66743438J3633049Q517437j300462j2620278j9005405k0637834j8981298
4128A16348647j5979361j2837709r788966p856284o239291n066797m211136l687070
$$ plain form
4186 12090992 12405065 12733397 13217228 13570294 13881538 14222775 14683889 15094946 15569384
4177 15569384 15861301 16393145 16888099 17296321 17838597 18394202 18918945 19531126 20148772
4168 20148772 20813142 21552928 22384540 23096910 23942097 24917609 25924994 26952474 28002729
4159 28002729 29271387 30554618 31885328 33171902 34656918 36293341 38138291 40157508
4151 40157508 42487783 45125025 48078249 51601785 55603463 60279447 65692181 71702106
4143 71702106 78496219 86444778 95793815 106691259 119609103 134646011 150952980 166743438
4135 166743438 180376487 188893924 187593462 174973184 155967779 135329945 116348647
4128 116348647 100369286 87531577 77742611 69886327 63647036 58580239 54369103 50682033
4120E0682033l211322k563645k246177k081549j678065j505135j275614j026712
4112C5093814q85405q53423m38003j10711K8273K31116N51757O43413N95368N69118
4102C5425317K19115j36256m12830p00869r13101j126657j096994p84644o50683
4093B9822398m08083O2684l8959M13535N24073O20397R78756J339739J515194
4084C4829734J916727K278216K566414K771686L237489L242222K970425K303277
4076E6116190J515219P34193M39575N28954L65683k01790j215189k168655l030768
4067E3083412l101260k830592k406138j865275j311560p70871k43888K39661O46281
4058D1439770J198822J605109K041970K365580K631572K733824K409526K009069
$$ plain form
4120 50682033 47470711 44907066 42660889 40579340 38901275 37396140 36120526 35093814
4112 35093814 34208409 33354986 32916983 32806272 32834545 33065661 33617418 34260831 34856199 35425317
4102 35425317 35644432 35508176 35095346 34394477 33481376 32354719 31257725 30473081 29822398
4093 29822398 29414315 29476999 29438040 29851575 30375648 30996045 31974801 33314540 34829734
4084 34829734 36746461 39024677 41591091 44362777 47600266 50842488 53812913 56116190
4076 56116190 57631409 58365602 58805177 59334131 59699814 59498024 58282835 56114180 53083412
4067 53083412 49982152 47151560 44745422 42880147 41568587 40797716 40553828 40793489 41439770
4058 41439770 42638592 44243701 46285671 48651251 51282823 54016647 56426173 58435242
4050E8435242J529738J399669J528291J938957K366012K508073J981485L62684
4042G2050151k209339m395483n799691o010154n564046m624119l913307l117032
4034C6416980k465386j842668j538188j345089r32133n06289l64418k44414k0736
4025B7157659J97482L68598O51935Q03856J082382J270419J422138J202212J052695
4016C5209376N50163n83664j620237k436555k658568k641946k458686j949406
4008B1410477j739815j422161j341799r54341q17738r40281o46607o30178n07010
3999A2410547n10777m64765m73832k41279l88276l67460k23590k37054k91037
3990I212477r0894j62283k6577j81812j18499m4560k82392j21378k70944j59450
$$ plain form
4050 58435242 59964980 61364649 62892940 64831897 67197909 69705982 71687467 72050151
4042 72050151 69840812 65445329 59645638 53635484 48071438 43447319 39534012 36416980
4034 36416980 33951594 32108926 30570738 29225649 28293516 27787227 27422809 27178395 27157659
4025 27157659 27355141 27723739 28375674 29179530 30261912 31532331 32954469 34156681 35209376
4016 35209376 35759539 35175875 33555638 31119083 28460515 25818569 23359883 21410477
4008 21410477 19670662 18248501 16906702 15952361 15134623 14194342 13547735 12917557 12410547
3999 12410547 11899770 11435005 10961173 10719894 10331618 9964158 9740568 9503514 9212477
3990 9212477 9121583 8959300 8932723 8750911 8632412 8587852 8305460 8184082 7913138 7753688
3980G753688k26069j20625o6315m7118j23119r2601j16307j90604l5863P9724
3970F814791j14803l2777K3471j56212N2560N4095L213R205m6123J3796J08518
3959F729734R0631N058J45952K11316n1588J10957J4748R8650J2147R4096R6236
3948G557937J60670K04522J75967K09842P2809J50203J14658R4548R7517J68120
3938I006793M6973J49528J80628J50276K74911J93035L97124K81493J96566L73113
3928A1250440K61034J78956L09621M11204K90253L85928M20165M23938K93305
3919A4224844O65666M43326M00322N64051O30294O05506O83343P95097P21332
3910A9733781R34279R63099J057059J285808J367267J384172J664736J715068
$$ plain form
3980 7753688 7527619 7406994 7340679 7293561 7170442 7077841 6961534 6770930 6735067 6814791
3970 6814791 6699988 6667211 6690682 6534470 6587030 6641125 6644338 6653543 6607420 6621216 6729734
3959 6729734 6820365 6825423 6971375 7182691 7131103 7242060 7256808 7355458 7367605 7461701 7557937
3948 7557937 7718607 7923129 8099096 8308938 8381747 8531950 8646608 8741156 8838673 9006793
3938 9006793 9053766 9203294 9383922 9534198 9809109 10002144 10399268 10680761 10877327 11250440
3928 11250440 11511474 11690430 12000051 12411255 12701508 13087436 13507601 13931539 14224844
3919 14224844 14890510 15333836 15734158 16298209 16928503 17534009 18217352 19012449 19733781
3910 19733781 20668060 21631159 22688218 23974026 25341293 26725465 28390201 30105269
3902C0105269J822334J919651K286819K571438L029269L620450M321676M829009
3894E4505915N550119O304527O669440O813049O707912O569598O939353Q410476
3886A08470389J0670733J3853510J7592377K0112034J9969171J7619667J2676835
3879B20964716m348502k2372096k7132196k5969213k1628407j5825693j1131399
3872I2557210p781029n315354l709456k989537k962197k816307k460364k221952
3864F2301014k932133l973438m592130m445985m092945l493241k857828k413018
3856C3500296j721431j471271j100806q44481o87314m36640l48460k16927j27488
3847B6545478j75133Q6108L6976K81605J52591k12190o25109q76157j156701j618972
$$ plain form
3902 30105269 31927603 33847254 36134073 38705511 41734780 45355230 49676906 54505915
3894 54505915 60056034 66360561 73030001 79843050 86550962 93120560 100059913 108470389
3886 108470389 119141122 132994632 150587009 170699043 190668214 208287881 220964716
3879 220964716 216616214 194244118 167111922 141142709 119514302 103688609 92557210
3872 92557210 84776181 79460827 75751371 72761834 69799637 66983330 64522966 62301014
3864 62301014 59368881 55395443 50803313 46357328 42264383 38771142 35913314 33500296
3856 33500296 31778865 30307594 29206788 28362307 27674993 27238353 26889893 26672966 26545478
3847 26545478 26370345 26456453 26493429 26775034 26927625 26715435 26090326 25214169 24057468 22438496
3837B2438496j493415j410928j356920j109533p93445p01381n96315l89140m05880
3828A4181539m20515k98102k01956k09482k46535m8670k12318k15918J3467j62374
3818A2179136j22119k9396L2934J47764R7093J37401J71707L86668K95525J35117
3808A3431830J19864J51051J06792k9746L4704K44199J23695N15510M93901N97418
3798A5789218O70923N01308M86600K65116J68083j8942j25487j55735j02728J62068
3788A7640424L20576M44632N74341O75002P28257M85737K86637N6152k74855l46461
3778B0590442m24894l70146j56609O3724K71424M74047O13577N10520O25044L89619
3768B2586748J70155J85170k06289l05535l42645q8196j33387K4404K05919M67666
$$ plain form
3837 22438496 20945081 19534153 18177233 17067700 16274255 15572874 14976559 14587419 14181539
3828 14181539 13761024 13462922 13260966 13051484 12804949 12756279 12543961 12328043 12341510 12179136
3818 12179136 12057017 12027621 12060555 12208319 12305412 12442813 12614520 13001188 13296713 13431830
3808 13431830 13551694 13702745 13809537 13779791 13814495 14058694 14182389 14697899 15191800 15789218
3798 15789218 16460141 16961449 17448049 17713165 17881248 17862306 17736819 17581084 17478356 17640424
3788 17640424 17961000 18405632 18979973 19654975 20383232 20868969 21155606 21211758 20936903 20590442
3778 20590442 20165548 19795402 19638793 19702517 19973941 20447988 21061565 21572085 22197129 22586748
3768 22586748 22756903 22942073 22735784 22430249 22087604 21999408 21866021 21890425 22096344 22564010
3758B2564010P51547P01331P92715O69911O19695L18136N0901l22874l43750l82254
3748B5419368l84398k43607K24680M61314N01832O93215P72272N90065K89820
3739B8324561m8651o23002q69669j076817j050742p78857n61938l96980o5239
3730B2852666R9307K26043n2390k08153n08229q53227r78230j165252j192005
3721A8220530j066085q80031p09436m08215m24199l42534l16227m35506m59541
3712A3178756n99652q20102p45838p39889o82804m16511m86791n15967j93539
3703G977663m43683l96643k07156l57257l08423k06248l84301l04479j07953j15868
3693E145652k01225k39457j95730k12956m2190P252j55578j78390k16271M2024
$$ plain form
3758 22564010 23315557 24016888 24809603 25479514 26099209 26417345 26468246 26145372 25801622 25419368
3748 25419368 25034970 24791363 25016043 25477357 25979189 26672404 27444676 28034741 28324561
3739 28324561 28275910 27652908 26783239 25706422 24655680 23876823 23314885 22917905 22852666
3730 22852666 22951973 23178016 23125626 22917473 22409244 21556017 20577787 19412535 18220530
3721 18220530 17154445 16274414 15564978 15156763 14732564 14390030 14073803 13638297 13178756
3712 13178756 12579104 11759002 11013164 10273275 9590471 9173960 8687169 8171202 7977663
3703 7977663 7533980 7137337 6930181 6572924 6264501 6058253 5673952 5369473 5261520 5145652
3693 5145652 4944427 4704970 4509240 4296284 4254094 4261346 4105768 3927378 3711107 3753131
3683C753131j3051j50036j09737j03400j50855n3425m0456P0166k7769l9365J1575
3672C146778q6394M4389k33378J8726K9992K9073j3237P732k209m9493p0053k747
3660B819179K2665J60987Q3247J51475J41226J16445J02657Q1482p5237k75006
3650C329120q2982k25622j43414j73736J19734n7975j14010k2233J28055m0895
3640B716042n152q7659P9456Q6669m4025R6320O8331n2968p5466J30297O7682
3629B979527R015j07518o4329j0388J07170m7155q7846p3562M0064m3586j03452
3618B597940K8551J45666J12223p5144J12887O8358L8592N7360N7573L0235J57446
3607C331687L8444K0734J20718q4432k22350o3184l8086K581M5146r6547L4344
$$ plain form
3683 3753131 3740080 3590044 3480307 3376907 3226052 3172627 3132171 3202337 3174568 3135203 3146778
3672 3146778 3060384 3104773 2871395 2890121 2920113 2949186 2935949 2943681 2941472 2891979 2821926 2819179
3660 2819179 2841844 3002831 3086078 3237553 3378779 3495224 3597881 3679363 3604126 3329120
3650 3329120 3246138 3020516 2877102 2703366 2823100 2765125 2651115 2628882 2756937 2716042
3640 2716042 2710890 2623231 2702687 2789356 2745331 2841651 2909982 2857014 2781548 2911845 2979527
3629 2979527 2988542 2881024 2816695 2806307 2913477 2866322 2778476 2704914 2744978 2701392 2597940
3618 2597940 2626491 2772157 2884380 2809236 2922123 2990481 3029073 3086433 3144006 3174241 3331687
3607 3331687 3370131 3390865 3511583 3427151 3204801 3141617 3103531 3106112 3151258 3054711 3089055
3596C089055L3356j06547J03400J20405o492K30318q325O9519J77301J64812J06518
3585C973320P5380K45582J14547m0192J17265O3880Q212j10395k6739P6642N1941
3574D549443l746M3877L3607O8381M3037J79234K27795K14197K9284J23637L45524
3563E854270J43614K91480K61294K41971L57017L60453L60837L32627M38394N89678
3553I231635O02935Q05370P74379P71232J017754J141761J661372J616849J644133
3544A9267420K003037K212261K160875K135387K117727J903124J527217J282251
3536C4609299P96158L64583Q9780j07074l51792m89029l71436l86569r1910M620
3526C4066630j25472j67912n24849p66174j131531j435998j723329j970329k117453
$$ plain form
3596 3089055 3122411 3015864 3119264 3239669 3233177 3463495 3455170 3524689 3701990 3866802 3973320
3585 3973320 4048700 4294282 4408829 4368637 4485902 4549782 4557994 4447599 4420860 4497502 4549443
3574 4549443 4545697 4589574 4623181 4691562 4734599 4913833 5141628 5355825 5385109 5508746 5854270
3563 5854270 5997884 6289364 6550658 6792629 7149646 7510099 7870936 8203563 8641957 9231635
3553 9231635 9834570 10639940 11414319 12185551 13203305 14345066 16006438 17623287 19267420
3544 19267420 21270457 23482718 25643593 27778980 29896707 31799831 33327048 34609299
3536 34609299 35405457 35770040 35859820 35752746 35400954 34911925 34540489 34153920 34062010 34066630
3526 34066630 33941158 33773246 33248397 32482223 31350692 29914694 28191365 26221036 24103583
3517B4103583k245749j991390j805323j655444j447500j251839j080349q52762
3509A1773227q21980p18313p48584m37427l92093l84157l28932j93023m27488
3500G321230l98939k18721j13827j42204q3502j82809j74380m9223j01956r8482
3490E757187j24770q6077o8471M2706j67186p2682o7204O6404J05835K985r7725
3479E291002j9133K01959j5564k9155M1647O5560L000Q4341k996k8879p5892l5262
3467E480628n7834j52345J3779j145o3927r7503l2732P8768M5212J04802O6943
3456E384646K2252P3688m8447P9522K32920o4361J37338J02909J03744K43181
3446F267392J34144J25430R1310O1613K17484J69596K40976K13720K62900K59136
$$ plain form
3517 24103583 21857834 19866444 18061121 16405677 14958177 13706338 12625989 11773227
3509 11773227 10951247 10232934 9484350 9046923 8654830 8270673 7941741 7748718 7321230
3500 7321230 6922291 6703570 6589743 6447539 6364037 6181228 6006848 5957625 5855669 5757187
3490 5757187 5632417 5546340 5477869 5520575 5353389 5280707 5213503 5279907 5385742 5388727 5291002
3479 5291002 5271869 5473828 5458264 5429109 5470756 5536316 5539316 5623657 5620661 5591782 5515890 5480628
3467 5480628 5422794 5270449 5284228 5283083 5219156 5121653 5088921 5167689 5212901 5317703 5384646
3456 5384646 5406898 5480586 5432139 5511661 5744581 5680220 5817558 5920467 6024211 6267392
3446 6267392 6401536 6526966 6618276 6679889 6897373 7066969 7307945 7521665 7784565 8043701
3436H043701L24640K74354K38068M12762L74442M72999L60324M69040M30356N34880
3426A1935566M95065L29056L62369K60138R3171J84014K03053O6814n6408o5359
3416A3807479J07212J14819O3992K34702J78949L48102L51615M29845L67193M45887
3406A6449795M17355N98623O06712O62879Q14879P87966P49229J002341J180642
3397B3270421J183338J236932J355976J643457J770479K018617K345231K696913
3389C7521364L012046L396146L806347M603126N285165N840873O597473P288720
3381G7351260P826318Q410471Q590808Q598584Q175126P467221O437408N002295
3373A37859491L362602J530000k71344j887029k882880l851379m382126m305213
$$ plain form
3436 8043701 8368341 8642695 8880763 9293525 9667967 10140966 10501290 10970330 11400686 11935566
3426 11935566 12430631 12759687 13122056 13382194 13475365 13659379 13862432 13929246 13872838 13807479
3416 13807479 13914691 14029510 14093502 14328204 14507153 14855255 15206870 15636715 16003908 16449795
3406 16449795 16867150 17465773 18072485 18735364 19550243 20338209 21087438 22089779 23270421
3397 23270421 24453759 25690691 27046667 28690124 30460603 32479220 34824451 37521364
3389 37521364 40533410 43929556 47735903 52339029 57624194 63465067 70062540 77351260
3381 77351260 85177578 93588049 102178857 110777441 118952567 126419788 132857196 137859491
3373 137859491 141222093 142752093 142480749 140593720 137710840 133859461 129477335 125172122
3365A25172122m151314m026791l924238m141294m473204m820106n426535n873768
3357H8334872o236790o498418o461340o187613n751297n247419m720977l962859
3349D3268159l431494k923027k480033k279901k070072j658244j450144j309965
3341B5665279j207365j057272j056086r54632p35729o98211p27716o36215l56403
3332A8235650m75060l66499l85668j82597j75104j59644j40367k51482j09171
3323A5990058J48058m5777j37364q7294q6268j67771j41340j33366j79442k27056
3313A4932438m53227l18912k75671j66248m55645m34336k74875k34125k78458
3304A2040941k90844l28526k79170l9307k5085j40158k87362j62839k1520q8321
$$ plain form
3365 125172122 121020808 116994017 113069779 108928485 104455281 99635175 94208640 88334872
3357 88334872 82098082 75599664 69138324 62950711 57199414 51951995 47231018 43268159
3349 43268159 39836665 36913638 34433605 32153704 30083632 28425388 26975244 25665279
3341 25665279 24457914 23400642 22344556 21389924 20654195 19955984 19228268 18592053 18235650
3332 18235650 17760590 17394091 17008423 16825826 16650722 16491078 16350711 16099229 15990058
3323 15990058 16138116 16092339 15954975 15867681 15781413 15613642 15472302 15338936 15159494 14932438
3313 14932438 14479211 14160299 13884628 13718380 13262735 12828399 12553524 12319399 12040941
3304 12040941 11750097 11421571 11142401 11103094 11078009 10937851 10650489 10487650 10466130 10377809
3294A0377809j7759q5492M6247j00956j03161l0923R1823K7282m1345j3722J9255
3283A0169058K70983J98702J3693J5647R2878K03236K32187J96571J04242J35950
3273A1633147K72422K03482K83848L37800K50871K31081L15082M02750M69215
3264A4399698K72144L01408K44309K57605J13668K33431J46428Q5322L16023J7678
3254A6387714K20785M16405J81770K33266K95026M26795N24768M75698N70189
3245A9732416N76723P11620P28800Q76739R26805Q75458J041080J232633J217228
3236B7919502J330836J546571J658921J925841J997741K418686K712913L076350
3228D4587361L440613M143924M663582N321174O213989P072289Q036816Q896253
$$ plain form
3294 10377809 10360050 10274558 10320805 10219849 10116688 10085765 10177588 10204870 10163525 10149803 10169058
3283 10169058 10440041 10638743 10652436 10668083 10760961 10964197 11196384 11392955 11497197 11633147
3273 11633147 11905569 12109051 12392899 12730699 12981570 13212651 13527733 13930483 14399698
3264 14399698 14671842 14973250 15217559 15475164 15588832 15822263 15968691 16054013 16370036 16387714
3254 16387714 16608499 17024904 17206674 17439940 17734966 18161761 18686529 19162227 19732416
3245 19732416 20309139 21020759 21749559 22626298 23553103 24428561 25469641 26702274 27919502
3236 27919502 29250338 30796909 32455830 34381671 36379412 38798098 41511011 44587361
3228 44587361 48027974 52171898 56835480 62156654 68370643 75442932 83479748 92376001
3220I2376001R738782J0791256J1592303J2173117J2318481J2025064J0968769
3213A71983773Q968099O140848K359999j568470n423161q976541j1628177j3159363
3205A48697007j3742599j3337913j2289020j0834861r589491q236194p112171
3198G3554758n893303n003147m443211l891020l501151l098605k752248k434912
3190D2537161j998646j788273j468391j413022j021495p47937o08580l11039j80218
3181C2999560j37861M8664p2971k80745k94888l0507J64063L56966O10763J056246
3171C4419290J141811J177836J381572J288822J206029R90378J155658J009255
3163D3770651R09094R08295Q48035O53299O12642M51023J60181J74008l7885k6770
$$ plain form
3220 92376001 102114783 112906039 124498342 136671459 148989940 161015004 171983773
3213 171983773 180951872 187092720 189452719 187884249 182461088 173484547 161856370 148697007
3205 148697007 134954408 121616495 109327475 98492614 88903123 80666929 73554758
3198 73554758 67661455 62658308 58215097 54324077 50822926 47724321 44972073 42537161
3190 42537161 40538515 38750242 37281851 35868829 34847334 34099397 33490817 33179778 32999560
3181 32999560 32861699 32910363 32837392 32556647 32261759 32231252 32395315 32752281 33363044 34419290
3171 34419290 35561101 36738937 38120509 39409331 40615360 41605738 42761396 43770651
3163 43770651 44679745 45588040 46436075 47089374 47702016 48153039 48313220 48487228 48449343 48422573
3153D8422573P8050j98939j86636j42721k63159n29394o59512q79881j144166
3144D4496215j460222j246790j139614j008618j017797q15023m91633l46224k71288
3135C6699006k25429k08934n9001O0643J53244J78884M62237O80762Q40863J007140
3125C9589415J197020J455103J479099J391552J388300J516771J402688J361560
3117E0781508J252583J097634J225636J332797J233810J394815J634646J752370
3109F1705799J773620K011443K205940K403204K456906K580211K559886K512535
3101H0209544K265648J966919J673349J233606Q64931N50947J91579L11950K52340
3092H9520813M94510R49956J288939J484981J736775J836849J691502J506354
$$ plain form
3153 48422573 48500623 48301684 48115048 47972327 47709168 47179774 46520262 45640381 44496215
3144 44496215 43035993 41789203 40649589 39640971 38623174 37808151 37316518 36970294 36699006
3135 36699006 36473577 36264643 36205642 36266285 36419529 36598413 37060650 37741412 38582275 39589415
3125 39589415 40786435 42241538 43720637 45112189 46500489 48017260 49419948 50781508
3117 50781508 52034091 53131725 54357361 55690158 56923968 58318783 59953429 61705799
3109 61705799 63479419 65490862 67696802 70100006 72556912 75137123 77697009 80209544
3101 80209544 82475192 84442111 86115460 87349066 88213997 88764944 88956523 89268473 89520813
3092 89520813 90015323 90965279 92254218 93739199 95475974 97312823 99004325 100510679
3084A00510679J134982O20683O5200n22084j070491j660720j912480k108760k280169
3075I2776840k157274k027998j644357j505066j297083j122925j272037j371781
3067H0378319j788114k346759k505633k749277l369315l565552l544412l613580
3059E6895677l215155l102851k965304k390049k261906k025471j755592j636264
3051C7543085j560410j459306j346773j167590j090828r41892p03780q64145n82160
3042B7826201o92738n32402l27452n71070n19629l28670l80677k39822l6568l2673
3032B4164500k2333R9409P2019n0468j71095q870j02102k1052j92378j44877n1820
3021B3570933q0421J6523J94091q7065J0838J40514P0230K0441k1125L0709M1527
$$ plain form
3084 100510679 101645661 102266344 102331544 101809460 100738969 99078249 97165769 95057009 92776840
3075 92776840 90619566 88591568 86947211 85442145 84145062 83022137 81750100 80378319
3067 80378319 78590205 76243446 73737813 70988536 67619221 64053669 60509257 56895677
3059 56895677 53680522 50577671 47612367 45222318 42960412 40934941 39179349 37543085
3051 37543085 35982675 34523369 33176596 32009006 30918178 29976286 29272506 28408361 27826201
3042 27826201 27133463 26601061 26273609 25702539 25182910 24854240 24473563 24233741 24197173 24164500
3032 24164500 24142167 24241576 24313595 24263127 24092032 24083162 23981060 23960008 23767630 23622753 23570933
3021 23570933 23490512 23507035 23701126 23614061 23624899 23765413 23835643 23856084 23834959 23865668 23907195
3010B3907195O7272n1134K69663M90811N89105P48335J072480J261698J029322
3001B9384747R00329R14947P63627R24447J004660J155795J224318R66287Q00736
2992C8039893M19601K59784Q9773O0118L15624K10140L89667K05410l405N732
2982C9992337l2625l18526j54075k66943m33808o08202j033117j267583j279514
2973C4597944j334633j546541j309841j039625r88697o73189n40821l53309k56689
2964B6554599j46365j38570j07958j52876J17042K80689M58929N46604O89654
2955B8101748R58648J117653J362773J584442J721427K281658K789514L085340
2947D3003203L490880M039548M588075M892188M992489N251117N226105M685866
$$ plain form
3010 23907195 23974467 23923333 24192996 24683807 25272912 26021247 27093727 28355425 29384747
3001 29384747 30285076 31200023 31963650 32888097 33892757 35048552 36272870 37239157 38039893
2992 38039893 38459494 38719278 38809051 38869169 39184793 39394933 39784600 39990010 39986605 39992337
2982 39992337 39959712 39641186 39487111 39220168 38786360 38178158 37145041 35877458 34597944
2973 34597944 33263311 31716770 30406929 29367304 28378607 27705418 27164597 26811288 26554599
2964 26554599 26408234 26269664 26161706 26008830 26125872 26406561 26865490 27412094 28101748
2955 28101748 29060396 30178049 31540822 33125264 34846691 37128349 39917863 43003203
2947 43003203 46494083 50533631 55121706 60013894 65006383 70257500 75483605 80169471
2939H0169471M215945L395037K236913Q12611m94320j980023l516071m475295
2931H0364268n253076n744207n790732n765050n412351m862486m334684l875242
2923C9326440l425893k951551k705928k314079j789113j716730j596733j473513
2915B1352900j204718j083987r40044q82445p31897q28172p25919n82616m35387
2906A3937715n60704m99311l42486l29261l75938l93760l15203k95289l94713
2897A0431050l52182j70093j87150j72578k59124k28392P9842k9462j79568k91766
2887H640577o9031r5722j18008O3376j67538j76076k27409k57531j62207k01988
2877G228443k46128q3360o6652j98007M2436j07233j67470M9637l7993j07359
$$ plain form
2939 80169471 84385416 87780453 90017366 90829977 90335657 88355634 84839563 80364268
2931 80364268 75111192 69366985 63576253 57811203 52398852 47536366 43201682 39326440
2923 39326440 35900547 32948996 30243068 27928989 26139876 24423146 22826413 21352900
2915 21352900 20148182 19064195 18124151 17241706 16509809 15681637 14955718 14373102 13937715
2906 13937715 13377011 12877700 12535214 12205953 11830015 11436255 11121052 10825763 10431050
2897 10431050 10078868 9908775 9721625 9549047 9289923 9061531 9141373 9111911 8932343 8640577
2887 8640577 8571546 8475824 8357816 8421192 8253654 8077578 7850169 7592638 7430431 7228443
2877 7228443 6982315 6898955 6832303 6634296 6676732 6569499 6402029 6451666 6413673 6306314
2867F306314r2218r2356j44293k5752l7436l1138o0354J7328j16156j18077L0966
2856E636828J26708j11741n6795J06976j53051L2071N4573K7258o0335K175o707
2845E597960N4314J21636n2306m9597L2153J7025m3137L1556j04987J19113L9648
2834E763378L796j48595p8984j15211q1864Q5028J03054J18095L3651N0384K1177
2823E753909J20511O5644L1744n7703M7490R4902J39496J91884J40862J93211
2813F721950J40437J77361J84773K50171J27638J56867J63779J65689J17721J14110
2803H320496J27626J88610J70983J59947O6591J02136J83100J99562L38913K03650
2793A0061614J10037K06246L19986K77121L26740M04130K81268L53551M07915
$$ plain form
2867 6306314 6214096 6121740 5977447 5951695 5914259 5883121 5822767 5840095 5723939 5605862 5636828
2856 5636828 5763536 5651795 5595000 5701976 5548925 5580996 5635569 5662827 5602492 5604667 5597960
2845 5597960 5652274 5773910 5721604 5672007 5704160 5721185 5678048 5709604 5604617 5723730 5763378
2834 5763378 5767174 5618579 5539595 5424384 5342520 5427548 5530602 5648697 5682348 5732732 5753909
2823 5753909 5874420 5940064 5971808 5914105 5961595 6056497 6195993 6387877 6528739 6721950
2813 6721950 6862387 7039748 7224521 7474692 7602330 7759197 7922976 8088665 8206386 8320496
2803 8320496 8448122 8636732 8807715 8967662 9034253 9136389 9319489 9519051 9857964 10061614
2793 10061614 10171651 10377897 10697883 10975004 11301744 11705874 11987142 12340693 12748608
2784A2748608N44036N19734M36879M81840N28092N13497N23602O33660O80879
2775A7610827P00939O74240P74803O75674Q48161Q09660Q51432R07967R09709
2766B4763412J012458J154248J184193J168175J459626J425817J507842J753002
2758C5428773J753428J882249K159717K548822K822584L244468L726422M532690
2750E8099153N049422N775444O572848P371585Q442180R503985J0765661J2798795
2742A24379073J5153698J7764068J9776041J9723501J6784067R956962k827201
2735B20710209j5991647k2045782k2185825j9164042j5032633j0916258p628729
2728A07745293n461731l945681k702634j883480p95817M73902J403691K590917
$$ plain form
2784 12748608 13292644 13812378 14249257 14731097 15259189 15772686 16296288 16929948 17610827
2775 17610827 18311766 18986006 19760809 20436483 21284644 22094304 22945736 23853703 24763412
2766 24763412 25775870 26930118 28114311 29282486 30742112 32167929 33675771 35428773
2758 35428773 37182201 39064450 41224167 43772989 46595573 49840041 53566463 58099153
2750 58099153 63148575 68924019 75496867 82868452 91310632 100814617 111580278 124379073
2742 124379073 139532771 157296839 177072880 196796381 213580448 223537410 220710209
2735 220710209 204718562 182672780 160486955 141322913 126290280 115374022 107745293
2728 107745293 102283562 98337881 95635247 93751767 92955950 93429852 94833543 97424460
2720I7424460L812399N243235O617693P931912R341817J1010837J3048111J4997199
2712A69427663J7667356K0874426K4758371K8772747L0849732K9013090K2278723
2705C43642108Q529306j1853399k9557741l7146984l7602458l3602366k7689333
2698A74719133k1871122j7218224j3815985j1511009r887769q709467p496064
2691H4209493o611612n692330n007021m514477m021560l687589l396528l030260
2683D8248116k575716k288184k024089j877844j486640j360742j335508j451870
2675C3847523j187567j166121j207116j196493j224771j195999j003435j065324
2667B4600697r64043r01994p95042o87349p49347p23702n47735n27489n64350
$$ plain form
2720 97424460 101236859 106480094 113097787 121029699 130371516 141382353 154430464 169427663
2712 169427663 187095019 207969445 232727816 261500563 292350295 321363385 343642108
2705 343642108 352171414 340318015 310760274 273613290 236010832 202408466 174719133
2698 174719133 152848011 135629787 121813802 110302793 100415024 91705557 84209493
2691 84209493 77597881 71905551 66898530 62384053 58362493 54674904 51278376 48248116
2683 48248116 45672400 43384216 41360127 39482283 37995643 36634901 35299393 33847523
2675 33847523 32659956 31493835 30286719 29090226 27865455 26669456 25666021 24600697
2667 24600697 23636654 22734660 21939618 21252269 20502922 19779220 19231485 18703996 18139646
2658A8139646m25443l63984l56511m05410m55300m28929m02395n05923l91583
2649A4404168l37302k92721m42121k78206l54276m43618k55285l50060k61389
2640A1389190j85091k57588k70797k29339p4665k95041k63005k68869k47905k00282
2630I096608k79654j67662n5613p6541j92389k31058j45117j13753j59293k28655
2620G446873j88263j45275k41235o9387k64253j18228k8593j42119j55630j23329
2610E970561k49908j17227o1962l13985j01143q660r7154j07844j80661j8267
2600D713750l1433q8347k0564k5899n4056j1949p3328m9582p6211j27836j56550
2589C997995q4432Q3372p9452r6816j04126j29967r4544m4203m1434o2443l3736
$$ plain form
2658 18139646 17714203 17350219 16993708 16588298 16132998 15704069 15301674 14795751 14404168
2649 14404168 14066866 13774145 13332024 13053818 12699542 12255924 12000639 11650579 11389190
2640 11389190 11204099 10946511 10675714 10446375 10371710 10076669 9813664 9544795 9296890 9096608
2630 9096608 8816954 8649292 8593679 8517138 8324749 8093691 7948574 7834821 7675528 7446873
2620 7446873 7258610 7113335 6872100 6802713 6538460 6420232 6391639 6249520 6093890 5970561
2610 5970561 5720653 5603426 5541464 5227479 5126336 5117676 5020522 4912678 4732017 4713750
2600 4713750 4682317 4593970 4573406 4547507 4493451 4481502 4408174 4358592 4282381 4154545 3997995
2589 3997995 3913563 3996935 3917483 3820667 3716541 3586574 3492030 3447827 3406393 3343950 3310214
2578C310214j17944j25949q2387q8038p1061L0418K0391j22832n5993q6566j13429
2567B496824k3753k9680L400j3964L7770q5308r7759K0813p2463j16231j50064
2556A969585m4761l9547J0501m72p4733J5559O472n1556n6287K046J24592L471
2544A864870j1652M6898j32686k6413J09317q0938j45183j1874N6240j5042j38533
2533A515004j0108j5403K9605P7929j7296n992j33846o3539k2928K3172n0439
2522A326159R713q1210o2519r453n7076L8767J56023j1152k24304P7917J59582
2511A322447J3622o8798l4579j0348m4857l4348k547M5370j49494j0568L7441
2500A063341J4008N7268r1421N5114L1232K9553J09001l9059N1166K3440J60715
$$ plain form
2578 3310214 3192270 3066321 2983934 2895896 2824835 2855253 2875644 2752812 2696819 2610253 2496824
2567 2496824 2473071 2443391 2446791 2432827 2470597 2385289 2287530 2308343 2235880 2119649 1969585
2556 1969585 1924824 1885277 1895778 1895306 1820573 1836132 1842604 1791048 1734761 1736807 1861399 1864870
2544 1864870 1853218 1900116 1767430 1741017 1850334 1769396 1624213 1612339 1668579 1653537 1515004
2533 1515004 1504896 1489493 1519098 1597027 1579731 1573739 1439893 1376354 1353426 1376598 1326159
2522 1326159 1335872 1254662 1192143 1182690 1125614 1164381 1320404 1309252 1084948 1162865 1322447
2511 1322447 1336069 1267271 1232692 1222344 1177487 1143139 1140592 1185962 1036468 1025900 1063341
2500 1063341 1077349 1134617 1043196 1098310 1129542 1159095 1268096 1229037 1280203 1303643 1464358
2489A464358J8805o3136J28337L0724J98756J29342J04143L2015M7382n5397j32180
2478A903149J9057j10380j51647k9334j77398p3062p2135j02696k8004N7966l1511
2467A204005p8718j8443P1094J4692p509N7940j0248J70830J28729n1612J378
2456A482138J09521K10075m570J94465R7504J62701K20086j6203O7374j84196
2446B338895k64466j88491j18536n2595j82074o9615l2723j15601q5454o9555
2436A159785p8831q5435J00387j9641q6943q3323K0581k21454J2852K5825q0871
2425F62932K132r74j9918M5809k9910J36177M488o5017J09493l1414o3909m6169
2413G03720N866K1552M0485q6775k9182k3758r2959L4762o6786M5069o1619o4445
$$ plain form
2489 1464358 1483163 1420027 1548364 1579088 1777844 1907186 2011329 2043344 2090726 2035329 1903149
2478 1903149 1922206 1811826 1660179 1630845 1453447 1380385 1308250 1205554 1177550 1235516 1204005
2467 1204005 1125287 1106844 1177938 1192630 1185121 1243061 1232813 1403643 1532372 1480760 1482138
2456 1482138 1591659 1801734 1797164 1991629 2089133 2251834 2471920 2455717 2523091 2338895
2446 2338895 2074429 1885938 1767402 1714807 1532733 1463118 1430395 1314794 1229340 1159785
2436 1159785 1080954 995519 1095906 1076265 989322 905999 926580 705126 717978 743803 662932
2425 662932 665064 664090 644172 689981 660071 796248 800736 735719 845212 813798 749889 703720
2413 703720 709586 731138 771623 684848 655666 631908 538949 573711 506925 551994 490375 425930
2401D25930Q4133N3214k9870p7034O5589O003L205r1578M855p5934K539P6215
2389D47267j1772L0793K4137j677L3451o7835k10423J54262N9954n5161L0215
2378D33211p9867m2374J954Q9779q7025L0621k663O3817p6972l4254J48975L9946
2366D85148p1473K1813l6848j61175m4948K6546M5955R2101O3039j35850Q7166
2355C71474n7468l6850j5240q0701M7076J15721q7700L9128m4651q1734J87564
2344C56619j8081j1007L0094p7324n5836N1709m6358m220n9339K1512k5851P5018
2332B36936k3565M2135M4509R9911j69811o2302P3138J7913m8896r4225L6196
2321A51939l312m7428R900P7587k7445o5344q8162R1524M1276P5453O2306R892
$$ plain form
2401 425930 510063 563277 533407 456373 521962 527965 531170 439592 444447 368513 371052 447267
2389 447267 435495 466288 490425 488748 522199 454364 243941 398203 458157 402996 433211
2378 433211 353344 310970 312924 402703 315678 346299 343636 407453 330481 296227 445202 485148
2366 485148 413675 435488 398640 237465 192517 219063 265018 357119 420158 284308 371474
2355 371474 314006 277156 261916 181215 228291 344012 256312 295440 250789 169055 356619
2344 356619 338538 327531 357625 280301 224465 276174 229816 225596 166257 187769 161918 236936
2332 236936 213371 255506 300015 399926 230115 167813 240951 258864 209968 115743 151939
2321 151939 148627 101199 111099 188686 161241 95897 7735 99259 140535 215988 278294 288186
2309B88186M4771o3701L1524o6225J09673J2946q3982l5617J1730k4148J03901
2298C29058L1822o7230P8728l524O9911q0697J9647j18816l8556J34220k6611
2287C27952l5370m0392n9508J21029k957n4206r6156J676J4005R2205J14855q1769
2275C01364n3915J40346j00743k1582j30076O1271R5291j6149q9115m6076J42302
2264B82918p216j34864L1429M5608k7142P7027l7493o0660m1138J1938J67434
2253C07841l9669L4010m7067r6255O794r0244l7870N8245K3514O0074J8128o319
2241A91182n0579o0685N6435M3088K2190q9929j8268J40314J60365p5943j36866
2230A81304J00180M3856r3107k420m5339q6694l7322J10005R0018j00565O3869
$$ plain form
2309 288186 332957 269256 300780 234555 344228 357174 273192 237575 249305 225157 329058
2298 329058 360880 293650 372378 368854 438765 358068 377715 258899 220343 354563 327952
2287 327952 292582 252190 192682 313711 310754 256548 160392 162068 176073 268278 383133 301364
2275 301364 247449 387795 287052 265470 135394 196665 291956 275807 186692 140616 282918
2264 282918 275702 140838 172267 217875 190733 267760 230267 169607 128469 140407 307841
2253 307841 268172 302182 255115 158860 165654 75410 37540 95785 119299 179373 197501 191182
2241 191182 140603 79918 136353 179441 201631 111702 93434 233748 394113 318170 181304
2230 181304 281484 325340 232233 229813 184474 97780 60458 170463 260481 159916 223785
2219B23785K3909o0592j02522M8900L3794r3851Q1587r9534o8364N7380J3699
2208E8191M610R8536K2170r4603j26807J82836o493r0354Q4973J14581J75816
2197D23456j12604j74504J3594L7050M9641m2391m3934M5933m3443J4289R5330
2186B62417j34200L4323p9446P0086L9617L0666N2848q7718k958P7728o7301P5189
2174B71251o8453m8192J4075M3902K0384p5826J1708K8642L8943M6148K4261n3305
2162B53538L9332J80252p0046q9986N6168l1995J7570j79964J12450R6769j40107
2151B43981n3396m1013l6767k3344N8761Q8400n5536N3302J91919p1011K5140
2140C80436R7297o3296l5994Q2388j61898R9355R1161l9690k7163n6538J5179
$$ plain form
2219 223785 247694 187102 84580 133480 167274 73423 155010 55476 -12888 44492 58191
2208 58191 62801 161337 183507 88904 -37903 144933 138440 48086 133059 247640 423456
2197 423456 310852 136348 149942 186992 236633 194242 150308 196241 152798 167087 262417
2186 262417 128217 162540 83094 153180 192797 223463 276311 188593 185635 263363 196062 271251
2174 271251 202798 154606 168681 212583 232967 157141 168849 197491 236434 282582 306843 253538
2162 253538 292870 473122 403076 313090 369258 337263 354833 174869 287319 384088 243981
2151 243981 190585 149572 112805 89461 148222 236622 181086 234388 426307 355296 380436
2140 380436 477733 414437 378443 460831 298933 398288 489449 449759 422596 366058 381237
2129C81237J49367J9704o281J40247R7273L7963o4081p6713k6871P919L2653J57506
2117H49923j181J1172n6147L4035q004q3973k0948R1481p2294J82893j6688n748
2105I04521P205r4395J4969J30776O9412J39820Q4097l6554m519K5317J28928
2094A369577J25671j7942o7046J73702Q8457j11285P6439J16341K9831M0013J78328
2083B002086M6147J29235R7210K28435N0093J53437R6405J49931K28087J16142
2073C297208K90458K53037K35335K04431L01151M85456M64071O24493P49983O72714
2063G578337O48928Q61834J108078J225351J407094J842227K063781L256656L782985
2054B3775271M370595L425067M058734O22265o071070n143151m752070m137014
$$ plain form
2129 381237 530604 550308 544027 684274 781547 819510 755429 678716 651845 659764 692417 849923
2117 849923 848742 859914 803767 837802 829798 745825 724877 816358 744064 926957 910269 904521
2105 904521 911726 817331 832300 963076 1032488 1172308 1256405 1219851 1215332 1240649 1369577
2094 1369577 1495248 1477306 1410260 1583962 1672419 1561134 1637573 1753914 1783745 1823758 2002086
2083 2002086 2048233 2177468 2274678 2503113 2553206 2706643 2803048 2952979 3181066 3297208
2073 3297208 3587666 3840703 4076038 4280469 4581620 5067076 5531147 6155640 6905623 7578337
2063 7578337 8227265 9089099 10197177 11422528 12829622 14671849 16735630 19992286 23775271
2054 23775271 28145866 31570933 35629667 36251932 30180862 25037711 20285641 16148627
2046A6148627k952013k038068j504504j074299p63553o10582o23017l05089l52949
2037E924553m96408m62080l81001m15568l06725k63530l10346k66327n2346k18208
2027B752014j18374j09672n874j22269j77425O053j00073j67064k05062j3789
2017A738465j04553o4388J9581l2574K1883k34440r6189J9456R9932o0393j00552
2006A206228j9702j2450q7316r7619M247o9349Q1835N6644K4059j57994n6483
1995H72100l3191Q8623K9114j75423n2913N5806o5667r861j10593J18714o4467
1984F52242L0867r4262J02397J4946r8209K5666n0753o8959M6181L3292o0966
1973E32442J0081j9924o3047j15254j04172K5175J8388K8661q047p1809p7475
$$ plain form
2046 16148627 13196614 11158546 9654042 8579743 7816190 7205608 6582591 6277502 5924553
2037 5924553 5428145 4966065 4585064 4169496 3862771 3599241 3288895 3022568 2970222 2752014
2027 2752014 2633640 2523968 2518094 2395825 2218400 2224453 2124380 1957316 1752254 1738465
2017 1738465 1633912 1569524 1589105 1556531 1578414 1343974 1247785 1267241 1367173 1306780 1206228
2006 1206228 1186526 1174076 1086760 989141 993388 924039 1005874 1062518 1086577 928583 872100
1995 872100 838909 927532 956646 781223 728310 784116 718449 708588 597995 716709 652242
1984 652242 683109 588847 691244 706190 607981 633647 582894 513935 560116 593408 532442
1973 532442 542523 522599 459552 344298 240126 265301 283689 312350 304303 232494 155019
1962A55019J67178R9632j24123P3473l4171P26o4966L4990m7123j4719J55976
1951D01892j13439M4139m3567j1145p0174N5613N1900p5736J7263j6765Q0264
1940C20245m5472J00121q0822q0922r0876K7700O2569M0350N722l8151K6723j1582
1928B35605L9313j3483l9913J4842l3518p7328l9948R997n514O2591q4483K9801
1916I7962R7360j02029Q3515N4678j02262k1011n4761P4943l7830j29589N5212
1905A6188P5591N0604p31j9576j23460j06598P0678P6724N3608L5354l0154L4514
1893A32742m2320L749M8600R3805n7875r6452r4017J3560N6760R6822m2696L247
1881A15925O002p0445K6185Q4691p3213l8913M5351q881N7155m1400o5612j7541
$$ plain form
1962 155019 322197 421829 297706 371179 337008 337734 272768 307758 260635 245916 401892
1951 401892 288453 332592 289025 277880 207706 263319 315219 239483 256746 239981 320245
1940 320245 274773 374894 294072 213150 122274 149974 212543 252893 258615 220464 247187 235605
1928 235605 274918 261435 221522 236364 202846 125518 85570 95567 90053 152644 68161 97962
1916 97962 195322 93293 176808 231486 129224 108213 53452 128395 90565 -39024 16188
1905 16188 91779 142383 141652 122076 -1384 -107982 -37304 39420 93028 128382 98228 132742
1893 132742 90422 94171 142771 236576 178701 82249 -11768 1792 58552 155374 112678 115925
1881 115925 121927 51482 77667 162358 89145 50232 95583 86702 143857 102457 36845 19304
1869A9304J9613j5170O6844l2470k865Q3361J8229p2118J5296L3509o169K0091
1857A47455Q7668m3562j25053j0423m2617n1589J1420q616J90082O2164p1964
1846A44965n1369K0247O579m2912n3573O4682K1709o2597P2300m5188K346n7370
1834A9819k64M728P7511k9396p384K3625r1913M2422j2847N3529R00N5207O30
1821A36567L3432r0646o490n9893o4632J02493J15962o729p4031Q3695n7149p2872
1809C9707P6098Q9763o8332n4117J871l2883J8545Q2376j12939j5074R358R0937
1797A25310k7242o5461j10845j0923K52827j14685O7274J13834j09778J0149j81971
1786e1511R3010L7915M5468M1383q0955n5007L0734k7196n7249J11403P01r2087
$$ plain form
1869 19304 38917 23747 90591 58121 55256 138617 156846 84728 100024 133533 127364 147455
1857 147455 235123 191561 66508 56085 13468 -38121 -26701 -35317 154765 216929 144965
1846 144965 93596 113843 120422 77510 23937 88619 110328 47731 120031 74843 77189 19819
1834 19819 19555 24283 101794 72398 65014 88639 -3274 39148 26301 79830 80730 135937 136567
1821 136567 169999 79353 72863 12970 -51662 50831 166793 160064 86033 169728 112579 39707
1809 39707 115805 205568 137236 83119 84990 52107 70652 153028 40089 25015 34373 125310
1797 125310 98068 32607 -78238 -89161 163666 48981 116255 230089 120311 130460 -51511
1786 -51511 41499 79414 124882 166265 85310 30303 61037 33841 -23408 87995 88696 -3391
1774c391K9277N6019p8238n2064K3339R5527n6912r008m6849O9025m1433p968
1762b2676P7390M7238L7593m7372M7123j07274r234l2439R6690p1762r3565L0729
1750d7559j5509R0969o2762K7007q8310J02643M7121m0544k672o0457J42828p4875
1738A7880j07490m971j7797R2560j0715O3697r2961q7314M8283J15892K3288j76081
1726a35729k0517J45176p3641l998J01352M8441k5810Q670J30889j41026m8855
1715a5048P4257n9182m1493J5572O8575p3921O0490O3778o7482q4893k5651K7890
1703e7108l533J10880J5108K0531k9500j2634r1621Q5222M0408j02653r0037J2883
1691a02054P9666r5160J24060O7171j59196P6506R4565J15728q8747N4400J548
$$ plain form
1774 -3391 25886 81905 3667 -48397 -25058 70469 13557 4549 -42300 26725 -14708 -22676
1762 -22676 54714 101952 139545 92173 139296 32022 22788 -9651 87039 15277 -78288 -47559
1750 -47559 -63068 27901 -34861 -7854 -96164 6479 53600 13056 10384 -50073 92755 17880
1738 17880 -89610 -94581 -112378 -19818 -30533 33164 -59797 -147111 -98828 17064 40352 -135729
1726 -135729 -156246 -11070 -84711 -88709 12643 61084 35274 43944 174833 33807 -15048
1715 -15048 59209 27 -41466 -25894 42681 -31240 29250 93028 25546 -59347 -84998 -57108
1703 -57108 -60641 50239 65347 85878 56378 43744 -47877 37345 77753 -24900 -114937 -102054
1691 -102054 -22388 -117548 6512 73683 -85513 -9007 85558 201286 112539 166939 168487
1680A68487j47348K0217q8893j9611K1322o5449L768J16523j03178Q0845k664
1669a5981J7366N0009M39J4324r8467q6366Q2145J63408J2791k13339n7525J19190
1657a2006L8628K9095l2751j9770J4690r8923Q4274o1104r330o578j49976J42072
1645h1679K9844L5549J8232j7845j08327j4981J34162J1300J8580Q8335j42914
1634b9744l8508J1070m6163M8326Q8394j02320K3043j2651P8849K9592o0771j10519
1622a21402M8905r2689K7605J30316N4646R083J6628K1732l3577p9489k6077N580
1610c8739O9743q1580q0087J1311R9436L5566j46996R9843N5948l1231p6710N6471
1598b7025o5074K0713j12258O1233J22763J02175o9984j04513O0388J27226j88632
$$ plain form
1680 168487 21139 41356 -47537 -67148 -45826 -111275 -107507 9016 -94162 -13317 -15981
1669 -15981 1385 51394 51833 66157 -32310 -118676 -36531 126877 139668 -73671 -131196 -12006
1657 -12006 26622 55717 22966 3196 17886 -81037 3237 -57867 -67197 -73775 -223751 -81679
1645 -81679 -51835 -16286 1946 -15899 -124226 -139207 -5045 6255 24835 113170 -29744
1634 -29744 -68252 -57182 -103345 -55019 33375 -68945 -45902 -58553 20296 49888 -10883 -121402
1622 -121402 -72497 -165186 -137581 -7265 47381 56464 73092 94824 61247 -18242 -44319 -38739
1610 -38739 31004 -50576 -130663 -119352 -19916 15650 -131346 -31503 24445 -6786 -83496 -27025
1598 -27025 -92099 -71386 -183644 -122411 352 102527 32543 -71970 -11582 115644 -72988
1587g2988m0148Q2787l3383N19L0146L8178r2718o9778J10010L9121P3621j059
1575F4308m2643o2513j8990N17J12142r8856J303O0931m4917J02164L7477j27671
1563a6748p3093J14326l4515Q9956k4950j02094O0258p88j03345r608L7708L2749
1551c0144j4475m473p4354L7807M0889P5034J4404j06791k7026P8621l9974J2715
1539c7767j5784K7446m9086Q8669P5122j91723M2973L8526L3959j01610k9882
1528a19157J55585L0485j24112q302O566k7407J19912J25944j849K7641j08981
1517G6325n1943L7976p6227p4413J59430Q1806q1823n947j1144k05324J07889
1506d3395J85796q2013L7379k7687j47474M3076L7662l3877K0089R794P5925r9574
$$ plain form
1587 -72988 -113136 -30349 -63732 -63213 -33067 5111 -87607 -157385 -47375 -8254 65367 64308
1575 64308 21665 -40848 -59838 -59321 52821 -46035 -44732 16199 -28718 73446 110923 -16748
1563 -16748 -89841 24485 -10030 79926 54976 -47118 13140 12352 -90993 -100601 -62893 -30144
1551 -30144 -44619 -49092 -123446 -85639 -44750 30284 44688 -62103 -89129 -10508 -50482 -37767
1539 -37767 -53551 -26105 -75191 13478 88600 -103123 -60150 -21624 12335 -89275 -119157
1528 -119157 36428 66913 -57199 -65501 -58935 -86342 33570 159514 157665 185306 76325
1517 76325 24382 62358 -13869 -88282 71148 152954 71131 65184 54040 -151284 -43395
1506 -43395 142401 60388 97767 70080 -77394 -34318 3344 -30533 -10444 -650 75275 -24299
1494b4299l0659k5708R592M6702j8866N0587q6156q6232O2522Q1312j9513O0749
1482B0031r0753p0979J07925n7134J9765R8776k2674j06781k7057M3500J58272
1471G2891o7729j5039l4787l3674r9825Q3965Q40J5381L2474j1686j5791l1629
1459a04609L1831J28987q4444n8723P0717N2752n8568K2557m5316k1535M2778
1448b3573l0435Q2826n1818j9029j7963M3876m2473J340J24018j0697J4919k4826
1436D6165k2398N9948N4851l9403J186j3438O2402M311j32148j07071l3745J48181
1424B8841J2930k7067l2202J5186l4147N4040l0508L2978J5697j1361j53862N8146
1412g1329J90934P906j3413k4142j66959o4512J07997J39795J0852N5791o1541
$$ plain form
1494 -24299 -54958 -80666 -71074 -24372 -43238 7349 -78807 -165039 -102517 -21205 -40718 20031
1482 20031 -70722 -141701 -33776 -90910 -71145 27631 4957 -101824 -128881 -85381 72891
1471 72891 5162 -9877 -44664 -78338 -178163 -94198 -93358 -77977 -45503 -57189 -72980 -104609
1459 -104609 -72778 56209 -28235 -86958 -16241 36511 -22057 500 -44816 -66351 -23573
1448 -23573 -54008 28818 -23000 -42029 -59992 -16116 -58589 -57249 66769 56072 70991 46165
1436 46165 23767 83715 138566 99163 100349 86911 149313 153624 21476 -85595 -119340 28841
1424 28841 41771 14704 -17498 -2312 -36459 17581 -12927 20051 35748 24387 -129475 -71329
1412 -71329 119605 127511 114098 89956 -77003 -141515 -33518 106277 117129 172920 111379
1401A11379j63940j4579J38016j17354j3477R4178o5093L2454o2708O8560N9254
1390F6690k0129l6804k7218m9098J5263J4817k522O9237j0466k4805R6067R373
1378A00405n9235p6340M6094R3566l1130o1675K6816J8743l8111O7301J9100q2705
1366B2829m5169O6223n3029O3292o5259j76381J90125j4943M7055q5107m2485
1355i2849P2550O5242l9717p0106j5839L4707J7755j08861J25259L1290L0102
1344D9533m6666J5709O0652m7699j30956N7358o1716K4712Q6426j575o3510N2277
1332e455P297J02860L2364j88755l4296J47489M8455j12514j812k201l8275m0500
1320h5343R5750J9970l8027j1373m1366P4090l2560R54K9452Q268k8458j07733
$$ plain form
1401 111379 -52561 -67140 70876 -46478 -59955 34223 -30870 1584 -61124 7436 66690
1390 66690 46561 9757 -17461 -66559 -51296 -36479 -39001 30236 19770 -5035 91032 100405
1378 100405 41170 -35170 10924 104490 73360 11685 38501 57244 19133 86434 105534 22829
1366 22829 -22340 43883 -9146 54146 -11113 -187494 2631 -12312 34743 -50364 -92849
1355 -92849 -20299 44943 5226 -64880 -80719 -46012 -28257 -137118 -11859 19431 49533
1344 49533 2867 18576 79228 31529 -99427 -42069 -103785 -79073 7353 5778 -57732 -5455
1332 -5455 1842 104702 137066 -51689 -85985 61504 109959 -2555 -4367 -6568 -44843 -85343
1320 -85343 10407 30377 -7650 -19023 -60389 13701 -18859 -17905 11547 19815 -8643 -116376
1308a16376N0355N7248J6925l7608l7426P7800j2648k6532Q9215k7148N4042j82728
1296i4881J5927P4287j1753k0164K5153j2991r157r6240R1402n680k5616m6592
1284a16305P8510O1922o4505N4671K9587m103n8086J59507p6829n6931p5702J7137
1272e1127N6970Q3191k463k4631l3713o268o81p5655l876n2075M3228k3114O8834
1259b1380P8888m1462J3301N9017p3990K1794P5443j41302J9248N1812j19225
1248g7856Q6952l0905j2850r2013l7286J072N3089K6967r311J04775o9319o9533
1236a26218m0170P3010p5401j3121L0958m270Q5656K6247k3207P7840M6570n918
1224E1976l3765P03K4708m0915m2054k2303N348k258K6078L2853j4884l4076O376
$$ plain form
1308 -116376 -66021 -8773 8152 -29456 -66882 10918 -1730 -28262 60953 33805 87847 -94881
1296 -94881 -78954 -4667 -16420 -36584 -11431 -24422 -33579 -129819 -38417 -44097 -69713 -116305
1284 -116305 -37795 24127 -40378 14293 43880 39777 -18309 141198 64369 7438 -68264 -51127
1272 -51127 5843 89034 86571 61940 28227 21959 21278 -54377 -58253 -110328 -67100 -90214 -21380
1259 -21380 57508 16046 29347 88364 14374 36168 111611 -29691 -10443 41369 -77856
1248 -77856 9096 -21809 -34659 -126672 -163958 -162886 -109797 -82830 -92141 12634 -56685 -126218
1236 -126218 -166388 -93378 -168779 -181900 -150942 -155212 -69556 -43309 -66516 11324 57894 51976
1224 51976 18211 18914 43622 2707 -39347 -61650 -56302 -58560 -32482 371 -14513 -48589 -42213
1211d2213l4633k4701j8264J0110j6147J5612O5971l6272K2378O2551p2791N7409
1199a0990M4884l8043p3950K79l2616J56988M5494m8533r1170j13259J10550p584
1187e7950n6028N7522J03336K0431O671N9079j02769o4524P5695n2257N9027r6904
1175d8671j07731q5200J10400J12412o6232j17030R9537Q1972k0529k5549J41997
1164G5376O2798j3356n8842K2479O728l8859j086j26698J3855O1878M2268J4345
1152F0886j09054P556M1161J86550Q451l6850j22789p2043J51894m3628J2317
1141H4451P5412j11985j06473J2399K0882k295R1365L9809j56417J1100p813J82864
1129A33299r26j87401J1261L2549L9758J4332k4377q096m4959n7215N4094O9000
$$ plain form
1211 -42213 -76846 -101547 -119811 -109701 -125848 -110236 -44265 -80537 -58159 4392 -68399 -10990
1199 -10990 33894 -4149 -78099 -77820 -110436 46552 92046 43513 -47657 -160916 -50366 -57950
1187 -57950 -113978 -56456 46880 67311 73982 133061 30292 -34232 41463 -10794 48233 -48671
1175 -48671 -156402 -241602 -131202 -18790 -85022 -202052 -102515 -20543 -41072 -66621 75376
1164 75376 138174 124818 65976 88455 95183 56324 55238 -71460 -57605 4273 46541 60886
1152 60886 -48168 -40612 549 187099 195550 158700 35911 -36132 115762 72134 84451
1141 84451 159863 47878 -58595 -46196 -25314 -27609 63756 103565 -52852 -41752 -49565 133299
1129 133299 132373 -55028 -43767 -11218 28540 42872 18495 10399 -34560 -91775 -37681 31319
1117C1319o1580l3746N2088P3487j1629o7730M2781l945R4221k4926l4526n3587
1105B227O6776k9763j41448Q2257j5547k624n9900l1743J4513J49751Q4980m3858
1093G5621o3839K9322r3001K6609O8535q2738n7020M2244n5195O9177p5667j24986
1081b40938J44039J06145N4725k3010l3184n1566J19271j12776L7967j8803q7309
1070a05439P504R3338m9000J14273l094l1181J34468m2190r7339j5627k9535q8902
1058a12724N6719R862J85538o2476j22293Q3638l7863j03959J22823j22380J09428
1047F313j1537O5037N2710j09121k4012k3713n5320J07464j1529j548p8043q0189
1035a63488L8962L6032l7786J6748q808O3121j2937r2281N6160J498k6764J42520
$$ plain form
1117 31319 -30261 -64007 -11919 61568 49939 -17791 24990 21045 115266 90340 55814 2227
1105 2227 69003 39240 -102208 -19951 -35498 -38122 -98022 -129765 -115252 34499 119479 75621
1093 75621 11782 41104 -51897 -25288 43247 -39491 -96511 -54267 -109462 -40285 -115952 -240938
1081 -240938 -96899 9246 63971 40961 7777 -43789 75482 -37294 673 -18130 -105439
1070 -105439 -97935 -4597 -53597 60676 57582 26401 160869 118679 21340 5713 -23822 -112724
1058 -112724 -56005 -46143 139395 76919 -45374 38264 401 -103558 19265 -103115 6313
1047 6313 -5224 59813 112523 3402 -20610 -44323 -99643 7821 -3708 -5256 -83299 -163488
1035 -163488 -124526 -88494 -126280 -109532 -118340 -55219 -68156 -160437 -104277 -102779 -129543 12977
1023A2977L9107j34728R1906l1409P3421m8928L5419Q3060l8369L8258m8278j4315
1011E8121M2264r6669Q2374L6116j9015l8509k9168k8088J6127k7880J3110R120
999A7903l3978j1002N0944o9737k6080J01608n4804k9356o5608O9846K8392m210
987b6082l5802J5139P006l1317M0308n0476L6109m9964Q953P39K6885J62448M2596
974A46542q1590j8376l1277m8845r760J06072O523j20243j841N7817L2466k1614
962A5874o3426o9806k881j6078L2867N7429P1629j7713p1224j7279p0971J42725
950h854O0416o0570k9462J309J28398K2580q3369M9984O762J3896j02659j27161
938a28730L7228J07871M4908n9968M6695J8901K3326q5893o2097n1014R6348J78349
$$ plain form
1023 12977 52084 -82644 9262 -22147 51274 2346 37765 120825 82456 120714 72436 58121
1011 58121 100385 3716 86090 122206 103191 64682 35514 7426 23553 -4327 8783 17903
999 17903 -16075 -27077 23867 -45870 -71950 29658 -25146 -54502 -120110 -50264 -21872 -26082
987 -26082 -61884 -46745 -39739 -71056 -30748 -81224 -45115 -95079 -86126 -85387 -58502 103946 146542
974 146542 64952 46576 15299 -33546 -43306 62766 69289 -50954 -52795 5022 37488 15874
962 15874 -47552 -117358 -120239 -136317 -103450 -46021 25608 7895 -63329 -80608 -151579 -8854
950 -8854 51562 -9008 -38470 -37161 91237 113817 30448 80432 87194 101090 -1569 -128730
938 -128730 -91502 16369 61277 1309 48004 66905 90231 4338 -57759 -108773 -12425 165924
926A65924m1409q6832m5355k2727L5535m8329N4274Q9951j293j212j13996P676
914g793o1155O1635o8116n4828R6812J08133o3476m17o8635M9370O6528O4660
902A22718l2572l3088K8592K3054j22223j7522M8928j34773R3282J9004j3239
891a7839o9994j9983J1944O6613O7956r4691K3235J19551l0846n6417R0943K2057
879A12529q9380n73m8953J8113M679K1282l2122J0110j07737o6884M4654r980
867a44262K7391J30147N11J21275P615r4173j24490j3149J6571K4277P5908R7278
855A24899p3639n1996J30969m9409j10134l8501Q5976n6433M3944J3958r5682
844g6048N9906J4033o2730l4746J2808O9407q0476k8524R9450N5750J19433p6638
$$ plain form
926 165924 124515 37683 -7672 -30399 5136 -43193 11081 101032 99739 98527 -15469 -7793
914 -7793 -68948 -7313 -75429 -130257 -33445 74688 11212 10795 -57840 -8470 58058 122718
902 122718 90146 57058 85650 108704 -13519 -31041 17887 -116886 -23604 -4600 -17839
891 -17839 -87833 -107816 -95872 -29259 38697 -55994 -32759 86792 55946 -471 90472 112529
879 112529 23149 22576 -26377 -8264 -3585 17697 -14425 -4315 -112052 -178936 -134282 -144262
867 -144262 -116871 13276 13787 135062 142677 48504 -75986 -89135 -72564 -48287 27621 124899
855 124899 51260 -736 130233 80824 -29310 -67811 18165 -38268 5676 19634 -76048
844 -76048 -16142 -2109 -64839 -99585 -86777 -17370 -97846 -126370 -26920 28830 148263 71625
832G1625P991K0050q3961M0026j4922n8342M067J2602m720k8480O9289O9531o642
819I8114n7808m9937j14941q669J24329Q4445K0354j67233j01254M6713M5472
808h0415P9762J04731P715j75660j3478L731j7930R9302L034K6176K0930n1433
796F465m9555q4597M368K0458J94201k4160o472K6526K8619j8655j18343n2652
784g3797O4030N8553o7996p683n2508J54694l8542j20125M5413N6525L6650L0952
772H6166o7805n1261K1710m2601O296J32758Q3136l3477j14605j3211R743p991
760H858K4920m7667N7121k3563o1648j7607l8001J43152o9687r0732J21447J38690
748A45283j26500O576O2671K5864k7149J2420k179P299L620j36395K3027k4801
$$ plain form
832 71625 79616 99666 15705 55731 40809 -17533 -13466 -864 -5584 -34064 35225 104756 98114
819 98114 40306 -9631 -124572 -133241 -8912 75533 95887 -71346 -172600 -125887 -80415
808 -80415 -653 104078 111793 -63867 -77345 -73614 -91544 7758 10792 36968 57898 6465
796 6465 -43090 -127687 -123319 -102861 91340 67180 60708 87234 115853 97198 -21145 -73797
784 -73797 -9767 48786 -19210 -26893 -79401 75293 36751 -83374 -37961 18564 55214 86166
772 86166 18361 -32900 -11190 -53791 -47495 85263 168399 134922 20317 7106 16849 8858
760 8858 33778 -13889 43232 19669 -41979 -59586 -97587 45565 -24122 -114854 6593 145283
748 145283 18783 25359 88030 113894 86745 99165 96986 104285 107905 -28490 -5463 -30264
736c0264M3212N6607j08243J06628M2255j11233Q2509q1768l2982J99531J528
725A67780j17656q2589L6991J5943L8541l480K6310n7641p7845M424M3702N8586
713E3066N2472N934O7401j34080r264m0016P2559m4074j54463O7129L5746l9661
701f7251O2124P8865p2900N5963J1682m9175J5751J0934n91m9045o5909o3331
689a32883O8980N8841m4851J51518N4564k448j18250r3673O2219O6324k10j03147
677c3016Q98M5344o4958n48n3839j8963O8509N5446m1177J03161Q515o1781p2684
664f5093L0888J7638M1082J04477j11782O6804o6312q2602Q6076Q5242J5183j39956
652a8355j0570O1102O8508J6490m0990j00179l0939o5529J25596l2647k0090K8530
$$ plain form
736 -30264 12948 69555 -38688 67940 110195 -1038 81471 -297 -33279 166252 167780
725 167780 50124 -32465 4526 20469 59010 55530 81840 24199 -53646 -49222 -5520 53066
713 53066 105538 111472 178873 44793 35529 -4487 68072 23998 -130465 -63336 -27590 -67251
701 -67251 -5127 73738 838 56801 68483 19308 35059 45993 45402 -3643 -69552 -132883
689 -132883 -63903 -5062 -49913 101605 156169 153721 35471 -58202 4017 70341 70131 -33016
677 -33016 -32118 13226 -51732 -52280 -106119 -125082 -56573 -1127 -42304 60857 69372 7591 -65093
664 -65093 -34205 -16567 24515 128992 17210 84014 17702 -64900 21176 106418 121601 -18355
652 -18355 -28925 32177 100685 117175 76185 -23994 -54933 -120462 5134 -27513 -47603 -19073
640a9073P9154k8473o2834P3420P260j462L153p80j07393q6055J76704N4494k5552
627F2563j6431J7647j1163k1937K247o5091J17518O330M5860j20885L5839J4731
615F7228K5514j4798j53531r7615Q4614J24737k9029O5146o6899l1274O5830L5884
603G5807j51027l5190J34860K1575o1415L4844k4725l1580Q554j05001P6396K04684
591A47782q246j06820m775p4517j8519P1731o9527O2637r1825j53731J67574K7506
579e0730j11892Q1320k797N4147j6524J029N9619k7080P652K6686M0248l0603
567C1075J8465J416p8825J4855M7294m7107o8020R4257K4965n9733J6313j7225
555b2270O0525o666K3152n3803o3544O4841k5379r6759K8828J00152n3415O4816
$$ plain form
640 -19073 60081 31608 -31226 42194 49454 47992 51145 50365 -57028 -143083 33621 88115 62563
627 62563 46132 63779 52616 30679 32926 -32165 85353 91683 137543 16658 52497 67228
615 67228 92742 77944 -75587 -173202 -88588 36149 7120 72266 5367 -25907 39923 75807
603 75807 -75220 -110410 24450 46025 -15390 19454 -5271 -36851 -28297 -133298 -56902 147782
591 147782 139536 32716 27941 -46576 -65095 6636 -62891 -254 -92079 -245810 -78236 -50730
579 -50730 -162622 -81302 -84099 -29952 -46476 -45447 14172 -12908 -5256 21430 61678 31075
567 31075 49540 50956 -27869 -13014 34280 -12827 -80847 13410 38375 -21358 -5045 -22270
555 -22270 38255 31589 54741 938 -62606 2235 -23144 -119903 -91075 9077 -44338 20478
543B0478J82061j6601k16182K5660o656N4214O4607j25681o5962O571k1165K9757
531f8899O6402j4214R90J1263m5026R6352Q2126j10526o6325O1034R6722r3124
519A6775j47341Q5892J32247j32986m5278K0473Q2984j22288Q7402l9336R8494
508C7038n6644J04686o5081j09015K28065j17970J001K5105j11326N5909K0612
497A2380p7918J15950M1865J4366L8199j24410l2708m9455J27601n5973L9313
486D9210J11295p8053n8086j4824O0270n5851j19851o7657J2029O7150K4523k534
474g2379j1625K986Q6738n3178J964o7278J55478M3205j17536P196k2441K7086
462a9784k2649L0254r7642Q5112m7512Q0436O1470p2877N7892j0229j30885K6126
$$ plain form
543 20478 202539 185938 -30244 -4584 -11240 42974 107581 -18100 -84062 -77491 -98656 -68899
531 -68899 -2497 -16711 -15721 -4458 -49484 46868 128994 18468 -47857 13177 109899 16775
519 16775 -130566 -44674 87573 -45413 -90691 -70218 12766 -109522 -22120 -61456 37038
508 37038 -19606 85080 19999 -89016 139049 21079 22080 47185 -64141 -8232 12380
497 12380 -65538 50412 92277 106643 144842 20432 -12276 -61731 65870 9897 49210
486 49210 160505 82452 24366 9542 69812 13961 -105890 -173547 -161518 -94368 -69845 -72379
474 -72379 -84004 -81018 5720 -47458 -45494 -112772 42706 85911 -31625 -24429 -46870 -19784
462 -19784 -42433 -12179 -109821 -24709 -72221 8215 69685 -3192 54700 44471 -86414 -60288
450f0288J37550k4560p2488o2310N4427p2582R0224m4404n4414j9573L6339J0257
438h1822M8128l3163Q7424L170M45J5892j06423L9382j14481R6933l2519Q0691
426C657l2678n4515R7013r3886J6340Q2911P4849j39385O2491o5095l8176O9986
414a6488J19005r378K095q8715K9978n6825K888j7971J2111n280o1550P6464K8899
401A5233p9671M6184O4631Q158r1716J2390N9367p4025J05633j9203q7646k8400
389f9065P8408m7826p9210J25679n1784L2418l3144N1668k2347j1145n2353j4689
377i3390J13629O3971k8491k0403j534k4173j31634L6352R5602q4534L2416j0377
365e2566J05775p121j01932p6864J22245L0200o0324R1688j2021l6646k8857o2856
$$ plain form
450 -60288 77262 52702 -19786 -82096 -27669 -100251 -10027 -54431 -108845 -128418 -92079 -81822
438 -81822 -33694 -66857 20567 23737 24182 40074 -66349 -26967 -141448 -44515 -77034 3657
426 3657 -29021 -83536 13477 -80409 -64069 18842 93691 -45694 16797 -48298 -86474 -16488
414 -16488 102517 93139 95234 6519 36497 -20328 -17440 -35411 -23300 -28580 -90130 -13666 15233
401 15233 -64438 -18254 46377 54535 -37181 -24791 34576 -39449 66184 46981 -40665 -69065
389 -69065 9343 -38483 -117693 7986 -43798 -11380 -44524 7144 -15203 -26348 -78701 -93390
377 -93390 20239 84210 55719 35316 33782 9609 -122025 -85673 9929 -74605 -42189 -52566
365 -52566 53209 46088 -55844 -132708 -10463 19737 -40587 51101 39080 2434 -26423 -89279
353h9279M0664l323N654l4856j1965J6551P6532K9364P182p4421K2472k389P0660
340E2846k5746k0702M5619O1272n0314n2181N4825n532q9874k6993m7958K4087
328h0651q417L879R0245Q677p4892j6758N3230L2641K2662k6629l3021k5320M94
315e3860j00304L2303J3611r5796J89951q2640M7513j7330N8127j8911K3008n7921
303f2249N9243m3280k173l96n91m663j6472Q1564j4932l696l7763J31604p0453
290A5743j23554j8394J92942q2618o1937R1323m7194L9768J0318k8171j1847P5637
278E2016L8546j57761N7166k9916R7138k6978m7957L2208q0021Q5638N9529j6748
266F2860M9827l5978o7270l1228j00845L5127j0422K0606O9707n7763o3660P5458
$$ plain form
353 -89279 -48615 -51938 -46284 -81140 -93105 -76554 -22 29342 36524 -37897 -15425 -17814 52846
340 52846 27100 6398 52017 113289 62975 10794 65619 60087 -29787 -56780 -104738 -80651
328 -80651 -89068 -85189 5056 13733 -61159 -77917 -24687 7954 30616 3987 -29034 -54354 -53860
315 -53860 -154164 -121861 -108250 -204046 -14095 -96735 -49222 -66552 -8425 -27336 -4328 -62249
303 -62249 -3006 -46286 -48459 -48855 -49446 -54109 -70581 10983 -3949 -7645 -45408 86196 15743
290 15743 -107811 -126205 66737 -15881 -77818 13505 -33689 6079 16397 -11774 -23621 52016
278 52016 90562 -67199 -10033 -39949 57189 30211 -17746 14462 -65559 20079 79608 62860
266 62860 112687 76709 9439 -21789 -122634 -87507 -97929 -77323 -7616 -65379 -129039 -53581
254e3581j8467Q303M9882m0063M6101m2105J29338q492K825o6173k7676p9107
242i9215j1983M7896P4514K3361j821j20524m0891O8011J0312m6279J72429k9538
230D6272r3649l6359N0516J0545o0525O7577j20709K4163R1459p8169j7605l9880
218a56364q908N6836m3374P0734P090J5723Q2156j1495j08322J7270Q9852J0369
206B1567O3304M3277j38946R8355m2589n2926k7440O05K3534K3072k3263j0471
194b1921j5445n486Q156O746J30951j5772m5513m9217n5437K9352j15108R1208
182e7486M6496R2726o7406l1938j8098j6084k874n1876Q2091j33218N8028J50401
170E0762N8227o1587j03426j0451N4870m8117R4556o1292q5917j763J04599M6225
$$ plain form
254 -53581 -72048 -63745 -13863 -53926 -7825 -49930 79408 70916 73741 7568 -20108 -99215
242 -99215 -111198 -63302 11212 34573 32752 -87772 -128663 -60652 -50340 -96619 75810 46272
230 46272 -47377 -83736 -33220 -22675 -83200 -15623 -136332 -112169 -20710 -98879 -116484 -156364
218 -156364 -165272 -108436 -151810 -81076 -73986 -58263 23893 12398 -95924 -78654 11198 21567
206 21567 84871 128148 -10798 87557 44968 -7958 -35398 -34793 -11259 11813 -11450 -21921
194 -21921 -37366 -42852 -34696 -27950 103001 87229 41716 -7501 -62938 -33586 -148694 -57486
182 -57486 -10990 81736 14330 -17608 -35706 -51790 -54664 -106540 -24449 -157667 -99639 50762
170 50762 108989 47402 -56024 -66475 -11605 -59722 34834 -26458 -112375 -114138 -9539 36686
158C6686o6559L9142N0958l9317M1065n2931Q0066o3408p6409k221Q565q0045
146a24408o884J42457k3233j21925o4937J34140p7592M6971J09463p7175n4940
135a18063k611L8219P1942M4908k6168k1529l5174j07104J17154L7122m0013J3373
123b7944J7670M5519q9829j0973J17722p6341o6112J3605N8640k9196N7649j8103
111g693j38134O2230N6909k57q088L765q1355j8272k3651L8477R5116L1301J399
98A1747o9376j5221M3036n1550q8294O3570J12176O9706j30746O2293p0693o3650
86a27002l0304L4876q63r141L3355K2070k1624k4229R5569R2335M5159m5771J5333
73G9763o6442m2890J4105P6910J5164k9661r6860m5640Q7681j0757n8823Q4955
$$ plain form
158 36686 -29873 9269 60227 20910 61975 9044 89110 25702 -50707 -52928 -44363 -124408
146 -124408 -131292 11165 -12068 -133993 -198930 -64790 -142382 -95411 14052 -63123 -118063
135 -118063 -120674 -82455 -10513 34395 8227 -13302 -48476 -155580 -38426 -1304 -41317 -27944
123 -27944 -10274 35245 -54584 -65557 52165 -24176 -90288 -76683 -18043 -47239 10410 -7693
111 -7693 -145827 -83597 -26688 -26945 -35033 -31268 -112623 -130895 -154546 -116069 -20953 10348 11747
98 11747 -57629 -72850 -29814 -81364 -169658 -106088 6088 75794 -54952 7341 -63352 -127002
86 -127002 -157306 -122430 -123293 -132434 -99079 -77009 -98633 -122862 -27293 65042 110201 64430 79763
73 79763 13321 -29569 -15464 61446 76610 46949 -49911 -95551 -7870 -18627 -77450 7505
61G505M155j7894K9600j1445j7806n1956l9674L0596j6346j8708l0790J0598Q4199
48c7966J9516j5293k6807L0577K1690o89o6903N4673j939n133m2241R3707P0001
35I3193p8328K2658r2190j3864j6904O5129k273o5289L7120J9570L508k6630k0872
22g5172N2495j4859n2981K3614N5025J1202l9707K8681j3009q9315l2449j1363
10a57838L7793J9171K3041M5255l8329K7104M7463K99O368p2245
0f1918
$$ plain form
61 7505 11660 -6234 23366 11921 -5885 -57841 -97515 -66919 -83265 -101973 -132763 -122165 -37966
48 -37966 -18450 -33743 -60550 -29973 -8283 -8972 -75875 -21202 -23141 -28274 -70515 23192 93193
35 93193 14865 37523 -54667 -68531 -85435 -20306 -22579 -87868 -50748 -31178 -27670 -54300 -75172
22 -75172 -22677 -37536 -90517 -66903 -11878 -676 -40383 -11702 -24711 -114026 -146475 -157838
10 -157838 -120045 -100874 -77833 -32578 -70907 -43803 3660 3959 10327 -61918
0 -61918
$$ Imaginary data points
##PAGE= N=2
##DATA TABLE= (X++(I..I)), XYDATA
16383b365265L9943K4383N4574K0731L6292N9342R4968N4838K6057J02141k3526
16372a875522m4025m7862L4732L0951j0174o929O3839J24567Q1307l972O7558
16361a585530q656N0140m065J3155k1884J6113Q2845M8475L9368Q5605j03861
16350a388295l6736J12327R1726O6402K6189q058M5571m8387M2608M8646q4029
16339a132036L1195L3415q932J25270L513M789J03644l9519J6021P8614M6709
16328g37317k4907L9757o8568J59070J8917K2538L277J666M4276n0234J7650O0402
16316e13473M3888K3714L8706j5739k6183J30738K1380N5199P8654O8783o308
16305a00641k0857l0600k5829J02754O242J1525o7880Q4012n382L0954O0580o9206
$$ plain form
16383 -2365265 -2325322 -2300939 -2246365 -2225634 -2189342 -2130000 -2035032 -1980194 -1954137 -1851996 -1875522
16372 -1875522 -1919547 -1967409 -1932677 -1901726 -1911900 -1918829 -1854990 -1730423 -1649116 -1653088 -1585530
16361 -1585530 -1594186 -1544046 -1548111 -1534956 -1556840 -1540727 -1457882 -1409407 -1370039 -1284434 -1388295
16350 -1388295 -1425031 -1312704 -1220978 -1154576 -1128387 -1136445 -1090874 -1139261 -1096653 -1048007 -1132036
16339 -1132036 -1100841 -1067426 -1076358 -951088 -947575 -942786 -839142 -878661 -862640 -784026 -737317
16328 -737317 -762224 -722467 -791035 -631965 -613048 -590510 -587233 -585567 -541291 -591525 -573875 -513473
16316 -513473 -469585 -445871 -407165 -422904 -449087 -318349 -296969 -241770 -163116 -94333 -100641
16305 -100641 -121498 -152098 -177927 -75173 -68931 -57406 -125286 -41274 -46656 -15702 44878 -24328
16293b4328Q3203O1461J01070J09667j2819r952K8641n0179K0614J118l4321O343
16281B80518m4738J14989k4323j0198N7373J55244n3296k5097O0619q018O4447
16270E67520J0703J2083k7196J03196M9085N4181l8774j2247M1927L1465N9859
16259H51802j55524L6049R2171Q9608J1296J6069l5731n5525L515p558R1324n0880
16247H86616j9560K5501P0379Q2431M361Q6528j04207k7380Q551J23883P2420
16236A209523M1378L3140j40961M6528L5887m1157J03441R811j41633N6844N7685
16225A270486J2828m6934O1230n3158L5313J81043j00778j7445P9870n1793j22765
16214A247897O0815J48265J0264l5466k0403K6928O896J7190J000N7668K8505
$$ plain form
16293 -24328 58875 120336 221406 331073 318254 308302 336943 286764 307378 308496 274175 280518
16281 280518 235780 350769 326446 316248 373621 528865 475569 450472 511091 503073 567520
16270 567520 578223 590306 563110 666306 715391 769572 730798 718551 760478 791943 851802
16259 851802 696278 732327 824498 914106 925402 941471 905740 850215 853730 846172 937496 886616
16247 886616 867056 892557 962936 1045367 1049728 1136256 1032049 1004669 1013220 1137103 1209523
16236 1209523 1250901 1284041 1143080 1189608 1225495 1184338 1287779 1297590 1155957 1212801 1270486
16225 1270486 1283314 1236380 1297610 1244452 1279765 1460808 1360030 1342585 1422455 1370662 1247897
16214 1247897 1308712 1456977 1467241 1431775 1411372 1438300 1445196 1462386 1463386 1521054 1549559
16203A549559k4188j9907M7835O6209m9382m6025Q4242J0232J14318n7628Q9275
16192A764540j4700l6476p1929n6155L8805q1174M6528K316P4817P9615K8382
16181A774569p2509k6516M2950Q1626K7985J10274J9383j71882L7999K8424K6720
16170A879023R8991j50322J05173j3839k0166J43975k6065r4490o9450l2914M9188
16159A869104j906l44K8470J9353K8895M3455P0871k2552l2430j03728L8802l8276
16147A899714J06415j2681l275j8485l0122M0061K1236Q0653j07226J7155L1401
16136B024846Q1430J4412j35304K5890J9266j0996n8557k5607q172Q6661M6946
16125B060815j02630N7083J2839M7303j2745K6882R817j31499O2R805r15J86833
$$ plain form
16203 1549559 1525371 1505464 1553299 1619508 1570126 1524101 1608343 1618575 1732893 1675265 1764540
16192 1764540 1749840 1713364 1641435 1585280 1624085 1542911 1589439 1591755 1666572 1746187 1774569
16181 1774569 1702060 1675544 1718494 1800120 1828105 1938379 1957762 1785880 1823879 1852303 1879023
16170 1879023 1978014 1827692 1932865 1919026 1898860 2042835 2016770 1922280 1852830 1819916 1869104
16159 1869104 1867198 1866854 1895324 1914677 1943572 1987027 2057898 2035346 2002916 1899188 1937990 1899714
16147 1899714 2006129 1993448 1990173 1971688 1941566 1981627 2002863 2083516 1976290 1993445 2024846
16136 2024846 2106276 2120688 1985384 2011274 2030540 2019544 1960987 1935380 1927208 2013869 2060815
16125 2060815 1958185 2015268 2028107 2075410 2062665 2089547 2099364 1967865 1967927 1977732 1976817 2163650
16113B163650k4727j6398n4067m2283K8911L573O4306J2446K2766L6711P1744
16102B266632j65568n5925m8014O3166L0263k0172J20944J4533J35313o4739q8440
16091B187993p5715M4848j3526N6747J54015k50074p0880R1393J18207P7857q4828
16080B236037L5453K5406K6345q9416n3879Q5721m744N1939K2873M503o8835L0071
16068B301474M3472q7033J0023k0887j11590j02671M8058K9422o1855J1437L2509
16057B092359J40296q3654q7332J30767J03592q3136j19871L5584O3923m6103
16047B146425Q5392K8610j27464P0485p3902J6621P9065L8463k3479K2935j6373
16036B246778n4188m1487J7701L217M5213J8678l8944Q433k9831L9778j23158
$$ plain form
16113 2163650 2138923 2122525 2068458 2026175 2055086 2058659 2122965 2135411 2158177 2194888 2266632
16102 2266632 2101064 2045139 1997125 2060291 2090554 2070382 2191326 2205859 2341172 2276433 2187993
16091 2187993 2112278 2157126 2143600 2200347 2354362 2104288 2033408 2124801 2243008 2320865 2236037
16080 2236037 2271490 2296896 2323241 2233825 2179946 2265667 2260923 2312862 2335735 2340238 2271403 2301474
16068 2301474 2344946 2257913 2267936 2247049 2135459 2032788 2080846 2110268 2048413 2059850 2092359
16057 2092359 2232655 2149001 2061669 2192436 2296028 2212892 2093021 2128605 2192528 2146425
16047 2146425 2231817 2260427 2132963 2203448 2129546 2146167 2225232 2263695 2240216 2263151 2246778
16036 2246778 2192590 2151103 2168804 2172021 2217234 2235912 2196968 2205401 2175570 2215348 2092190
16025B092190L0231j482P3109M4967j08323M1182K0865K2452K4719N4981n5943
16014B238948L1775O6406p8665J7968p0814M3353M259o5598n0088m8601k2703
16003B066240J41022k3830P2277k5965m2175M1013O3928Q3394q5250M5223q9172
15992B246705l8349n2668J3465J45791O4772j14931J9315k8144J2019m1317r3880
15981B132778J22519L5985r6143l0980J7621M0585j29195k0605K8692J93563M088
15970B298908p9981l8261j0185O5390l6318N4945l2906L0493L3045K0619n0101
15959B255648r1156J13306p6245M0200L8304j8382K0226o4029p378M3896N9575
15948B313965m3423q1887L7014k9583O2622J04540j8302j89574N546J42352j15550
$$ plain form
16025 2092190 2122421 2120939 2194048 2239015 2130692 2171874 2192739 2215191 2239910 2294891 2238948
16014 2238948 2270723 2337129 2258464 2276432 2205618 2248971 2253230 2187632 2137544 2088943 2066240
16003 2066240 2207262 2183432 2255709 2229744 2187569 2228582 2292510 2375904 2290654 2335877 2246705
15992 2246705 2208356 2155688 2169153 2314944 2379716 2264785 2284100 2255956 2267975 2226658 2132778
15981 2132778 2255297 2291282 2195139 2164159 2181780 2222365 2093170 2072565 2101257 2294820 2298908
15970 2298908 2218927 2180666 2170481 2235871 2199553 2254498 2221592 2252085 2285130 2305749 2255648
15959 2255648 2164492 2277798 2201553 2241753 2280057 2261675 2281901 2217872 2210494 2254390 2313965
15948 2313965 2270542 2188655 2225669 2196086 2258708 2363248 2344946 2155372 2160918 2303270 2187720
15937B187720O0332j3519n1006L0939M0131m8082j4156L9628O2109n343M7796
15926B336549o0190o4357l0751L1403R950J9511l005q085O4755n48L7330p2985
15914B259577j3213K1002L6417j3568j20608j9064k3338R7830M3387m1959L9820
15903B266283r40p4033J5723J9977q158l1490R5529j18142L0056M8852J17167
15892B360824j00593j06102R0147N2406n1044m330N2796q2006O6868n2961J1181
15881B237186K0843n599J9878J12519l9986N6312p7478j72522K3782Q9408J41796
15870B406139r4351n6063l4185J8110l2586Q1246q0424k3784o1475Q027K8138
15859B158792o4988J82365M9904k0083j04898J20017L5055p1721J05685j9248
$$ plain form
15937 2187720 2248052 2234533 2183527 2214466 2254597 2206515 2192359 2231987 2294096 2288753 2336549
15926 2336549 2276359 2212002 2181251 2212654 2222604 2242115 2239110 2231025 2295780 2295232 2332562 2259577
15914 2259577 2246364 2267366 2303783 2290215 2169607 2150543 2127205 2225035 2268422 2226463 2266283
15903 2266283 2265343 2191310 2207033 2227010 2218852 2187362 2282891 2164749 2194805 2243657 2360824
15892 2360824 2260231 2154129 2244276 2296682 2245638 2241308 2294104 2212098 2278966 2226005 2237186
15881 2237186 2258029 2252430 2272308 2384827 2344841 2401153 2323675 2151153 2174935 2264343 2406139
15870 2406139 2311788 2255725 2221540 2239650 2207064 2288310 2207886 2184102 2122627 2130654 2158792
15859 2158792 2093804 2276169 2326073 2305990 2201092 2321109 2356164 2284443 2390128 2370880
15849B370880j02622R2543k192q7841q3734N5094K0105j2627j3353P5619m5412
15838B266460M9928L7397k8829Q7748L766q9069n0724l249n4949R843L6210p0244
15826B194288r2830L3324J39263O6912k7406R870k1129n3450l1289j8469R2554
15815B291638j09661J1478J04537k9040l2131M9590J16446p2703q0912o9048L5288
$$ plain form
15849 2370880 2268258 2360801 2358609 2270768 2187034 2242128 2262233 2249606 2236253 2311872 2266460
15838 2266460 2316388 2353785 2324956 2412704 2416470 2327401 2276677 2273428 2218479 2228322 2264532 2194288
15826 2194288 2101458 2134782 2274045 2340957 2313551 2323421 2302292 2248842 2217553 2199084 2291638
15815 2291638 2181977 2193455 2297992 2268952 2236821 2286411 2402857 2330154 2249242 2180194 2215482
$$ [...]
##END NTUPLES=NMR SPECTRUM
##END=
