##TITLE=1H_CG-1143
 CDcl3,8 sc, 
 12.03.2021
##JCAMPDX= 6.0         $$ Bruker NMR JCAMP-DX V2.0
##DATA TYPE= NMR SPECTRUM
##DATA CLASS= NTUPLES
##ORIGIN= UXNMR, Bruker Analytische Messtechnik GmbH
##OWNER= root
$$ XWIN-NMR		Version 3.5
$$ Fri Mar 12 11:11:41 2021 Russian Standard Time (UT+4h)  she@DPX200
##.OBSERVE FREQUENCY= 200.131506
##.OBSERVE NUCLEUS= ^1H
##.ACQUISITION MODE= SIMULTANEOUS
##.ACQUISITION SCHEME= undefined
##.AVERAGES= 8
##.DIGITISER RES= 18
##SPECTROMETER/DATA SYSTEM= spect
##.PULSE SEQUENCE= zg30
##.SOLVENT NAME= D2O
##.SHIFT REFERENCE= (INTERNAL, D2O, 0, 15.9751)
##AUDIT TRAIL= $$ (NUMBER, WHEN, WHO, WHERE, WHAT)
$$ ##TITLE= Audit trail, XWIN-NMR		Version 3.5
$$ ##JCAMPDX= 5.01
$$ ##ORIGIN= Bruker BioSpin GmbH
$$ ##OWNER= she
$$ F:/spectra/data/she/nmr/H-F/1/pdata/1/auditp.txt
$$ ##AUDIT TRAIL=  $$ (NUMBER, WHEN, WHO, WHERE, WHAT)
(   1,<2021-03-12 11:10:34.07 +0400>,<she>,<DPX200>,
      <created by zg, POWCHK disabled, PULCHK disabled
       configuration hash MD5:
       00 E9 B6 7A A2 85 ED C7 34 08 36 98 17 FE 4E 26
       data hash MD5: 16K
       59 C9 8C F8 D9 39 17 C3 4A 20 D2 BB 76 57 A9 66>)
(   2,<2021-03-12 11:10:36.62 +0400>,<she>,<DPX200>,
      <Start of raw data processing
       efp BC_mod = 2 LB = 0.24 FT_mod = 6 PKNL = 1 PHC0 = -11277.12 PHC1 = 12.00094 SI = 16K 
       data hash MD5: 16K
       1A A2 98 32 09 FC 0F 99 E2 E0 A1 6A EC FE 15 AB>)
(   3,<2021-03-12 11:10:57.32 +0400>,<she>,<DPX200>,
      <pk PHC0 = 159.3911 PHC1 = -1.6 
       data hash MD5: 16K
       D7 3B B5 CA C9 A5 93 99 A0 09 BC 56 85 31 53 69>)
(   4,<2021-03-12 11:11:00.46 +0400>,<she>,<DPX200>,
      <abs ABSG = 5 
       data hash MD5: 16K
       BB 23 D7 95 CF 02 F6 85 0B 2C 2F B6 E7 52 70 5A>)
(   5,<2021-03-12 11:11:22.68 +0400>,<she>,<DPX200>,
      <pk PHC0 = 0.5484306 PHC1 = -0.3999996 
       data hash MD5: 16K
       F8 52 93 04 8C AD DD A4 75 E7 40 85 19 70 95 1D>)
$$ ##END=
$$ 
$$ hash MD5
$$ 20 0E E6 5B FC 82 1F 1A BA F8 09 39 BA 32 56 A8
##$RELAX= 
##$RELAX= 
##$RELAX= 
##$RELAX= 
##$RELAX= 
##$RELAX= 
$$ Bruker specific parameters
$$ --------------------------
##$DU= <F:/spectra>
##$EXPNO= 1
##$NAME= <H-F>
##$PROCNO= 1
##$TYPE= <nmr>
##$USER= <she>
##$AMP= (0..31)
100 100 100 100 100 100 100 100 100 100 100 100 100 100 100 100 100 100 
100 100 100 100 100 100 100 100 100 100 100 100 100 100 
##$AQSEQ= 0
##$AQ_mod= 1
##$AUNM= <au_zg>
##$AUTOPOS= <>
##$BF1= 200.13
##$BF2= 200.13
##$BF3= 200.13
##$BF4= 200.13
##$BF5= 200.13
##$BF6= 200.13
##$BF7= 200.13
##$BF8= 200.13
##$BYTORDA= 1
##$CFDGTYP= 0
##$CFRGTYP= 5
##$CHEMSTR= <none>
##$CNST= (0..31)
1 1 145 1 1 1 1 1 1 1 1 1 1 1 1 1 1 1 1 1 1 1 1 1 1 1 1 1 1 1 1 1 
##$CPDPRG= <>
##$CPDPRG1= <>
##$CPDPRG2= <>
##$CPDPRG3= <>
##$CPDPRG4= <mlev>
##$CPDPRG5= <mlev>
##$CPDPRG6= <mlev>
##$CPDPRG7= <mlev>
##$CPDPRG8= <mlev>
##$CPDPRGB= <>
##$CPDPRGT= <>
##$D= (0..31)
0 1.2 0 0 0 0 0 0 0 0.06 0 0.03 0 0 0 0 0.0002 0 0 0 0 0 0 0 0 0 0 0 0 
0 0 0 
##$DATE= 1615533033
##$DBL= (0..7)
$$ [...]
##$SUBNAM3= <"">
##$SUBNAM4= <"">
##$SUBNAM5= <"">
##$SUBNAM6= <"">
##$SUBNAM7= <"">
##$SUBNAM8= <"">
##$SUBNAM9= <"">
##$SW= 16.9725357007746
##$SWIBOX= (0..15)
0 0 2 0 0 0 0 0 0 0 0 0 0 0 0 0 
##$SW_h= 3396.73913043478
##$TD= 16384
##$TD0= 1
##$TE= 0
##$TE2= 300
##$TE3= 300
##$TEG= 300
##$TL= (0..7)
0 120 120 120 120 120 120 120 
##$TP= (0..7)
150 150 150 150 150 150 150 150 
##$TP07= 0
##$TPNAME0= <>
##$TPNAME1= <>
##$TPNAME2= <>
##$TPNAME3= <>
##$TPNAME4= <>
##$TPNAME5= <>
##$TPNAME6= <>
##$TPNAME7= <>
##$TPOAL= (0..7)
0.5 0.5 0.5 0.5 0.5 0.5 0.5 0.5 
##$TPOFFS= (0..7)
0 0 0 0 0 0 0 0 
##$TUNHIN= 0
##$TUNHOUT= 0
##$TUNXOUT= 0
##$USERA1= <user>
##$USERA2= <user>
##$USERA3= <user>
##$USERA4= <user>
##$USERA5= <user>
##$V9= 5
##$VALIST= <valist>
##$VCLIST= <CCCCCCCCCCCCCCC>
##$VD= 0
##$VDLIST= <DDDDDDDDDDDDDDD>
##$VPLIST= <PPPPPPPPPPPPPPP>
##$VTLIST= <TTTTTTTTTTTTTTT>
##$WBST= 1024
##$WBSW= 4
##$XGAIN= (0..3)
0 0 0 0 
##$XL= 0
##$YL= 0
##$YMAX_a= 234801
##$YMIN_a= -284652
##$ZGOPTNS= <>
##$ZL1= 120
##$ZL2= 120
##$ZL3= 120
##$ZL4= 120
##$ABSF1= 15.97506
##$ABSF2= -0.9976015
##$ABSG= 5
##$ABSL= 3
##$ALPHA= 0
##$AQORDER= 0
##$ASSFAC= 0
##$ASSFACI= 0
##$ASSFACX= 0
##$ASSWID= 0
##$AUNMP= <proc_1d>
##$AZFE= 0.1
##$AZFW= 0.1
##$BCFW= 0
##$BC_mod= 2
##$BYTORDP= 0
##$COROFFS= 0
##$CY= -3
##$DATMOD= 1
##$DC= 0
##$DFILT= <>
##$DTYPP= 0
##$F1P= 0
##$F2P= 0
##$FCOR= 1
##$FTSIZE= 16384
##$FT_mod= 6
##$GAMMA= 0
##$GB= 0
##$INTBC= 1
##$INTSCL= 2.992141e-10
##$ISEN= 128
##$LB= 0.24
##$LEV0= 0
##$LPBIN= 0
##$MAXI= 10000
##$MC2= 0
##$MEAN= 0
##$ME_mod= 0
##$MI= 1.114404
##$NCOEF= 0
##$NC_proc= -9
##$NLEV= 6
##$NOISF1= 3.799351
##$NOISF2= 2.8
##$NSP= 0
##$NTH_PI= 0
##$NZP= 0
##$OFFSET= 15.97506
##$PC= 1
##$PHC0= -11117.18
##$PHC1= 10.00094
##$PH_mod= 1
##$PKNL= yes
##$PPARMOD= 0
##$PSCAL= 0
##$PSIGN= 0
##$REVERSE= no
##$SF= 200.13000728009
##$SI= 16384
##$SIGF1= 3
##$SIGF2= 2
##$SINO= 5.538805
##$SIOLD= 16384
##$SREGLST= <1H.CDCl3>
##$SSB= 0
##$STSI= 16384
##$STSR= 0
##$SW_p= 3396.73913043479
##$SYMM= 0
##$S_DEV= 0
##$TDeff= 16384
##$TDoff= 0
##$TI= <>
##$TILT= no
##$TM1= 0
##$TM2= 0
##$TOPLEV= 0
##$USERP1= <user>
##$USERP2= <user>
##$USERP3= <user>
##$USERP4= <user>
##$USERP5= <user>
##$WDW= 1
##$XDIM= 16384
##$YMAX_p= 404150714
##$YMIN_p= -2728476
$$ End of Bruker specific parameters
$$ ---------------------------------
##NTUPLES= NMR SPECTRUM
##VAR_NAME=  FREQUENCY,     SPECTRUM/REAL,   SPECTRUM/IMAG
##SYMBOL=    X,             R,               I
##VAR_TYPE=  INDEPENDENT,   DEPENDENT,       DEPENDENT
##VAR_FORM=  AFFN,          ASDF,            ASDF
##VAR_DIM=   16384,         16384,           16384
##UNITS=     HZ,            ARBITRARY UNITS, ARBITRARY UNITS
##FACTOR=    0.207333158178282, 1,           1
##FIRST=     3197.08896675039, 0,            0
##LAST=      -199.650163684396, 0,           0
##MIN=       -199.650163684396, -2728476,    0
##MAX=       3197.08896675039, 404150714,    0
$$ Real data points
##PAGE= N=1
##DATA TABLE= (X++(R..R)), XYDATA
$$ [...]
$$ plain form
4730 6960245 6138686 7112274 6560534 6253644 5715147 6084134 6409499 6065710 6489929 6177910
4720 6177910 6626994 6979575 6211729 5802079 6231365 6480573 6982154 7341285 6961333 5544652
4710 5544652 7204290 7771914 7185678 7780352 7324271 6007120 6688776 6553008 6574381
4701 6574381 6482177 6706500 7914537 7298076 6463407 6704750 7293790 7681666 6663035
4692 6663035 6455776 6330618 6331964 7236356 7559463 7392004 7458196 7595308 8214907 7829964
4682 7829964 7554158 6884322 7295770 8139950 7858757 7534759 8107833 7670935 7707739 8006060
4672 8006060 8114041 8288831 8536426 8590580 9127813 8928815 8465574 8187343 8614360 8688894
4662 8688894 8361734 8990417 9530094 8989611 8546229 8910994 9233347 9518356 9572463 9575161
$$ packed form
4730F960245q21559R73588n51740l06890n38497L68987L25365l43789M24219l12019
4720F177910M49084L52581p67846m09650M29286K49208N01581L59131l79952j416681
4710E544652J659638N67624n86236N94674m56081j317151O81656j35768K1373
4701F574381r2204K24323J208037o16461q34669K41343N89040L87876j018631
4692F663035k07259j25158J346R04392L23107j67459O6192J37112O19599l84943
4682G829964k75806o69836M11448Q44180k81193l23998N73074m36898L6804K98321
4672H006060J07981J74790K47595N4154N37233j98998m63241k78231M27017P4534
4662H688894l27160O28683N39677n40483m43382L64765L22353K85009N4107K698
$$ plain form
4652 9575161 9733130 10317585 10193099 9566695 10210020 11042757 11374161 12142599 10777918
4643 10777918 10266485 10493609 10553803 9984032 9741141 9955266 10634472 11696434 11904938
4634 11904938 12434216 12217283 12503670 13457746 13266799 12699900 13127011 14609440 15525789
4625 15525789 15507683 15538824 15765055 16079325 17033611 18279586 18782166 18984124 20600295
4616 20600295 20250373 21948633 22303420 21820206 22425550 23597823 24840144 25764364 26838480
4607 26838480 28240727 29395561 30326927 31184165 32320470 33810072 34767894 34387708 35647328
4598 35647328 36576640 37202653 38536890 40117662 41337544 43707395 44551890 45359495 47135824
4589 47135824 47820116 49433620 51100160 52420102 55278022 58740654 61622770 63564216
$$ packed form
4652I575161J57969N84455j24486o26404O43325Q32737L31404P68438j364681
4643A0777918n11433K27124O0194n69771k42891K14125O79206J061962K08504
4634A1904938N29278k16933K86387R54076j90947n66899M27111J482429R16349
4625A5525789j8106L1141K26231L14270R54286J245975N02580K01958J616171
4616B0600295l49922J698260L54787m83214O05344J172273J242321R24220J074116
4607B6838480J402247J154834R31366Q57238J136305J489602R57822l80186J259620
4598C5647328R29312O26013J334237J580772J219882K369851Q44495Q07605J776329
4589D7135824O84292J613504J666540J319942K857920L462632K882116J941446
$$ plain form
4581 63564216 64690681 67499011 70303498 72915726 74738504 78125160 81070662 83076468
4573 83076468 86380658 88486841 90080209 92518865 94115508 95821841 96827028 97980007
4565 97980007 98771202 99154407 98830666 99127540 99944304 100265868 101166220 101401274 101441076 101849243
4555 101849243 101939016 102370878 102510040 103281230 104850048 105363299 105664080 105922074 106055557
4546 106055557 106515389 107733040 108822227 110124658 111660452 112321878 113859083 115975834
4538 115975834 117412280 118186567 118904083 120161350 121668196 121845947 121759349 122537764 123642772
4529 123642772 122453084 121540040 119606232 118528816 117204591 115669717 114733016 112178580
4521 112178580 109811931 108232760 107172111 106315890 104452541 103317835 102843895 100764513
$$ packed form
4581F3564216J126465K808330K804487K612228J822778L386656K945502K005806
4573H3076468L304190K106183J593368K438656J596643J706333J005187J152979
4565I7980007P91195L83205l23741K96874Q16764L21564R00352K35054L9802M08167
4555A01849243Q9773M31862J39162P71190J568818N13251L00781K57994J33483
4546A06055557M59832J217651J089187J302431J535794O61426J537205K116751
4538A15975834J436446P74287P17516J257267J506846J77751q6598P78415J105008
4529A23642772j189688r13044j933808j077416j324225j534874r36701k554436
4521A12178580k366649j579171j060649q56221j863349j134706m73940k079382
$$ plain form
4513 100764513 98808681 98208616 97666283 96924573 94474069 92596313 90718859 88394820
4505 88394820 87398380 86328615 84170224 82726907 82185219 80208183 79021541 77829583
4497 77829583 76887572 75423226 74487681 74458041 74757156 73835313 73856156 74286813 74123889 72674240
4487 72674240 71604859 70835952 70234530 69619747 68614091 68731984 68273619 67891877 67942633
4478 67942633 66939839 66117460 66498910 66434268 67168414 67553403 66172796 66363119 67349072
4469 67349072 66756806 66820607 66361789 66055009 65823889 64418076 64055246 63910493 62840029
4460 62840029 62205261 62296292 61530684 61354790 60465248 60225212 60017721 59657435 59798931 59570475
4450 59570475 59320450 59572034 58845228 59533328 59453374 58999347 59830236 59467550 59866463 61756975
$$ packed form
4513A00764513j955832o00065n42333p41710k450504j877756j877454k324039
4505H8394820r96440j069765k158391j443317n41688j977036j186642j191958
4497G7829583r42011j464346r35545k9640K99115r21843K0843M30657j62924j449649
4487G2674240j069381p68907o01422o14783j005656J17893m58365l81742N0756
4478F7942633j002794q22379L81450o4642P34146L84989j380607J90323R85953
4469F7349072n92266O3801m58818l06780k31120j405813l62830j44753j070464
4460F2840029o34768R1031p65608j75894q89542k40036k07491l60286J41496k28456
4450E9570475k50025K51584p26806O88100p9954m54027Q30889l62686L98913J890512
$$ plain form
4440 61756975 62981016 62401550 62651463 63031017 63396886 63784835 65187290 66226737 66674537
4431 66674537 67363680 66893137 67401161 67819140 68184316 68523562 68377194 68669162 67946761
4422 67946761 68400958 68840927 68884519 69189067 69350487 69324495 68751215 68930854 69283697 68492948
4412 68492948 68615478 69813501 71256861 72521871 72459628 73451617 73375248 73748389 74002592
4403 74002592 73137319 73299022 73141060 73673390 73165081 72142239 70952875 70451706 69870862
4394 69870862 68367017 66813150 65454552 63359359 61852594 61242235 59612611 56479731
4386 56479731 55618250 54429207 53211729 51694896 50472806 49566778 47882710 47165657 45845272
4377 45845272 45175211 44273315 43452699 42386301 41428822 39897207 39115259 38728361 37492013
$$ packed form
4440F1756975J224041n79466K49913L79554L65869L87949J402455J039447M47800
4431F6674537O89143m70543N08024M17979L65176L39246j46368K91968p22401
4422F7946761M54197M39969M3592L04548J61420k5992n73280J79639L52843p90749
4412F8492948J22530J198023J443360J265010o2243R91989p6369L73141K54203
4403G4002592q65273J61703j57962N32330n08309j022842j189364n01169n80844
4394F9870862j503845j553867j358598k095193j506765o10359j629624l132880
4386E6479731q61481j189043j217478j516833j222090r06028j684068p17053j320385
4377D5845272o70061r01896q20616j066398r57479j531615p81948l86898j236348
$$ plain form
4368 37492013 36750365 36487797 36219386 36065687 35162804 34991738 34959981 34042066 33804211 32670189
4358 32670189 33711875 33864839 32536541 31336663 31347609 30758446 30249998 29556114 29127938
4349 29127938 28698792 28622615 28872490 29206450 29109968 27583092 27677396 27787000 27699291 27048171
4339 27048171 26487566 26920606 27102124 25637030 25609929 25743099 26375216 26498414 25966265
4330 25966265 25686982 25722251 25210561 25686842 26158289 26379570 26139876 26005618 26426029 25531380
4320 25531380 25129401 25848734 26417321 26058631 26241583 26347652 25802249 25314738 25507207
4311 25507207 26205658 24801717 24518740 24965982 24660621 25397308 25281590 25002032 24961529
4302 24961529 24576201 23902378 23684547 23835981 23811400 23281693 23523061 23797763 23651066 23219593
$$ packed form
4368C7492013p41648k62568k68411j53699r02883j71066l1757r17915k37855j134022
4358C2670189J041686J52964j328298j199878J0946n89163n08448o93884m28176
4349B9127938m29146p6177K49875L33960r6482j526876R4304J09604q7709o51120
4339B7048171n60605M33040J81518j465094k7101J33170O32117J23198n32149
4330B5966265k79283L5269n11690M76281M71447K21281k39694j34258M20411q94649
4320B5531380m01979P19333N68587l58690J82952J06069n45403m87511J92469
4311B5507207O98451j403941k82977M47242l05361P36687j15718k79558m0503
4302B4961529l85328o73823k17831J51434k4581n29707K41368K74702j46697m31473
$$ plain form
4292 23219593 22605032 22689649 22104940 22426135 22640780 22186249 21790938 21498895 22289464 22974690
4282 22974690 23371435 22614179 22505750 22950956 23415106 23091694 22495244 23109596 22301095
4273 22301095 22301871 23056214 23011363 22961114 21957426 20899869 20640370 20702430 21076717 20136741
4263 20136741 19930267 19990967 19822466 20397763 20944087 20042304 19409380 18565220 18519832 18044621
4253 18044621 18176906 18170411 16846044 16835819 16932421 16504087 16228755 15608048 15786014 16281942
4243 16281942 16117767 16027623 15517447 14689550 15074278 15485612 14303274 14258187 14216023 13816390
4233 13816390 12927993 13179041 13595537 13780269 13131492 12472019 13125724 13422389 13164804
4224 13164804 13428228 13149879 13339635 13579099 13146312 12281579 12623175 13537742 12489034
$$ packed form
4292B3219593o14561Q4617n84709L21195K14645m54531l95311k92043P90569O85226
4282B2974690L96745p57256j08429M45206M64150l23412n96450O14352q08501
4273B2301095P76P54343m4851n0249j003688j057557k59499O2060L74287r39976
4263B0136741k06474O0700j68501N75297N46324r01783o32924q44160m5388m75211
4253A8044621J32285o495j324367j0225R6602m28334k75332o20707J77966M95928
4243A6281942j64175r0144n10176q27897L84728M11334j182338m5087m2164l99633
4233A3816390q88397K51048M16496J84732o48777o59473O53705K96665k57585
4224A3164804K63424k78349J89756K39464m32787q64733L41596R14567j048708
$$ plain form
4215 12489034 12557217 12591417 12349967 12577482 12928235 13034283 12374545 12823268 11880104 12086896
4205 12086896 12745533 13178115 12968715 12332162 12517018 12150442 11517510 11282850 12070785
4196 12070785 11800761 11581411 11779326 11315109 11218478 11248095 10559764 10896401 11247935 10942371
4186 10942371 11065691 11652246 11812827 11621088 12440474 12777142 12583257 13302179 12283661
4177 12283661 12114477 12595504 12297242 12925552 13146624 13218165 12112637 12063227 12532959 12354548
4167 12354548 12318966 12782463 12357768 12664894 13025841 13057393 12333639 12384685 12342917 12888000
4157 12888000 13282061 12968973 12527802 13102196 13004412 12630844 12631140 12010059 11737878 11834738
4147 11834738 11578393 12808232 13797912 13569919 12500900 12503466 13197425 13504314 14694419
$$ packed form
4215A2489034O8183L4200k41450K27515L50753J06048o59738M48723r43164K06792
4205A2086896O58637M32582k09400o36553J84856l66576o32932k34660P87935
4196A2070785k70024k19350J97915m64217r6631K9617o88331L36637L51534l05564
4186A0942371J23320N86555J60581j91739Q19386L36668j93885P18922j018518
4177A2283661j69184M81027k98262O28310K21072P1541j105528m9410M69732j78411
4167A2354548l5582M63497m24695L07126L60947L1552p23754N1046m1768N45083
4157A2888000L94061l13088m41171N74394r7784l73568K96o21081k72181R6860
4147A1834738k56345J229839R89680k27993j069019K566O93959L06889J190105
$$ plain form
4138 14694419 14568205 13215950 13254109 14050069 13556728 13011699 13147017 13215784 12937620 14026140
4128 14026140 13685505 12617614 11969440 12792331 11753748 12123301 11738012 11320352 11968922
4119 11968922 11610744 11372828 11625188 11088719 11302278 11619475 10740043 11022132 12064780
4110 12064780 11788773 11458774 10973770 10631468 10486092 10153236 10141107 11100082 11556517 11551491
4100 11551491 11056963 11305415 10203917 9654118 10957748 10646211 10897741 11670792 11029908
4091 11029908 11126851 11039667 11681907 11588005 11939488 11343777 11256939 12704746 12175658 11652236
4081 11652236 11168157 11224885 11081264 11484605 11376668 11705117 11714383 10763341 10343592 10623566
4071 10623566 10478257 10564186 10887376 11663582 12165079 12809117 11572442 11114422 11507191
$$ packed form
4138A4694419j26214j352255L8159P95960m93341n45029J35318O8767k78164J088520
4128A4026140l40635j067891o48174Q22891j038583L69553l85289m17660O48570
4119A1968922l58178k37916K52360n36469K13559L17197q79432K82089J042648
4110A2064780k76007l29999m85004l42302j45376l32856j2129R58975M56435n026
4100A1551491m94528K48452j101498n49799J303630l11537K51530P73051o40884
4091A1029908R6943q7184O42240r3902L51483n95711q6838J447807n29088n23422
4081A1652236m84079N6728j43621M03341j07937L28449R266r51042m19749K79974
4071A0623566j45309Q5929L23190P76206N01497O44038j236675m58020L92769
$$ plain form
4062 11507191 11627953 11739627 10798332 11454363 12485617 11955158 11574896 11511028 11266583
4053 11266583 11255788 11834416 11407959 11857599 11718685 11482219 10576275 10316913 11434220
4044 11434220 10865949 11361334 11063985 10571497 10932943 11041582 11551067 11725817 11441113
4035 11441113 11187529 10617345 11151053 11819682 12012460 11825775 11443014 11229137 11337945
4026 11337945 11852122 12334852 12027763 12336128 12244772 12328046 12654608 12573420 12390289 11095622
4016 11095622 10608759 11432415 11762523 11772724 11563604 10782507 11194309 11877893 11921563 11890584
4006 11890584 12036479 11935710 11920497 12867100 13033618 12844169 12880770 12455375 12741765 11950672
3996 11950672 11232886 11265920 10516064 10318155 11579962 11956983 12257252 12090097 11935675
$$ packed form
4062A1507191J20762J11674r41295O56031J031254n30459l80262o3868k44445
4053A1266583j0795N78628m26457M49640j38914k36466r05944k59362J117307
4044A1434220n68271M95385k97349m92488L61446J08639N09485J74750k84704
4035A1441113k53584n70184N33708O68629J92778j86685l82761k13877J08808
4026A1337945N14177M82730l07089L08365r1356Q3274L26562q1188j83131j294667
4016A1095622m86863Q23656L30108J0201k09120p81097M11802O83584M3670l0979
4006A1890584J45895j00769j5213R46603J66518j89449L6601m25395K86390p91093
3996A1950672p17786L3034p49856j97909J261807L77021L00269j67155j54422
$$ plain form
3987 11935675 11390038 11557769 12130453 11933356 12332122 12141539 12438631 12346222 12756163 12525555
3977 12525555 12808660 12620982 12180341 12015625 12146147 11480436 11179465 12340116 11911758
3968 11911758 12297316 12541649 12052651 12325940 12826610 12341501 14046148 14305131 13611413
3959 13611413 12827109 13376260 13500641 13418718 13197890 13846254 12797218 12603920 13570838
3950 13570838 14143266 14451366 14421598 14757438 13831944 13835897 13727978 14222353 14080652 14234379
3940 14234379 13848263 14703674 15541862 14838232 13787887 13127990 14456705 14943345 14929854
3931 14929854 14357475 15120428 15820096 15534455 16004962 16199376 16602188 16487835 17195314
3922 17195314 17058671 17376996 16821693 16647309 17054197 16977313 17833006 18505451 17904093 18147756
$$ packed form
3987A1935675n45637J67731N72684j97097L98766j90583K97092r2409M09941k30608
3977A2525555K83105j87678m40641j64716J30522o65711l00971J160651m28358
3968A1911758L85558K44333m88998K73289N00670m85109J704647K58983o93718
3959A3611413p84304N49151J24381q1923k20828O48364j049036j93298R66918
3950A3570838N72428L08100k9768L35840r25494L953j07919M94375j41701J53727
3940A4234379l86116Q55411Q38188p03630j050345o59897J328715M86640j3491
3931A4929854n72379P62953O99668k85641M70507J94414M02812j14353P07479
3922A7195314j36643L18325n55303j74384M06888p6884Q55693O72445o01358K43663
$$ plain form
3912 18147756 17527629 17462390 18350023 17866834 18704225 19167254 18989741 19516751 18981188 19862239
3902 19862239 20901324 20631537 21176027 21167538 21446630 23210200 23099869 23641116 24257500
3893 24257500 24419410 25277294 26255322 27018387 27857157 29092616 29125863 28786241 29919717
3884 29919717 30484198 30670636 32501055 32276093 33046574 34180528 34307371 35827295 35923031
3875 35923031 36811890 37682726 38843327 40210419 40568602 40468665 41076474 42362558 43860320
3866 43860320 44387309 45442521 47258623 48467885 50061622 52175972 53569999 54846308
3858 54846308 57506507 60230358 62468538 65703994 70216891 74092267 77476494 80265175
3850 80265175 81099492 80612061 81111957 81403189 80359740 79778734 80173370 80726465 80734498 81951502
$$ packed form
3912A8147756o20127o5239Q87633m83189Q37391M63029j77513N27010n35563Q81051
3902A9862239J039085k69787N44490q489K79092J763570j10331N41247O16384
3893B4257500J61910Q57884R78028P63065Q38770J235459L3247l39622J133476
3884B9919717N64481J86438J830419k24962P70481J133954J26843J519924R5736
3875C5923031Q88859Q70836J160601J367092L58183r9937O07809J286084J497762
3866D3860320N26989J055212J816102J209262J593737K114350J394027J276309
3858E4846308K660199K723851K238180L235456M512897L875376L384227K788681
3850H0265175Q34317m87431M99896K91232j043449n81006L94636N53095Q033J217004
$$ plain form
3840 81951502 83188366 83818382 85330873 86692143 87642047 89134094 91168946 92048310 93106135
3831 93106135 94187842 95697636 96865860 97888256 99587135 100924672 102378751 104187936
3823 104187936 106240927 109512346 113813507 117872926 122059962 125793806 129693416 133647572
3815 133647572 137067243 141176054 144025588 147076838 149284181 151002903 151800749 151534608
3807 151534608 151139701 152113241 153480379 155280605 157256180 159208046 161933279 164861637
3799 164861637 167674155 172048169 176726166 179968283 184644094 189535191 193975453 198540089
3791 198540089 202935768 207756103 210790809 214438666 219745678 225418712 230508283 235231298
3783 235231298 239141581 242304233 243418763 243480587 244004410 243684711 244759938 245979460 246579647
$$ packed form
3840H1951502J236864O30016J512491J361270R49904J492047K034852Q79364J057825
3831I3106135J081707J509794J168224J022396J698879J337537J454079J809185
3823A04187936K052991L271419M301161M059419M187036L733844L899610L954156
3815A33647572L419671M108811K849534L051250K207343J718722P97846k66141
3807A51534608l94907R73540J367138J800226J975575J951866K725233K928358
3799A64861637K812518M374014M677997L242117M675811M891097M440262M564636
3791A98540089M395679M820335L034706L647857N307012N673034N089571M723015
3783B35231298L910283L162652J114530O1824N23823l19699J075227J219522O00187
$$ plain form
3774 246579647 247072740 247815922 249406033 251824965 253390329 254750062 256614202 259078905
3766 259078905 261618502 262172168 263060566 263652850 264351650 266346612 268080958 269814720 273054334
3757 273054334 275896725 278706916 282551129 284957835 289158620 293769385 297532032 300812117
3749 300812117 304678109 309022661 311305630 313055188 314808252 313280645 310932372 307300433
3741 307300433 303301230 299661205 296084913 292750465 289213718 285618081 282844151 280817063
3733 280817063 277787814 274798142 273563370 270753609 269378506 268522594 266876630 266044636
3725 266044636 264155516 263146699 260300534 257425008 255017828 252526416 251126459 249714095
3717 249714095 248655757 246927072 244451907 242622121 240563723 239215927 236999504 235088877
$$ packed form
3774B46579647M93093P43182J590111K418932J565364J359733J864140K464703
3766B59078905K539597N53666Q88398N92284O98800J994962J734346J733762L239614
3757B73054334K842391K810191L844213K406706M200785M610765L762647L280085
3749C00812117L865992M344552K282969J749558J753064j527607k348273l631939
3741C07300433l999203l640025l576292l334448l536747l595637k773930k027088
3733B80817063l029249k989672j234772k809761j375103q55912j645964q31994
3725B66044636j889120j008817k846165k875526k407180k491412j399957j412364
3717B49714095j058338j728685k475165j829786k058398j347796k216423j910627
$$ plain form
3709 235088877 234669200 233110311 231517486 230079043 228114101 226971670 225748386 224362531
3701 224362531 223155752 222005683 220797749 219956712 218945171 217928697 216690925 216043612
3693 216043612 215336089 213562118 212600438 212730575 212953341 212625424 211849864 211404702 211742300
3684 211742300 211690202 212630179 213676846 214648571 215243034 215414800 213982218 211201343 207902206
3675 207902206 204750962 202302182 199906615 197381962 195996054 195261328 193935011 192044640
3667 192044640 190930356 190669530 191155401 190718295 189747282 189153728 189393642 189326263 188583038
3658 188583038 188576749 188816009 190579072 191982291 193923789 194835224 196349044 197751953 198717360
3649 198717360 200004580 201482815 202360742 202966974 204559056 205617002 207270644 208425522
$$ packed form
3709B35088877m19677j558889j592825j438443j964942j142431j223284j385855
3701B24362531j206779j150069j207934q41037j011541j016474j237772o47313
3693B16043612p07523j773971r61680J30137K22766l27917p75560m45162L37598
3684B11742300n2098R39977J046667R71725N94463J71766j432582k780875l299137
3675B07902206l151244k448780k395567k524653j385908p34726j326317j890371
3667A92044640j114284k60826M85871m37106r71013n93554K39914o7379p43225
3658A88583038o289K39260J763063J403219J941498R11435J513820J402909R65407
3649A98717360J287220J478235Q77927O06232J592082J057946J653642J154878
$$ plain form
3641 208425522 210186025 211080946 211889558 213339949 213921723 217210026 219975160 222578333
3633 222578333 223986502 224517955 225538492 226815173 228615497 229867114 231655442 233332608
3625 233332608 234170943 234799318 235785009 236575195 237584670 238490892 239389340 240138213 240218686
3616 240218686 240557867 241361809 241818402 242994298 242648424 241572245 240064985 238284462 234950544
3607 234950544 232831806 231189425 229488539 228452243 227128170 226330170 225403986 225695000
3599 225695000 225805322 225207884 224460121 223926282 222466178 221510372 220311285 218045825 216811168
3590 216811168 214753702 211750956 209604519 206756204 205570958 202559664 200491734 199069613
3582 199069613 196469426 194180135 191829891 190907995 190166774 187830563 185198845 184372832
$$ packed form
3641B08425522J760503Q94921Q08612J450391N81774L288303K765134K603173
3633B22578333J408169N31453J020537J276681J800324J251617J788328J677166
3625B33332608Q38335O28375R85691P90186J009475R06222Q98448P48873Q0473
3616B40218686L39181Q03942M56593J175896l45874j076179j507260j780523l333918
3607B34950544k118738j642381j700886j036296j324073p98000r26184K91014
3599B25695000J10322n97438p47763n33839j460104r55806j199087k265460j234657
3590B16811168k057466l002746k146437k848315j185246l011294k067930j422121
3582A99069613k600187k289291k350244r21896p41221k336211k631718q26013
$$ plain form
3574 184372832 182298227 181323608 179959884 178504827 176319858 175441293 174078924 172826929
3566 172826929 172466881 171787156 171375247 171352890 171391923 170579158 170380494 168916761 167429357
3557 167429357 166134837 164682544 163113108 161301927 159510346 156936706 154944022 153473550
3549 153473550 150472026 148658917 147129525 146021692 144667637 143156509 142072921 140559898
3541 140559898 139136624 138293293 138225492 136319309 134330490 132978326 131930899 131110603 129711027
3532 129711027 128482770 128154921 127702229 126512917 126323588 124952802 123976648 123121943 122148112
3523 122148112 121612364 120371859 118794931 117177141 116319015 115362611 114229093 113063516
3515 113063516 112263831 111547609 110185295 108454674 107842737 107353008 106645831 106289973 105036341
$$ packed form
3574A84372832k074605r74619j363724j455057k184969q78565j362369j251995
3566A72826929l60048o79725m11909k2357L9033q12765j98664j463733j487404
3557A67429357j294520j452293j569436j811181j791581k573640j992684j470472
3549A53473550l001524j813109j529392j107833j354055j511128j083588j513023
3541A40559898j423274q43331o7801j906183j988819j352164j047427q20296j399576
3532A29711027j228257l27849m52692j189312j89329j370786r76154q54705r73831
3523A22148112n35748j240505j576928j617790q58126r56404j133518j165577
3515A13063516p99685p16222j362314j730621o11937m89729p07177l55858j253632
$$ plain form
3506 105036341 104903274 104062748 103906306 103674371 103327487 103246014 103187298 103033743 102721436 103814552
3496 103814552 103583868 104061569 103724271 103333734 103147698 102862304 102061141 101345837 100357685
3487 100357685 99123277 98214889 97312891 97506648 97067263 95971027 94454244 93794357 93045508
3478 93045508 92788804 92514955 91895455 91700523 91929894 91291004 89960498 90959204 91123386
3469 91123386 90494884 90417260 91143877 91533947 91484207 90902924 90941368 91669257 91838885 92102393
3459 92102393 91946465 91641401 91158223 90736278 89169456 89817249 89559121 89489895 88864222
3450 88864222 86693229 85574111 84895676 84559414 84543080 84174761 83569729 83486202 83059152
3441 83059152 83516476 84147677 83115461 83613293 84316010 84279773 85526969 86767757 86236462
$$ packed form
3506A05036341j33067q40526j56442k31935l46884q1473n8716j53555l12307J093116
3496A03814552k30684M77701l37298l90537j86036k85394q01163p15304r88152
3487A00357685j234408r08388r01998J93757m39385j096236j516783o59887p48849
3478I3045508k56704k73849o19500j94932K29371o38890j330506R98706J64182
3469I1123386o28502p7624P26617L90070m9740n81283L8444P27889J69628K63508
3459I2102393j55928l05064m83178m21945j566822O47793k58128o9226o25673
3450H8864222k170993j119118o78435l36262j6334l68319o05032q3527m27050
3441H3059152M57324O31201j032216M97832P02717l6237J247196J240788n31295
$$ plain form
3432 86236462 85620417 85899024 85740270 86721642 87322142 87802309 88356478 87599656 87583131 87969349
3422 87969349 88271227 88258777 87486669 87164293 86613028 87171868 86638883 87054729 86871586 87666684
3412 87666684 88612665 89010798 89143568 89626948 90923286 91503370 92400998 92757605 93377954
3403 93377954 94624466 95425166 97257486 98797238 100354141 101573435 103796413 105404042
3395 105404042 106634725 109193182 110522336 111777847 113872951 115581568 116698063 119338843
3387 119338843 120887784 121868079 123393883 124395667 125695849 128201201 131172348 133427172
3379 133427172 135824161 137556562 139744470 143380973 145421658 146586494 148815903 152028926
3371 152028926 153979820 156761845 159862844 162887129 166362527 169459845 173401127 178919630
$$ packed form
3432H6236462o16045K78607j58754R81372O00500M80167N54169p56822j6525L86218
3422H7969349L01878j2450p72108l22376n51265N58840n32985M15846j83143P95098
3412H7666684R45981L98133J32770M83380J296338N80084Q97628L56607O20349
3403I3377954J246512Q00700J832320J539752J556903J219294K222978J607629
3395A05404042J230683K558457J329154J255511K095104J708617J116495K640780
3387A19338843J548941R80295J525804J001784J300182K505352K971147K254824
3379A33427172K396989J732401K187908L636503K040685J164836K229409L213023
3371A52028926J950894K782025L100999L024285L475398L097318L941282N518503
$$ plain form
3363 178919630 184148596 188467332 194609295 201326337 208535686 214840602 220831302 227049599
3355 227049599 231741028 236715204 240132429 242862262 245150972 246482009 247494529 248468135
3347 248468135 249199563 250754262 251376457 252175530 253068978 253428647 254767459 255646326 256366286
3338 256366286 256851775 256941134 257337617 256420667 255932104 255480697 255886406 257080333 258124499
3329 258124499 259003660 261433736 263000371 266004304 269388368 271695428 274643986 277711552
3321 277711552 280878849 283646044 286245851 288303104 289226643 288806908 289200966 288108695
3313 288108695 286455214 282910395 280628788 277496119 274192300 271067154 268386562 266513311
3305 266513311 263344249 260475939 257909455 254649869 250555938 248405955 246344286 243833264
$$ packed form
3363A78919630N228966M318736O141963O717042P209349O304916N990700O218297
3355B27049599M691429M974176L417225K729833K288710J331037J012520R73606
3347B48468135P31428J554699O22195P99073Q93448L59669J338812Q78867P19960
3338B56366286M85489Q9359L96483r16950m88563m51407M05709J193927J044166
3329B58124499Q79161K430076J566635L003933L384064K307060K948558L067566
3321B77711552L167297K767195K599807K057253R23539m19735L94058j092271
3313B88108695j653481l544819k281607l132669l303819l125146k680592j873251
3305B66513311l169062k868310k566484l259586m093931k149983k061669k511022
$$ plain form
3297 243833264 241833347 238942552 236824625 233012660 229618278 225742953 223028229 220300132
3289 220300132 216515857 214009984 211066297 208044598 205774478 201880339 199472545 197435325
3281 197435325 193429493 191577186 190422676 188375586 186366172 184362467 182903528 181930891
3273 181930891 180813858 179537498 177982050 177020778 175851775 174977757 172829682 171149119
3265 171149119 169249320 168243132 167309258 166254187 164444327 163967796 164423498 164431178 164250692
3256 164250692 164711681 165574840 164758634 164827380 165681364 165138288 164345987 163094661 162180439
3247 162180439 160467917 159253189 158260075 156201869 155352394 155427644 154537271 153634070 153277216
3238 153277216 152426429 151619761 151044486 149789291 149323713 150095439 148884495 148439338 149803695
$$ packed form
3297B43833264j999917k890795k117927l811965l394382l875325k714724k728097
3289B20300132l784275k505873k943687l021699k270120l894139k407794k037220
3281A97435325m005832j852307j154510k047090k009414k003705j458939r72637
3273A81930891j117033j276360j555448r61272j169003q74018k148075j680563
3265A71149119j899799j006188r33874j055071j809860m76531M55702P680j80486
3256A64250692M60989Q63159q16206O8746Q53984n43076p92301j251326r14222
3247A62180439j712522j214728r93114k058206q49475P5250q90373r03201l56854
3238A53277216q50787q06668n75275j255195m65578P71726j210944m45157J364357
$$ plain form
3229 149803695 150690091 150710810 151716557 153196618 154110390 155473900 157476723 159104545 159893891
3220 159893891 160987703 163447885 164352593 164933464 165216252 165627755 165949409 167786693 169399893
3211 169399893 169901878 170110082 170553889 170787529 171596551 172924712 173137233 173206010 173900709
3202 173900709 175302743 175846246 177479363 179492485 180638328 182091073 183948125 185101755
3194 185101755 186630667 188647304 190427772 192229183 194322016 195427401 197086128 198373539
3186 198373539 199513781 200529398 201034307 200132217 198713516 197224308 197155926 196274282 195615716
3177 195615716 195054305 194139741 195060731 195688134 195547049 196185203 197295104 198617322 198991087
3168 198991087 197369839 194478105 192436887 189618289 186278176 184396947 182328794 180372573
$$ packed form
3229A49803695Q86396K0719J005747J480061R13772J363510K002823J627822P89346
3220A59893891J093812K460182R04708N80871K82788M11503L21654J837284J613200
3211A69399893N01985K08204M43807K33640Q09022J328161K12521O8777O94699
3202A73900709J402034N43503J633117K013122J145843J452745J857052J153630
3194A85101755J528912K016637J780468J801411K092833J105385J658727J287411
3186A98373539J140242J015617N04909r02090j418701j489208o8382q81644o58566
3177A95615716n61411r14564R20990O27403j41085O38154J109901J322218L73765
3168A98991087j621248k891734k041218k818598l340113j881229k068153j956221
$$ plain form
3160 180372573 178331999 175518207 174444353 174029572 172219806 171181663 169855296 169449090
3152 169449090 168889546 167315034 165288597 162765484 160645552 158906587 157217872 155925033
3144 155925033 153894645 153120314 153666554 153877219 153827194 154751665 155448867 155993364 158237167
3135 158237167 160219699 161544905 162721154 163656457 164538576 163821181 162631480 160301433
3127 160301433 157419752 154055547 150733334 147497057 145332661 143112924 142030391 138694851
3119 138694851 135311509 133880411 132975933 131050940 131419097 131386467 130196314 129595598 128824130
3110 128824130 127902685 125190217 122329511 119617762 116958034 115258535 113496791 112845484
3102 112845484 112077522 111123766 108769088 107150102 106404006 105285929 105992582 104958880 103598779
$$ packed form
3160A80372573k040574k813792j073854m14781j809766j038143j326367m06206
3152A69449090n59544j574512k026437k523113k119932j738965j688715j292839
3144A55925033k030388p74331N46240K10665n0025R24471O97202N44497K243803
3135A58237167J982532J325206J176249R35303Q82119p17395j189701k330047
3127A60301433k881681l364205l322213l236277k164396k219737j082533l335540
3119A38694851l383342j431098r04478j924993L68157l2630j190153o00716p71468
3110A28824130r21445k712468k860706k711749k659728j699499j761744o51307
3102A12845484p67962r53756k354678j618986p46096j118077P06653j033702j360101
$$ plain form
3093 103598779 102260154 101445947 101219495 101289355 100359261 99823179 99464382 99718223 98043792
3084 98043792 97030776 96009515 94850057 94491818 93041853 91549379 91897723 91647020 90108206
3075 90108206 89863167 90799008 90869730 91384787 91638830 90956844 90183594 91244813 92717874
3066 92717874 92968783 93272078 93994786 94284945 93942070 93091456 91428696 90241182 89726642
3057 89726642 88606902 87953155 87700158 86834113 87152756 86799444 86603134 86450656 86308778
3048 86308778 86829518 86783353 86835301 86779062 87237132 87679291 87473507 88078026 88456275 88604978
3038 88604978 90965066 91635421 92414438 93242140 94744285 95097083 95567854 95748363 96636378
3029 96636378 98010444 97619099 97715565 98511585 99267667 100106842 100092671 100233074 100362366 100061630
$$ packed form
3093A03598779j338625q14207k26452O9860r30094n36082l58797K53841j674431
3084I8043792j013016j021261j159458l58239j449965j492474L48344k50703j538814
3075I0108206k45039R35841P0722N15057K54043o81986p73250J061219J473061
3066I2717874K50909L03295P22708K90159l42875q50614j662760j187514n14540
3057H9726642j119740o53747k52997q66045L18643l53312j96310j52478j41878
3048H6308778N20740m6165N1948n6239M58070M42159k05784O04519L78249J48703
3038H8604978K360088O70355P79017Q27702J502145L52798M70771J80509Q88015
3029I6636378J374066l91345R6466P96020P56082Q39175j4171J40403J29292l00736
$$ plain form
3019 100061630 99633215 100682398 101494910 100989287 100869298 101781184 101978902 103131253 103978939
3010 103978939 104692832 105661380 106552471 107012517 106982503 108094810 109190477 110078634 111067043
3001 111067043 111676180 111170337 112558707 113816087 113646586 111762298 110657011 109328066
2993 109328066 107796605 105750464 105137392 103802746 102717413 102072236 101879025 100519028
2985 100519028 99065102 98709310 97762313 96806701 95454977 94269216 94488991 93310712 92004622
2976 92004622 91370996 90721583 90027006 89543509 88733865 88057343 87036756 87242136 86551933
2967 86551933 86187407 85531394 84746888 83957078 83930991 83584355 83190403 82674319 81621658
2958 81621658 80958420 80577486 79724966 78570257 77595304 77359125 77645273 77118413 76527593
$$ packed form
3019A00061630m28415J049183Q12512n05623j19989R11886J97718J152351Q47686
3010A03978939P13893R68548Q91091M60046l0014J112307J095667Q88157R88409
3001A11067043O09137n05843J388370J257380j69501j884288j105287j328945
2993A09328066j531461k046141o13072j334646j085333o45177j93211j359997
2985A00519028j453926l55792r46997r55612j351724j185761K19775j178279j306090
2976I2004622o33626o49413o94577m83497q09644o76522j020587K05380o90203
2967H6551933l64526o56013p84506p89810k6087l46636l93952n16084j052661
2958H1621658o63238l80934q52520j154709r74953k36179K86148n26860n90820
$$ plain form
2949 76527593 74612365 73684072 72696233 73462646 73191126 72534829 72040946 71359491 71020423
2940 71020423 70380141 69798000 69023963 69076182 68390338 67476173 66517339 65168140 64593633
2931 64593633 64768514 64664087 63922592 62912528 62636866 62620128 61828861 61773748 60539791
2922 60539791 59694260 59566185 58477167 57923021 57684408 56655298 56336488 56410141 56202394
2913 56202394 55426975 54539839 54280784 54130721 53858253 53887206 54314281 54338544 54139940 54214203
2903 54214203 54099909 52503441 52461246 52712478 52266213 52072510 51100657 51031500 50750258 50576701
2893 50576701 50471573 50203363 49555821 49678473 49713487 48307435 47386464 48390115 48621880
2884 48621880 48253147 48351199 47161882 47075650 47364697 46853089 46336814 46262573 47088967 46942459
$$ packed form
2949G6527593j915228r28293r87839P66413k71520o56297m93883o81455l39068
2940G1020423o40282n82141p74037N2219o85844r14165r58834j349199n74507
2931F4593633J74881j04427p41495j010064k75662j6738p91267n5113j233957
2922F0539791q45531j28075j089018n54146k38613j029110l18810P3653k07747
2913E6202394p75419q87136k59055j50063k72468K8953M27075K4263j98604P4263
2903E4214203j14294j596468m2195K51232m46265j93703r71853o9157k81242j73557
2893E0576701j05128k68210o47542J22652L5014j406052r20971J003651K31765
2884D8621880l68733R8052j189317q6232K89047n11608n16275p4241Q26394j46508
$$ plain form
2874 46942459 46366625 46126312 46000417 46315694 45486570 44547010 44322361 44513575 43992644
2865 43992644 44350573 44839332 44860945 45440474 45577992 45238047 43506783 43971192 44330025
2856 44330025 43749594 42445326 42067386 42123925 42727022 43129512 42976439 43703967 43129488
2847 43129488 41481656 41664026 41754656 42649432 41992621 40505364 40563528 39806591 39957215
2838 39957215 40644378 41194481 40946197 40141417 39820297 40270374 39948903 39571416 39511466 38276014
2828 38276014 38146366 39318919 38828060 38963156 39143042 38218849 37941896 37749797 37452996
2819 37452996 37677036 37610352 37583316 36808746 36432943 35921276 35595071 34509398 34881986 35033824
2809 35033824 34292022 34110548 34244646 34709762 33197705 33758126 33742851 33144883 34101958
$$ packed form
2874D6942459n75834k40313j25895L15277q29124r39560k24649J91214n20931
2865D3992644L57929M88759K1613N79529J37518l39945j731264M64409L58833
2856D4330025n80431j304268l77940N6539O03097M02490j53073P27528n74479
2847D3129488j647832J82370R0630Q94776o56811j487257N8164p56937J50624
2838C9957215O87163N50103k48284q04780l21120M50077l21471l77487n9950j235452
2828C8276014j29648J172553m90859J35096J79886r24193k76953j92099k96801
2819C7452996K24040o6684k7036p74570l75803n11667l26205j085673L72588J51838
2809C5033824p41802j81474J34098M65116j512057N60421j5275n97968R57075
$$ plain form
2800 34101958 33362045 32340192 32261621 31382285 31265473 30829878 31044490 30674965 31505076
2791 31505076 32256523 31987926 31422210 31700549 32592512 32184723 32250771 32272448 32195116 32370594
2781 32370594 32392130 32466152 32890878 32914404 32778523 32482210 33227599 33788744 33927878 33625624
2771 33625624 33350808 34659836 35782164 35325532 35939412 37246506 37952854 37795286 38151374
2762 38151374 38194552 37678992 38112320 38688825 38723070 39737448 39300595 39016868 39763799 40488813
2752 40488813 40767808 41157180 41950527 42626868 41812382 41975602 42762890 42978665 43342466
2743 43342466 42698462 43389289 43809835 43032842 42674465 43122825 43608951 42893433 43070082
2734 43070082 43465831 43925720 43331781 44604069 45817251 45531499 45213533 45402381 44568196
$$ packed form
2800C4101958p39913j021853p8571q79336j16812m35595K14612l69525Q30111
2791C1505076P51447k68597n65716K78339Q91963m07789O6048K1677p7332J75478
2781C2370594K1536P4022M24726K3526j35881k96313P45389N61145J39134l02254
2771C3625624k74816J309028J122328m56632O13880J307094P06348j57568L56088
2762C8151374M3178n15560M33328N76505L4245J014378m36853k83727P46931P25014
2752D0488813K78995L89372P93347O76341q14486J63220P87288K15775L63801
2743D3342466o44004O90827M20546p76993l58377M48360M86126p15518J76649
2734D3070082L95749M59889n93939J272288J213182k85752l17966J88848q34185
$$ plain form
2725 44568196 44630580 45086663 46178322 46079989 44786026 44642461 44294464 45086400 46052446
2716 46052446 46180483 44879325 44541488 44149714 44290786 44185130 44010783 43687716 44537625
2707 44537625 44346397 43269721 43244208 43107228 43394728 42315659 41132019 40446823 40243301
2698 40243301 40271259 39688421 39550451 39082080 38668771 38744805 39053711 38736000 39128327 39053976
2688 39053976 39058855 39255147 38066482 37564157 36820089 36549182 36456506 36507588 35486261 34859008
2678 34859008 36129615 35317860 35116360 35265834 35463178 35641220 35239281 34155100 35054649
2669 35054649 35365221 33810996 34021089 35135883 36362934 36111644 35012051 34843617 35313517
2660 35313517 36090271 36145246 36560286 36564698 36891781 36533430 36896287 36773300 36192336 36158199
$$ packed form
2725D4568196O2384M56083J091659r8333j293963j43565l47997P91936R66046
2716D6052446J28037j301158l37837l91774J41072j05656j74347l23067Q49909
2707D4537625j91228j076676k5513j36980K87500j079069j183640o85196k03522
2698D0243301K7958n82838j37970m68371m13309P6034L08906l17711L92327p4351
2688C9053976M879J96292j188665n02325p44068k70907r2676N1082j021327o27253
2678C4859008J270607q11755k01500J49474J97344J78042m01939j084181Q99549
2669C5054649L10572j554225K10093J114794J227051k51290j099593j68434M69900
2660C5313517P76754N4975M15040M412L27083l58351L62857j22987n80964l4137
$$ plain form
2650 36158199 36510372 36647891 36869359 37068359 37226196 36974834 37852724 37985729 39257918
2641 39257918 39491625 39230790 39476547 39355948 39720421 39713808 40280854 40704607 42455705 43359476
2631 43359476 43771527 43811337 44440052 44576931 44096852 44403287 44537539 46221364 46881448
2622 46881448 46930744 48057572 48795338 49646328 50888681 51215571 52247315 53893929 53898373
2613 53898373 54537934 54994007 56050830 57295159 58177092 59888254 60863110 62260691 64492296
2604 64492296 65534462 66350891 67329946 69143132 70869601 73055712 73557477 75287127 76501477
2595 76501477 78202287 80012456 81407186 82648728 84899409 85643753 86776857 89493868
2587 89493868 90419650 92427383 95017668 96895031 99490010 102605284 105013833 106564145
$$ packed form
2650C6158199L52173J37519K21468J99000J57837k51362Q77890J33005J272189
2641C9257918K33707k60835K45757j20599L64473o613N67046M23753J751098R03771
2631D3359476M12051L9810O28715J36879m80079L06435J34252J683825O60084
2622D6881448M9296J126828P37766Q50990J242353L26890J031744J646614M444
2613E3898373O39561M56073J056823J244329Q81933J711162R74856J397581K231605
2604F4492296J042166Q16429R79055J813186J726469K186111N01765J729650J214350
2595G6501477J700810J810169J394730J241542K250681P44344J133104K717011
2587H9493868R25782K007733K590285J877363K594979L115274K408549J550312
$$ plain form
2579 106564145 108956263 111616930 113909750 115932130 118537712 120139782 121735187 124304390
2571 124304390 126667424 128306069 129592391 131000756 133242772 134527883 136212708 137798077
2563 137798077 138329439 139956173 140843188 141397111 141807410 142781077 142949880 142963576 143287682
2554 143287682 142878735 143590579 144133827 145292261 146056795 146992245 148410662 149481158 150501204
2545 150501204 150756969 151699850 152836823 154053800 154828304 155831070 156184627 157325899 158009416
2536 158009416 158228179 158692713 158947763 159849522 159622347 158868260 158183584 159090829 158954008
2527 158954008 158829503 158501119 155657660 155797770 155082561 154072945 151912709 150492102 149037680
2518 149037680 146878204 145012241 142826815 141308321 140184774 138693541 137065751 134573819
$$ packed form
2579A06564145K392118K660667K292820K022380K605582J602070J595405K569203
2571A24304390K363034J638645J286322J408365K242016J285111J684825J585369
2563A37798077N31362J626734Q87015N53923M10299R73667J68803J3696L24106
2554A43287682m08947P11844N43248J158434P64534R35450J418417J070496J020046
2545A50501204K55765R42881J136973J216977P74504J002766L53557J141272O83517
2536A58009416K18763M64534K55050R01759k27175p54087o84676R07245j36821
2527A58954008j24505l28384k843459J40110p15209j009616k160236j420607j454422
2518A49037680k159476j865963k185426j518494j123547j491233j627790k491932
$$ plain form
2510 134573819 132578924 131790415 131157041 129000770 127410369 125428690 124382078 122798900
2502 122798900 120845288 119489698 118652502 117763289 116433769 116408514 115539457 114147856 112184081
2493 112184081 111139277 110791134 109989172 109700356 108550292 107915906 106551341 106200672 106746932
2484 106746932 106057573 105275763 104848992 104510096 105151036 104623909 103641026 103408569 103004093
2475 103004093 102659183 103480770 104370788 103303369 103420421 103207517 103569873 102722992 102882397
2466 102882397 103166924 102461330 102128072 101865829 101542546 101284351 100428344 100524023 100997991
2457 100997991 101049314 99735888 98927543 98586788 99398841 99619255 99310887 98769966 99521897
2448 99521897 99472386 100393543 100517028 100306788 100914562 100975986 101247938 102377457 103114432 103526715
$$ packed form
2510A34573819j994895p88509o33374k156271j590401j981679j046612j583178
2502A22798900j953612j355590q37196q89213j329520k5255q69057j391601j963775
2493A12184081j044804l48143q01962k88816j150064o34386j364565l50669N46260
2484A06746932o89359p81810m26771l38896O40940n27127r82883k32457m04476
2475A03004093l44910Q21587Q90018j067419J17052k12904L62356q46881J59405
2466A02882397K84527p05594l33258k62243l23283k58195q56007R5679M73968
2457A00997991N1323j313426q08345l40755Q12053K20414l08368n40921P51931
2448I9521897m9511R21157J23485k10240O07774O1424K71952J129519P36975M12283
$$ plain form
2438 103526715 104744245 106352800 107044435 107401816 109173098 110290829 112038576 112589768
2430 112589768 112988177 114156913 114828774 115361675 116635262 118205208 120217875 120398991 121702289
2421 121702289 123636126 124808773 126233221 128573647 130282589 131485757 133536069 135395814
2413 135395814 136829368 138507880 140060788 141814074 144318222 145087089 145894732 147828656
2405 147828656 149245210 150324963 151395245 152931873 154829096 156333504 157657834 158821987
2397 158821987 159830061 161406335 162943829 164497367 166715722 168791075 170764033 172931503
2389 172931503 175972609 178356849 180377746 183853922 186363859 190403721 193368157 196279316
2381 196279316 199299115 201260009 202861731 204389840 206152295 206964212 207007262 206376265 206764213
$$ packed form
2438A03526715J217530J608555O91635L57381J771282J117731J747747N51192
2430A12589768L98409J168736O71861N32901J273587J569946K012667J81116J303298
2421A21702289J933837J172647J424448K340426J708942J203168K050312J859745
2413A35395814J433554J678512J552908J753286K504148P68867Q07643J933924
2405A47828656J416554J079753J070282J536628J897223J504408J324330J164153
2397A58821987J008074J576274J537494J553538K218355K075353J972958K167470
2389A72931503L041106K384240K020897L476176K509937M039862K964436K911159
2381A96279316L019799J960894J601722J528109J762455Q11917M3050o30997L87948
$$ plain form
2372 206764213 206543471 206117260 205521898 205498662 205363185 204310172 204981821 205115119 204656207
2363 204656207 205329157 204913576 205151592 206197220 205980179 205768272 205975768 206000336 206527986
2354 206527986 207503186 208553327 210670232 213309709 215586364 217900542 220931211 224450800
2346 224450800 228171308 230110066 231749932 233024260 234182091 234801788 234948843 234078219
2338 234078219 232555456 230489417 227401723 225025748 222468277 219819698 216424009 214118982
2330 214118982 212203102 210134057 209106818 208476489 207481531 206561842 205659076 204679750 203203373
2321 203203373 202531635 200179663 197367555 194589161 191754144 190803912 188611311 186963751
2313 186963751 185374713 184010575 182727455 180962476 179673903 178371952 178960195 179021741
$$ packed form
2372B06764213k20742m26211n95362k3236j35477j053013O71649J33298m58912
2363B04656207O72950m15581K38016J045628k17041k11907K07496K4568N27650
2354B06527986R75200J050141K116905K639477K276655K314178L030669L519589
2346B24450800L720508J938758J639866J274328J157831O19697J47055q70624
2338B34078219j522763k066039l087694k375975k557471k648579l395689k305027
2330B14118982j915880k069045j027239o30329r94958r19689r02766r79326j476377
2321B03203373o71738k351972k812108k778394k835017r50232k192601j647560
2313A86963751j589038j364138j283120j764979j288573j301951N88243O1546
$$ plain form
2305 179021741 178121618 177888951 177235706 176623179 177118700 177453360 176912289 176653388 177508527
2296 177508527 176733181 175634580 175103991 175583821 175683540 175524357 176363728 177352191 177366444
2287 177366444 177198674 178649295 179355388 181107581 182337650 184119382 185371526 186506753
2279 186506753 187878043 188997730 190727392 192324116 192943623 193244033 193681834 194001108 194385899
2270 194385899 194445466 194979956 196199461 197886550 197503263 198016894 199173893 200439953 201602109
2261 201602109 202344675 203592904 206087841 208169722 209577120 212386790 214594473 217122466
2253 217122466 219834673 223413462 227024902 230060181 233720986 238257851 241618489 244884360
2245 244884360 247411178 251035018 255599056 258939614 263722170 267236653 270740967 274246787
$$ packed form
2305A79021741r00123k32667o53245o12527M95521L34660n41071k58901Q55139
2296A77508527p75346j098601n30589M79830R9719j59183Q39371R88463J4253
2287A77366444j67770J450621P06093J752193J230069J781732J252144J135227
2279A86506753J371290J119687J729662J596724O19507L00410M37801L19274L84791
2270A94385899N9567N34490J219505J687089l83287N13631J156999J266060J162156
2261B01602109P42566J248229K494937K081881J407398K809670K207683K527993
2253B17122466K712207L578789L611440L035279L660805M536865L360638L265871
2245B44884360K526818L623840M564038L340558M782556L514483L504314L505820
$$ plain form
2237 274246787 277826423 282655860 288224489 293297734 297678840 301578411 305424518 309110109
2229 309110109 311885931 314437413 317266511 319964215 322534874 325799093 328946611 333217910
2221 333217910 336320918 339299182 343026671 347339521 351492627 355066982 358271591 361884522
2213 361884522 365479152 367416821 369718092 373176655 375227411 376026190 378524262 379775434
2205 379775434 381070729 382831528 384923029 387886099 390266709 393358496 397155279 400615644
2197 400615644 402692204 404150714 403641155 401625813 399211012 397900279 396504210 394256094
2189 394256094 391572611 389516252 388085362 385990025 384917115 383652490 383284443 381456661
2181 381456661 380488656 378450258 376262068 374435480 372929270 371391490 370792214 369434218
$$ packed form
2237B74246787L579636M829437N568629N073245M381106L899571L846107L685591
2229C09110109K775822K551482K829098K697704K570659L264219L147518M271299
2221C33217910L103008K978264L727489M312850M153106L574355L204609L612931
2213C61884522L594630J937669K301271L458563K050756P98779K498072J251172
2205C79775434J295295J760799K091501K963070K380610L091787L796783L460365
2197D00615644K076560J458510n09559k015342k414801j310733j396069k248116
2189C94256094k683483k056359j430890k095337j072910j264625l68047j827782
2181C81456661r68005k038398k188190j826588j506210j537780n99276j357996
$$ plain form
2173 369434218 367759055 367211471 366454390 366124573 366043098 367515275 368577790 370215624 372994357
2164 372994357 375472559 376932555 378262213 378584157 378971723 377691794 374755260 372454406
2156 372454406 368894443 364339661 360473807 357095820 354457953 351849979 347438702 344594410
2148 344594410 341663932 339022258 337485937 334973210 332896094 331038853 330025345 328792062
2140 328792062 327543530 326168853 323429453 320376742 318962998 315623276 314082607 312276535
2132 312276535 309439188 309931312 309798506 308931675 308493316 308764809 308871280 307767456 305815078
2123 305815078 303149014 301348122 299854094 298473031 296346065 293568237 291537809 290312832
2115 290312832 289446632 289435638 288082662 285608905 283989165 283022021 282273488 282293967 281979636
$$ packed form
2173C69434218j675163n47584p57081l29817q1475J472177J062515J637834K778733
2164C72994357K478202J459996J329658L21944L87566j279929k936534k300854
2156C72454406l559963m554782l865854l377987k637867k607974m411277k844292
2148C44594410k930478k641674j536321k512727k077116j857241j013508j233283
2140C28792062j248532j374677k739400l052711j413744l339722j540669j806072
2132C12276535k837347M92124j32806q66831m38359K71493J06471j103824j952378
2123C05815078k666064j800892j494028j381063k126966k777828k030428j224977
2115B90312832q66200j0994j352976k473757j619740r67144p48533K0479l14331
$$ plain form
2106 281979636 281334595 281551446 281223027 281160707 279240232 279220689 278778407 278305273 278802286
2097 278802286 278880394 278172670 278658555 279391971 279924484 279547142 278500011 277222430 275450692
2088 275450692 275416480 275862514 275926054 275261128 275265157 275120243 275632202 274967258 274854117 274700137
2078 274700137 275545523 275951288 275706213 276541587 277302649 276846396 277359509 278606494 279485890
2069 279485890 280092251 281074825 281580936 284156339 285962154 286303756 287339358 289073953 290771140
2060 290771140 292839723 293159644 292720045 291709128 291323791 291969177 291810172 291584521 291358970
2051 291358970 291340281 291259197 290430207 288902864 287399386 285850303 284026436 282531440 281850855
2042 281850855 281374130 280413355 279298082 278055721 276384020 275123132 272938899 271935558
$$ packed form
2106B81979636o45041K16851l28419o2320j920475j9543m42282m73134M97013
2097B78802286P8108p07724M85885P33416N32513l77342j047131j277581j771738
2088B75450692l4212M46034O3540o64926M029j44914N11959o64944j13141j53980
2078B74700137Q45386M05765k45075Q35374P61062m56253N13113J246985Q79396
2069B79485890O06361R82574N06111K575403J805815L41602J035602J734595J697187
2060B90771140K068583L19921m39599j010917l85337O45386j59005k25651k25551
2051B91358970j8689q1084q28990j527343j503478j549083j823867j494996o80585
2042B81850855m76725r60775j115273j242361j671701j260888k184233j003341
$$ plain form
2034 271935558 270589384 269827820 269540031 269605387 269029749 268237605 266766717 265717057 265200267
2025 265200267 264233967 261645061 258899277 255564725 253941453 251461472 249143372 247800384
2017 247800384 246612565 244367131 242923897 241799843 240783107 239381174 237001276 234417015
2009 234417015 232879318 229895893 227187317 225563177 223423903 220307954 216823745 214843339
2001 214843339 213068526 209894868 208191591 205994844 202891111 200586056 198515275 196658455
1993 196658455 194711576 193253283 189858119 187768811 185721388 182927771 180205558 176507457
1985 176507457 172936553 170571769 167426685 164924908 162423490 160932126 159037728 157086825
1977 157086825 154855489 153339361 151681110 149805880 147409577 146312301 144427602 143443048
$$ packed form
2034B71935558j346174p61564k87789O5356n75638p92144j470888j049660n16790
2025B65200267r66300k588906k745784l334552j623272k479981k318100j342988
2017B47800384j187819k245434j443234j124054j016736j401933k379898k584261
2009B34417015j537697k983425k708576j624140k139274l115949l484209j980406
2001B14843339j774813l173658j703277k196747l103733k305055k070781j856820
1993A96658455j946879j458293l395164k089308k047423k793617k722213l698101
1985A76507457l570904k364784l145084k501777k501418j491364j894398j950903
1977A57086825k231336j516128j658251j875230k396303j097276j884699r84554
$$ plain form
1969 143443048 142144544 140362635 139673835 138415050 137047404 135617153 134523234 133134122
1961 133134122 131202737 130176856 130015738 128570069 127266369 125497275 125092225 124092301
1953 124092301 122753738 122854510 121890085 121006793 120890128 120403983 118570390 116897653 116956584
1944 116956584 117462817 117006091 115673097 113228533 111950652 111566205 109810877 109129343 107675731
1935 107675731 106732620 105803987 104262728 102581810 101567373 101148036 101485346 100679439 99200382
1926 99200382 98765793 98444582 97445898 96693620 96029207 95844627 96294111 96308015 95686978 95104691
1916 95104691 95651200 94905218 94971763 95409302 95495861 94192958 93939354 93150362 93136530 93520552
1906 93520552 93363298 92597011 92516484 92546577 93090839 92836380 91531986 90558966 90101560 90002272
$$ packed form
1969A43443048j298504j781909o88800j258785j367646j430251j093919j389112
1961A33134122j931385j025881j61118j445669j303700j769094m05050r99924
1953A24092301j338563J00772r64425q83292j16665m86145j833593j672737N8931
1944A16956584N06233m56726j332994k444564j277881l84447j755328o81534j453612
1935A07675731r43111r28633j541259j680918j014437m19337L37310q05907j479057
1926I9200382m34589l21211r98684p52278o64413j84580M49484J3904o21037n82287
1916I5104691N46509p45982O6545M37539Q6559j302903k53604p88992j3832L84022
1906I3520552j57254p66287q0527L0093N44262k54459j304394r73020m57406r9288
$$ plain form
1896 90002272 89967190 90985376 90872041 89932747 89193182 89394469 90145581 89840209 89597871
1887 89597871 90299648 90863426 91505191 90315859 90244624 90069604 90708823 90864515 90061471
1878 90061471 89136922 87672074 87820924 86195079 84503246 84524709 83591895 82755152 81178383
1869 81178383 80995004 80124012 79154627 78494208 77352364 78444688 77995887 76720824 76373988
1860 76373988 76632718 76994373 76739143 77305317 77300005 76966721 77872336 78574434 78675296 78096783
1850 78096783 78816970 79334041 80105796 81123926 81401648 82328564 83354579 84216274 85335897
1841 85335897 87101484 87663815 88471985 89770910 90660157 92454928 94257421 94692370 96522833
1832 96522833 98704062 100158480 103303931 105609966 107991297 110759619 113805173 117693243
$$ packed form
1896I0002272l5082J018186j13335r39294p39565K01287P51112l05372k42338
1887H9597871P01777N63778O41765j189332p1235j75020O39219J55692q03044
1878I0061471r24549j464848J48850j625845j691833K1463r32814q36743j576769
1869H1178383j83379q70992r69385o60419j141844J092324m48801j275063l46836
1860G6373988K58730L61655k55230N66174n312l33284R05615P02098J00862n78513
1850G8096783P20187N17071P71755J018130K77722R26916J026015Q61695J119623
1841H5335897J765587N62331Q08170J298925Q89247J794771J802493M34949J830463
1832I6522833K181229J454418L145451K306035K381331K768322L045554L888070
$$ plain form
1824 117693243 121054397 125826502 130666800 136120126 141050496 146407521 151874402 154630747
1816 154630747 157097651 158589172 160494806 162191900 163950967 165247659 167146962 169695931
1808 169695931 171179883 173251320 176814673 179899851 182229524 184815691 187972812 191351635
1800 191351635 193353027 195395237 198276207 201768591 204213565 206451733 209173505 212456998
1792 212456998 217285376 222057824 227925459 234116161 240888960 248000668 255594469 263266239
1784 263266239 270692571 279833247 290571507 301346640 310939744 320854197 329720531 335912352
1776 335912352 339292855 339803728 337156312 334238872 332227229 329426024 326106640 322590999
1768 322590999 319381223 318898730 318872097 319435275 320774523 322194352 323553324 324636290 325022717
$$ packed form
1824A17693243L361154M772105M840298N453326M930370N357025N466881K756345
1816A54630747K466904J491521J905634J697094J759067J296692J899303K548969
1808A69695931J483952K071437L563353L085178K329673K586167L157121L378823
1800A91351635K001392K042210K880970L492384K444974K238168K721772L283493
1792B12456998M828378M772448N867635O190702O772799P111708P593801P671770
1784B63266239P426332R140676J0738260J0775133R593104R914453Q866334O191821
1776C35912352L380503N10873k647416k917440k011643k801205l319384l515641
1768C22590999l209776m82493k6633N63178J339248J419829J358972J082966L86427
$$ plain form
1759 325022717 324259863 322018626 318185386 315244543 312271123 310381336 309926571 309774261
1751 309774261 309691323 309952177 311735559 314345791 319323578 324392231 328744434 333386697
1743 333386697 338699603 344673459 349462156 353722541 355466532 355296808 353366146 347988013
1735 347988013 341821223 334548471 327152394 319140934 313776864 308599804 303052698 298055657
1727 298055657 292762236 288215165 285165787 283490202 282403780 281276832 280718941 279385416
1719 279385416 276782508 273316295 269424211 264708813 259371842 253597822 248235224 243876704
1711 243876704 238935373 233612782 228787608 225562663 221787045 218965659 216289186 212999210
1703 212999210 211423630 210125856 208296387 207196889 204849733 203928245 203276716 202564597
$$ packed form
1759C25022717p62854k241237l833240k940843k973420j889787m54765j52310
1751C09774261q2938K60854J783382K610232M977787N068653M352203M642263
1743C33386697N312906N973856M788697M260385J743991j69724j930662n378133
1735C47988013o166790p272752p396077q011460n364070n177060n547106m997041
1727B98055657n293421m547071l049378j675585j086422j126948n57891j333525
1719B79385416k602908l466213l892084m715398n336971n774020n362598m358520
1711B43876704m941331n322591m825174l224945l775618k821386k676473l289976
1703B12999210j575580j297774j829469j099498k347156r21488o51529p12119
$$ plain form
1695 202564597 201609388 200735356 199577290 198344974 196725563 195393494 194158993 193349448
1687 193349448 192948985 192044370 192228086 192475467 192820676 192420924 192164375 193469876 194634913
1678 194634913 195945689 196271833 198380796 200491353 202268402 202251037 201757355 200613038 197723164
1669 197723164 194578355 191260545 188538443 186622756 184761953 182886910 181765477 181494622
1661 181494622 180466782 180587570 179770719 179486369 178986702 178296358 178683800 178904606 180449144
1652 180449144 181405091 183104797 184432049 187199864 189524606 190299382 190880579 191797620 191682025
1643 191682025 191524160 190739246 189050797 188319662 188209033 187867697 186050535 185823103 185197926
1634 185197926 184419047 183963247 182915263 181654338 181006394 180128445 178617386 178613250 177976376
$$ packed form
1695B02564597r55209q74032j158066j232316j619411j332069j234501q09545
1687A93349448m00463r04615J83716K47381L45209l99752k56549J305501J165037
1678A94634913J310776L26144K108963K110557J777049j7365m93682j144317k889874
1669A97723164l144809l317810k722102j915687j860803j875043j121433k70855
1661A81494622j027840J20788q16851k84350m99667o90344L87442K20806J544538
1652A80449144R55947J699706J327252K767815K324742P74776N81197R17041j15595
1643A91682025j57865p84914j688449p31135j10629l41336j817162k27432o25177
1634A85197926p78879m55800j047984j260925o47944q77949j511059m136o36874
$$ plain form
1625 177976376 176918827 175105238 174945695 174480134 174693364 175813026 176108835 176272706 177329840
1616 177329840 177466623 178092025 178733013 179037787 180122636 180455765 181303737 182228510 183721095
1607 183721095 183987264 182255549 178778968 173745143 168547017 162501973 156449114 151379377
1599 151379377 146993492 143212496 139638734 135488464 131775445 128211074 125076872 121660010
1591 121660010 117974563 114801124 112106132 109267207 105717665 103693688 101492445 99476962
1583 99476962 96530907 94493425 91913829 89175761 88076564 86399934 85239653 83731240
1575 83731240 81770409 80009748 78797793 77224862 75308499 73858266 72878796 70177606
1567 70177606 69697082 68902274 68080019 67548993 66113799 64479182 63453820 62698141 61613818
$$ packed form
1625A77976376j057549j813589j59543m65561K13230J119662K95809J63871J057134
1616A77329840J36783O25402O40988L04774J084849L33129Q47972R24773J492585
1607A83721095K66169j731715l476581n033825n198126o045044o052859n069737
1599A51379377m385885l780996l573762m150270l713019l564371l134202l416862
1591A21660010l685447l173439k694992k838925l549542k023977k201243k015483
1583I9476962k946055k037482k579596k738068j099197j676630j160281j508413
1575H3731240j960831j760661j211955j572931j916363j450233r79470k701190
1567G0177606m80524p94808q22255n31026j435194j634617j025362p55679j084323
$$ plain form
1558 61613818 60685612 60474088 58791293 58215439 57751594 57177116 56161874 54721305 54835646
1549 54835646 54216550 52814994 51420325 50892365 50365801 50299703 50390394 50113182 49291903
1540 49291903 48723902 47956323 46998736 46201566 45316374 44250207 43910140 43420479 43214629
1531 43214629 43301195 42687013 42682950 42130024 41508822 40526870 39531171 39017753 39525995 38899559
1521 38899559 38201163 37716987 37046263 36717493 35805595 35446182 35483657 35037467 34182323 34672275
1511 34672275 33909785 34180046 33210247 32899262 31563157 30908721 30627198 29890941 29137975
1502 29137975 29017811 29254681 28652378 28709868 28291039 27164117 26730620 26846562 26583576
1493 26583576 26302145 25601944 25487458 24678077 23469183 23766239 23255821 23122689 23047780
$$ packed form
1558F1613818r28206k11524j682795n75854m63845n74478j015242j440569J14341
1549E4835646o19096j401556j394669n27960n26564o6098R0691k77212q21279
1540D9291903n68001p67579r57587p97170q85192j066167l40067m89661k05850
1531D3214629Q6566o14182m063n52926o21202r81952r95699n13418N08242o26436
1521C8899559o98396m84176o70724l28770r11898l59413L7475m46190q55144M89952
1511C4672275p62490K70261r69799l10985j336105o54436k81523p36257p52966
1502B9137975j20164K36870o02303N7490m18829j126922m33497J15942k62986
1493B6583576k81431p00201j14486q09381j208894K97056n10418j33132p4909
$$ plain form
1484 23047780 23062638 23196087 22713607 22442718 21960582 21682052 21837045 22393650 21263299
1475 21263299 19757407 19407880 19711961 19317721 18777090 18765851 18728133 18297303 17140046
1466 17140046 17167216 16510556 16404212 15397448 14462129 14307037 13781175 14009264 13135660
1457 13135660 12745466 12549795 11927533 11752031 10973714 11248326 11546968 11274282 10876929
1448 10876929 9680662 10026205 9631141 9282035 8298500 8160964 8935261 8467899 8405517
1439 8405517 8679284 9023132 8671379 7955981 7524529 6938745 6381595 6758896 6998277 6652809
1429 6652809 6580400 7266026 5811612 5315312 6045708 6276555 6241716 5922431 5559957 5950901
1419 5950901 5464926 4029268 4753554 4651142 4417498 4274569 3710934 4525123 4472809 3831639
$$ packed form
1484B3047780J4858J33449m82480k70889m82136k78530J54993N56605j130351
1475B1263299j505892l49527L04081l94240n40631j1239l7718m30830j157257
1466A7140046K7170o56660j06344j006764r35319j55092n25862K28089q73604
1457A3135660l90194j95671o22262j75502p78317K74612K98642k72686l97353
1448A0876929j196267L45543l95064l49106r83535j37536P74297m67362o2382
1439H405517K73767L43848l51753p15398m31452n85784n57150L77301K39381l45468
1429F652809p2409O85626j454414m96300P30396K30847l4839l19285l62474L90944
1419E950901m85975j435658P24286j02412k33644j42929n63635Q14189n2314o41170
$$ plain form
1409 3831639 4519469 4209283 4626007 4756997 4620727 3986858 3710828 3541519 4034982 4211695
1399 4211695 4946472 4671758 3822331 2925100 2831317 3481674 3827561 2784352 1906189 2432365
1389 2432365 2208799 2732006 3242536 3222202 2483959 2388503 2414118 2443823 2725780 3063797
1379 3063797 3355122 3739590 3285989 3343339 2855600 2374557 1990488 2522372 2807336 2269003
1369 2269003 1596032 1122430 1483544 1935699 2250580 1967940 1787060 2058048 2225779 1675767
1359 1675767 1610706 1732237 1720640 1480804 1500494 2045781 2495296 1897331 1552813 1343480
1349 1343480 1345199 1960196 2588342 2383655 2006688 1725375 1711869 1491645 1729033 1881057
1339 1881057 1759109 1379008 1519761 1028663 459407 1302836 1810987 1296747 1750379 1227416
$$ packed form
1409C831639O87830l10186M16724J30990j36270o33869k76030j69309M93463J76713
1399D211695P34777k74714q49427q97231r3783O50357L45887j043209q78163N26176
1389B432365k23566N23207N10530k0334p38243r5456K5615K9705K81957L38017
1379C063797K91325L84468m53601N7350m87739m81043l84069N31884K84964n38333
1369B269003o72971m73602L61114M52155L14881k82640j80880K70988J67731n50012
1359A675767o5061J21531j1597k39836J9690N45287M49515n97965l44518k09333
1349A343480J719O14997O28146k04687l76967k81313j3506k20224K37388J52024
1339A881057j21948l80101J40753m91098n69256Q43429N08151n14240M53632n22963
$$ plain form
1329 1227416 197406 328480 641161 1407171 1602350 700964 1262231 649446 1184842
1320 1184842 950271 850863 960026 1940305 2409010 1597868 1415370 168248 857449 789835
1310 789835 1061499 1076369 1834547 1574621 1648803 1077664 1278858 2040082 1767901 777029
1300 777029 605597 64080 393760 688213 1766298 1961467 2404475 2660838 2238335 2404186
1290 2404186 1718824 1175760 1072356 1652150 1773829 1111574 685765 398580 81688 458462
1280 458462 428597 1132511 1408921 1022189 250703 -430487 65003 103576 358976 1138996
1270 1138996 466324 459799 123216 57303 974540 1385355 2040102 1273404 834983 845819
1260 845819 519107 943548 521237 420305 1014844 586290 600909 1197777 1132584 809842
$$ packed form
1329A227416j030010J31074L12681P66010J95179r01386N61267o12785N35396
1320A184842k34571r9408J09163R80279M68705q11142j82498j247122O89201o7614
1310G89835K71664J4870P58178k59926P4182n71139K01194P61224k72181r90872
1300G77029j71432n41517L29680K94453J078085J95169M43008K56363m22503J65851
1290B404186o85362n43064j03404N79794J21679o62255m25809k87185l16892L76774
1280D58462k9865P03914K76410l86732p71486o81190M95490L8573K55400P80020
1270A138996o72672o525l36583o5913R17237M10815O54747p66698m38421J0836
1260H45819l26712M24441m22311j00932N94539m28554J4619N96868o5193l22742
$$ plain form
1250 809842 196211 405355 65291 -1024582 527750 1472917 1163053 262044 309224 242177
1240 242177 976914 1072836 796546 624186 675120 -46530 10894 1218776 250108 663957
1230 663957 1035051 770859 713671 119235 -187708 776163 130077 -29978 -24452 -880136
1220 -880136 -309149 1298799 1452510 289775 -61379 821586 -71565 -277144 110487
1211 110487 276954 -123481 -152295 -612495 -532730 653248 183595 -527878 -225095 47894
1201 47894 454803 93502 -19314 -519298 -620416 -587564 -901801 -685094 -464054 305072
1191 305072 -42666 423541 312382 806033 81543 -599654 426927 -359623 48435 68619
1181 68619 177097 1586766 1408494 190798 -49561 247122 326355 887244 741995 -224303
$$ packed form
1250H09842o13631K09144l40064j089873J552332R45167l09864r01009M7180o7047
1240B42177P34737R5922k76290j72360N0934p21650N7424J207882r68668M13849
1230F63957L71094k64192n7188n94436l06943R63871o46086j60055N526q55684
1220h80136N70987J607948J53711j162735l51154Q82965q93151k05579L87631
1211A10487J66467m00435k8814m60200P9765J185978m69653p11473L02783K72989
1201D7894M06909l61301j12816m99984j01118L2852l14237K16707K21040P69126
1191C05072l47738M66207j11159M93651p24490o81197J026581p86550M08058K0184
1181F8619J08478J409669j78272j217696k40359K96683P9233N60889j45249r66298
$$ plain form
1171 -224303 -158696 686476 1478405 633067 394586 182495 -34064 -98270 -271386 478165
1161 478165 794359 1606976 1605016 984255 152702 465834 69223 -149369 22863 -51072
1151 -51072 -25282 -205626 965624 1638254 772342 295767 568780 -173937 -824330 -595348
1141 -595348 63046 894383 108422 -299939 -296139 -161886 -388114 965984 1263612 1056785
1131 1056785 810417 894438 1033117 652591 635353 843410 1523174 641408 887827 1009115
1121 1009115 581018 928294 1372332 1374799 1905606 2165841 1980266 1077666 727671 1458334
1111 1458334 1912805 814759 1063596 1040192 1528172 1284192 1469801 490429 -287526 280076
1101 280076 142059 1087113 1059043 1030211 1088802 1462878 1352148 165708 -154468 1136734
$$ packed form
1171b24303O5607Q45172P91929q45338k38481k12091k16559o4206j73116P49551
1161D78165L16194Q12617j960o20761q31553L13132l96611k18592J72232p3935
1151e1072K5790j80344J171250O72630q65912m76575K73013p42717o50393K28982
1141e95348O58394Q31337p85961m08361L800J34253k26228J354098K97628k06827
1131A056785k46368Q4021J38679l80526j7238K08057O79764q81766K46419J21288
1121A009115m28097L47276M44038K467N30807K60235j85575r02600l49995P30663
1111A458334M54471j098046K48837k3404M87980k43980J85609r79372p77955N67602
1101B80076j38017R45054k8070k8832N8591L74076j10730j186440l20176J291202
$$ plain form
1091 1136734 1662449 1773737 2475442 2430248 2741811 2834971 2493616 2639387 3077571 2826042
1081 2826042 2048719 1518346 1933539 1989364 1304283 1780069 2392325 3253207 3590644 2878084
1071 2878084 2534501 3075619 2969408 2887430 3034554 2935561 2978708 4448261 4641974 4250268
1061 4250268 3659062 3836221 3782204 3656632 3634836 4284376 5201983 5639454 5700852 7240435
1051 7240435 6958257 7200687 7569557 8346830 9572020 8692468 8508135 8374586 8796875
1042 8796875 9096135 9873890 10736831 11453579 12200491 12198590 11923300 12084799 13012509 13097591
1032 13097591 13560532 14533139 15708845 15982641 16018286 16437175 16459718 17501880 18468119
1023 18468119 19673051 20396551 21598635 22026075 22253862 23435999 24410482 25764863 28047761
$$ packed form
1091A136734N25715J11288P01705m5194L11563R3160l41355J45771M38184k51529
1081B826042p77323n30373M15193N5825o85081M75786O12256Q60882L37437p12560
1071B878084l43583N41118j06211q1978J47124r8993M3147J469553J93713l91706
1061D250268n91206J77159n4017j25572k1796O49540R17607M37471O1398J539583
1051G240435k82178K42430L68870P77273J225190q79552j84333j33549M22289
1042H796875K99260P77755Q62941P16748P46912j901k75290J61499R27710Q5082
1032A3097591M62941R72607J175706K73796L5645M18889K2543J042162R66239
1023A8468119J204932P23500J202084M27440K27787J182137R74483J354381K282898
$$ plain form
1014 28047761 29096923 31108491 33283815 35718032 38302147 41899450 44167919 44907607
1006 44907607 44590543 43380290 42441494 42225303 41665662 40417385 39297279 40011679 40169273
997 40169273 39968109 40331629 40986544 41330707 41845260 42321726 43017177 42952390 42185780 42115969
987 42115969 41562841 41067228 40772579 41855666 40961216 40830419 40651647 41435787 43204090
978 43204090 44291906 46071907 48362553 49795445 51457010 52804494 53841861 54653527
970 54653527 54834546 55069842 53350826 53090421 50831294 47826320 45530205 43775245 42536132
961 42536132 42174455 42158184 40932648 39388449 39174457 39205876 38368905 38257201 39136646 39601134
951 39601134 39205594 38886338 37760813 35446045 34294327 33432327 33115943 32844008 31433962
$$ packed form
1014B8047761J049162K011568K175324K434217K584115L597303K268469P39688
1006D4907607l17064j210253r38796k16191n59641j248277j120106P14400J57594
997D0169273k01164L63520O54915L44163N14553M76466O95451o4787p66610o9811
987D2115969n53128m95613k94649J083087q94450j30797j78772P84140J768303
978D3204090J087816J780001K290646J432892J661565J347484J037367Q11666
970E4653527J81019K35296j719016k60405k259127l004974k296115j754960j239113
961D2536132l61677j6271j225536j544199k13992L1419q36971j11704Q79445M64488
951C9601134l95540l19256j125525k314768j151718q62000l16384k71935j410046
$$ plain form
942 31433962 30573611 29691010 30310708 28754093 27292358 26439576 26623798 26626074 26428705 25767879
932 25767879 24878239 24895751 25291883 25181080 25199372 25310232 25016241 25078001 25134147 25000850
922 25000850 24908913 23729021 23381541 23346483 22709505 22558970 22860432 22166810 21865878 22018919
912 22018919 22053698 21886778 22083331 22349587 22782522 22359589 23185554 24164628 24464323 24386816
902 24386816 23949657 23143678 21618046 20623025 21338579 19713909 19587327 19437164 17972238
893 17972238 19344611 18758819 18435797 17327741 17102862 17537338 18324155 18445136 18902317
884 18902317 18636753 18084255 17539293 17742038 18151422 18871163 20188056 20861171 21937981
875 21937981 22575374 22862700 23166907 23435312 23646987 23619661 23400256 22935426 22703594 22514741
$$ packed form
942C1433962q60351q82601O19698j556615j461735q52782J84222K276j97369o60826
932B5767879q89640J7512L96132j10803J8292J10860k93991O1760N6146j33297
922B5000850r1937j179892l47480l5058o36978j50535L01462o93622l00932J53041
912B2018919L4779j66920J96553K66256M32935m22933Q25965R79074K99695p7507
902B4386816m37159q05979j525632r95021P15554j624670j26582j50163j464926
893A7972238J372373n85792l23022j108056k24879M34476P86817J20981M57181
884A8902317k65564n52498n44962K02745M09384P19741J316893O73115J076810
875B1937981O37393K87326L04207K68405K11675k7326k19405m64830k31832j88853
$$ plain form
865 22514741 22824121 23157642 24180171 23906733 23596424 22762685 22904512 23247976 23052005
856 23052005 23192261 23707926 23742556 23086419 23095678 24018166 24863000 24914216 25275070 25714457
846 25714457 25350879 24918877 24959853 25958861 26676774 26585800 26718310 28215712 28642452 28025269
836 28025269 26803698 24862561 23168985 22071415 21465743 21141354 20703418 20729514 19557044
827 19557044 18398043 18207303 17348469 16869836 16062089 15103075 15221328 15337619 14774815
818 14774815 14871315 14586603 14412730 12938161 13182795 13066842 11765677 11056594 10279459
809 10279459 10433230 10961193 10642791 9927225 9602991 9275708 9227790 9099400 9201937 8896290
799 8896290 8487096 7966334 7631332 7863504 8344128 7831748 7053730 7385939 7161218 7493604
$$ packed form
865B2514741L09380L33521J022529k73438l10309q33739J41827L43464j95971
856B3052005J40256N15665L4630o56137R259R22488Q44834N1216L60854M39387
846B5714457l63578m32002M0976R99008P17913r0974J32510J497402M26740o17183
836B8025269j221571j941137j693576j097570o05672l24389m37936K6096j172470
827A9557044j159001j90740q58834m78633q07747r59014J18253J16291n62804
818A4774815R6500k84712j73873j474569K44634j15953j301165p09083p77135
809A0279459J53771N27963l18402p15566l24234l27283m7918j28390J02537l05647
799H896290m09194n20762l35002K32172M80624n12380p78018L32209k24721L32386
$$ plain form
789 7493604 7219716 7344646 7289039 7283068 7103967 5665745 5365180 5662727 5751406 6464644
779 6464644 5996424 5871661 5491312 5580088 5300344 5378664 5398983 5864514 5575619 5217250
769 5217250 5484013 5768424 6091986 6110580 6690197 5877753 5525067 6110323 5245834 4930564
759 4930564 5237424 4592401 4288208 4331988 4574039 5380309 5258270 5256929 4679811 4836679
749 4836679 5264571 4565362 4416910 3590885 4026746 3281157 3492475 3306356 2353766 2892420
739 2892420 3421351 3861780 3475796 3717729 3220894 2910888 3062678 3572353 3808548 2755889
729 2755889 3530767 2901900 2326226 1978536 2698588 3016882 3038937 3513847 3175250 2517850
719 2517850 2364030 2983818 2743663 2720256 2182854 2591784 1909722 1611258 2511372 1638607
$$ packed form
789G493604k73888J24930n5607n971j79101j438222l00565K97547Q8679P13238
779F464644m68220j24763l80349Q8776k79744P8320K0319M65531k88895l58369
769E217250K66763K84411L23562J8594N79617q12444l52686N85256q64489l15270
759D930564L06860o45023l04193M3780K42051Q06270j22039j341n77118J56868
749D836679M27892o99209j48452q26025M35861p45589K11318j86119r52590N38654
739B892420N28931M40429l85984K41933m96835l10006J51790N09675K36195j052659
729B755889P74878o28867n75674l47690P20052L18294K2055M74910l38597o57400
719B517850j53820O19788k40155k3407n37402M08930o82062k98464R00114q72765
$$ plain form
709 1638607 1764848 2153793 2406511 3062020 2512299 2987428 2991167 2736484 2457475 2562161
699 2562161 2222767 2375231 2061703 1671762 1444529 658000 1289452 1361207 1496217 320646
689 320646 389319 855495 1178896 1920112 1263449 -103355 591193 612173 -232473 451562
679 451562 363963 816802 1142901 498115 426868 714643 333299 516007 532250 638247
669 638247 649953 1051824 1584752 979316 1395356 818824 -64990 264379 547401 1031976
659 1031976 375660 322020 708569 1017378 239378 -28254 398665 -164305 -632138 -634737
649 -634737 -150091 29459 21806 -546058 -98595 -445857 -172605 -190672 -393331 -117505
639 -117505 40169 7747 432506 34657 253819 539897 1109966 55068 -653073 -525801
$$ packed form
709A638607J26241L88945K52718O55509n49721M75129L739k54683k79009J04686
699B562161l39394J52464l13528l89941k27233p86529O31452P1755J35010j175571
689C20646O8673M66176L23401P41216o56663j366804O94548K0980q44646O84035
679D51562q7599M52839L26099o44786p1247K87775l81344J82708J6243J05997
669F38247J1706M01871N32928o05436M16040n76532q83814L29369K83022M84575
659A031976o56316n3640L86549L08809p78000k67632M26919n62970m67833k599
649f34737M84646J79550p653n67864M47463l47262K73252j8067k02659K75826
639a17505J57674l2422M24759l97849K19162K86078N70069j054898p08141J27272
$$ plain form
629 -525801 -499329 -222757 20751 445459 -684473 108793 -555352 -350609 -431272 247847
619 247847 13372 47479 28011 -1061101 477841 -63606 -724695 -964214 173880 116933
609 116933 40436 103940 581007 472318 855719 269828 124657 326187 -878996 -1033549
599 -1033549 -87187 -171186 -18558 505 -828303 -284878 157060 278780 128625 376413
589 376413 -115101 -132435 185492 245406 597336 1026768 -6457 -343579 -327338 694949
579 694949 -32965 141928 -16357 -509979 -862865 -436080 602321 353800 -533726 -630073
569 -630073 101427 355113 385904 345501 646397 45850 122603 -669397 -882263 -970904 -464716
558 -464716 -259680 -1968979 -1288115 -914288 -547578 -165166 -344565 -479885 -318249 -892001
$$ packed form
629e25801K6472K76572K43508M24708j129932P93266o64145K04743q0663O79119
619B47847k34475L4107j9468j089112J538942n41447o61089k39519J138094n6947
609A16933p6497O3504M77067j08689L83401n85891j45171K01530j205183j54553
599a033549R46362q3999J52628J9063q28808N43425M41938J21720j50155K47788
589C76413m91514j7334L17927N9914L51930M29432j033225l37122J6241J022287
579F94949p27914J74893j58285m93622l52886M26785J038401k48521q87526r6347
569f30073P31500K53686L0791m0403L00896o00547P6753p92000k12866q8641N06188
558d64716K05036j709299O80864L73827L66710L82412j79399j35320J61636n73752
$$ plain form
548 -892001 -990022 -908545 -460290 47090 -235559 35361 251515 94510 446030 97758
538 97758 413006 559738 -395387 -776815 -310397 -330261 -1109833 -1178451 -176500 699811
528 699811 138688 446074 902921 -235755 -382022 133750 -226949 -49488 -410196 -269354
518 -269354 138104 148720 -835546 -603521 -43892 -102882 -302861 -404349 -467892 -1372559
508 -1372559 -943224 -1349302 -411359 393848 -177272 -440493 -155249 -596242 -565833 351157
498 351157 535547 282447 -325827 -319229 974006 981469 -250860 -356201 105133 124974
488 124974 -3326 -1351482 -937563 111389 369837 1034606 215642 -733821 -1374654 -1473352
478 -1473352 -1746910 -783336 764996 1206294 777045 204675 -1245382 395138 731944
$$ packed form
548h92001r8021Q1477M48255N07380k82649K70920K16154j57005L51520l48272
538I7758L15248J46732r55125l81428M66418j9864p79572o8618J001951Q76311
528F99811n61123L07386M56847j138676j46267N15772l60699J77461l60708J40842
518b69354M07458J0616r84266K32025N59629n8990j99979j01488o3543r04667
508a372559M29335m06078R37943Q05207n71120k63221K85244m40993L0409R16990
498C51157J84390k53100o08274O598J293235P463j232329j05341M61334J9841
488A24974j28300j348156M13919J048952K58448O64769q18964r49463o40833r8698
478a473352k73558R63574J548332M41298m29249n72370j450057J640520L36806
$$ plain form
469 731944 325673 17381 35480 -226219 -120362 804237 512479 266789 -637987 -142472
459 -142472 -28405 235663 452954 -895883 -58983 -54086 -4367 -57697 -273340 -1167531
449 -1167531 -953484 -466895 60321 89681 -196757 25770 682068 -542033 -1054271 -90583
439 -90583 418883 607392 -516468 -510324 -715809 -399951 -46929 -793124 -148611 503924
429 503924 181895 -799123 -1309474 -232393 -56860 440544 687966 -242154 -1036847 -405600
419 -405600 -530519 -1042768 -1097459 -1106875 -421461 -21316 -1220720 -681292 -90353 44343
409 44343 302278 411299 276428 -449407 -532283 -1138781 -432059 472748 298754 451725
399 451725 -294219 -617107 -912113 -343608 481588 305380 77511 -116022 -527628 -895285
$$ packed form
469G31944m06271l08292J8099k61699J05857R24599k91758k45690r04776M95515
459a42472J14067K64068K17291j348837Q36900M897M9719n3330k15643q94191
449a167531K14047M86589N27216K9360k86438K22527O56298j224101n12238R63688
439i0583N09466J88509j123860O144k05485L15858L53022p46195O44513O52535
429E03924l22029r81018n10351J077081J75533M97404K47422r30120p94693O31247
419d05600j24919n12249n4691r416O85414M00145j199404N39428N90939J34696
409D4343K57935J09021j34871p25835q2876o06498P06722R04807j73994J52971
399D51725p45944l22888k95006N68505Q25196j76208k27869j93533m11606l67657
$$ plain form
389 -895285 -643408 688812 729339 202787 295733 -299219 -452537 -154481 -717176 -774720
379 -774720 -1254938 -803875 111255 260007 547107 410022 192275 -120063 -107468 -408901
369 -408901 77544 -501799 -1022520 -124383 -154337 -391477 -108395 490064 -227507 113383
359 113383 395394 -197166 -300795 -272765 -290893 -899005 -740773 -95568 -210743 -472756
349 -472756 -400500 709670 395051 -194891 366900 76616 -637656 -88664 -103859 -413225
339 -413225 36647 86619 808726 333592 -206979 -484432 98993 1128163 499451 -300806
329 -300806 -890251 -294228 5654 843216 440601 -444427 -398749 412505 743128 175709
319 175709 -325983 -752140 -650959 -232532 -1158355 -1590760 -1125692 -1388186 -1746654 -1121973
$$ packed form
389h95285K51877J332220M0527n26552R2946n94952j53318K98056n62695n7544
379g74720m80218M51063R15130J48752K87100j37085k17747l12338J2595l01433
369d08901M86445n79343n20721Q98137k9954k37140K83082N98459p17571L40890
359A13383K82011n92560j03629K8030j8128o08112J58232O45205j15175k62013
349d72756P2256J110170l14619n89942N61791k90284p14272N48992j5195l09366
339d13225M49872M9972P22107m75134n40571k77453N83425J029170o28712q00257
329c00806n89445N96023K99882Q37562m02615q85028M5678Q11254L30623n67419
319A75709n01692m26157J01181M18427r25823m32405M65068k62494l58468O24681
$$ plain form
309 -1121973 150716 -195781 -1052674 270418 779704 -222230 -579077 -683182 -852358
300 -852358 -571668 -149938 -152355 -325089 -604160 -256697 -476228 -298870 -393065 -135970
290 -135970 -230689 -675409 -1366080 -188045 800347 -98738 -744839 -759170 -601741 49948
280 49948 686948 675462 282949 167984 -383360 283235 -6858 -558982 43465 -750492
270 -750492 -1367650 -1172546 -57887 513268 -875859 -607333 -410496 -278331 -598101 -1152040
260 -1152040 -747337 -391105 -804859 -428888 -263042 -184442 -974772 -927327 -774960 -686424
250 -686424 -1063599 -696440 -708755 -155135 -1834 -1246736 -1291932 -581682 -114062 38066
240 38066 21293 189813 584358 239672 -671784 -1174360 12683 748913 806725 -649134
$$ packed form
309a121973J272689l46497q56893J323092N09286j001934l56847j04105j69176
300h52358K80690M21730k417j72734k79071L47463k19531J77358r4195K57095
290a35970r4719m44720o90671J178035R88392q99085o46101j4331J57429O51689
280D9948O37000j1486l92513j14965n51344O66595k90093n52124O02447p93957
270g50492o17158J95104J114659N71155j389127K68526J96837J32165l19770n53939
260a152040M04703L56232m13754L75971J65846P8600p90330M7445J52367Q8536
250f86424l77175L67159j2315N53620J53301j244902m5196P10250M67620J52128
240C8066j6773J68520L94545l44686r11456n02576J187043P36230N7812j455859
$$ plain form
230 -649134 -283095 -27429 87876 -783009 -891720 -262758 -215501 308258 228966 -1039964
220 -1039964 -812642 -1172520 -673478 -193953 -694214 -434773 -55192 217276 334670 -93655
210 -93655 -587531 -482379 -159303 -780886 -956070 -1171606 -568594 -154165 -1083582 -1075022
200 -1075022 651893 144534 427283 663978 266575 -653546 -674952 -959035 -573073 -619377
190 -619377 -1451732 -622904 -877474 179776 -585431 -541536 -416874 -57324 173302 -258013
180 -258013 -187222 -144555 -894141 -826959 -1053398 -118559 -135840 -620393 -1332859 -1267620 -280785
169 -280785 306075 84960 -972560 -299550 -304987 -1273479 -1016976 -455113 -290335 -352984
159 -352984 -745487 -670718 -307497 -896114 -337365 -542857 -1230685 -1589599 -1173959 -604529
$$ packed form
230f49134L66039K55666J15305q70885j08711O28962M7257N23759p9292j268930
220a039964K27322l59878M99042M79525n00261K59441L79581K72468J17394m28325
210i3655m93876J05152L23076o21583j75184k15536O03012M14429r29417Q560
200a075022J726915n07359K82749K36695l97403r20121k1406k84083L85962m6304
190f19377q32355Q28828k54570J057250p65207M3895J24662L59550K30626m31315
180b58013P0791M2667p49586O7182k26439R34839j7281m84553p12466O5239R86835
169b80785N86860k21115j057520O73010n437r68492K56503N61863J64778o2649
159c52984l92503P4769L63221n88617N58749k05492o87828l58914M15640N69430
$$ plain form
149 -604529 -834928 -654306 -631639 134815 -753066 -860580 -1405031 -938829 -965856 -949721
139 -949721 -257178 -645552 -542830 -736947 94171 149876 8665 -785427 -337107 -714055
129 -714055 -1127998 -420552 -840751 218492 -167552 -374230 -1053013 -1150887 -1456890 -1322589
119 -1322589 -531716 -640369 -555104 -217108 -685542 -292021 -346347 -466331 -1283444 -1464801
109 -1464801 -383122 -766066 -698221 -696006 -38791 -1508492 -1405177 -1278668 -1223703 -598887
99 -598887 -656001 -510536 103572 -155488 560499 644140 332731 -110794 -585754 -14777
89 -14777 -345162 -291851 -54908 -561546 -411193 -270234 -382491 -688220 -735660 -679826 -1364827
78 -1364827 -1252854 -1019591 -476907 -1171066 -965563 -794733 -410412 -504248 -577703 -781552
$$ packed form
149f04529k30399J80622K2667P66454q87881j07514n44451M66202k7027J6135
139i49721O92543l88374J02722j94117Q31118N5705j41211p94092M48320l76948
129g14055m13943P07446m20199J059243l86044k06678o78783r7874l06003J34301
119a322589P90873j08653Q5265L37996m68434L93521n4326j19984q17113j81357
109a464801J081679l82944O7845K215O57215j469701J03315J26509N4965O24816
99e98887n7114J45465O14108k59060P15987Q3641l11409m43525m74960N70977
89a4777l30385N3311K36943n06638J50353J40959j12257l05729m7440N5834o85001
78a364827J11973K33263N42684o94159K05503J70830L84321r3836p3455k03849
$$ plain form
68 -781552 -884010 -1229325 -1165527 -844626 -674058 -1489498 -1060059 -354457 -866334 -1064324
58 -1064324 -629414 -670084 -1047477 -1538657 -1348606 -759092 -1094040 -1035010 -732625 -421995
48 -421995 -623329 -500534 -1524450 -1516121 -833138 -735268 -1040635 -1069713 -618491 -424429 -370749
37 -370749 -301607 -505026 -700183 -963383 -743931 -927387 -933781 -1487755 -1282451 -736823 -1254424
26 -1254424 -1296413 -1016687 -1310069 -872020 -331067 -411156 -112841 -392382 -289790 -75371
16 -75371 -329542 -818239 -926500 -873548 -1156952 -1203602 -1312357 -1042233 -946311 -954758 -1175043
5 -1175043 -1205964 -1042433 -1182206 -419360 -215118
0 -215118
$$ packed form
68g81552j02458l45315O3798L20901J70568q15440M29439P05602n11877j97990
58a064324M34910m0670l77393m91180J90051N89514l34948N9030L02385L10630
48d21995k01334J22795j023916Q329O82983R7870l05367k9078M51222J94062N3680
37c70749O9142k03419j95157k63200K19452j83456o394n53974K05304N45628n17601
26a254424m1989K79726k93382M38049N40953q0089K98315k79541J02592K14419
16g5371k54171m88697j08261N2952k83404m6650j08755K70124R5922q447k20285
5a175043l0921J63531j39773P62846K04242
0b15118
$$ Imaginary data points
##PAGE= N=2
##DATA TABLE= (X++(I..I)), XYDATA
$$ plain form
16383 -21460233 -21197073 -20584960 -20323310 -20233742 -20299511 -20270502 -20083436 -19603159 -19066908 -19658585
16373 -19658585 -19594908 -18802047 -18448572 -18574382 -18121279 -17980085 -18085967 -17118039 -16236934
16364 -16236934 -16447841 -16330981 -16544710 -16303514 -16013987 -15968122 -16052775 -15515877 -15173102 -15093101
16354 -15093101 -14213616 -14140241 -14103726 -14317809 -14177650 -13945516 -13904332 -13261618 -13750961 -13061754
16344 -13061754 -12374070 -12146975 -12046570 -11672126 -11128297 -11165844 -11198257 -11210195 -11513260 -10521993
16334 -10521993 -10195862 -10383116 -10786193 -10681783 -10802663 -10478041 -9791832 -8963690 -8790908
16325 -8790908 -9000533 -8998964 -8298887 -8056393 -8125392 -7702060 -7953603 -7605720 -7363327 -6820661
16315 -6820661 -6381079 -6940759 -7111854 -6587581 -6535587 -6588735 -5604368 -4961599 -5576056 -5357421
$$ packed form
16383b1460233K63160O12113K61650Q9568o5769K9009J87066M80277N36251n91677
16373a9658585O3677P92861L53475j25810M53103J41194j05882R67928Q81105
16364a6236934k10907J16860k13729K41196K89527M5865q4653N36898L42775Q0001
16354a5093101Q79485P3375L6515k14083J40159K32134M1184O42714m89343O89207
16344a3061754O87684K27095J00405L74444N43829l7547l2413j1938l03065R91267
16334a0521993L26131j87254m03077J04410j20880L24622O86209Q28142J72782
16325h790908k09625J569P00077K42494o8999M23332k51543L47883K42393N42666
16315f820661M39582n59680j71095N24273N1994n3148R84367O42769o14457K18635
$$ plain form
16305 -5357421 -5020021 -5017140 -5063703 -4345816 -4060777 -3838735 -3146661 -3020117 -3049252 -3316356
16295 -3316356 -3742215 -3052127 -2270920 -2345945 -1852776 -2202496 -2764781 -2233387 -2680624 -2742072
16285 -2742072 -2868958 -2145168 -1666068 -864301 -1524359 -2130861 -913106 -850739 -1409697
16276 -1409697 -636316 -273922 -3730 422319 57140 1003837 1310916 753284 607802
16267 607802 608173 1286793 1719909 1985127 1583508 1567439 955292 940243 1643044 1696402 2262872
16256 2262872 2970781 2452134 3081965 4017941 4064754 3785612 3911730 3820395 3453777 4271277
16246 4271277 4642189 4130920 4530673 4309615 4017412 4799398 4764216 4267970 4337363 4873577
16236 4873577 5641573 5561649 5767845 5636050 6140528 6568796 6180615 6555625 6296302 6211009
$$ packed form
16305e357421L37400K881m6563P17887K85039K22042O92074J26544k9135k67104
16295c316356m25859O90088P81207p5025M93169l49720n62285N31394m47237o1448
16285b742072j26886P23790M79100Q01767o60058o06502J217755O2367n58958
16276a409697P73381L62394K70192M26049l65179R46697L07079n57632j45482
16267F07802L71O78620M33116K65218m01619j6069o12147j5049P02801N3358N66470
16256B262872P07909n18647O29831R35976M6813k79142J26118r1335l66618Q17500
16246D271277L70912n11269L99753k21058k92203P81986l5182m96246O9393N36214
16236D873577P67996p9924K06196j31795N04478M28268l88181L75010k59323q5293
$$ plain form
16226 6211009 6349803 5673095 5594573 6293020 6816443 6965416 6599724 6602493 6383913 6146304
16216 6146304 6184715 6767536 6415010 6118423 6576447 6764951 6694254 6906958 7130322 7267384
16206 7267384 8027098 8030488 6930850 7294333 7613222 7502783 8328222 8676302 7904283 8169817
16196 8169817 8068830 9327972 8932188 8540039 8754969 8797237 8470688 8349122 9301536
16187 9301536 9065969 8848476 9184141 8573781 8484512 8973489 8834543 8269794 9184959 9417044
16177 9417044 9276078 9028839 9448298 9302681 9186105 9887923 9554786 9392395 9143188
16168 9143188 9437304 10187426 9986262 9817152 10554371 10492662 10591322 9439233 9217829 9635277
16158 9635277 10438528 10936316 11048466 12121340 11222866 10417099 10255960 10655650 11125665
$$ packed form
16226F211009J38794o76708p8522O98447N23423J48973l65692K769k18580k37609
16216F146304L8411N82821l52526k96587M58024J88504p0697K12704K23364J37062
16206G267384P59714L390j099638L63483L18889j10439Q25439L48080p72019K65534
16196H169817j00987J259142l95784l92149K14930M2268l26549j21566R52414
16187I301536k35567k17493L35665o10360q9269M88977j38946n64749R15165K32085
16177I417044j40966k47239M19459j45617j16576P01818l33137j62391k49207
16168I143188K94116P50122k01164j69110P37219o1709R8660j152089k21404M17448
16158I635277Q03251M97788J12150J072874q98474q05767j61139L99690M70015
$$ plain form
16149 11125665 10877331 11326362 11078513 10328236 9747038 10327994 11196800 11247259 11410682
16140 11410682 12260414 11788431 12385810 12332265 12542192 12768690 11559415 10719856 10683357
16131 10683357 11825433 11957589 11762713 11664580 11420334 12396830 12229569 11610933 12230441
16122 12230441 12086610 11597706 11672859 11521434 10752838 11165749 12510000 12196212 11795433
16113 11795433 11913423 12042322 12798798 13230521 12957433 12642028 11583762 11121455 12260223
16104 12260223 11319745 10365015 11354569 11467447 10797561 12023675 12347166 12155774 12473719
16095 12473719 12076790 13117832 13119156 12417592 12473689 11968127 11270045 12126020 12310822 12287528
16085 12287528 12636034 12526273 12368077 12534888 12777765 12994949 13653065 12513656 11789170
$$ packed form
16149A1125665k48334M49031k47849p50277n81198N80956Q68806N0459J63423
16140A1410682Q49732m71983N97379n3545K09927K26498j209275q39559l6499
16131A0683357J142076J32156j94876r8133k44246R76496j67261o18636O19508
16122A2230441j43831m88904P5153j51425p68596M12911J344251l13788m00779
16113A1795433J17990J28899P56476M31723k73088l15405j058266m62307J138768
16104A2260223r40478r54730R89554J12878o69886J226114L23491j91392L17945
16095A2473719l96929J041042J324p01564N6097n05562o98082Q55975J84802k3294
16085A2287528L48506j09761j58196J66811K42877K17184O58116j139409p24486
$$ plain form
16076 11789170 12247858 12091963 11140077 11228674 11541497 12019200 12463805 12710444 13210290
16067 13210290 12995750 12936647 13023591 13037289 12262305 12638494 12054235 11766976 11587743 11333456
16057 11333456 11854001 12031712 12632992 12910880 12479321 12390138 12319381 12010580 12314972 12638109
16047 12638109 12429503 12998133 13194646 12939622 13138186 12973645 12900159 11994932 12004082 12578235
16037 12578235 12668994 13348110 12952523 13196866 12693937 12561871 12905052 12791350 13059347
16028 13059347 12351919 13341063 13409097 13009822 12235737 12349997 12503532 12308399 12352612 12684276
16018 12684276 13077664 12549522 12768271 12593413 12318496 12326257 12829690 13225427 11691427
16009 11691427 11528558 12439539 12325568 12808135 13472832 13943221 13334014 12139204 12604487
$$ packed form
16076A1789170M58688j55895r51886Q8597L12823M77703M44605K46639M99846
16067A3210290k14540n9103Q6944J3698p74984L76189n84259k87259j79233k54287
16057A1333456N20545J77711O01280K77888m31559q9183p0757l08801L04392L23137
16047A2638109k08606N68630J96513k55024J98564j64541p3486r05227R150N74153
16037A2578235R0759O79116l95587K44343n02929j32066L43181j13702K67997
16028A3059347p07428R89144O8034l99275p74085J14260J53535j95133M4213L31664
16018A2684276L93388n28142K18749j74858k74917P761N03433L95737j534000
16009A1691427j62869R10981j13971M82567O64697M70389o09207j194810M65283
$$ plain form
16000 12604487 13575247 13331111 12863944 12894329 13279712 13303445 14000632 14321508 13373341 12868013
15990 12868013 12685622 12862777 13173445 13127496 12305421 12769282 12647319 12197949 11608401
15981 11608401 11847440 11823330 12097643 12229984 12590844 12803623 12387218 12376800 12082515 12290885
15971 12290885 11965924 12150427 12089255 12413632 12013049 12012898 11955748 11418277 12726252 13272700
15961 13272700 12528276 12421985 13082082 13151926 12241398 12473957 13509041 13302647 12843700
15952 12843700 12586092 12210437 12165166 12250240 12439227 12294216 12269103 12526945 12611711 12910304
15942 12910304 13429026 13435998 13189979 13012687 12695727 12582437 12716698 13161369 12602287 12727320
15932 12727320 12872343 12763323 11695631 12135207 12578217 12270396 12714325 12662659 12824806
$$ packed form
16000A2604487R70760k44136m67167L0385L85383K3733O97187L20876r48167n05328
15990A2868013j82391J77155L10668m5949q22075M63861j21963m49370n89548
15981A1608401K39039k4110K74313J32341L60860K12779m16405j0418k94285K08370
15971A2290885l24961J84503o1172L24377m00583j51n7150n37471J307975N46448
15961A3272700p44424j06291O60097O9844r10528K32559J035084k06394m58947
15952A2843700k57608l75655m5271Q5074J88987j45011k5113K57842Q4766K98593
15942A2910304N18722O972k46019j77292l16960j13290J34261M44671n59082J25033
15932A2727320J45023j09020j067692M39576M43010l07821M43929n1666J62147
$$ plain form
15923 12824806 13497828 12776476 11896691 12480814 12326045 13005269 13332455 13515659 12584861
$$ packed form
15923A2824806O73022p21352q79785N84123j54769O79224L27186J83204r30798
$$ [...]
##END NTUPLES=NMR SPECTRUM
##END=
