##TITLE=1H_CG-1142-x
 DMSO,8 sc, 
 12.03.2021
##JCAMPDX= 6.0         $$ Bruker NMR JCAMP-DX V2.0
##DATA TYPE= NMR SPECTRUM
##DATA CLASS= NTUPLES
##ORIGIN= UXNMR, Bruker Analytische Messtechnik GmbH
##OWNER= root
$$ XWIN-NMR		Version 3.5
$$ Fri Mar 12 11:18:46 2021 Russian Standard Time (UT+4h)  she@DPX200
##.OBSERVE FREQUENCY= 200.131506
##.OBSERVE NUCLEUS= ^1H
##.ACQUISITION MODE= SIMULTANEOUS
##.ACQUISITION SCHEME= undefined
##.AVERAGES= 8
##.DIGITISER RES= 18
##SPECTROMETER/DATA SYSTEM= spect
##.PULSE SEQUENCE= zg30
##.SOLVENT NAME= DMSO
##.SHIFT REFERENCE= (INTERNAL, DMSO, 0, 15.9958)
##AUDIT TRAIL= $$ (NUMBER, WHEN, WHO, WHERE, WHAT)
$$ ##TITLE= Audit trail, XWIN-NMR		Version 3.5
$$ ##JCAMPDX= 5.01
$$ ##ORIGIN= Bruker BioSpin GmbH
$$ ##OWNER= she
$$ F:/spectra/data/she/nmr/H-F/1/pdata/1/auditp.txt
$$ ##AUDIT TRAIL=  $$ (NUMBER, WHEN, WHO, WHERE, WHAT)
(   1,<2021-03-12 11:17:32.15 +0400>,<she>,<DPX200>,
      <created by zg, POWCHK disabled, PULCHK disabled
       configuration hash MD5:
       00 E9 B6 7A A2 85 ED C7 34 08 36 98 17 FE 4E 26
       data hash MD5: 16K
       B9 AD 75 E2 6D A7 84 B9 1D 29 FF 3B 12 B3 DC 7C>)
(   2,<2021-03-12 11:17:35.37 +0400>,<she>,<DPX200>,
      <Start of raw data processing
       efp BC_mod = 2 LB = 0.24 FT_mod = 6 PKNL = 1 PHC0 = -11117.18 PHC1 = 10.00094 SI = 16K 
       data hash MD5: 16K
       86 6A 49 F1 93 2F E3 9C E5 4D B8 78 D1 56 C6 89>)
(   3,<2021-03-12 11:17:57.93 +0400>,<she>,<DPX200>,
      <pk PHC0 = -5.456096 PHC1 = 1.8 
       data hash MD5: 16K
       A7 4B F6 C9 82 85 6A FE A9 D6 B6 98 F7 19 3B 09>)
(   4,<2021-03-12 11:18:01.37 +0400>,<she>,<DPX200>,
      <abs ABSG = 5 
       data hash MD5: 16K
       27 ED 5F 86 2F 48 28 58 3A C2 DE 96 00 D3 42 B6>)
$$ ##END=
$$ 
$$ hash MD5
$$ 39 7F A8 07 86 94 48 E9 0A A0 46 9E 1E E2 F1 2A
##$RELAX= 
##$RELAX= 
##$RELAX= 
##$RELAX= 
##$RELAX= 
##$RELAX= 
$$ Bruker specific parameters
$$ --------------------------
##$DU= <F:/spectra>
##$EXPNO= 1
##$NAME= <H-F>
##$PROCNO= 1
##$TYPE= <nmr>
##$USER= <she>
##$AMP= (0..31)
100 100 100 100 100 100 100 100 100 100 100 100 100 100 100 100 100 100 
100 100 100 100 100 100 100 100 100 100 100 100 100 100 
##$AQSEQ= 0
##$AQ_mod= 1
##$AUNM= <au_zg>
##$AUTOPOS= <>
##$BF1= 200.13
##$BF2= 200.13
##$BF3= 200.13
##$BF4= 200.13
##$BF5= 200.13
##$BF6= 200.13
##$BF7= 200.13
##$BF8= 200.13
##$BYTORDA= 1
##$CFDGTYP= 0
##$CFRGTYP= 5
##$CHEMSTR= <none>
##$CNST= (0..31)
1 1 145 1 1 1 1 1 1 1 1 1 1 1 1 1 1 1 1 1 1 1 1 1 1 1 1 1 1 1 1 1 
##$CPDPRG= <>
##$CPDPRG1= <>
##$CPDPRG2= <>
##$CPDPRG3= <>
##$CPDPRG4= <mlev>
##$CPDPRG5= <mlev>
##$CPDPRG6= <mlev>
##$CPDPRG7= <mlev>
##$CPDPRG8= <mlev>
##$CPDPRGB= <>
##$CPDPRGT= <>
##$D= (0..31)
0 1.2 0 0 0 0 0 0 0 0.06 0 0.03 0 0 0 0 0.0002 0 0 0 0 0 0 0 0 0 0 0 0 
0 0 0 
##$DATE= 1615533451
##$DBL= (0..7)
120 120 120 120 120 120 120 120 
##$DBP= (0..7)
150 150 150 150 150 150 150 150 
##$DBP07= 0
##$DBPNAM0= <>
##$DBPNAM1= <>
##$DBPNAM2= <>
##$DBPNAM3= <>
##$DBPNAM4= <>
$$ [...]
##$SUBNAM3= <"">
##$SUBNAM4= <"">
##$SUBNAM5= <"">
##$SUBNAM6= <"">
##$SUBNAM7= <"">
##$SUBNAM8= <"">
##$SUBNAM9= <"">
##$SW= 16.9725357007746
##$SWIBOX= (0..15)
0 0 2 0 0 0 0 0 0 0 0 0 0 0 0 0 
##$SW_h= 3396.73913043478
##$TD= 16384
##$TD0= 1
##$TE= 0
##$TE2= 300
##$TE3= 300
##$TEG= 300
##$TL= (0..7)
0 120 120 120 120 120 120 120 
##$TP= (0..7)
150 150 150 150 150 150 150 150 
##$TP07= 0
##$TPNAME0= <>
##$TPNAME1= <>
##$TPNAME2= <>
##$TPNAME3= <>
##$TPNAME4= <>
##$TPNAME5= <>
##$TPNAME6= <>
##$TPNAME7= <>
##$TPOAL= (0..7)
0.5 0.5 0.5 0.5 0.5 0.5 0.5 0.5 
##$TPOFFS= (0..7)
0 0 0 0 0 0 0 0 
##$TUNHIN= 0
##$TUNHOUT= 0
##$TUNXOUT= 0
##$USERA1= <user>
##$USERA2= <user>
##$USERA3= <user>
##$USERA4= <user>
##$USERA5= <user>
##$V9= 5
##$VALIST= <valist>
##$VCLIST= <CCCCCCCCCCCCCCC>
##$VD= 0
##$VDLIST= <DDDDDDDDDDDDDDD>
##$VPLIST= <PPPPPPPPPPPPPPP>
##$VTLIST= <TTTTTTTTTTTTTTT>
##$WBST= 1024
##$WBSW= 4
##$XGAIN= (0..3)
0 0 0 0 
##$XL= 0
##$YL= 0
##$YMAX_a= 157491
##$YMIN_a= -154948
##$ZGOPTNS= <>
##$ZL1= 120
##$ZL2= 120
##$ZL3= 120
##$ZL4= 120
##$ABSF1= 15.97506
##$ABSF2= -0.9976015
##$ABSG= 5
##$ABSL= 3
##$ALPHA= 0
##$AQORDER= 0
##$ASSFAC= 0
##$ASSFACI= 0
##$ASSFACX= 0
##$ASSWID= 0
##$AUNMP= <proc_1d>
##$AZFE= 0.1
##$AZFW= 0.1
##$BCFW= 0
##$BC_mod= 2
##$BYTORDP= 0
##$COROFFS= 0
##$CY= -3
##$DATMOD= 1
##$DC= 0
##$DFILT= <>
##$DTYPP= 0
##$F1P= 0
##$F2P= 0
##$FCOR= 1
##$FTSIZE= 16384
##$FT_mod= 6
##$GAMMA= 0
##$GB= 0
##$INTBC= 1
##$INTSCL= 2.992141e-10
##$ISEN= 128
##$LB= 0.24
##$LEV0= 0
##$LPBIN= 0
##$MAXI= 10000
##$MC2= 0
##$MEAN= 0
##$ME_mod= 0
##$MI= 1.114404
##$NCOEF= 0
##$NC_proc= -7
##$NLEV= 6
##$NOISF1= 3.799351
##$NOISF2= 2.8
##$NSP= 0
##$NTH_PI= 0
##$NZP= 0
##$OFFSET= 15.99578
##$PC= 1
##$PHC0= -11122.64
##$PHC1= 11.80094
##$PH_mod= 1
##$PKNL= yes
##$PPARMOD= 0
##$PSCAL= 0
##$PSIGN= 0
##$REVERSE= no
##$SF= 200.130003133161
##$SI= 16384
##$SIGF1= 3
##$SIGF2= 2
##$SINO= 5.538805
##$SIOLD= 16384
##$SREGLST= <1H.CDCl3>
##$SSB= 0
##$STSI= 16384
##$STSR= 0
##$SW_p= 3396.73913043479
##$SYMM= 0
##$S_DEV= 0
##$TDeff= 16384
##$TDoff= 0
##$TI= <>
##$TILT= no
##$TM1= 0
##$TM2= 0
##$TOPLEV= 0
##$USERP1= <user>
##$USERP2= <user>
##$USERP3= <user>
##$USERP4= <user>
##$USERP5= <user>
##$WDW= 1
##$XDIM= 16384
##$YMAX_p= 268182021
##$YMIN_p= -622202
$$ End of Bruker specific parameters
$$ ---------------------------------
##NTUPLES= NMR SPECTRUM
##VAR_NAME=  FREQUENCY,     SPECTRUM/REAL,   SPECTRUM/IMAG
##SYMBOL=    X,             R,               I
##VAR_TYPE=  INDEPENDENT,   DEPENDENT,       DEPENDENT
##VAR_FORM=  AFFN,          ASDF,            ASDF
##VAR_DIM=   16384,         16384,           16384
##UNITS=     HZ,            ARBITRARY UNITS, ARBITRARY UNITS
##FACTOR=    0.207333158178282, 1,           1
##FIRST=     3201.23549974618, 0,            0
##LAST=      -195.503630688605, 0,           0
##MIN=       -195.503630688605, -622202,     0
##MAX=       3201.23549974618, 268182021,    0
$$ Real data points
##PAGE= N=1
##DATA TABLE= (X++(R..R)), XYDATA
$$ [...]
$$ plain form
4464 11315128 11091392 10852184 10534296 10283962 10024412 9828610 9540122 9180726 8935790
4455 8935790 8571902 8182792 8010471 7859153 7650270 7447594 7279232 6934311 6598372 6598059
4445 6598059 6309696 5727650 5599642 5498945 5556598 5241267 4899032 4676588 4391973 4370151
4435 4370151 4348146 3970752 3666247 3685498 3665071 3790193 3771317 3563259 3425884 3368993
4425 3368993 3201467 3164746 2998613 3004439 3196196 3023565 2915646 2904555 2813139 2668974
4415 2668974 2767831 2822281 2677478 2585842 2615342 2720791 2590241 2642951 2374355 2463539 2537923
4404 2537923 2549765 2565603 2504040 2493144 2349258 2367583 2458396 2501737 2571812 2807827 2578753
4393 2578753 2682001 2964551 3034103 3198386 3241987 3153869 3136668 3174277 3167076 3152460 3112500
$$ packed form
4464A1315128k23736k39208l17888k50334k59550j95802k88488l59396k44936
4455H935790l63888l89110j72321j51318k08883k02676j68362l44921l35939l13
4445F598059k88363n82046j28008j00697N7653l15331l42235k22444k84615k1822
4435D370151k2005l77394l04505J9251k0427J25122j8876k08058j37375n6891
4425C368993j67526l6721j66133N826J91757j72631j07919j1091r1416j44165
4415B668974R8857N4450j44803r1636K9500J05449j30550N2710k68596Q9184P4384
4404B537923J1842J5838o1563j0896j43886J8325R0813M3341P0075K36015k29074
4393B578753J03248K82550O9552J64283M3601q8118j7201L7609p201j4616l9960
$$ plain form
4382 3112500 3354754 3346257 3111078 2667546 2524484 2505281 2483521 2577046 2589748 2680041 2885737
4371 2885737 2592228 2757030 2489756 2608829 2590612 2555547 2677097 2745437 2691497 2512319
4361 2512319 2580027 2620993 2657745 2635913 2833394 2865297 2834516 2919329 3129422 3182786 3122914
4350 3122914 3024745 3210185 3477448 3483230 3469645 3378745 3455026 3633341 3903457 4082720 4076610
4339 4076610 3859509 3905217 4292910 4430581 4574036 4644580 4882457 4910750 4872173 4888340
4329 4888340 5244586 5201600 5333177 5353860 5341210 5356418 5188978 5566850 5828170 5730844
4319 5730844 5750574 5879675 5840708 5863139 6023639 6315837 6541614 6496767 6879688 6850120
4309 6850120 7024796 7159692 7319348 7542194 7799761 7797022 8077034 8289818 8663329 8834588
$$ packed form
4382C112500K42254q497k35179m43532j43062j9203k1760R3525J2702R0293K05696
4371B885737k93509J64802k67274J19073j8217l5065J21550O8340n3940j79178
4361B512319O7708M0966L6752k1832J97481L1903l0781Q4813K10093N3364n9872
4350C122914r8169J85440K67263N782j3585r0900P6281J78315K70116J79263o110
4339D076610k17101M5708L87693J37671J43455P0544K37877K8293l8577J6167
4329D888340L56246m2986J31577K0683j2650J5208j67440L77872K61320r7326
4319E730844J9730J29101l8967K2431J60500K92198K25777m4847L82921k9568
4309F850120J74676J34896J59656K22846K57567k739K80012K12784L73511J71259
$$ plain form
4299 8834588 9149002 9498282 9665830 9760850 9752704 9768255 10001890 9985894 10018268 9866073 10088151
4288 10088151 10327402 10069005 9915026 9871795 9868074 9592124 9527087 9564231 9785589 9844606
4278 9844606 9903663 9759049 10215727 10299697 10355182 10332258 10431517 10674025 10780173 11023445
4268 11023445 11115074 11265100 11602475 11839053 12013881 12115439 12056185 12004495 12237170 12364901
4258 12364901 12303387 12521823 12344981 12086915 12086405 12156562 11835249 11764896 11504729 11521643 11459772
4247 11459772 11328248 11135488 11017526 11001711 10922065 11185319 11271254 11180431 11007833 11078334
4237 11078334 10946374 10887213 10990844 10926950 10845232 10840323 10753932 10756846 10702982 10723171 10434038
4226 10434038 10473117 10123540 10109035 10264612 10183267 9976118 9836302 9736014 10006476 9922612
$$ packed form
4299H834588L14414L49280J67548R5020q146J5551K33635j5996L2374j52195K22078
4288A0088151K39251k58397j53979m3231l721k75950o5037L7144K21358N9017
4278I844606N9057j44614M56678Q3970N5485k2924R9259K42508J06148K43272
4268A1023445R1629J50026L37375K36578J74828J01558n9254n1690K32675J27731
4258A2364901o1514K18436j76842k58066n10P0157l21313p0353k60167J6914o1871
4247A1459772j31524j92760j17962j5815p9646K63254Q5935r0823j72598P0501
4237A1078334j31960n9161J03631o3894q1718m909q6391K914n3864K0189k89133
4226A0434038L9079l49577j4505J55577q1345k07149j39816j00288K70462q3864
$$ plain form
4216 9922612 9739010 9600957 9583687 9293155 8966591 9164237 9365313 9239683 9084202 9193898
4206 9193898 9152188 9004317 9024407 9133073 9019219 8895197 8777577 8581836 8563175 8456745
4196 8456745 8444536 8334318 8142629 8085785 7921647 7883748 7739355 7405960 7182502 7097124
4186 7097124 7001532 6778266 6639459 6395958 6278148 6342889 6315268 6098587 5908881 5998751
4176 5998751 5971805 6134816 6012276 5930537 5912583 5827156 5735034 6088888 6249047 6206696 6146608
4165 6146608 5857950 5708622 5705402 5847153 5706139 5511691 5348570 5350863 5394552 5253708
4155 5253708 4985485 4915210 5085459 5038738 4831530 4760896 4740264 4687895 4864416 4918114 4856151
4144 4856151 4682696 4694170 4834376 4781090 4815275 4925967 4792502 5026637 4963986 4642686
$$ packed form
4216I922612j83602j38053j7270k90532l26564J97646K01076j25630j55481J09696
4206I193898m1710j47871K0090J08666j13854j24022j17620j95741j8661j06430
4196H456745j2209j10218j91689n6844j64138l7899j44393l33395k23458q5378
4186G097124r5592k23266j38807k43501j17810O4741k7621k16681j89706Q9870
4176E998751k6946J63011j22540q1739j7954q5427r2122L53854J60159m2351o0088
4165F146608k88658j49328l220J41751j41014j94448j63121K293M3689j40844
4155E253708k68223p0275J70249m6721k07208p0634k0632n2369J76521N3698o1963
4144D856151j73455J1474J40206n3286L4185J10692j33465K34135o2651l21300
$$ plain form
4134 4642686 4701224 4754966 4920953 5270857 5565181 5466743 5353441 5361100 5346304 5386428 5292781
4123 5292781 5547170 5702736 5832706 5955955 5855300 5794865 5557771 5587293 5717551 5592988
4113 5592988 5498979 5525803 5723928 5841074 5912464 5968513 5872738 5852097 6073024 5953736 5977026
4102 5977026 5935675 6024818 5998072 6041825 6317364 6313133 6206132 6308992 6647352 6512830 6458245
4091 6458245 6299824 6502413 6638783 6588579 6689340 6679604 6846086 6922991 6763686 6647169
4081 6647169 6832344 6935144 7015268 7145220 7128625 7454779 7858903 8068257 7898046 7829034
4071 7829034 7958414 7903716 8392758 8512329 8790356 8957691 9173971 9473731 9701045 10012137
4061 10012137 10249530 10544748 11062515 11578432 11903058 12182341 12538119 13028171 13517370
$$ packed form
4134D642686N8538N3742J65987L49904K94324r8438j13302P659j4796M0124r3647
4123E292781K54389J55566J29970J23249j00655o0435k37094K9522J30258j24563
4113E592988r4009K6824J98125J17146P1390N6049r5775k0641K20927j19288K3290
4102E977026m1351Q9143k6746M3753K75539m231j07001J02860L38360j34522n4585
4091F458245j58421K02589J36370n0204J00761r736J66482P6905j59305j16517
4081F647169J85175J02800Q0124J29952j6595L26154M04124K09354j70211o9012
4071G829034J29380n4698M89042J19571K78027J67335K16280K99760K27314L11092
4061A0012137K37393K95218N17767N15917L24626K79283L55778M90052M89199
$$ plain form
4052 13517370 13952953 14347763 14976095 15362181 15917056 16372554 16802343 17228026 17782742
4043 17782742 18182148 18428513 18804487 19216831 19721369 20130869 20484489 20860171 21350784
4034 21350784 21799101 22011186 22215109 22703800 23251495 23767639 24298665 24660602 25179805
4025 25179805 25688081 26480998 27048896 27513660 27922136 28245564 28687963 29083368 29521912
4016 29521912 29929103 30014093 30179547 30414577 30525458 30790318 31075690 31165990 31046511 31057068
4006 31057068 31110228 31346405 31368273 31191333 31115467 30929136 30718266 30485979 30174839 30005199
3996 30005199 29727100 29525208 29161378 28676889 28392897 28003915 27625757 27087540 26393115
3987 26393115 26013321 25526838 25128994 24632578 24052763 23738918 23298589 22896163 22331371
$$ packed form
4052A3517370M35583L94810O28332L86086N54875M55498M29789M25683N54716
4043A7782742L99406K46365L75974M12344N04538M09500L53620L75682M90613
4034B1350784M48317K12085K03923M88691N47695N16144N31026L61937N19203
4025B5179805N08276P92917N67898M64764M08476L23428M42399L95405M38544
4016B9521912M07191Q4990J65454K35030J10881K64860K85372R0300j19479J0557
4006C1057068N3160K36177K1868j76940p5866j86331k10870k32287l11140j69640
3996C0005199k78099k01892l63830m84489k83992l88982l78158n38217o94425
3987B6393115l79794m86483l97844m96416n79815l13845m40329m02426n64792
$$ plain form
3978 22331371 21873063 21632789 21131302 20585328 20165195 19621752 19070915 18583335 18207569
3969 18207569 17844439 17174306 16521855 15933798 15623145 15302398 14628790 14305278 13563691
3960 13563691 13113469 12965549 12521864 12019629 11375875 11076275 10879481 10592988 10140208
3951 10140208 9823780 9722541 9552842 9402945 9093612 8859377 8659965 8578708 8415849 8184898
3941 8184898 8023118 8083797 7898388 7526655 7395716 7481424 7095034 7183412 7139546 7083479
3931 7083479 6932282 6692280 6683575 6752007 6733115 6833325 6832744 6559645 6453885 6253467 6237463
3920 6237463 6056425 6149001 6250574 6307399 6078591 5802895 5986580 5739239 5514110 5708013
3910 5708013 5781652 5676500 5523483 5243877 5242544 5461627 5350275 5269474 5374469 5275464
$$ packed form
3978B2331371m58308k40274n01487n45974m20133n43443n50837m87580l75766
3969A8207569l63130o70133o52451n88057l10653l20747o73608l23512p41587
3960A3563691m50222j47920m43685n02235o43754k99600j96794k86493m52780
3951A0140208l16428j01239j69699j49897l09333k34235j99412q1257j62859k30951
3941H184898j61780O0679j85409l71733j30939Q5708l86390Q8378m3866n6067
3931G083479j51197k40002q705O8432j8892J00210n81k73099j05760k00418j6004
3920F237463j81038R2576J01573N6825k28808k75696J83685k47341k25129J93903
3910E708013P3639j05152j53017k79606j333K19083j11352q0801J04995r9005
$$ plain form
3900 5275464 5009544 5059742 5078044 5202138 4949166 4948474 4788159 4733111 4738238 5103553 5020928
3889 5020928 4826024 4772567 4712081 4641093 4833661 4646251 4649851 4523735 4669706 4868520
3879 4868520 4813553 4827913 4780364 4763513 4602579 4621901 4786613 4800299 4802621 4981192 4921042
3868 4921042 4859793 4721093 4663329 4781269 4678833 4730329 4792998 4778227 5014393 4978921 5232661
3857 5232661 5526820 5543507 5397056 5452773 5495807 5461084 5341568 5387518 5753801 5738894 5773232
3846 5773232 5938522 5798513 5928910 5933930 5833994 5991397 6195468 6151042 6391084 6332043
3836 6332043 6297261 6361377 6680612 6642861 6861427 7031360 6707230 6953480 7319374 7491097
3826 7491097 7562198 7766870 7698483 7803864 8161067 8202776 8294005 8533313 8719374 8569092
$$ packed form
3900E275464k65920N0198J8302J24094k52972o92j60315n5048N127L65315q2625
3889E020928j94904n3457o0486p0988J92568j87410L600j26116J45971J98814
3879D868520n4967J4360m7549j6851j60934J9322J64712J3686K322J78571o0150
3868D921042o1249j38700n7764J17940j02436N1496O2669j4771K36166l5472K53740
3857E232661K94159J6687j46451N5717M3034l4723j19516M5950L66283j4907L4338
3846E773232J65290j40009J30397N020r9936J57403K04071m4426K40042n9041
3836F332043l4782O4116L19235l7751K18566J69933l24130K46250L65894J71723
3826G491097P1101K04672o8387J05381L57203M1709R1229K39308J86061j50282
$$ plain form
3816 8569092 8748166 8900887 9091022 9431853 9600348 9851943 10025522 10140336 10446540 10551927
3806 10551927 10812698 11168312 11509490 11728457 12028504 12258848 12686766 13342636 13811801
3797 13811801 14212154 14721572 15463450 16048653 16770033 17206558 17716095 18655011 19366476
3788 19366476 20119015 21153751 21971085 22718637 23762699 25110565 26372489 27497478 28962717
3779 28962717 30597261 32520194 34406269 36326225 38696560 40943932 43706618 46844644
3771 46844644 49947715 52918395 56566333 60320284 63910707 67251927 70423080 72733394
3763 72733394 74760775 76027676 76558991 76479723 75651252 74180789 72249653 70496223 68820976
3754 68820976 67342469 66101806 65131456 64383217 64063787 64184075 64563529 64870706 65781845
$$ packed form
3816H569092J79074J52721J90135L40831J68495K51595J73579J14814L06204J05387
3806A0551927K60771L55614L41178K18967L00047K30344M27918O55870M69165
3797A3811801M00353N09418P41878N85203P21380M36525N09537R38916P11465
3788A9366476P52539J034736Q17334P47552J044062J347866J261924J124989J465239
3779B8962717J634544J922933J886075J919956K370335K247372K762686L138026
3771D6844644L103071K970680L647938L753951L590423L341220L171153K310314
3763G2733394K027381J266901N31315p9268q28471j470463j931136j753430j675247
3754F8820976j478507j240663r70350p48239l19430J20288L79454L07177R11139
$$ plain form
3745 65781845 66477625 67207300 67683936 68250410 68273982 67734494 66998944 65459868 63275275
3736 63275275 60685479 57478655 54093564 50568156 47081727 43794757 40852017 38384187
3728 38384187 35729959 33237306 30826644 28892860 27306492 25776689 24201343 22984625
3720 22984625 21660544 20668690 19858771 19003002 18089778 17375218 16476989 15768115 15382605
3711 15382605 14750191 14502500 14041357 13506041 12997425 12598711 12239446 11864218 11445177
3702 11445177 11196880 11113792 11063860 10622922 10308571 9936955 9510178 9212727 9074580 8878112
3692 8878112 8687394 8728274 8394750 8065244 7960621 7723270 7454340 7233498 7033012 7006204
3682 7006204 6890616 6622973 6460581 6397433 6261735 6303845 6070192 5956266 5955767 5771116
$$ packed form
3745F5781845O95780P29675M76636N66474K3572n39488p35550j539076k184593
3736F3275275k589796l206824l385091l525408l486429l286970k942740k467830
3728C8384187k654228k492653k410662j933784j586368j529803j575346j216718
3720B2984625j324081r91854q09919q55769r13224p14560q98229p08874l85510
3711A5382605o32414k47691m61143n35316n08616l98714l59265l75228m19041
3702A1445177k48297q3088m9932m40938l14351l71616m26777k97451j38147j96468
3692H878112j90718M0880l33524l29506j04623k37351k68930k20842k00486k6808
3682G006204j15588k67643j62392o3148j35698M2110k33653j13926m99j84651
$$ plain form
3672 5771116 5678566 5561251 5412399 5133183 5208423 5134849 4968412 4732181 4640162 4540164
3662 4540164 4558187 4759372 4641128 4463084 4274550 4334443 4130883 3977355 4050933 4028233
3652 4028233 3796966 3823323 3973700 3874303 3838818 3804782 3803267 3810711 3784126 3907012 3596046
3641 3596046 3243491 3274403 3369659 3527363 3509379 3335492 3284523 3156635 3176883 3158292 3059670
3630 3059670 3021872 3216475 3145266 3173267 3161786 3164628 3081256 3182491 3214510 2929093 2764626
3619 2764626 2928793 3085917 2872792 2695488 2743166 2874406 2718124 2584825 2755967 2781718
3609 2781718 2571141 2486743 2607370 2684800 2649123 2799675 2933566 2873879 2657673 2733179
3599 2733179 2747115 2927109 2661660 2631247 2645127 2852416 3002061 2811772 2699790 2856040
$$ packed form
3672E771116r2550j17315j48852k79216P5240p3574j66437k36231r2019r9998
3662D540164J8023K01185j18244j78044j88534N9893k03560j53528P3578k2700
3652D028233k31267K6357J50377r9397l5485l4036j515P444k6585J22886l10966
3641C596046l52555L0912R5256J57704j7984j73887n0969j27888K0248j8591r8622
3630C059670l7798J94603p1209K8001j1481K842q3372J01235L2019k85417j64467
3619B764626J64167J57124k13125j77304M7678J31240j56282j33299J71142K5751
3609B781718k10577q4398J20627P7430l5677J50552J33891n9687k16206P5506
3599B733179J3936J79994k65449l0413J3880K07289J49645j90289j11982J56250
$$ plain form
3589 2856040 2749319 2849991 2854697 2975612 3063085 3182284 3313456 3065967 3434921 3597157
3579 3597157 3375802 3390865 3341795 3242116 3359961 3236628 3062868 3134902 3181290 2945137
3569 2945137 3046744 3153113 3107253 2917595 2939550 2748949 2692071 3028268 3134555 3178728
3559 3178728 3077627 3071340 3139377 3289989 3259391 3278799 3340162 3390326 3291527 3394123 3546587
3548 3546587 3569419 3677048 3543213 3338162 3220629 3066757 3323695 3514071 3523852 3683928
3538 3683928 3713194 3849066 3806302 3884519 3948644 3801782 3961199 4144637 4060332 3898838
3528 3898838 3781746 3990354 3898033 3990461 3769160 3610053 3706652 3793051 3865877 3814627 3615852
3517 3615852 3618458 3817967 3817316 3654692 3640676 3667364 3785867 3675585 3725602 3767130 3519661
$$ packed form
3589B856040j06721J00672M706J20915Q7473J19199J31172k47489L68954J62236
3579C597157k21355J5063m9070r9679J17845j23333j73760P2034M6388k36153
3569B945137J01607J06369m5860j89658K1955j90601n6878L36197J06287M4173
3559C178728j01101o287O8037J50612l0598J9408O1363N0164r8799J02596J52464
3548C546587K2832J07629j33835k05051j17533j53872K56938J90376R781J60076
3538C683928K9266J35872m2764P8217O4125j46862J59417J83438q4305j61494
3528C898838j17092K08608r2321R2428k21301j59107R6599Q6399P2826n1250j98775
3517C615852K606J99509o51j62624j4016K6688J18503j10282N0017M1528k47469
$$ plain form
3506 3519661 3692234 3807445 3804943 3823356 3909741 4129344 4256894 4099161 4066780 4316751
3496 4316751 4275578 4219172 4384534 4491243 4617845 4572390 4457942 4608395 4555811 4581332
3486 4581332 4476191 4588887 4735772 4564506 4595116 4607870 4918965 5251451 5327766 5377772
3476 5377772 5440274 5365343 5238470 5337536 5773332 5776081 5785103 6011045 6189532 6275637 6408595
3465 6408595 6331762 6239235 6385352 6497830 6548920 6511513 6538004 6813675 6973422 6991382 7018530
3454 7018530 7007757 7050080 7040353 7410776 7802393 7811830 7721577 7737812 8001414 8235700 8486723
3443 8486723 8533545 8766830 8959578 9039656 9141863 9334153 9396255 9466288 9637513 10031996
3433 10031996 10042242 10302068 10446849 10676230 10865778 10856773 11159583 11591668 11710644 11781257
$$ packed form
3506C519661J72573J15211k502J8413Q6385K19603J27550j57733l2381K49971
3496D316751m1173n6406J65362J06709J26602m5455j14448J50453n2584K5521
3486D581332j05141J12696J46885j71266L0610J2754L11095L32486P6315N0006
3476E377772O2502p4931j26873R9066M35796K749R022K25942J78487Q6105J32958
3465F408595p6833r2527J46117J12478N1090l7407K6491K75671J59747J7960K7148
3454G018530j0773M2323r727L70423L91617R437r0253J6235K63602K34286K51023
3443H486723M6822K33285J92748Q0078J02207J92290O2102P0033J71225L94483
3433A0031996J0246K59826J44781K29381J89548r005L02810M32085J18976P0613
$$ plain form
3423 11781257 12043613 12192145 12532991 12741091 12936549 13312991 13742875 14249493 14699593
3414 14699593 14882757 15383439 15886689 16479916 16941849 17382560 17922904 18600855 19406945
3405 19406945 20078461 20954470 21637685 22152479 23010529 23934005 24930480 26057117 27324762
3396 27324762 28371593 29458784 30940448 32471484 33870768 35286313 37067936 39036804
3388 39036804 41232495 43708951 46610826 50080171 53711053 57318670 61077812 64907111
3380 64907111 68754888 72622196 76368216 80055159 83664569 87489385 91650537 96150130
3372 96150130 100405061 104282363 107317648 109626189 111191105 112370627 113655936 115485494
3364 115485494 117561573 119291758 120106496 119486516 117497341 114179725 110168120 106691364
$$ packed form
3423A1781257K62356J48532L40846K08100J95458L76442M29884N06618M50100
3414A4699593J83164N00682N03250N93227M61933M40711N40344O77951Q06090
3405A9406945O71516Q76009O83215N14794Q58050R23476R96475J126637J267645
3396B7324762J046831J087191J481664J531036J399284J415545J781623J968868
3388C9036804K195691K476456K901875L469345L630882L607617L759142L829299
3380F4907111L847777L867308L746020L686943L609410L824816M161152M499593
3372I6150130M254931L877302L035285K308541J564916J179522J285309J829558
3364A15485494K076079J730185Q14738o19980j989175l317616m011605l476756
$$ plain form
3356 106691364 103672539 101288588 99430788 97285489 94374887 90514636 85874277 81018339
3348 81018339 76505352 72787546 69908491 67211079 64493763 61664053 58670968 55392630
3340 55392630 52331795 49608609 47098822 45172615 43854752 42454776 41162069 40259915
3332 40259915 39528122 38822997 38147905 37757718 37145078 36628187 36340687 36156667 36101038 36035026
3322 36035026 35884233 36094041 36120619 36198003 36413937 36511675 36888201 37312510 37563597 37670097
3312 37670097 37707748 38188368 38697694 39002852 39354297 39776705 40402079 41170465 41847373 42226977
3302 42226977 42492665 42544698 42807196 42577718 42517535 42459259 42104669 42054611 42070295 42133825
3292 42133825 42039289 42140176 42384212 42739436 42860935 42842680 43151257 43253082 43276275 43465944
$$ packed form
3356A06691364l018825k383951j857800k145299k910602l860251m640359m855938
3348H1018339m512987l717806k879055k697412k717316k829710k993085l278338
3340E5392630l060835k723186k509787j926207j317863j399976j292707r02154
3332D0259915p31793p05125o75092l90187o12640n16891k87500j84020n5629o6012
3322C6035026j50793K09808K6578P7384K15934R7738L76526M24309K51087J06500
3312C7670097L7651M80620N09326L05158L51445M22408O25374P68386O76908L79604
3302D2226977K65688N2033K62498k29478o0183n8276l54590n0058J5684O3530
3292D2133825r4536J00887K44036L55224J21499j8255L08577J01825K3193J89669
$$ plain form
3282 43465944 43055601 42299775 41829158 41370510 40999669 40447000 40011708 39736607 39494415
3273 39494415 39114973 39024305 38759829 38766912 38892699 39047185 39270449 39459926 39913215 40422680
3263 40422680 40769584 41295680 42107210 42821484 43480383 44448021 45465810 46531144 47593045
3254 47593045 48714450 49996293 51446041 53156139 54952325 57103718 59449912 61867349
3246 61867349 64765050 68025003 71458750 75375239 80106302 85370438 91134823 97636072
3238 97636072 104769619 112445865 120223543 127586361 134308987 139325344 142345680 142685371
3230 142685371 140095487 135419075 128503269 119773282 109868781 99835710 90267435 81597066
3222 81597066 73937084 67660132 62304846 57565147 53472918 49508441 46249238 43490435
$$ packed form
3282D3465944m10343p55826m70617m58648l70841n52669m35292k75101k42192
3273C9494415l79442r0668k64476P083J25787J54486K23264J89477M53289N09465
3263D0422680L46904N26096Q11530P14274O58899R67638J017789J065334J061901
3254D7593045J121405J281843J449748J710098J796186K151393K346194K417437
3246F1867349K897701L259953L433747L916489M731063N264136N764385O501249
3238I7636072P133547P676246P777678P362818O722626N016357L020336L39691
3230A42685371k589884m676412o915806q729987r904501j0033071r568275q670369
3222H1597066p659982o276952n355286m739699m092229l964477l259203k758803
$$ plain form
3214 43490435 40800282 38261376 36275685 34388387 32621946 30828475 29176247 27788984
3206 27788984 26565634 25577384 24363272 23328850 22493137 21543632 20643671 19908496 19045697
3197 19045697 18457223 17849295 17042120 16635238 16264212 15575651 15156783 14695295 14475662
3188 14475662 14075246 13613023 12930034 12298208 12205639 12132613 11728839 11510946 11107477 10867840
3178 10867840 10813117 10536304 10159259 9843808 9728357 9437275 8928764 8708931 8673340 8424730
3168 8424730 8156878 7894279 7714977 7654963 7421064 7213020 7307481 7209521 6933446 6921093
3158 6921093 6999139 6852238 6526553 6141690 6123165 6260175 6055127 5911598 5725789 5707996
3148 5707996 5677179 5510399 5241992 5059054 5028709 4849823 4871768 5042391 4959085 4638172
$$ packed form
3214D3490435k690153k538906j985691j887298j766441j793471j652228j387263
3206B7788984j223350r88250j214112j034422q35713r49505q99961p35175q62799
3197A9045697n88474o07928q07175m06882l71026o88561m18868m61488k19633
3188A4475662m00416m62223o82989o31826r2569p3026m03774k17893m03469k39637
3178A0867840n4723k76813l77045l15451j15451k91082n08511k19833l5591k48610
3168H424730k67852k62599j79302o0014k33899k08044R4461r7960k76075j2353
3158F921093P8046j46901l25685l84863j8525J37010k05048j43529j85809j7793
3148E707996l0817j66780k68407j82938l0345j78886K1945J70623q3306l20913
$$ plain form
3138 4638172 4384147 4370410 4461071 4282867 4185085 4264197 4201470 4067958 3973428 3987697 3865206
3127 3865206 3941085 3941714 3824238 3832443 3607113 3594783 3623580 3398722 3250057 3507356 3402905
3116 3402905 3296557 3105600 3109794 3268901 3346538 3093348 3162851 3198272 3044163 3171468
3106 3171468 3013210 3159748 3041278 2879642 2780228 2792438 2805627 2700938 2700265 2712067 2841494
3095 2841494 2835409 2870524 2588688 2517843 2522567 2534353 2431527 2260050 2208414 2275837 2316922
3084 2316922 2381482 2446945 2579838 2398873 2314469 2048455 2070731 2195375 2199375 2190656 2135763
3073 2135763 2197614 2005067 2208933 2314338 2033243 2198969 2384029 2198495 2133077 2308917
3063 2308917 2407411 2397185 2204784 2219695 2363343 2268450 2344102 2471751 2547409 2385279 2220427
$$ packed form
3138D638172k54025j3737R0661j78204r7782P9112o2727j33512r4530J4269j22491
3127C865206P5879O29j17476Q205k25330j2330K8797k24858j48665K57299j04451
3116C402905j06348j90957M194J59107P7637k53190O9503L5421j54109J27305
3106C171468j58258J46538j18470j61636r9414J2210J3189j04689o73J1802J29427
3095B841494o085L5115k81836p0845M724J1786j02826j71477n1636O7423M1085
3084B316922O4560O5463J32893j80965q4404k66014K2276J24644M000q719n4893
3073B135763O1851j92547K03866J05405k81095J65726J85060j85534o5418J75840
3063B308917R8494j0226j92401J4911J43648r4893P5652J27649P5658j62130j64852
$$ plain form
3052 2220427 2085269 2298520 2336649 2621789 2585220 2608614 2568025 2766584 2581812 2619288
3042 2619288 2832622 2861337 2658646 2740135 3036296 2982177 2673784 2584352 2731396 2757551
3032 2757551 2781373 2837170 2913794 2868865 2829271 2874806 2773977 2741392 2895395 2968448 2949140
3021 2949140 3032602 2962841 2903639 2965966 2978708 3031935 3048254 3125013 3015123 3045184 2996322
3010 2996322 3103257 2955472 2847613 2887041 2928664 2771319 2968371 2987857 3143259 3232366
3000 3232366 3281807 3192049 3224229 3374428 3253417 3149088 3354486 3745400 3620965 3534503
2990 3534503 3759911 3864182 3869827 4046682 4275092 4297729 4378074 4427510 4428213 4480126 4703575
2979 4703575 4960407 5096018 5415866 5559417 5854389 6237088 6570451 7089486 7337911 7631325
$$ packed form
3052B220427j35158K13251L8129K85140l6569K3394m0589J98559j84772L7476
3042B619288K13334K8715k02691Q1489K96161n4119l08393q9432J47044K6155
3032B757551K3822N5797P6624m4929l9594M5535j00829l2585J54003P3053j9308
3021B949140Q3462o9761n9202O2327J2742N3227J6319P6759j09890L0061m8862
3010B996322J06935j47785j07859L9428M1623j57345J97052J9486J55402Q9107
3000C232366M9441q9758L2180J50199j21011j04329K05398L90914j24435q6462
2990C534503K25408J04271N645J76855K28410K2637Q0345M9436P03N1913K23449
2979D703575K56832J35611L19848J43551K94972L82699L33363N19035K48425K93414
$$ plain form
2969 7631325 8361482 8965501 9559048 9941827 10575534 11810954 13109872 15010187 17020445
2960 17020445 18955548 20701786 22258631 23316922 23624033 23146371 21353877 17667248
2952 17667248 14643050 12973107 11479988 10697226 10229303 9547440 9194952 9082006 8637752
2943 8637752 8529179 8673230 8755911 8752231 8634409 8746624 8942434 9080714 9207897 9439646
2933 9439646 9772976 9989589 10330192 10723264 10885318 11274554 11937333 12337057 12635939 13224870
2923 13224870 13700742 13625168 14093430 14399643 14788472 15212066 15405200 15904967 16528140 17080220
2913 17080220 17483088 17838117 18436234 19018883 19459463 19893742 20491300 20764849 20929792
2904 20929792 21253550 21672722 21817788 21941657 22173392 22424606 22772957 23005658 23333115
$$ packed form
2969G631325P30157O04019N93547L82779O33707J235420J298918J900315K010258
2960A7020445J935103J746238J556845J058291L07111m77662j792494l686629
2952A7667248l024198j669943j493119p82762m67923o81863l52488j12946m44254
2943H637752j08573J44051Q2681l680j17822J12215J95810J38280J27183K31749
2933I439646L33330K16613L40603L93072J62054L89236O62779L99724K98882N88931
2923A3224870M75872p5574M68262L06213L88829M23594J93134M99767O23173N52080
2913A7080220M02868L55029N98117N82649M40580M34279N97558K73549J64943
2904B0929792L23758M19172J45066J23869K31735K51214L48351K32701L27457
$$ plain form
2895 23333115 23480573 23582252 23602603 23485501 23519963 23448388 23241405 23093998 22687534 22166677
2885 22166677 21801384 21549472 21359386 21015772 20762123 20382410 20060834 19583244 18952845
2876 18952845 18567244 18161446 17607660 17084180 16510251 16162284 15723998 15134279 14440772
2867 14440772 13941824 13567009 13098483 12497638 12119282 11775558 11277308 10929076 10516590
2858 10516590 9992554 9489974 9068196 8606180 8280421 8114214 7934822 7760279 7508798
2849 7508798 7245107 6705643 6515356 6384461 5910562 5791924 5660335 5511620 5388586 5159592
2839 5159592 4983146 4964602 4910347 4732582 4563368 4436363 4238550 4088173 4069663 3984720
2829 3984720 3731224 3700962 3566835 3559063 3641200 3528870 3327028 3395223 3255974 3086614
$$ packed form
2895B3333115J47458J01679K0351j17102L4462p1575k06983j47407m06464n20857
2885B2166677l65293k51912j90086l43614k53649l79713l21576m77590o30399
2876A8952845l85601m05798n53786n23480n73929l47967m38286n89719o93507
2867A4440772m98948l74815m68526o00845l78356l43724m98250l48232m12486
2858A0516590n24036n02580m21778m62016l25759j66207j79392j74543k51481
2849G508798k63691n39464j90287j30895m73899j18638j31589j48715j23034k28994
2839E159592j76446j8544n4255j77765j69214j27005j97813j50377j8510q4943
2829C984720k53496l0262j34127p772Q2137j12330k01842O8195j39249j69360
$$ plain form
2819 3086614 2970922 3123524 3051819 2943094 2914227 2908373 2726281 2695282 2644700 2698839 2737100
2808 2737100 2667595 2816748 2555455 2540466 2444119 2454509 2704641 2455196 2207343 2124118
2798 2124118 2301426 2274673 2231869 2125071 2147774 2084926 2089985 2082794 1906379 1845469 1715728
2787 1715728 1846901 1811250 1717579 2053601 2025341 1921560 1722792 1705534 1462335 1402826
2777 1402826 1707241 1697879 1504129 1435425 1589560 1674877 1643605 1523428 1620761 1555814 1634467
2766 1634467 1693501 1774714 1829522 1624852 1364847 1487640 1511080 1326322 1306980 1521853
2756 1521853 1530555 1488723 1336587 1363324 1361734 1380533 1536209 1785185 1715292 1348326 1523612
2745 1523612 1638850 1646135 1681667 1467283 1429938 1485638 1456308 1409413 1544544 1595012 1695520
$$ packed form
2819C086614j15692J52602p1705j08725k8867n854j82092l0999n0582N4139L8261
2808B737100o9505J49153k61293j4989r6347J0390K50132k49445k47853q3225
2798B124118J77308k6753m2804j06798K2703o2848N059p191j76415o0910j29741
2787A715728J31173l5651r3671L36022k8260j03781j98768j7258k43199n9509
2777A402826L04415r362j93750o8704J54135Q5317l1272j20177R7333o4947P8653
2766A634467N9034Q1213N4808k04670k60005J22793K3440j84758j9342K14873
2756A521853Q702m1832j52136K6737j590J8799J55676K48976o9893l66966J75286
2745A523612J15238P285L5532k14384l7345N5700k9330m6895J35131N0468J00508
$$ plain form
2734 1695520 1692613 1650267 1654798 1857778 2055832 1984893 1796897 1737263 1876376 1829808 1789413
2723 1789413 1710253 1749915 1951535 1789387 1773740 1775856 1562538 1570429 1578820 1589047 1454510
2712 1454510 1393272 1417650 1604702 1621125 1617894 1726609 1911015 1852295 1690171 1665564 1792166
2701 1792166 1834187 1931612 1877881 1789039 1745188 1708761 1585333 1714081 1866449 1414706 1358718
2690 1358718 1473204 1687914 1778346 1862119 1867050 1788519 1597336 1801544 1935330 2016598 1854321
2679 1854321 2050758 2090140 2183680 2333068 2233711 2220041 2209977 2194568 2227545 2370702 2504641
2668 2504641 2277286 2177587 2419832 2647039 2687427 2582721 2644812 2730122 2808602 2788641 2856342
2657 2856342 3091869 3078148 2895128 3201039 3059365 3043285 3272928 3413767 3367709 3428095
$$ packed form
2734A695520k907m2346M531K02980J98054p0939j87996n9634J39113m6568m0395
2723A789413p9160L9662K01620j62148j5647K116k13318P891Q391J0227j34537
2712A454510o1238K4378J87052J6423l231J08715J84406n8720j62124k4607J26602
2701A792166M2021R7425n3731q8842m3851l6427j23428J28748J52368m51743n5988
2690A358718J14486K14710R0432Q3773M931p8531j91183K04208J33786Q1268j62277
2679A854321J96437L9382R3540J49388r9357j3670j0064j5409L2977J43157J33939
2668B504641k27355r9699K42245K27207M0388j04706O2091Q5310P8480j9961O7701
2657B856342K35527j3721j83020L05911j41674j6080K29643J40839m6058O0386
$$ plain form
2647 3428095 3588985 3679992 3619385 3628222 3593943 3688946 3884267 3944667 3901774 3997403 4132891
2636 4132891 4177834 4066519 4114359 4305429 4239395 4223123 4189340 4202003 4473587 4696028 4570275
2625 4570275 4637217 4456612 4634537 4752682 4741064 4812084 4761229 4822141 5084118 5301320
2615 5301320 5112517 5302440 5513330 5525079 5853758 6204178 6109330 5893008 5709153 6049681
2605 6049681 6424059 6488757 6492622 6550975 6794902 6804658 6995304 7309856 7364510 7352578 7437961
2594 7437961 7468713 7789146 8179271 8361983 8642173 8779714 8880190 8979412 9275925 9733550
2584 9733550 10160198 10341554 10801649 11057606 11427054 11848095 12300075 12630930 12889744 13264894
2574 13264894 13733233 14343450 15175788 15957476 16726898 17626698 18406663 19190740 20266889
$$ packed form
2647C428095J60890R1007o0607Q837l4279R5003J95321O0400m2893R5629J35488
2636D132891M4943j11315M7840J91070o6034j6272l3783J2663K71584K22441j25753
2625D570275O6942j80605J77925J18145j1618P1020n0855O0912K61977K17202
2615E301320j88803J89923K10890J1749L28679L50420r4848k16322j83855L40528
2605F049681L74378O4698L865N8353K43927R756J90646L14552N4654j1932Q5383
2594G437961L0752L20433L90125J82712K80190J37541J00476R9222K96513M57625
2584I733550M26648J81356M60095K55957L69448M21041M51980L30855K58814L75150
2574A3264894M68339O10217Q32338P81688P69422Q99800P79965P84077J076149
$$ plain form
2565 20266889 21349519 22635676 23793497 24949298 26231155 27843822 29534185 31417243
2557 31417243 33504625 35411421 37579757 40128679 42452858 44418295 46571675 48650816
2549 48650816 50503404 52050061 53650766 54839846 55661693 56112301 56168128 56144340 55983869
2540 55983869 55852882 55503342 54968119 54594542 54303600 53654526 53029556 52300429 51341823
2531 51341823 50247860 48952770 47513602 45814266 43732855 41574210 39385952 36902047
2523 36902047 34918887 32565859 30760188 28908897 26989764 25409900 23872781 22386508
2515 22386508 21365498 20453982 19216015 18321147 17669864 16856751 16108214 15631840 14908878
2506 14908878 14272628 13761941 13368727 13020135 12659081 12322819 12039589 11769597 11455905
$$ packed form
2565B0266889J082630J286157J157821J155801J281857J612667J690363J883058
2557C1417243K087382J906796K168336K548922K324179J965437K153380K079141
2549D8650816J852588J546657J600705J189080Q21847M50608N5827k3788j60471
2540E5983869j30987l49540n35223l73577k90942o49074o24970p29127r58606
2531E1341823j093963j295090j439168j699336k081411k158645k188258k483905
2523C6902047j983160k353028j805671j851291j919133j579864j537119j486273
2515B2386508j021010r11516j237967q94868o51283q13113p48537m76374p22962
2506A4908878o36250n10687l93214l48592l61054l36262k83230k69992l13692
$$ plain form
2497 11455905 11241642 10973094 10806463 10508186 10305020 10248497 9995856 9907106 9635382 9548687
2487 9548687 9614591 9333738 9250675 9200337 9154915 8782570 8843515 8724722 8472971 8584012
2477 8584012 8646969 8286568 8239320 8224149 8231623 8431942 8230133 8176902 8064296 7699060 7673367
2466 7673367 7654975 7661398 7848771 7675749 7658376 7729372 7684136 7729476 8114670 8197355 7801035
2455 7801035 7773780 8001883 7830307 7926050 8029891 7884750 8077634 7701248 7833214 8125195
2445 8125195 8166044 8226065 8256868 8187957 8266397 8428037 8560352 8389072 8443133 8389521 8371144
2434 8371144 8716618 8747005 8910582 9280149 9420281 9395752 9554038 9613908 9928793 9885769
2424 9885769 9835085 9957853 10260567 10594592 10721297 10749518 10860120 11098660 11357233 11502048
$$ packed form
2497A1455905k14263k68548j66631k98277k03166n6523k52641q8750k71724q6695
2487I548687O5904k80853q3063n0338m5422l72345O0945j18793k51751J11041
2477H584012O2957l60401m7248j5171P474K00319k01809n3231j12606l65236k5693
2466G673367j8392O423J87373j73022j7373P0996m5236M5340L85194Q2685l96320
2455G801035k7255K28103j71576R5743J03841j45141J92884l76386J31966K91981
2445H125195M0849O0021L0803o8911P8440J61640J32315j71280N4061n3612j8377
2434H371144L45474L0387J63577L69567J40132k4529J58286N9870L14885m3024
2424I885769n0684J22768L02714L34025J26705K8221J10602K38540K58573J44815
$$ plain form
2414 11502048 11735484 11686502 12022090 12329097 13017518 13081453 13077517 13408375 13927060 14152606
2404 14152606 14251161 14375654 14620675 14876931 15155561 15481753 15563381 15891798 16200151 16539479
2394 16539479 16864556 16877738 17268628 17818543 17928046 18226860 18781160 19037241 19298166 19889024
2384 19889024 20364075 20808304 21526795 22078851 22813161 23408058 24280592 25196357 25966666
2375 25966666 26983975 27958728 29110644 30311997 31352268 32554286 34003932 35723955
2367 35723955 37419126 39400415 41525071 43524535 46034645 48602521 51352715 54403417
2359 54403417 57594381 61097465 64725179 68866195 73578997 78081060 82957814 88081205
2351 88081205 93063986 98067022 103339167 108083838 112630583 116824530 120570135 123657104
$$ packed form
2414A1502048K33436m8982L35588L07007O88421O3935l936L30858N18685K25546
2404A4152606R8555J24493K45021K56256K78630L26192Q1628L28417L08353L39328
2394A6539479L25077J3182L90890N49915J09503K98814N54300K56081K60925N90858
2384A9889024M75051M44229P18491N52056P34310N94897Q72534R15765P70309
2375B5966666J017309R74753J151916J201353J040271J202018J449646J720023
2367C5723955J695171J981289K124656J999464K510110K567876K750194L050702
2359E4403417L190964L503084L627714M141016M712802M502063M876754N123391
2351H8081205M982781N003036N272145M744671M546745M193947L745605L086969
$$ plain form
2343 123657104 125830687 127466743 128137036 128108435 127530801 125698573 122965934 119780319 115791396
2334 115791396 111203509 106298496 101076116 95499194 89790072 84190257 78543048 73174857
2326 73174857 68114232 63679892 59383333 55505605 51777391 48409915 45299586 42712847
2318 42712847 40343643 38231277 36423549 34583850 32831681 31388654 30045031 28736829
2310 28736829 27441252 26626476 25437062 24434837 23585791 22734361 22339661 21527204 20933281
2301 20933281 20363385 19448761 18963589 18589945 18073947 17508951 17019578 16576743 16373557
2292 16373557 16269740 15997992 15692213 15416278 15195871 15043664 14759306 14521611 14410729
2283 14410729 14455792 14408905 13957416 13754213 13522876 13310658 13117167 12716535 12374323 12263280
$$ packed form
2343A23657104K173583J636056O70293k8601n77634j832228k732639l185615l988923
2334A15791396m587887m905013n222380n576922n709122n599815n647209n368191
2326G3174857n060625m434340m296559l877728l728214l367476l110329k586739
2318D2712847k369204k112366j807728j839699j752169j443027j343623j308202
2310B8736829j295577q14776j189414j002225q49046q51430l94700q12457n93923
2301B0933281n69896r14624m85172l73644n15998n64996m89373m42835k03186
2292A6373557j03817k71748l05779k75935k20407j52207k84358k37695j10882
2283A4410729M5063m6887m51489k03203k31337k12218j93491m00632l42212j11043
$$ plain form
2273 12263280 12177730 12026629 11655745 11465088 11606304 11446743 11167439 11173903 11008535 10986136
2263 10986136 11069203 11042769 10875737 10719834 10823108 10879423 10734668 10616496 10407843 10445207
2253 10445207 10206055 10120467 9924670 9871383 10079378 9982482 9877280 9710854 9653608 9552660
2243 9552660 9492707 9696171 9904071 10007514 9687801 9629747 9665989 9873416 9986231 10042511
2233 10042511 10022191 10040954 10104275 10299194 10508918 10578629 10678079 10889430 11078658 11409813
2223 11409813 11657443 11723322 11845314 12253364 12320782 12532626 12929503 13228740 13471773 13774649
2213 13774649 14383157 14614974 14925318 15509447 16021168 16419370 16784159 16917505 17213422
2204 17213422 17544818 17615595 17826853 18210631 18015019 18230164 18412410 18488717 18766286 18739805
$$ packed form
2273A2263280q5550j51101l70884j90657J41216j59561k79304O464j65368k2399
2263A0986136Q3067k6434j67032j55903J03274N6315j44755j18172k08653L7364
2253A0445207k39152q5588j95797n3287K07995r6896j05202j66426n7246j00948
2243I552660n9953K03464K07900J03443l19713n8054L6242K07427J12815N6280
2233A0042511k0320J8763O3321J94919K09724O9711R9450K11351J89228L31155
2223A1409813K47630O5879J21992M08050O7418K11844L96877K99237K43033L02876
2213A3774649O08508K31817L10344N84129N11721L98202L64789J33346K95917
2204A7213422L31396P0777K11258L83778j95612K15145J82246P6307K77569k6481
$$ plain form
2194 18739805 18932510 19232302 19335571 19398752 19658975 19719060 19728286 19743106 19753210 19864741
2184 19864741 20013525 20120419 20188941 20448419 20594354 20603337 20989118 21393832 21937330 22633690
2174 22633690 23334951 23668502 24125768 24931013 25915859 26838070 27811296 28971488 29985652
2165 29985652 31323441 32626937 33994560 35718163 37452525 39224120 41310255 43377747
2157 43377747 45623094 48096303 50739348 53338284 55932038 58872745 61580472 64328652
2149 64328652 66974513 69612502 72063558 74173978 76172165 77795543 79447856 81209821
2141 81209821 83121329 84514464 86151466 87555525 88851109 90068298 91083465 92245423
2133 92245423 92878366 92911084 92697312 92034892 91077772 89748310 88211337 86477978 84635308
$$ packed form
2194A8739805J92705K99792J03269O3181K60223O0085R226J4820J0104J11531
2184A9864741J48784J06894O8522K59478J45935Q983L85781M04714N43498O96360
2174B2633690P01261L33551M57266Q05245R84846R22211R73226J160192J014164
2165B9985652J337789J303496J367623J723603J734362J771595K086135K067492
2157D3377747K245347K473209K643045K598936K593754K940707K707727K748180
2149F4328652K645861K637989K451056K110420J998187J623378J652313J761965
2141H1209821J911508J393135J637002J404059J295584J217189J015167J161958
2133I2245423O32943L2718k13772o62420r57120j329462j536973j733359j842670
$$ plain form
2124 84635308 82571671 80792257 79009343 77184371 75258604 73448707 71576850 69662547
2116 69662547 67587980 65609735 63476432 61185848 58731565 56425597 53942513 51651366
2108 51651366 49326296 46806866 44666320 42300901 39978002 37951467 36139088 34490382
2100 34490382 33198359 31789186 30634093 29576462 28493257 27350871 26284744 25359393
2092 25359393 24443787 24170524 23638811 23250039 22812103 22386747 22251108 22062834 21652717
2083 21652717 21312754 21006070 21132644 21090282 20694474 20860161 20737140 20747981 20722849 20680421
2073 20680421 20597460 20796594 20678051 20553484 20363636 20307249 19854839 19825944 19934283 19688717
2063 19688717 19272420 19159717 18835894 18652611 18379043 18083101 17825721 17409872 16928216
$$ packed form
2124H4635308k063637j779414j782914j824972j925767j809897j871857j914303
2116F9662547k074567j978245k133303k290584k454283k305968k483084k291147
2108E1651366k325070k519430k140546k365419k322899k026535j812379j648706
2100C4490382j292023j409173j155093j057631j083205j142386j066127r25351
2092B5359393r15606k73263n31713l88772m37936m25356j35639j88274m10117
2083B1652717l39963l06684J26574m2362l95808J65687j23021J0841k5132m2428
2073B0680421q2961J99134j18543j24567j89848n6387m52410k8895J08339k45566
2063A9688717m16297j12703l23823j83283k73568k95942k57380m15849m81656
$$ plain form
2054 16928216 16728939 16284231 15654327 15328110 15351754 14979810 14517828 14033973 13512801 13487482
2044 13487482 13786013 13443355 13015529 12650083 12299758 12005058 11840625 11778403 11590979 11427639
2034 11427639 11263773 11112573 11046629 11172050 11049198 10931285 10966927 10938717 11049746 11306143
2024 11306143 11196355 11094674 10900963 11033223 11251827 11278693 11210632 11167689 11378936 11602765
2014 11602765 11435421 11495202 11515492 11551900 11534602 11473257 11418433 11814268 12063485 12338277
2004 12338277 12543267 12691817 12893833 13023671 13215233 13590119 13872182 14178844 14578929
1995 14578929 15043628 15367923 15750498 16309583 16783822 17540137 18247694 18658924 19317280
1986 19317280 20063627 20669744 21100794 21830276 23015798 24120355 25164793 26182868 27288995
$$ packed form
2054A6928216j99277m44708o29904l26217K3644l71944m61982m83855n21172k5319
2044A3487482K98531l42658m27826l65446l50325k94700j64433o2222j87424j63340
2034A1427639j63866j51200o5944J25421j22852j17913L5642k8210J11029K56397
2024A1306143j09788j01681j93711J32260K18604K6866o8061m2943K11247K23829
2014A1602765j67344N9781K0290L6408j7298o1345n4824L95835K49217K74792
2004A2338277K04990J48550K02016J29838J91562L74886K82063L06662M00085
1995A4578929M64699L24295L82575N59085M74239P56315P07557M11230O58356
1986A9317280P46347O06117M31050P29482J185522J104557J044438J018075J106127
$$ plain form
1977 27288995 28514127 29794829 31365437 33036070 34823215 36779849 39076996 41378398
1969 41378398 43810868 46403882 49153014 51969924 54659160 57483415 60200359 63126905
1961 63126905 65617071 67446177 68838921 69837257 70105414 69715993 68739598 66952482 64802024
1952 64802024 62414722 59552319 56495453 53344854 50115303 47087566 44058382 41061002
1944 41061002 38294956 35867529 33797498 31452150 29277977 27475610 26089057 24769999
1936 24769999 23389121 22272708 21073466 20097055 19092514 18239373 17522312 16794003 16141520
1927 16141520 15571185 14970860 14396145 14124048 13726222 13306190 13042889 12738139 12322692
1918 12322692 11698492 11172273 11006311 10868216 10601251 10299041 10071228 9840164 9715241
$$ packed form
1977B7288995J225132J280702J570608J670633J787145J956634K297147K301402
1969D1378398K432470K593014K749132K816910K689236K824255K716944K926546
1961F3126905K490166J829106J392744R98336K68157l89421r76395j787116k150458
1952F4802024k387302k862403l056866l150599l229551l027737l029184k997380
1944D1061002k766046k427427k070031k345348k174173j802367j386553j319058
1936B4769999j380878j116413j199242r76411j004541q53141p17061p28309o52483
1927A6141520n70335o00325n74715k72097l97826m20032k63301l04750m15447
1918A2322692o24200n26219j65962j38095k66965l02210k27813k31064j24923
$$ plain form
1909 9715241 9831976 9405833 9242627 9275278 9056043 8909426 8625783 8459612 8370429 8427523
1899 8427523 8424021 8226056 8445502 8477992 8290132 8222577 8000713 7993306 7905774 7611573 7371028
1888 7371028 7223085 7044342 7270040 7232108 6999540 6810116 6788433 6814927 6551317 6544811
1878 6544811 6539961 6377439 6099051 6152920 6110290 6053164 5847506 5932367 5586215 5490250 5553974
1867 5553974 5539575 5447278 5167504 5210369 5294075 5287615 5282635 5070148 4644791 4718368 4737698
1856 4737698 4871529 4845561 4776524 4971408 4939777 4644782 4792238 4850964 4989264 4789129
1846 4789129 4865094 4953847 4931790 4965220 4835447 4769823 4791433 5090787 4995269 4994059 4953064
1835 4953064 4848854 4886315 4692263 4750985 4924707 5071359 4866255 5184947 5168925 5227927
$$ packed form
1909I715241J16735m26143j63206L2651k19235j46617k83643j66171q9183N7094
1899H427523l502j97965K19446L2490j87860o7555k21864p407q7532k94201k40545
1888G371028j47943j78743K25698l7932k32568j89424k1683K6494k63610o506
1878F544811m850j62522k78388N3869m2630n7126k05658Q4861l46152r5965O3724
1867E553974j4399r2297k79774M2865Q3706o460m980k12487m25357P3577J9330
1856D737698J33831k5968o9037J94884l1631k94995J47456N8726J38300k00135
1846D789129P5965Q8753k2057L3430j29773o5624K1610K99354r5518j210m0995
1835D953064j04210L7461j94052N8722J73722J46652k05104L18692j6022N9002
$$ plain form
1825 5227927 5277654 5061205 4989280 5067962 5285340 5244085 5074221 5042985 5126372 5334859 5315948
1814 5315948 5265487 5422834 5390104 5378331 5259566 5557622 5967589 5967597 5990390 5949684 5889355
1803 5889355 6067342 6068962 6211604 6181898 6103564 5968354 6154592 6297765 6494977 6624874
1793 6624874 6547333 6537977 6812942 7176155 7181003 7320663 7252779 7485629 7686525 7734809 8073973
1782 8073973 8438923 8280674 8295034 8574051 8907944 9150197 9220921 9524172 9749229 9758459
1772 9758459 9824191 10147790 10477398 10663094 10789667 10873323 10979460 11132721 11605716 11890020
1762 11890020 12048376 11998748 12248493 12397585 12591865 13083419 13375958 13603796 13929339 14425461
1752 14425461 14640839 15128138 15589066 16150232 16588926 16760978 17080671 17523836 17886880
$$ packed form
1825E227927M9727k16449p1925P8682K17378m1255j69864l1236Q3387K08487j8911
1814E315948n0461J57347l2730j1773j18765K98056M09967QK2793m0706o0329
1803E889355J77987J620J42642k9706p8334j35210J86238J43173J97212J29897
1793F624874p7541r356K74965L63213M848J39660o7884K32850K00896M8284L39164
1782H073973L64950j58249J4360K79017L33893K42253P0724L03251K25057R230
1772I758459O5732L23599L29608J85696J26573Q3656J06137J53261M72995K84304
1762A1890020J58356m9628K49745J49092J94280M91554K92539K27838L25543M96122
1752A4425461K15378M87299M60928N61166M38694J72052L19693M43165L63044
$$ plain form
1743 17886880 18326391 18733610 19359110 19720096 20287882 20840528 21424390 21955886 22582356
1734 22582356 23381135 24335002 25103719 25998381 26796206 27804175 29236158 30334953 31511198
1725 31511198 33057587 34364553 35977510 37775601 39502692 41422737 43493241 45439128
1717 45439128 47667284 50095620 52666602 55430966 58206880 61093761 64475108 68182158
1709 68182158 72207065 76676262 81401300 86647644 92447074 98703243 106050813 114123043
1701 114123043 122859211 132679341 143464638 155700920 169193693 184258221 200244559
1694 200244559 216528074 232654599 246938191 258332356 265749132 268182021 264908169
1687 264908169 255248612 240403255 222396819 202691834 183256468 165394488 149234311
$$ packed form
1743A7886880M39511M07219O25500L60986N67786N52646N83862N31496O26470
1734B2582356P98779R53867P68717Q94662P97825J007969J431983J098795J176245
1725C1511198J546389J306966J612957J798091J727091J920045K070504J945887
1717D5439128K228156K428336K570982K764364K775914K886881L381347L707050
1709F8182158M024907M469197M725038N246344N799430O256169P347570Q072230
1701A14123043Q736168R820130J0785297J2236282J3492773J5064528J5986338
1694B00244559J6283515J6126525J4283592J1394165P416776K432889l273852
1687B64908169r659557j4845357j8006436j9704985j9435366j7861980j6160177
$$ plain form
1680 149234311 135129678 122918574 112563770 103681375 95659449 88661181 82433107 76843040
1672 76843040 72017545 67727595 63855203 60381033 57321577 54548328 52010212 49687340
1664 49687340 47479035 45461953 43535556 41706510 40057329 38377994 36870389 35318068
1656 35318068 34244664 32987291 32145372 30952626 29705989 28439542 27290104 26423520
1648 26423520 25760959 24720134 23767006 23263045 22763249 22375283 21936212 21501889 21231183
1639 21231183 21018682 20834335 20617546 20567684 20663116 20601382 20296056 20248595 20020482 19695752
1629 19695752 19133178 18467422 17972609 17260470 16485919 15784528 15094558 14373399 13927924
1620 13927924 13550477 12804973 12252411 11949991 11408425 11268689 11011136 10723591 10306236
$$ packed form
1680A49234311j4104633j2211104j0354804q882395q021926o998268o228074n590067
1672G6843040m825495m289950l872392l474170l059456k773249k538116k322872
1664D9687340k208305k017082j926397j829046j649181j679335j507605j552321
1656C5318068j073404j257373q41919j192746j246637j266447j149438q66584
1648B6423520o62561j040825r53128n03961m99796l87966m39071m34323k70706
1639B1231183k12501j84347k16789m9862R5432o1734l05326m7461k28113l24730
1629A9695752n62574o65756m94813p12139p74551p01391o89970p21159m45475
1620A3927924l77447p45504n52562l02420n41566j39736k57553k87545m17355
$$ plain form
1611 10306236 9959723 9740770 9309758 8993188 8865871 8681621 8286435 8308456 8136814 7872479
1601 7872479 7508542 7168897 7016121 7016009 7085653 7193765 7102182 6747235 6510333 6263429
1591 6263429 6122128 5751040 5621012 5406454 5479766 5590786 5431466 5095013 5023991 5014057
1581 5014057 4950269 4801222 5081855 4875536 4750628 4581226 4378954 4347712 4290383 4215595
1571 4215595 4016266 4006332 3948797 3808331 3657541 3598132 3667548 3777594 3581922 3478525
1561 3478525 3658892 3408443 3247239 3183566 3087333 2927143 2819589 2889965 2715379 2832338
1551 2832338 2740533 2744513 2737412 2612461 2626858 2663949 2676584 2644859 2566844 2365267 2497452
1540 2497452 2484773 2297639 2179109 2254055 2407517 2507512 2258842 2426958 2346526 2071119
$$ packed form
1611A0306236l46513k18953m31012l16570j27317j84250l95186K2021j71642k64335
1601G872479l63937l39645j52776j12O9644J08112r1583l54947k36902k46904
1591F263429j41301l71088j30028k14558P3312J11020j59320l36453p1022r934
1581E014057o3788j49047K80633k06319j24908j69402k02272l1242n7329p4788
1571D215595j99329r934n7535j40466j50790n9409O9416J10046j95672j03397
1561C478525J80367k50449j61204o3673r6233j60190j07554P0376j74586J16959
1551B832338r1805L980p101j24951J4397L7091J2635l1725p8015k01577J32185
1540B497452j2679j87134j18530P4946J53462R9995k48670J68116q0432k75407
$$ plain form
1530 2071119 2223224 2129773 1999612 2119170 2254567 2232799 2080818 1801241 1827441 1852543
1520 1852543 1880305 1939099 1839406 1816270 1830423 1578093 1366827 1347872 1482794 1606582 1662045
1509 1662045 1670965 1587184 1394168 1430858 1359515 1188474 1125530 1207111 1244153 1245646 1074818
1498 1074818 1281315 1412809 1351671 1283748 1142462 920193 932923 1129820 1262629 1305146
1488 1305146 1298036 1124104 961802 959831 1050441 854795 855749 925486 966328 1124971 1053493
1477 1053493 994642 1052502 1226265 993287 991243 1070570 831973 848539 791363 773109 905407
1466 905407 864147 1000203 828342 741820 813735 828624 711780 836006 868331 894425 938303
1455 938303 1040081 887969 948534 987220 1165462 991454 779823 609388 483164 710089
$$ packed form
1530B071119J52105r3451j30161J19558J35397k1768j51981k79577K6200K5102
1520A852543K7762N8794r9693k3136J4153k52330k11266j8955J34922J23788N5463
1509A662045Q920q3781j93016L6690p1343j71041o2944Q1581L7042J493j70828
1498A074818K06497J31494o1138o7923j41286k22269J2730J96897J32809M2517
1488A305146p110j73932j62302j971R0610j95646R54O9737M0842J58643p1478
1477A053493n8851N7860J73763k32978k044P9327k38597J6566n7176j8254J32298
1466I05407m1260J36056j71861q6522P1915J4889j16844J24226L2325K6094M3878
1455I38303J01778j52112O0565L8686J78242j74008k11631j70435j26224K26925
$$ plain form
1445 710089 855562 837304 831509 718855 546311 732430 777208 766609 861602 897666 823165
1434 823165 767707 519564 540658 329280 552902 626338 689257 655787 629543 673910 538538
1423 538538 485466 682688 949160 764888 498986 457687 433355 435745 544806 610846 710360
1412 710360 643455 654984 789673 554230 449375 540988 697220 692397 599923 587919 838974
1401 838974 1040191 1302983 1273873 1109023 1077835 1301793 1428256 1522058 1403542 1519169
1391 1519169 1586324 1419145 1592631 1507349 1342243 1277422 1331459 1101475 1153579 1079232 933884
1380 933884 819623 942929 1010344 885822 946259 1099182 974305 754661 728309 649138
1370 649138 848878 686475 377826 384696 300282 563135 494037 267541 454573 513592 394073
$$ packed form
1445G10089J45473j8258n795j12654j72544J86119M4778j0599R4993L6064p4501
1434H23165n5458k48143K1094k11378K23622P3436O2919l3470k6244M4367j35372
1423E38538n3072J97222K66472j84272k65902m1299k4332K390J09061O6040R9514
1412G10360o6905J1529J34689k35443j04855R1613J56232m823r2474j2004K51055
1401H38974K01217K62792k9110j64850l1188K23958J26463R3802j18516J15627
1391A519169O7155j67179J73486q5282j65106o4821N4037k29984N2104p4347j45348
1380I33884j14261J23306O7415j24522O0437J52923j24877k19644k6352p9171
1370F49138J99740j62403l08649O870q4414K62853o9098k26496J87032N9019j19519
$$ plain form
1359 394073 372285 366844 312978 255150 388343 555921 762910 422303 183184 238666 143664
1348 143664 320937 471884 253520 137428 261211 255583 258917 327703 333698 448796 517227
1337 517227 382561 307859 136687 84848 264647 367271 362206 258809 292073 251686 170211
1326 170211 287912 257710 158764 247805 96294 211532 241123 273997 449994 315040 356099
1315 356099 416695 480272 214973 240459 184462 166556 248100 24583 28930 108355 159746
1304 159746 174652 297973 349918 206404 108359 40794 257396 227433 288722 371418 63661
1293 63661 8596 195596 338 155940 206226 -99020 -4520 93333 47425 -7926 92295
1282 92295 115319 102101 -68304 -63796 68254 124601 273506 -21606 -28879 20458 3100
$$ packed form
1359C94073k1788n441n3866n7828J33193J67578K06989l40607k39119N5482r5002
1348A43664J77273J50947k18364j16092J23783n628L334O8786N995J15098O8431
1337E17227j34666p4702j71172n1839J79799J02624n065j03397L3264m0387q1475
1326A70211J17701l0202r8946Q9041j51511J15238K9591L2874J75997j34954M1059
1315C56099O0596O3577k65299K5486n5997j7906Q1544k23517M347P9425N1391
1304A59746J4906J23321N1945j43514r8045o7565K16602k9963O1289Q2696l07757
1293F3661n5065J87000j95258J55602N0286l05246R4500R7853m5908n5351J00221
1282I2295K3024j3218j70405M508J32050N6347J48905k95112p273M9337j7358
$$ plain form
1271 3100 201003 78600 127995 36171 56349 94613 5566 179499 -4934 -86084 65474
1260 65474 -35837 135401 303721 353282 265166 133257 256053 407129 260899 499776
1250 499776 353093 198623 -150688 -139142 7760 20154 24608 28630 122607 182300 418818
1239 418818 432668 243572 8463 -163020 13560 251604 242339 321735 263363 590825 545754
1228 545754 505905 456935 253781 128261 341301 373669 380158 453843 390250 463574 247706
1217 247706 172047 135989 -98715 -33145 340908 431358 509577 207972 342433 536178 147282
1206 147282 110911 46900 -183343 -166035 245302 375267 330940 396892 479625 321735 284895
1195 284895 320203 312714 272252 209410 237525 179586 118973 95931 250535 69103 -959
$$ packed form
1271C100J97903j22403M9395r1824K0178L8264q9047J73933j84433q1150J51558
1260F5474j01311J71238J68320M9561q8116j31909J22796J51076j46230K38877
1250D99776j46683j54470l49311J1546J46902J2394M454M022R3977N9693K36518
1239D18818J3850j89096k35109j71483J76580K38044r265P9396n8372L27462m5071
1228E45754l9849m8970k03154j25520K13040L2368O489P3685o3593P3324k15868
1217B47706p5659l6058k34704O5570L74053R0450P8219l01605J34461J93745l88896
1206A47282l6371o4011k30243J7308M11337J29965m4327O5952Q2733j57890l6840
1195B84895L5308p489m0462o2842K8115n7939o0613k3042J54604j81432p0062
$$ plain form
1184 -959 -31265 -87645 -12552 -199738 -40446 36030 139772 167040 169867 -14255 115891
1173 115891 97556 6 -1050 71036 49527 179797 50497 109824 282450 4173 103246
1162 103246 67698 149613 233653 188380 124602 163042 29324 298484 521857 92408 99967
1151 99967 195592 214973 160859 -93419 -21861 51280 159708 282806 405876 330615 213415
1140 213415 153889 128916 69551 -46746 -45030 -104978 -195927 -402116 -114910 47506 -16269
1129 -16269 221568 95476 -94238 -136149 -59469 48068 164292 118347 152024 -187825 89684
1118 89684 274879 193430 189271 115529 171100 43359 46381 246014 191273 124786 169670 174554
1106 174554 256350 248745 366722 345113 131352 245291 501990 314769 285925 378384 365162
$$ packed form
1184i59l0306n6380P5093j87186J59292P6476J03742K7268K827j84122J30146
1173A15891j8335r7550j056P2086k1509J30270j29300N9327J72626k78277R9073
1162A03246l5548Q1915Q4040m5273o3778L8440j33718K69160K23373m29449P559
1151I9967R5625J9381n4114k54278P1558P3141J08428J23098J23070p5261j17200
1140B13415n9526k4973n9365j16297J716n9948r0949k06189K87206J62416o3775
1129a6269K37837j26092j89714m1911P6680J07537J16224m5945L3677l39849K77509
1118H9684J85195q1449m159p3742N5571j27741L022J99633n4741o6487M4884M884
1106A74554Q1796p605J17977k1609k13761J13939K56699j87221k8844R2459j3222
$$ plain form
1095 365162 93978 140700 306038 291495 319709 218832 40641 7962 4948 185229 124494
1084 124494 189724 214065 248323 265002 121518 325568 271020 294940 285134 195059 193893 330533
1072 330533 591009 495124 180118 353053 377335 332590 403434 496139 584693 546869 527465
1061 527465 361500 255754 215679 267803 342123 401509 547183 625376 640958 658613 517248
1050 517248 649471 649664 772048 656323 528507 630753 751715 793188 840839 794243 806949
1039 806949 868790 815976 946023 1087369 1098128 890646 908198 821461 985627 993549 917671
1028 917671 880452 1014836 1140895 1182768 941160 828725 1037741 911329 783400 956872
1018 956872 1064897 1174171 1151515 1214838 1319720 1407688 1205691 1376100 1568025 1592036
$$ packed form
1095C65162k71184M6722J65338j4543K8214j00877j78191l2679l014J80281o0735
1084A24494O5230K4341L4258J6679j43484K04050n4548K3920r806r0075j166J36640
1072C30533K60476r5885l15006J72935K4282m4745P0844R2705Q8554l7824j9404
1061E27465j65965j05746m0075N2124P4320N9386J45674P8193J5582J7655j41365
1050E17248J32223J93J22384j15725j27816J02246J20962M1473M7651m6596J2706
1039H06949O1841n2814J30047J41346J0759k07482J7552q6737J64166P922p5878
1028I17671l7219J34384J26059M1873k41608j12435K09016j26412j27929J73472
1018I56872J08025J09274k2656O3323J04882Q7968k01997J70409J91925K4011
$$ plain form
1008 1592036 1860960 1663582 1666920 1734664 1827515 1870050 1761998 1856109 2003703 2038324 2030130
997 2030130 2175162 2191713 2308626 2197957 2217381 2269338 2417878 2596496 2473423 2808251
987 2808251 2754043 2822977 3000789 3043766 3212898 3302326 3313483 3470881 3721642 3916942 4091755
976 4091755 4286600 4461412 4730747 5109106 5496472 5962893 6214022 6528840 6719967 7071167
966 7071167 7267891 7806906 8705037 9129376 9655532 10214057 11182040 12070965 13045452 14102462
956 14102462 14879732 15897353 17156502 18780435 20580102 23142735 26465806 30754299
948 30754299 36177165 41761862 47234450 52867085 57200628 60045482 60981579 58907468
940 58907468 52847056 42232692 32773443 26600261 22589057 19585216 17286959 15490789
$$ packed form
1008A592036K68924j97378L338O7744R2851M2535j08052R4111J47594L4621q194
997B030130J45032J6551J16913j10669J9424N1957J48540J78618j23073L34828
987B808251n4208O8934J77812M2977J69132Q9428J1157J57398K50761J95300J74813
976D091755J94845J74812K69335L78359L87366M66421K51129L14818J91127L51200
966G071167J96724N39015Q98131M24339N26156N58525R67983Q88925R74487J057010
956A4102462P77270J017621J259149J623933J799667K562633L323071M288493
948C0754299N422866N584697N472588N632635M333543K844854R36097k074111
940E8907468o060412j0614364r459249o173182m011204l003841k298257j796170
$$ plain form
932 15490789 14185148 13082952 12127918 11249984 10410576 9868902 9365957 8769898 8068594
923 8068594 7452014 6894254 6663375 5997806 5692691 5516230 5373495 5206064 4822593 4567471
913 4567471 4286802 3975975 4022822 3933834 3772549 3678882 3361516 3361899 3043641 2918120 2693398
902 2693398 2602738 2356923 2213176 2363862 2312955 2088642 2205231 2278070 2251028 2174641 2035558
891 2035558 1925168 1949109 1770625 1629443 1604369 1659283 1604513 1651203 1769515 1593806 1391975
880 1391975 1227007 1217961 1206628 1057267 1171493 1226685 1072251 1251439 1313947 1020857 833735
869 833735 891386 738725 749018 801816 907959 762725 755145 683248 823962 852708 698201
858 698201 802153 872930 719946 737787 903699 978392 944755 984991 684651 603734 544581
$$ packed form
932A5490789j305641j102196r55034q77934q39408n41674n02945n96059p01304
923H068594o16580n57760k30879o65569l05115j76461j42735j67431l83471k55122
913D567471k80669l10827M6847q8988j61285r3667l17366L83l18258j25521k24722
902B693398r0660k45815j43747J50686n0907k24313J16589P2839k7042p6387j39083
891B035558j10390K3941j78484j41182k5074N4914n4770M6690J18312j75709k01831
880A391975j64968r046j1333j49361J14226N5192j54434J79188O2508k93090j87122
869H33735N7651j52661J0293N2798J06143j45234p580p1897J40714K8746j54507
858F98201J03952P0777j52984J7841J65912P4693l3637M0236l00340q0917n9153
$$ plain form
847 544581 502076 440302 414027 379919 533289 637781 528716 699008 708630 552312 700425
836 700425 617711 471817 417601 370489 290029 225279 147133 332705 312188 420682 335932
825 335932 120750 310257 273711 138096 91033 82358 84114 504112 508138 433335 273841
814 273841 120437 144572 266747 504051 350285 31528 53583 -99400 -120642 104579
804 104579 181571 216723 153281 211125 12638 61657 145065 284452 262201 185369 190752 164702
792 164702 79701 -97973 -245834 -287002 169635 438719 396371 208431 19025 177221
782 177221 411432 364416 279816 180528 258867 296740 220042 54980 51503 25564 66607 16110
770 16110 49414 45442 -17114 -75487 -204188 -80468 20158 -141990 -209676 -115057 -3253
$$ packed form
847E44581m2505o1774k6275l4108J53370J04492j09065J70292R622j56318J48113
836G00425q2714j45894n4216m7112q0460o4750p8146J85572k0517J08494q4750
825C35932k15182J89507l6546j35615m7063q675J756M19998M026p4803j59494
814B73841j53404K4135J22175K37304j53766l18757K2055j52983k1242K25221
804A04579P6992L5152o3442N7844j98487M9019Q3408J39387k2251p6832N383k6050
792A64702q5001j77674j47861m1168M56637K69084m2348j87940j89406J58196
782A77221K34211m7016q4600r9288P8339L7873p6698j65062l477k5939M1043n0497
770A6110L3304l972o2556n8373j28701J23720J00626j62148o7686R4619J11804
$$ plain form
759 -3253 80153 38213 -123851 -157944 154594 154782 103131 -184989 -61143 183230 79736
748 79736 145221 -145083 -66946 -25682 -28095 -11194 -18725 -1706 -57714 -161391 -105474 20686
736 20686 65980 -36346 112051 -29906 -125945 104531 -37478 97617 193175 74876 194474
725 194474 344290 290860 105757 72708 -9391 57681 -55941 -100462 -172773 -192382 -282355
714 -282355 -104049 122569 318027 117537 -136735 133360 -36834 -138879 -123103 -115354
704 -115354 -105325 -79477 -58796 454 -147856 -89444 35664 -38452 -19188 9755 141018
693 141018 -40027 -220292 30437 2301 -186760 -276033 -144215 -127674 -54052 77242 70466
682 70466 36224 69101 65792 -93775 -184505 81870 149795 53190 149053 182886 162794 294866
$$ packed form
759c253Q3406m1940j62064l4093L12538J88n1651k88120J23846K44373j03494
748G9736O5485k90304P8137M1264k413J6901p531J7019n6008j03677N5917J26160
736B0686M5294j02326J48397j41957r6039K30476j42009J35095R5558j18299J19598
725A94474J49816n3430j85103l3049q2099O7072j13622m4521p2311j9609q9973
714b82355J78306K26618J95458k00490k54272K70095j70194j02045J5776P749
704a15354J0029K5848K0681N9250j48310N8412J25108p4116J9264K8943J31263
693A41018j81045j80265K50729k8136j89061q9273J31818J6541P3622J31294o776
682G0466l4242L2877l309j59567r0730K66375O7925r6605R5863L3833k0092J32072
$$ plain form
670 294866 -86215 -41795 92757 187812 200108 -170780 23921 55960 70870 236175 132625
659 132625 -105028 16159 210637 145343 117297 37851 43407 50100 -142266 -293693 -280370
648 -280370 -221753 146465 270798 205261 -3504 41524 -11476 -68899 207398 58463 -56957
637 -56957 -181300 24488 -49812 82170 -86290 -182685 -87697 54836 -110436 -259928 -197413
626 -197413 -249772 87991 199614 177896 25296 -111459 -174243 -286258 -181307 -55772
616 -55772 82964 -26354 -195433 -245538 -137363 80511 -12926 -32284 -13097 -277273 -244663
605 -244663 -77949 28744 55121 1933 -109541 -197313 -156268 -261233 -166431 -157607 -81129
594 -81129 -245212 -264463 -251093 -27014 156338 -30027 -34077 -96666 -188268 -107981 -224177
$$ packed form
670B94866l81081M4420J34552R5055J2296l70888J94701L2039J4910J65305j03550
659A32625k37653J21187J94478o5294k8046p9446N556O693j92366j51427J3323
648b80370N8617L68218J24333o5537k08765M5028n3000n7423K76297j48935j15420
637e6957j24343K05788p4300J31982j68460r6395R4988J42533j65272j49492O2515
626a97413n2359L37763J11623k1718j52600j36755o2784j12015J04951J25535
616e5772J38736j09318j69079n0105J08175K17874r3437j9358J9187k64176L2610
605b44663J66714J06693K6377n3188j11474q7772M1045j04965R4802Q824P6478
594h1129j64083j9251J3370K24079J83352j86365m050o2589r1602Q0287j16196
$$ plain form
583 -224177 -70318 -6315 -132242 -121885 7831 72636 79164 -8080 -9436 -67965 11932 -102735
571 -102735 -63669 -175483 -255954 -144159 -128017 -49438 -28946 -173924 -152492 -31952 -323104
560 -323104 -444622 -74564 -157007 -306828 -209851 -253351 8190 160815 -176615 -147327 15661
549 15661 76581 -171254 -117022 -83516 -116026 60415 -103460 -94715 -158224 -177387 -116609 -74129
537 -74129 319505 188754 -155361 -61669 -211795 -265702 -153466 91436 -46799 62611
527 62611 -204065 -332472 -194201 -260826 -427511 -178016 -91695 -304577 -246274 26201 112842
516 112842 167899 -92149 -57805 -230365 -103458 -97232 -106522 10047 -61745 -51582 -151219
505 -151219 -279966 -191400 -170351 -75244 -186822 -213125 -50263 -208824 -117097 98842 258016
$$ packed form
583b24177J53859O4003j25927J0357J29716O4805O528q7244j356n8529P9897j14667
571a02735L9066j11814q0471J11795J6142P8579K0492j44978K1432J20540k91152
560c23104j21518L70058q2443j49821R6977m3500K61541J52625l37430K9288J62988
549A5661O0920k47835N4232L3506l2510J76441j63875Q745o3509j9163O0778M2480
537g4129L93634j30751l44115R3692j50126n3907J12236K44902j38235J09410
527F2611k66676j28407J38271o6625j66685K49495Q6321k12882N8303K72475Q6641
516A12842N5057k60048L4344j72560J26907O226r290J16569p1792J0163r9637
505a51219j28747Q8566K1049R5107j11578k6303J62862j58561R1727K15939J59174
$$ plain form
494 258016 -5752 -62154 -74967 -23328 -109450 683 -26162 -150413 -81169 41154 -53324
483 -53324 -112104 -371415 -379611 24275 -115240 -279219 -267540 -347185 -357224 -184174 -184664 66266
471 66266 95617 -12007 -101270 -77727 -80380 -49661 -108673 -79845 -86168 -77911 -222653 -102831
459 -102831 -266749 -456395 -72121 12185 -84154 -144207 -170441 -174877 -24807 -28324 -111760
448 -111760 -123889 -178650 -245622 -146912 -215621 -119267 -227200 -105286 -98093 -140009 -199118 -218318
436 -218318 -163524 -272193 -187778 -119815 -239369 -187050 21798 25791 -21612 -150093 -306969
425 -306969 -223776 -181032 -418716 -597627 -265298 -105382 -186353 -285586 -197605 -305573 -361543
414 -361543 -271125 -322714 -345821 -411652 -408026 -317082 -309929 -223432 -231650 -454233 -356221 -207624
$$ packed form
494B58016k63768n6402j2813N1639q6122J10133k6845j24251O9244J22323r4478
483e3324n8780k59311q196M03886j39515j63979J1679p9645j0039J73050m90K50930
471F6266K9351j07624q9263K3543k653L0719n9012K8828o323Q257j44742J19822
459a02831j63918j89646L84274Q4306r6339o0053k6234m436J50070l517q3436
448a11760j2129n4761o6972R8710o8709R6354j07933J21914P193m1916n9109j9200
436b18318N4794j08669Q4415O7963j19554N2319K08848L993m7403j28481j56876
425c06969Q3193M2744k37684j78911L32329J59916q0971r9233Q7981j07968n5970
414c61543R0418n1589k3107o5831L626R0944P153Q6497q218k22583R8012J48597
$$ plain form
402 -207624 -238063 -125730 -297413 -424059 -210878 -105998 -136691 -190086 -317259 -219019 -228315
391 -228315 -203220 -265069 -300561 -261719 -249380 -323559 -371473 -337560 -300525 -232229 -246515 -3850
379 -3850 -38625 -376205 -218082 -94347 -48803 -148549 85086 10139 -254859 -316764 -178118
368 -178118 -7975 167012 127500 -12953 -70254 -250648 -334737 -557197 -184667 -166037 -267983
357 -267983 -353779 -250863 51503 23571 -194621 -234591 -343935 -353375 -313284 -408920 -458532
346 -458532 -268151 -77268 -220674 -437431 -410759 -400750 -305695 -114737 -180214 -224882 -5314
335 -5314 -5171 -262871 -528790 -432192 -361403 -389632 -507433 -445102 -517892 -323321 -68812 -159251
323 -159251 -264290 -383131 -441594 -119163 -127982 -216991 -245698 -232059 -344374 -267506 -36489
$$ packed form
402b07624l0439J12333j71683j26646K13181J04880l0693n3395j27173R8240r296
391b28315K5095o1849l5492L8842J2339p4179m7914L3913L7035O8296j4286K42665
379c850l4775l37580J58123J23735M5544r9746K33635p4947k64998o1905J38646
368a78118J70143J74987l9512j40453n7301j80394q4089k22460L72530J8630j01946
357b67983q5796J02916L02366k7932k18192l9970j09344r440M0091r5636m9612
346d58532J90381J90883j43406k16757K6672J0009R5055J90958o5477m4668K19568
335e314J43k57700k65919R6598P0789k8229j17801O2331p2790J94571K54509r0439
323a59251j05039j18841n8463L22431q819q9009k8707J3639j12315P6868K31017
$$ plain form
312 -36489 -79068 -198073 -336126 -270786 -291057 -213112 -382781 -301366 -378268 -327255 -273665
301 -273665 -432572 -298127 -228012 -272835 -185499 -303548 -436791 -333135 -402571 -638477 -561757
290 -561757 -612388 -475229 -248818 -123342 -356063 -383997 -279217 -275116 -396698 -472870 -431124
279 -431124 -324607 -196064 -89450 -250723 -413136 -61093 -77961 -425656 -431856 -418178 -414256
268 -414256 -160092 -91366 -85189 -133631 -188048 -279987 -246069 -336391 -474995 -393558 -122152
257 -122152 -374200 -376437 -259703 -173815 -213665 -150870 -24617 -331100 -387899 -273406 -501779
246 -501779 -642976 -458283 -192223 -289118 -340125 -517200 -570747 -495400 -337392 -133756 -482496
235 -482496 -336978 -286904 -542735 -459341 -412388 -332846 -346060 -332610 -330520 -177149 -386365
$$ packed form
312c6489m2579j19005j38053O5340k0271P7945j69669Q1415p6902N1013N3590
301b73665j58907J34445P0115m4823Q7336j18049j33243J03656o9436k35906P6720
290e61757n0631J37159K26411J25476k32721k7934J04780M101j21582p6172M1746
279d31124J06517J28543J06614j61273j62413L52043j6868l47695o200J3678L922
268d14256K54164O8726O177m8442n4417r1939L3918r0322j38604Q1437K71406
257a22152k52048k237J16734Q5888l9850O2795J26253l06483n6799J14493k28373
246e01779j41197J84693K66060r6895n1007j77075n3547P5347J58008K03636l48740
235d82496J45518N0074k55831Q3394M6953P9542j3214J3450K090J53371k09216
$$ plain form
224 -386365 -517329 -386094 -339162 -229971 -257206 -247877 -439190 -550223 -565475 -524006 -346471
213 -346471 -158159 -131544 -190953 -531066 -367855 -453209 -560689 -537792 -512505 -382145 -341663
202 -341663 -216310 -343130 -364224 -232051 -481978 -665141 -437015 -570973 -423969 -460707
192 -460707 -552385 -289635 -220980 -189377 -240987 -133229 -385824 -534285 -408830 -220711 -227666
181 -227666 -45676 -65902 -321844 -259048 -385949 -278578 -111967 -14755 -23896 -246121 -355517
170 -355517 -450595 -360064 -248350 -291695 -318737 -326104 -398040 -310502 -351010 -326966 -205473 -136049
158 -136049 -248249 -402906 -431847 -270901 -226647 -317870 -259760 -240319 -350169 -317439 -264319
147 -264319 -392397 -411575 -246555 -151313 -278059 -339895 -485350 -497619 -574533 -564368 -235600
$$ packed form
224c86365j30964J31235M6932J09191k7235R329j91313j11033j5252M1469J77535
213c46471J88312K6615n9409l40113J63211q5354j07480K2897K5287J30360M0482
202c41663J25353j26820k1094J32173k49927j83163K28126j33958J47004l6738
192d60707r1678K62750O8655L1603n1610J07758k52595j48461J25455J88119o955
181b27666J81990k0226k55942O2796j26901J07371J66611R7212r141k22225j09396
170c55517r5078R0531J11714m3345k7042p367p1936Q7538m0508K4044J21493O9424
158a36049j12200j54657k8941J60946M4254r1223N8110J9441j09850L2730N3120
147b64319j28078j9178J65020R5242j26746o1836j45455j2269p6914J0165L28768
$$ plain form
136 -235600 -255161 -463018 -508310 -552258 -550782 -604964 -473404 -479641 -517750 -400984 -407419 -637532
124 -637532 -505347 -454233 -391262 -305374 -222329 -343093 -499844 -310684 -385209 -378990 -382236
113 -382236 -324747 -427962 -331429 -216576 -140675 -272189 -405176 -481652 -619726 -419438 -416355
102 -416355 -407789 -448739 -541807 -530864 -641209 -669740 -550980 -517817 -449325 -410502 -482038 -426375
90 -426375 -307907 -291652 -455196 -494633 -699002 -566791 -354612 -564648 -489727 -647719 -633259
79 -633259 -525892 -431235 -286715 -285409 -383767 -535343 -586598 -590202 -568773 -468996 -579002 -566290
67 -566290 -531198 -512128 -504653 -564106 -296808 -424951 -434222 -353168 -290587 -429281 -504692 -453024
55 -453024 -452640 -390291 -448109 -365984 -266252 -332722 -403953 -399133 -309291 -305843 -358753 -374776 -507614
$$ packed form
136b35600j9561k07857m5292m3948J476n4182J31560o237l8109J16766o435k30113
124f37532J32185N1114O2971Q5888Q3045j20764j56751J89160p4525O219l246
113c82236N7489j03215R6533J14853P5901j31514j32987p6476j38074K00288L083
102d16355Q566m0950r3068J0943j10345k8531J18760L3163O8492L8823p1536N5663
90d26375J18468J6255j63544l9437k04369J32211K12179k10036P4921j57992J4460
79f33259J07367R4657J44520J306r8358j51576n1255l604K1429R9777j10006J2712
67e66290L5092J9070P475n9453K67298j28143r271Q1054O2581j38694p5411N1668
55d53024L84O2349n7818Q2125R9732o6470p1231M820Q9842L448n2910j6023j32838
$$ plain form
42 -507614 -378763 -469973 -551805 -394692 -398339 -490680 -495865 -579654 -522906 -447566 -457706 -486505
30 -486505 -515407 -351680 -269092 -211149 -268322 -455061 -558002 -479755 -457001 -499410 -354061
19 -354061 -516378 -470092 -490319 -513659 -376391 -371039 -460340 -497558 -508594 -418798 -475871 -525767
7 -525767 -506305 -540891 -445355 -496198 -561474 -532434 -587297
0 -587297
$$ packed form
42e07614J28851r1210q1832J57113l647r2341n185q3789N6748P5340j0140k8799
30d86505k8902J63727Q2588N7943n7173j86739j02941P8247K2754m2409J45349
19c54061j62317M6286k0227k3340J37268N352q9301l7218j1036Q9796n7073m9896
7e25767J9462l4586R5536n0843o5276K9040n4863
0e87297
$$ Imaginary data points
##PAGE= N=2
##DATA TABLE= (X++(I..I)), XYDATA
$$ plain form
16383 -3265664 -3347968 -3224747 -3261856 -3287524 -3331601 -3130407 -3006532 -3004140 -2889863 -2779789
16373 -2779789 -2842027 -2875049 -2755245 -2697667 -2633330 -2728146 -2654634 -2594923 -2609093 -2632892 -2604997
16362 -2604997 -2508248 -2525435 -2411736 -2333842 -2134985 -2061003 -2051883 -2039735 -2150446 -2157965 -2138165
16351 -2138165 -2052713 -2028945 -1997488 -1967650 -1897929 -1742065 -1940777 -1928551 -1889988 -1873483 -1807128
16340 -1807128 -1782893 -1813836 -1717349 -1671545 -1646651 -1563972 -1445494 -1362964 -1329916 -1380579 -1438474
16329 -1438474 -1455168 -1372727 -1325510 -1282518 -1295272 -1401072 -1386687 -1258751 -1229214 -1374966 -1460029
16318 -1460029 -1390509 -1155736 -952259 -991672 -1042438 -991555 -791542 -707174 -652639 -513691
16308 -513691 -507106 -631223 -665197 -629504 -403420 -432468 -475474 -434463 -641162 -598450 -569744
$$ packed form
16383c265664q2304J23221l7109k5668m4077K01194J23875K392J14277J10074
16373b779789o2238l3022J19804N7578O4337r4816P3512N9711j4170k3799K7895
16362b604997R6749j7187J13699P7894J98857P3982R120J2148j10711p519J9800
16351b138165Q5452K3768L1457K9838O9721J55864j98712J2226L8563J6505O6355
16340a807128K4235l0943R6487M5804K4894Q2679J18478Q2530L3048n0663n7895
16329a438474j6694Q2441M7217M2992j2754j05800J4385J27936K9537j45752q5063
16318a460029O9520K34773K03477l9413n0766N0883K00013Q4368N4535J38948
16308e13691O585j24117l3974L5693K26084k9048m3006M1011k06699M2712K8706
$$ plain form
16297 -569744 -527422 -438079 -358261 -341588 -255404 -297969 -316113 -261993 -116464 -183220 -48581
16286 -48581 -47033 -35101 -13591 -194701 34248 129879 141404 116272 -32998 170277 338613
16275 338613 210618 209599 332236 257468 303313 335328 160776 229160 368354 525494 644745
16264 644745 567136 589500 549183 551470 547763 643528 662528 806473 577871 679287 777044
16253 777044 925536 681118 664536 805447 770339 835683 1015753 1054894 1032421 961810 696348
16242 696348 632344 535831 609613 739260 1053619 1097692 899349 980614 1083084 1004065 944234
16231 944234 851556 1115682 1109425 997844 993909 1176557 1160015 1087191 1138090 1217094 1134867
16220 1134867 1126430 1074144 1163869 1394416 1352275 1467534 1272431 1243658 1190537 1193749 1477313
$$ packed form
16297e69744M2322Q9343P9818J6673Q6184m2565j8144N4120J45529o6756J34639
16286d8581J548J1932K1510j81110K28949R5631J1525k5132j49270K03275J68336
16275C38613j27995j019J22637p4768M5845L2015j74552O8384J39194J57140J19251
16264F44745p7609K2364m0317K287l707R5765J9000J43945k28602J01416R7757
16253G77044J48492k44418j6582J40911l5108O5344J80070L9141k2473p0611k65462
16242F96348o4004r6513P3782J29647L14359M4073j98343Q1265J02470p9019n9831
16231I44234r2678K64126o257j11581l935J82648j6542p2824N0899P9004q2227
16220A134867q437n2286Q9725K30547m2141J15259j95103k8773n3121L212K83564
$$ plain form
16209 1477313 1429935 1252675 1239663 1129147 1075129 1176034 1357227 1642796 1776246 1772778
16199 1772778 1459772 1503035 1508816 1520146 1527307 1475416 1625236 1658410 1792439 1661582 1471318
16188 1471318 1454137 1622821 1583461 1621064 1855943 1966829 1724726 1582204 1663252 1522360
16178 1522360 1518147 1613561 1675367 1575224 1529519 1577587 1691808 1583878 1779711 2162558
16168 2162558 2096364 1850178 1799186 1706496 1800119 1854893 2067731 2026157 1873024 1967725 1902796
16157 1902796 1759143 1861039 1920643 1791045 1631853 1775815 1869493 1883340 1911756 1982750
16147 1982750 2073035 2162530 2120366 2209390 2138766 1916717 2064635 2033674 1999279 2036236 2008532
16136 2008532 2139579 1912136 1762415 1557086 1882977 2113725 2068618 2048724 1983339 2227183
$$ packed form
16209A477313m7378j77260j3012j10516n4018J00905J81193K85569J33450l468
16199A772778l13006M3263N781J1330P161n1891J49820L3174J34029j30857j90264
16188A471318j7181J68684l9360L7603K34879J10886k42103j42522Q1048j40892
16178A522360m213R5414O1806j00143m5705M8068J14221j07930J95833L82847
16168B162558o6194k46186n0992r2690R3623N4774K12838m1574j53133R4701o4929
16157A902796j43653J01896N9604j29598j59192J43962R3678J3847K8416P0994
16147A982750R0285Q9495m2164Q9024p0624k22049J47918l0961l4395L6957k7704
16136B008532J31047k27443j49721k05329L25891K30748m5107j9894o5385K43844
$$ plain form
16126 2227183 2208869 2185284 2113431 2089239 2065192 2149564 2187969 2321401 2268848 2051236 1956756
16115 1956756 2184208 1990815 1990056 2167178 2259640 2286483 2292860 2354931 2287752 2178146 2312499
16104 2312499 2266904 2207152 2162901 2242805 2241419 2260305 2147866 2024518 2186600 2397702 2299385
16093 2299385 1986456 2038609 2158298 2141536 2153232 2139452 2158606 1913312 1884073 2088539
16083 2088539 2149444 2089062 2017250 2129598 2163605 2268815 2369267 2328700 2301471 2203238 2070368
16072 2070368 2001441 2053716 2301825 2336733 2316255 2193683 2374052 2343623 2355039 2354117 2419550
16061 2419550 2246341 2131432 2288464 2100344 1890017 1986249 2242439 2217894 2229940 2275635
16051 2275635 2070839 2011305 2100675 2028612 2069014 2182470 2093080 2150690 2200375 2011954 2037902
$$ packed form
16126B227183j8314k3585p1853k4192k4047Q4372L8405J33432n2553k17612r4480
16115A956756K27452j93393p59J77122R2462K6843O377O2071o7179j09606J34353
16104B312499m5595n9752m4251P9904j386J8886j12439j23348J62082K11102r8317
16093B299385l12929N2153J19689j6762J1696j3780J9154k45294k9239K04466
16083B088539O0905o0382p1812J12348L4007J05210J00452m0567k7229r8233j32870
16072B070368o8927N2275K48109L4908k0478j22572J80369l0429J1416r22O5433
16061B419550j73209j14909J57032j88120k10327R6232K56190k4545J2046M5695
16051B275635k04796n9534Q9370p2063M0402J13456q9390N7610M9685j88421K5948
$$ plain form
16040 2037902 2128530 2002406 2036068 2160887 2124166 1994204 2139837 2154366 2070220 2123882
16030 2123882 2100086 2189886 2040990 2244438 2138821 2024724 1968896 2157943 2194720 2248702
16020 2248702 2242123 2184241 2288750 2191613 2019809 2033843 2101565 2124850 2187278 2127822 2368021
16009 2368021 2466418 2122981 1971405 2144355 2091925 2206855 2322117 2256102 2171430 1975552
15999 1975552 2066491 2169545 2216570 2292542 2426586 2151919 2026938 2156927 2090777 2221741
15989 2221741 2303458 2205712 2087967 2217481 2322976 2097182 2168545 2176563 2220076 2370374
15979 2370374 2173837 2060452 2298742 2547993 2340167 2369650 2263471 2138381 2018914 2469277
15969 2469277 2619753 2629425 2437971 2359507 2248433 2207454 2106246 2115671 2171465 2081681 2018706
$$ packed form
16040B037902R0628j26124L3662J24819l6721j29962J45633J4529q4146N3662
16030B123882k3796Q9800j48896K03448j05617j14097n5828J89047L6777N3982
16020B248702o579n7882J04509r7137j71804J4034O7722K3285O2428n9456K40199
16009B368021R8397l43437j51576J72950n2430J14930J15262o6015q4672j95878
15999A975552R0939J03054M7025P5972J34044k74667j24981J29989o6150J30964
15989B221741Q1717r7746j17745J29514J05495k25794P1363Q018M3513J50298
15979B370374j96537j13385K38290K49251k07826K9483j06179j25090j19467M50363
15969B469277J50476R672j91454p8464j11074m0979j01208R425N5794q9784o2975
$$ plain form
15958 2018706 2364436 2566320 2366331 2189892 1891511 2059382 2061280 2158331 2351873 2249279
15948 2249279 2330159 2199014 1931905 1903272 1949046 2024419 2173423 2338627 2339885 2242245 2102429
15937 2102429 2240474 2168504 2176565 2333317 2422094 2393866 2448189 2283590 2373253 2310447 2284841
15926 2284841 2307901 2473746 2381338 2240762 2250784 2186145 2271911 2172671 2313456 2185763
15916 2185763 2207596 2221397 2110503 2217980 2503694 2445456 2284265 2348866 2141394 2168088
15906 2168088 2401463 2636082 2281172 2325650 2336109 2426440 2201087 2023284 2177936 2090176
15896 2090176 2125686 2197690 2157853 2264296 2366676 2308049 2265731 2205402 2297838 2406425 2464935
15885 2464935 2459725 2326690 2230840 2198349 2117091 2172992 2031490 2123496 2241277 2365331 2156595
$$ packed form
15958B018706L45730K01884j99989j76439k98381J67871J898R7051J93542j02594
15948B249279Q0880j31145k67109k8633M5774P5373J49004J65204J258r7640j39816
15937B102429J38045p1970Q061J56752Q8777k8228N4323j64599Q9663o2806k5606
15926B284841K3060J65845r2408j40576J0022o4639Q5766r9240J40785j27693
15916B185763K1833J3801j10894J07477K85714n8238j61191O4601k07472K6694
15906B168088K33375K34619l54910M4478J0459R0331k25353j77803J54652q7760
15896B090176L5510P2004l9837J06443J02380n8627m2318o0329R2436J08587N8510
15885B464935n210j33035r5850l2491q1258N5901j41502R2006J17781J24054k08736
$$ plain form
15874 2156595 2035608 2032748 1932153 2175781 2325474 2453911 2579800 2407218 2280372 2327032
15864 2327032 2307114 2176103 2381766 2301123 2322947 2143764 2122178 2247757 2394756 2350451
15854 2350451 2511387 2498055 2347508 2337631 2493223 2199949 1942958 2151288 2370750 2216267
15844 2216267 2174329 2215505 2104274 2145276 2405899 2663102 2553491 2401265 2230371 2266504
15834 2266504 2368954 2284708 2216746 2444781 2516525 2538667 2366830 2307846 2437641 2720519
15824 2720519 2674126 2302298 2378973 2632938 2604455 2475280 2231624 2391251 2312050 2267992
15814 2267992 2221461 2354016 2350062 2397963 2391274 2384700 2357484 2401409 2241042 2409055 2283560
15803 2283560 2288995 2457909 2378308 2307374 2252254 2287596 2311271 2438194 2447221 2424453 2441955
$$ packed form
15874B156595j20987k860j00595K43628J49693J28437J25889j72582j26846M6660
15864B327032j9918j31011K05663q0643K1824j79183k1586J25579J46999m4305
15854B350451J60936j3332j50547r877J55592k93274k56991K08330K19462j54483
15844B216267m1938M1176j11231M1002K60623K57203j09611j52226j70894L6133
15834B266504J02450q4246o7962K28035P1744K2142j71837n8984J29795K82878
15824B720519m6393l71828P6675K53965k8483j29175k43656J59627p9201m4058
15814B267992m6531J32555l954M7901o689o574k7216M3925j60367J68013j25495
15803B283560N435J68914p9601p0934n5120L5342K3675J26923R027k2768J7502
$$ plain form
15792 2441955 2433045 2320062 2264911 2409463 2513011 2568523 2439426 2276732 2209313 2046981
15782 2046981 2428613 2485794 2302718 2342229 2218533 2015618 2035663 1925123 1962481 2280939
15772 2280939 2207838 2094890 2104922 2229920 2241762 2346616 2569982 2476822 2382092 2161611
15762 2161611 2271487 2388996 2371927 2299229 2419250 2381568 2281046 2379558 2316149 2238532
15752 2238532 2350850 2213517 2214660 2261283 2225358 2341899 2456058 2604625 2412540 2183247
15742 2183247 2371588 2363778 2376581 2286367 2233095 2382969 2236359 2196783 2445333 2338401
15732 2338401 2333151 2234803 2421863 2261375 2163908 2364068 2363885 2268541 2398995 2487091 2235435
15721 2235435 2250276 2328072 2621724 2502036 2472880 2772618 2739396 2479804 2547531 2467709
$$ packed form
15792B441955q910j12983n5151J44552J03548N5512j29097j62694o7419j62332
15782B046981L81632N7181j83076L9511j23696k02915K0045j10540L7358L18458
15772B280939p3101j12948J0032J24998J1842J04854K23366r3160r4730k20481
15762B161611J09876J17509j7069p2698J20021l7682j00522R8512o3409p7617
15752B238532J12318j37333J143M6623l5925J16541J14159J48567j92085k29293
15742B183247J88341p810J2803r0214n3272J49874j46610l9576K48550j06932
15732B338401n250r8348J87060j60488r7467K00160j83r5344J30454Q8096k51656
15721B235435J4841P7796K93652j19688k9156K99738l3222k59592O7727p9822
$$ plain form
15711 2467709 2447172 2498314 2270088 2215041 2285077 2127773 2227751 2340321 2038622 2197901
15701 2197901 2426242 2295513 2241263 2105594 2108735 2305401 2190826 2331711 2554302 2461994
15691 2461994 2533566 2366839 2275570 2524662 2496697 2479261 2394257 2357581 2427460 2442144 2517233
15680 2517233 2400716 2339439 2280682 2368313 2250353 2486241 2591290 2605517 2506857 2468978
15670 2468978 2359676 2211456 2247198 2289031 2150979 2157044 2216596 2214405 2451914 2483804 2417301
15659 2417301 2398689 2249194 2476282 2451546 2402073 2416018 2308863 2466081 2443238 2462732
15649 2462732 2352760 2527097 2464338 2376222 2429383 2325887 2384734 2504044 2360565 2290613
15639 2290613 2239401 2391255 2290099 2227357 2173696 2143949 2072518 2102740 2295334 2411975
$$ packed form
15711B467709k0537N1142k28226n5047P0036j57304R9978J12570l01699J59279
15701B197901K28341j30729n4250j35669L141J96666j14575J40885K22591r2308
15691B461994P1572j66727r1269K49092k7965j7436q5004l6676O9879J4684P5089
15680B517233j16517o1277n8757Q7631j17960K35888J05049J4227r8660l7879
15670B468978j09302j48220L5742M1833j38052O065N9552k191K37509L1890o6503
15659B417301j8612j49495K27088k4736m9473J3945j07155J57218k2843J9494
15649B462732j09972J74337o2759q8116N3161j03496N8847J19310j43479o9952
15639B290613n1212J51854j01156o2742n3661k9747p1431L0222J92594J16641
$$ plain form
15629 2411975 2520661 2162715 2047978 2302443 2475060 2624251 2530465 2237822 2416662 2382271
15619 2382271 2255833 2374475 2214495 2320232 2295498 2377036 2413114 2406845 2587180 2524151
15609 2524151 2532113 2324857 2360593 2403520 2378519 2429769 2415359 2284945 2400050 2439743 2498343
15598 2498343 2631754 2613999 2606064 2476288 2378547 2411659 2464159 2311414 2204071 2293099 2505191
15587 2505191 2483315 2442123 2609827 2490439 2495859 2644161 2421190 2366375 2292642 2355791 2179818
15576 2179818 2365822 2224576 2043233 2195447 2248049 2514022 2527102 2414531 2427725 2414761
15566 2414761 2406580 2491217 2518812 2567197 2584057 2569603 2483589 2565759 2490590 2276380 2004738
15555 2004738 1979732 2074949 2093913 2181481 2356476 2200634 2214582 2354655 2344995 2514777 2444310
$$ packed form
15629B411975J08686l57946j14737K54465J72617J49191r3786k92643J78840l4391
15619B382271j26438J18642j59980J05737k4734Q1538L6078o269J80335o3029
15609B524151P962k07256L5736M2927k5001N1250j4410j30414J15105L9693N8600
15598B498343J33411j7755p935j29776r7741L3112N2500j52745j07343Q9028K12092
15587B505191k1876m1192J67704j19388N420J48302k22971n4815p3733O3149j75973
15576B179818J86004j41246j81343J52214N2602K65973J3080j12571J3194j2964
15566B414761q181Q4637K7595M8385J6860j4454q6014Q2170p5169k14210k71642
15555B004738k5006R5217J8964Q7568J74995j55842J3948J40073r660J69782p0467
$$ plain form
15544 2444310 2308491 2209573 2350159 2390371 2497797 2518224 2721985 2764734 2729401 2518751
15534 2518751 2310333 2329369 2296004 2313820 2445061 2314967 2343680 2308219 2246657 2631674
15524 2631674 2613474 2455590 2359949 2463707 2429964 2314296 2277896 2460336 2379192 2502990
15514 2502990 2688454 2654475 2631576 2639615 2593746 2540520 2183877 2322091 2465479 2550674 2747107
15503 2747107 2803718 2653336 2364582 2411396 2538951 2565746 2526470 2527001 2643283 2684403 2659471
15492 2659471 2427931 2365717 2415007 2496256 2424048 2356464 2328361 2259949 2399770 2430838 2390144
15481 2390144 2380969 2302589 2384423 2195549 2356310 2409929 2329127 2320197 2357099 2540576 2318646
15470 2318646 2244214 2286084 2320186 2414052 2532253 2352272 2461206 2495182 2597203 2512448
$$ packed form
15544B444310j35819r8918J40586M0212J07426K0427K03761M2749l5333k10650
15534B518751k08418J9036l3365J7816J31241j30094K8713l5461o1562L85017
15524B631674j8200j57884r5641J03758l3743j15668l6400J82440q1144J23798
15514B502990J85464l3979k2899Q039m5869n3226l56643J38214J43388Q5195J96433
15503B747107N6611j50382k88754M6814J27555K6795l9276N31J16282M1120k4932
15492B659471k31540o2214M9290Q1249p2208o7584k8103o8412J39821L1068m0694
15481B390144r175p8380Q1834j88874J60761N3619q0802q930L6902J83477k21930
15470B318646p4432M1870L4102R3866J18201j79981J08934L3976J02021q4755
$$ plain form
15460 2512448 2341115 2259681 2175115 2183070 2342922 2491063 2268655 2169124 2207658 2276429 2200629
15449 2200629 2219195 2364747 2395740 2318884 2382397 2391178 2131427 2212040 2251701 2464801 2347109
15438 2347109 2220433 2408653 2611447 2497140 2379544 2206866 2381650 2422204 2466198 2406162
15428 2406162 2340907 2462017 2561430 2239731 2369236 2603368 2237277 2165565 2428985 2443617
15418 2443617 2555579 2629066 2394504 2430651 2478593 2459318 2481116 2590592 2303232 2402542
15408 2402542 2391826 2400408 2570546 2603009 2622828 2567025 2413062 2198081 2338089 2435414 2363562
15397 2363562 2412442 2339364 2388863 2350890 2233361 2445149 2756959 2801425 2628044 2461088
15387 2461088 2334534 2379332 2314583 2483800 2553910 2374407 2414514 2395361 2526102 2266557
$$ packed form
15460B512448j71333q1434q4566P955J59852J48141k22408r9531L8534O8771p5800
15449B200629J8566J45552L0993p6856O3513Q781k59751Q0613L9661K13100j17692
15438B347109j26676J88220K02794j14307j17596j72678J74784M0554M3994o0036
15428B406162o5255J21110R9413l21699J29505K34132l66091p1712K63420J4632
15418B443617J11962P3487k34562L6147M7942j9275K1798J09476k87360R9310
15408B402542j0716Q582J70138L2463J9819n5803j53963k14981J40008R7325p1852
15397B363562M8880p3078M9499l7973j17529K11788L11810M4466j73381j66956
15387B461088j26554M4798o4749J69217P0110j79503M0107j9153J30741k59545
$$ plain form
15377 2266557 2427301 2230893 2333844 2451703 2356503 2335490 2479951 2608676 2549357 2350998
15367 2350998 2576364 2729994 2564006 2507694 2618887 2524762 2077745 2024414 2250072 2620057
15357 2620057 2547793 2566672 2502728 2620154 2283564 1905526 2040218 2359133 2343402 2339165
15347 2339165 2411539 2444386 2628874 2512690 2254831 2403752 2501962 2294413 2255530 2422559
15337 2422559 2321442 2158887 2519661 2677402 2555138 2445066 2378807 2465723 2424932 2508227
15327 2508227 2521027 2577162 2474013 2322911 2172303 2171351 2278582 2410899 2429716 2440564 2364147
15316 2364147 2268816 2187394 2164708 2310089 2258291 2158883 2170271 2305459 2549289 2540945 2609501
15305 2609501 2595057 2532486 2315703 2335981 2723062 2522492 2611019 2648898 2613696 2570707 2405401
$$ packed form
15377B266557J60744j96408J02951J17859r5200k1013J44461J28725n9319j98359
15367B350998K25366J53630j65988n6312J11193r4125m47017n3331K25658L69985
15357B620057p2264J8879o3944J17426l36590l78038J34692L18915j5731m237
15347B339165P2374L2847J84488j16184k57859J48921R8210k07549l8883J67029
15337B422559j01117j62555L60774J57741j22264j10072o6259Q6916m0791Q3295
15327B508227J2800N6135j03149j51102j50608r52J07231J32317J8817J0848p6417
15316B364147r5331q1422k2686J45381n1798r9408J1388J35188K43830q344O8556
15305B609501j4444o2571k16783K0278L87081k00570Q8527L7879l5202m2989j65306
$$ plain form
15294 2405401 2403153 2522499 2737050 2676669 2371307 2414849 2333127 2412888 2503683 2802324 2645683
15283 2645683 2427168 2459191 2582865 2448548 2386390 2518432 2508496 2356460 2291903 2416617
15273 2416617 2436610 2336641 2133424 2387014 2451578 2333308 2300249 2479150 2388283 2300827
15263 2300827 2325364 2491926 2525929 2361040 2333952 2435350 2506251 2331105 2341026 2421570 2547812
15252 2547812 2623090 2442014 2226022 2219743 2233045 2256952 2339060 2307404 2457966 2393200 2393343
15241 2393343 2399030 2204094 2078629 2220655 2287852 2235792 2454110 2580638 2274035 2208158
15231 2208158 2207605 2422967 2715344 2649456 2602100 2374076 2445431 2351690 2393097 2406157 2365252
15220 2365252 2100027 2446487 2461063 2055597 2124011 2496456 2523811 2482802 2544211 2457130
$$ packed form
15294B405401k248J19346K14551o0381l05362M3542q1722P9761R0795K98641j56641
15283B645683k18515L2023J23674j34317o2158J32042r936j52036o4557J24714
15273B416617J9993r9969k03217K53590O4564j18270l3059J78901r0867q7456
15263B300827K4537J66562L4003j64889k7088J01398P0901j75146R921Q0544J26242
15252B547812P5278j81076k15992o279J3302K3907Q2108l1656J50562o4766J43
15241B393343N687j94936j25465J42026O7197n2060K18318J26528l06603o5877
15231B208158n53K15362K92377o5888m7356k28024P1355r3741M1407J3060m0905
15220B365252k65225L46460J4576m05466O8414L72445K7355m1009O1409q7081
$$ plain form
15210 2457130 2386630 2426370 2574433 2508272 2232786 2163860 2205561 2319544 2365169 2349137 2577715
15199 2577715 2508546 2635345 2590234 2496640 2407673 2168883 2043626 2241450 2309309 2383587
15189 2383587 2508213 2445496 2348191 2299075 2412226 2558631 2410937 2367213 2337879 2459575
15179 2459575 2547566 2670886 2668933 2546522 2446807 2548667 2532299 2545870 2468637 2468983 2548680
15168 2548680 2602763 2436600 2426781 2671102 2843478 2728172 2504394 2464342 2561624 2373787
15158 2373787 2225738 2510170 2620781 2490989 2506306 2542632 2612874 2648827 2592854 2662304
15148 2662304 2448417 2471619 2590154 2364109 2443405 2431243 2221407 2373611 2504501 2405616
15138 2405616 2289154 2209035 2292629 2412649 2449070 2858242 2767302 2538766 2591440 2706311
$$ packed form
15210B457130p0500L9740J48063o6161k75486o8926M1701J13983M5625j6032K28578
15199B577715o9169J26799m5111r3594q8967k38790j25257J97824O7859P4278
15189B383587J24626o2717r7305m9116J13151J46405j47694m3724k9334J21696
15179B459575Q7991J23320j953j22411r9715J01860j6368J3571p7233L46P9697
15168B548680N4083j66163r819K44321J72376j15306k23778m0052R7282j87837
15158B373787j48049K84432J10611j29792J5317L6326P0242L5953n5973O9450
15148B662304k13887K3202J18535k26045P9296j2162k09836J52204J30890r8885
15138B405616j16462q0119Q3594J20020L6421M09172r0940k28536N2674J14871
$$ plain form
15128 2706311 2859053 2836481 2834434 2906043 2796059 2712159 2694261 2530366 2506884 2325866 2343838
15117 2343838 2627450 2535323 2647777 2656718 2506221 2581619 2621573 2676265 2673125 2682459 2548575
15106 2548575 2690272 2585041 2722944 2620461 2250824 2388230 2369272 2363095 2468108 2677230
15096 2677230 2551654 2548982 2681952 2642227 2587766 2666174 2605607 2738585 2540409 2717446
15086 2717446 2752042 2752657 2618022 2453410 2288552 2604212 2695985 2528558 2360553 2283711
15076 2283711 2415532 2528305 2530626 2458334 2534756 2438220 2662209 2798652 2529616 2435709
15066 2435709 2691178 2611694 2771020 2649863 2840767 2574687 2517346 2599434 2428462 2388432
$$ packed form
15128B706311J52742k2572k047P1609j09984q3900j7898j63895k3482j81018J7972
15117B343838K83612r2127J12454Q941j50497P5398L9954N4692l140R334j33884
15106B548575J41697j05231J37903j02483l69637J37406j8958o177J05013K09122
15096B677230j25576k672J32970l9725n4461P8408o0567J32978j98176J77037
15086B717446L4596O15j34635j64612j64858L15660R1773j67427j68005p6842
15076B283711J31821J12773K321p2292P6422r6536K23989J36443k69036r3907
15066B435709K55469p9484J59326j21157J90904k66080n7341Q2088j70972m0030
$$ [...]
##END NTUPLES=NMR SPECTRUM
##END=
