##TITLE=1H_CG-1142-D
 CDCl3, 8 sc, 
 11.06.2021
##JCAMPDX= 6.0         $$ Bruker NMR JCAMP-DX V2.0
##DATA TYPE= NMR SPECTRUM
##DATA CLASS= NTUPLES
##ORIGIN= UXNMR, Bruker Analytische Messtechnik GmbH
##OWNER= root
$$ XWIN-NMR		Version 3.5
$$ Fri Jun 11 10:47:06 2021 Russian Standard Time (UT+4h)  she@DPX200
##.OBSERVE FREQUENCY= 200.131506
##.OBSERVE NUCLEUS= ^1H
##.ACQUISITION MODE= SIMULTANEOUS
##.ACQUISITION SCHEME= undefined
##.AVERAGES= 8
##.DIGITISER RES= 18
##SPECTROMETER/DATA SYSTEM= spect
##.PULSE SEQUENCE= zg30
##.SOLVENT NAME= CDCl3
##.SHIFT REFERENCE= (INTERNAL, CDCl3, 0, 17.5044)
##AUDIT TRAIL= $$ (NUMBER, WHEN, WHO, WHERE, WHAT)
$$ ##TITLE= Audit trail, XWIN-NMR		Version 3.5
$$ ##JCAMPDX= 5.01
$$ ##ORIGIN= Bruker BioSpin GmbH
$$ ##OWNER= she
$$ F:/spectra/data/she/nmr/H-F/1/pdata/1/auditp.txt
$$ ##AUDIT TRAIL=  $$ (NUMBER, WHEN, WHO, WHERE, WHAT)
(   1,<2021-06-11 10:44:50.89 +0400>,<she>,<DPX200>,
      <created by zg, POWCHK disabled, PULCHK disabled
       configuration hash MD5:
       00 E9 B6 7A A2 85 ED C7 34 08 36 98 17 FE 4E 26
       data hash MD5: 16K
       53 AD CB 2D 16 B4 47 FD 94 EC 00 E0 F7 BF 1A 37>)
(   2,<2021-06-11 10:45:00.28 +0400>,<she>,<DPX200>,
      <Start of raw data processing
       efp BC_mod = 2 LB = 0.24 FT_mod = 6 PKNL = 1 PHC0 = -11473.01 PHC1 = -6.59899 SI = 16K 
       data hash MD5: 16K
       3D 58 C3 B7 26 09 2A AF E0 9E F5 0E F1 20 28 CA>)
(   3,<2021-06-11 10:45:28.29 +0400>,<she>,<DPX200>,
      <pk PHC0 = -10.78901 PHC1 = 18.2 
       data hash MD5: 16K
       7B 4B 7B A9 82 86 29 7B 82 5B 17 C2 6C 27 9C FB>)
(   4,<2021-06-11 10:45:32.34 +0400>,<she>,<DPX200>,
      <abs ABSG = 5 
       data hash MD5: 16K
       3D D2 D1 18 2E 81 1B 7B E0 EC CB 37 65 05 68 69>)
$$ ##END=
$$ 
$$ hash MD5
$$ 0C 7D 89 C2 7A 83 D7 74 89 BB 96 4C B3 5F 0C 82
##$RELAX= 
##$RELAX= 
##$RELAX= 
##$RELAX= 
##$RELAX= 
##$RELAX= 
$$ Bruker specific parameters
$$ --------------------------
##$DU= <F:/spectra>
##$EXPNO= 1
##$NAME= <H-F>
##$PROCNO= 1
##$TYPE= <nmr>
##$USER= <she>
##$AMP= (0..31)
100 100 100 100 100 100 100 100 100 100 100 100 100 100 100 100 100 100 
100 100 100 100 100 100 100 100 100 100 100 100 100 100 
##$AQSEQ= 0
##$AQ_mod= 1
##$AUNM= <au_zg>
##$AUTOPOS= <>
##$BF1= 200.13
##$BF2= 200.13
##$BF3= 200.13
##$BF4= 200.13
##$BF5= 200.13
##$BF6= 200.13
##$BF7= 200.13
##$BF8= 200.13
##$BYTORDA= 1
##$CFDGTYP= 0
##$CFRGTYP= 5
##$CHEMSTR= <none>
##$CNST= (0..31)
1 1 145 1 1 1 1 1 1 1 1 1 1 1 1 1 1 1 1 1 1 1 1 1 1 1 1 1 1 1 1 1 
##$CPDPRG= <>
##$CPDPRG1= <>
##$CPDPRG2= <>
##$CPDPRG3= <>
##$CPDPRG4= <mlev>
##$CPDPRG5= <mlev>
##$CPDPRG6= <mlev>
##$CPDPRG7= <mlev>
##$CPDPRG8= <mlev>
##$CPDPRGB= <>
##$CPDPRGT= <>
##$D= (0..31)
0 1.2 0 0 0 0 0 0 0 0.06 0 0.03 0 0 0 0 0.0002 0 0 0 0 0 0 0 0 0 0 0 0 
0 0 0 
##$DATE= 1623393890
##$DBL= (0..7)
120 120 120 120 120 120 120 120 
##$DBP= (0..7)
150 150 150 150 150 150 150 150 
##$DBP07= 0
##$DBPNAM0= <>
##$DBPNAM1= <>
##$DBPNAM2= <>
##$DBPNAM3= <>
##$DBPNAM4= <>
$$ [...]
##$SUBNAM3= <"">
##$SUBNAM4= <"">
##$SUBNAM5= <"">
##$SUBNAM6= <"">
##$SUBNAM7= <"">
##$SUBNAM8= <"">
##$SUBNAM9= <"">
##$SW= 20.0188882624521
##$SWIBOX= (0..15)
0 0 2 0 0 0 0 0 0 0 0 0 0 0 0 0 
##$SW_h= 4006.41025641026
##$TD= 16384
##$TD0= 1
##$TE= 0
##$TE2= 300
##$TE3= 300
##$TEG= 300
##$TL= (0..7)
0 120 120 120 120 120 120 120 
##$TP= (0..7)
150 150 150 150 150 150 150 150 
##$TP07= 0
##$TPNAME0= <>
##$TPNAME1= <>
##$TPNAME2= <>
##$TPNAME3= <>
##$TPNAME4= <>
##$TPNAME5= <>
##$TPNAME6= <>
##$TPNAME7= <>
##$TPOAL= (0..7)
0.5 0.5 0.5 0.5 0.5 0.5 0.5 0.5 
##$TPOFFS= (0..7)
0 0 0 0 0 0 0 0 
##$TUNHIN= 0
##$TUNHOUT= 0
##$TUNXOUT= 0
##$USERA1= <user>
##$USERA2= <user>
##$USERA3= <user>
##$USERA4= <user>
##$USERA5= <user>
##$V9= 5
##$VALIST= <valist>
##$VCLIST= <CCCCCCCCCCCCCCC>
##$VD= 0
##$VDLIST= <DDDDDDDDDDDDDDD>
##$VPLIST= <PPPPPPPPPPPPPPP>
##$VTLIST= <TTTTTTTTTTTTTTT>
##$WBST= 1024
##$WBSW= 4
##$XGAIN= (0..3)
0 0 0 0 
##$XL= 0
##$YL= 0
##$YMAX_a= 300849
##$YMIN_a= -242143
##$ZGOPTNS= <>
##$ZL1= 120
##$ZL2= 120
##$ZL3= 120
##$ZL4= 120
##$ABSF1= 17.53255
##$ABSF2= -2.486488
##$ABSG= 5
##$ABSL= 3
##$ALPHA= 0
##$AQORDER= 0
##$ASSFAC= 0
##$ASSFACI= 0
##$ASSFACX= 0
##$ASSWID= 0
##$AUNMP= <proc_1d>
##$AZFE= 0.1
##$AZFW= 0.1
##$BCFW= 0
##$BC_mod= 2
##$BYTORDP= 0
##$COROFFS= 0
##$CY= -3
##$DATMOD= 1
##$DC= 0
##$DFILT= <>
##$DTYPP= 0
##$F1P= 0
##$F2P= 0
##$FCOR= 1
##$FTSIZE= 16384
##$FT_mod= 6
##$GAMMA= 0
##$GB= 0
##$INTBC= 1
##$INTSCL= 1.334414e-10
##$ISEN= 128
##$LB= 0.24
##$LEV0= 0
##$LPBIN= 0
##$MAXI= 10000
##$MC2= 0
##$MEAN= 0
##$ME_mod= 0
##$MI= 1.114404
##$NCOEF= 0
##$NC_proc= -6
##$NLEV= 6
##$NOISF1= 3.799351
##$NOISF2= 2.8
##$NSP= 0
##$NTH_PI= 0
##$NZP= 0
##$OFFSET= 17.50444
##$PC= 1
##$PHC0= -11483.8
##$PHC1= 11.60101
##$PH_mod= 1
##$PKNL= yes
##$PPARMOD= 0
##$PSCAL= 0
##$PSIGN= 0
##$REVERSE= no
##$SF= 200.130006042654
##$SI= 16384
##$SIGF1= 3
##$SIGF2= 2
##$SINO= 5.538805
##$SIOLD= 16384
##$SREGLST= <1H.CDCl3>
##$SSB= 0
##$STSI= 16384
##$STSR= 0
##$SW_p= 4006.41025641026
##$SYMM= 0
##$S_DEV= 0
##$TDeff= 16384
##$TDoff= 0
##$TI= <>
##$TILT= no
##$TM1= 0
##$TM2= 0
##$TOPLEV= 0
##$USERP1= <user>
##$USERP2= <user>
##$USERP3= <user>
##$USERP4= <user>
##$USERP5= <user>
##$WDW= 1
##$XDIM= 16384
##$YMAX_p= 288357369
##$YMIN_p= -280306
$$ End of Bruker specific parameters
$$ ---------------------------------
##NTUPLES= NMR SPECTRUM
##VAR_NAME=  FREQUENCY,     SPECTRUM/REAL,   SPECTRUM/IMAG
##SYMBOL=    X,             R,               I
##VAR_TYPE=  INDEPENDENT,   DEPENDENT,       DEPENDENT
##VAR_FORM=  AFFN,          ASDF,            ASDF
##VAR_DIM=   16384,         16384,           16384
##UNITS=     HZ,            ARBITRARY UNITS, ARBITRARY UNITS
##FACTOR=    0.24454680195387, 1,            1
##FIRST=     3503.1637445367, 0,             0
##LAST=      -503.246511873556, 0,           0
##MIN=       -503.246511873556, -280306,     0
##MAX=       3503.1637445367, 288357369,     0
$$ Real data points
##PAGE= N=1
##DATA TABLE= (X++(R..R)), XYDATA
$$ [...]
5594A9318418j420044j049658r35080p30488o08933j12743K1300N7942L92768
$$ 19318418 17898374 16848716 15913636 15183148 14574215 14461472 14482772 14540714 14933482
5585A4933482P11034Q18082R73971J319037J666114J869840K345609K409245L027331
$$ 14933482 15644516 16462598 17436569 18755606 20421720 22291560 24637169 27046414 30073745
5576C0073745L359515L379000L275472K725693J830675L93055j341574l193053
$$ 30073745 33433260 36812260 40087732 42813425 44644100 45037155 43695581 40502528
5568D0502528m251917m212546l664746l081487k404837j857816j554939j199445
$$ 40502528 36250611 32038065 28373319 25291832 22886995 21029179 19474240 18274795
5560A8274795r54734o99598m74173l17614O452J25282K41057N32570P15716R33095
$$ 18274795 17320061 16620463 16146290 15828676 15835128 15960410 16201467 16734037 17449753 18382848
5550A8382848Q90362J076846J161767J236847J033654O83687J80132n28667j324712
$$ 18382848 19273210 20350056 21511823 22748670 23782324 24466011 24646143 24117476 22792764
5541B2792764j932060k156472k120377j799442j499405j296788r94475j021869
$$ 22792764 20860704 18704232 16583855 14784413 13285008 11988220 10993745 9971876
5533I971876q66096n55278p31839n17246m76165k66525l64363m76492l58206r6838
$$ 9971876 9105780 8550502 7818663 7301417 6825252 6558727 6194364 5717872 5359666 5262828
5523E262828l30907l22354j35130j83939j37486j32833j60754j06369j27068j10023
$$ 5262828 4931921 4609567 4474437 4290498 4153012 4020179 3859425 3753056 3625988 3515965
5513C515965l61842j13224r4696l9579j43872q8303n5643j01687O110j60459r6283
$$ 3515965 3154123 3040899 2946203 2906624 2762752 2674449 2618806 2517119 2523229 2362770 2266487
5502B266487o340j413O7167j34281n3566r9296M183J59517N6611j28447o8175
$$ 2266487 2260147 2258734 2325901 2191620 2138054 2038758 2042941 2202458 2259069 2130622 2062447
5491B062447j01042R3970k1560n4110m7886j23101j2117r198j49978j78931k05104
$$ 2062447 1961405 2055375 2033815 1979705 1931819 1808718 1796601 1787403 1637425 1458494 1253390
5480A253390p9517k556K7436n1132J9391M640l5857k5628q2416N4179j072K0295
$$ 1253390 1173873 1171317 1198753 1147621 1167012 1171652 1135795 1110167 1027751 1081930 1080858 1101153
5468A101153K7235K45K5693K0947j39678O6000R1439J68592j35686l2114M5541
$$ 1101153 1128388 1128633 1154326 1175273 1035595 1101595 1193034 1361626 1225940 1193826 1239367
5457A239367j69588j3740r4209p0283L1383L1676r898n1778l8252k8269O2789
$$ 1239367 1069779 1056039 961830 891547 922930 954606 944708 892930 854678 826409 889198
5446H89198j57736k7918L2166m4409k5965O6521l1129p1630k13750m3652O3274
$$ 889198 731462 703544 735710 691301 665336 731857 700728 629098 415348 371696 434970
5435D34970J27622P5l9488L7018O096l7426l9135K7899k2334j36328O5341R6293
$$ 434970 562592 562667 523179 560197 566293 528867 489732 517631 495297 358969 424310 520603
5423E20603K4989r1024n148j23408L2949r668R144r0981L4172P2044R8838m1281
$$ 520603 545592 454568 449420 326012 358961 349293 358437 267456 301628 373672 472510 431229
5411D31229m9336j5952j22982L0816M7754q572k6630N5821n489K1954j03557L169
$$ 431229 381893 365941 242959 273775 321529 312957 286327 342148 336659 358613 255056 258225
5399B58225J9269J21589M8585p5132j4367p207m0542L4489k2921l8868q1433J2122
$$ 258225 277494 399083 447668 372536 358169 350962 310420 344909 321988 283120 201687 213809
5387B13809J35303J02662j20236n6885K9662M3410j11849R0475j22579Q5650j2186
$$ 213809 349112 451774 331538 274653 304315 347725 235876 326351 203772 289422 277236
5376B77236O7553P2621P5352n4795k5629o4870k1757L6442j12622R6158J00954
$$ 277236 344789 417410 492762 437967 412338 347468 325711 362153 249531 345689 446643
5365D46643L7764R9933j0386p7647O1931n9399J01001M8724J3012L1805o3774
$$ 446643 484407 584340 573954 496307 558238 498839 599840 648564 661576 693381 629607
5354F29607r4982J8683J5623J66404n5680p4353P1886p7541l7001O5066o3279
$$ 629607 534625 553308 568931 735335 679655 605302 677188 599647 562646 627712 564433
5343E64433K4886p4061L0855m2558k8477n3956J37261O2096Q0167j9624o5743
$$ 564433 589319 515258 546113 503555 475078 421122 558383 620479 700646 681022 615279
5332F15279J46063K8011O4667j24004j2824O017j2747p6925l3020j7838Q4958
$$ 615279 761342 789353 854020 730016 717192 723209 710462 633537 600517 582679 667637
5321F67637n1959J915R5728N1553J0888m8113j8279m1020j9299J49499O3932p6780
$$ 667637 615678 617593 713321 764874 775762 727649 709370 668350 649051 798550 862482 785702
5309G85702M8108O7818p0913R3542q8275K5307J29797J0791p9590L7171K3718
$$ 785702 833810 901628 830715 924257 835982 861289 991086 1001877 922287 959458 983176
5298I83176j80870K4730L3889J23592n3513j13831o0063R6353J5570o1351p0553
$$ 983176 802306 827036 860925 984517 931004 817173 757110 853463 869033 807682 737129
5287G37129R0628M969n5349p342r109j63129P1985l582j05978O0925L1004o9957
$$ 737129 827757 832726 777377 770035 760926 597797 669782 666200 560222 621147 652151 582194
5275E82194k606P6515k9584m117n1237O5970Q1651j25716o3980J11728m1041j23760
$$ 582194 579588 656103 626519 622402 571165 637135 718786 593070 529090 640818 599777 476017
5263D76017Q757O6659k0856o756K0638r8868n1658N1097M4024N9339K0080k0648
$$ 476017 484774 551433 530577 523821 544459 445591 393933 445030 489054 548393 568473 547825
5251E47825q4090M8984J949j01032M0177j3026l2721P480n3926R7727L8106J6176
$$ 547825 463735 512719 514668 413636 453813 440787 408066 415546 361620 459347 497453 513629
5239E13629q3036P9588j5427j2342l046k1115o2592q088J84967J1377p2758Q9874
$$ 513629 430593 510181 494754 482412 479366 458251 395659 387571 572538 583915 511157 601031
5227F01031k6837L8394Q777j5898k9675K6889j5620k1345m4050n0584P0187j03174
$$ 601031 574194 612588 621365 605467 575792 602681 587061 565716 521666 471082 541269 438095
5215D38095O7879O6106K5412j07308L4227J9798j4232l0289O0693k3959o5418
$$ 438095 505974 572080 597492 490184 524411 544209 529977 499688 560381 536422 471004
5204D71004J05837L2490m4455j22901J2846M8730J28358Q8488J04032K9305p758
$$ 471004 576841 609331 564876 441975 454821 503551 631909 720397 824429 853734 845976
5193H45976O5496r7393r0070J05106J57026L4410r7623o5393o6182r217J3908
$$ 845976 911472 814079 724009 829115 986141 1020551 922928 857535 791353 782136 796044
5182G96044o0406n5508j1143J32565j20802j5337Q1903m530Q5966j00351l1071
$$ 796044 735638 680130 668987 801552 680750 665413 747316 742786 828752 728401 697330
5171F97330K0883n2523J17646n160L7288K0544j50701N0746J01184L9954r7815
$$ 697330 718213 665690 783336 778176 815464 836008 685307 736053 837237 877191 779376
5160G79376L3100P5634R974j36010O5770l0388j5596O1517P278J14855q1241n4816
$$ 779376 812476 888110 898084 762074 827844 797456 781860 843377 850655 965510 884269 829453
5148H29453J84417R3272r2076J48104O1343J27837l0785O2230J06152l4392K8753
$$ 829453 1013870 1107142 1015066 1163170 1224513 1352350 1321565 1383795 1489947 1455555 1484308
5137A484308J37463j3589L9305M689K3386k5402N1578o3668o7357m7219n9742
$$ 1484308 1621771 1608182 1647487 1652176 1675562 1650160 1701738 1638070 1570713 1523494 1463752
5126A463752J7985j1377p8936J38107R1414k7793J32675O1626m9487K693k4193
$$ 1463752 1481737 1470360 1391424 1529531 1620945 1593152 1725827 1787453 1737966 1740659 1716466
5115A716466k6093R3628l8096m4969j11879L3438L6906l9865P0835K1544N6018
$$ 1716466 1690373 1784001 1745905 1700936 1589057 1622495 1659401 1619536 1690371 1711915 1767933
5104A767933J6066P9590J89579n7708J2677J88044P1880Q2586R3223R7275K20393
$$ 1767933 1783999 1863589 2053168 1995460 2008137 2196181 2268061 2350647 2443870 2541145 2761538
5093B761538J24236R5133J78756J13680m9550Q267Q967M0334l6337J1143J2381
$$ 2761538 2885774 2980907 3159663 3273343 3223793 3232060 3241027 3281361 3245024 3256167 3268548
5082C268548M4084J29296O1351L2642J9150J50813K13840R5844J97035J72611
$$ 3268548 3312632 3441928 3503279 3535921 3555071 3705884 3919724 4015568 4212603 4385214
5072D385214K90305K80855K80856K91338L76178L45767L67570L91488M28044M13128
$$ 4385214 4675519 4956374 5237230 5528568 5904746 6250513 6618083 7009571 7437615 7850743
5062G850743L76618K08900j9207r5898n0584m113J87274L47774L43252L27945
$$ 7850743 8227361 8436261 8417054 8321156 8270572 8266459 8453733 8801507 9144759 9472704
5052I472704M44367O06696Q32749Q00954Q93019J200457J386907J656851J831843
$$ 9472704 9917071 10523767 11356516 12157470 13050489 14250946 15637853 17294704 19126547
5043A9126547K100235K604635K948514L457167L922913M254428M560827M561940
$$ 19126547 21226782 23831417 26779931 30237098 34160011 38414439 42975266 47537206
5035D7537206M675363M720297M416154L484363K533657J470636K99963j054920
$$ 47537206 52212569 56932866 61349020 64833383 67367040 68837676 69137639 68082719
5027F8082719k648303l540772m011629m210652m223057m197981m137431m086610
$$ 68082719 65434416 61893644 57882015 53671363 49448306 45250325 41112894 37026284
5019C7026284l550764l407806l127684k650574k073704j984139j666410j404676
$$ 37026284 33475520 30067714 26940030 24289456 22215752 20231613 18565203 17160527
5011A7160527j284569j050096j003065p23465p48094o73333m75167n18879p21927
$$ 17160527 15875958 14825862 13822797 13099332 12351238 11677905 11202738 10683859 9961932
5002I961932n68673o56194m80682m10811n13319k61002l34036l35489k71537l63309
$$ 9961932 9393259 8737065 8256383 7845572 7332253 7071251 6737215 6401726 6130189 5766880
4992E766880j93230j66049j07854l10509k32913p5060j34989r4934k94751j53309
$$ 5766880 5573650 5407601 5299747 4989238 4756325 4681265 4546276 4451342 4156591 4003282
4982D003282j11384n8186j49526r1574j4074j5792k5872k76766o619p2262k01759
$$ 4003282 3891898 3833712 3684186 3592612 3578538 3562746 3536874 3260108 3253489 3181227 2979468
4971B979468p147r1294j12251n1895J24959q1879o0049j08345n8041k5710l1239
$$ 2979468 2972321 2881027 2768776 2716881 2841840 2759961 2699912 2591567 2533526 2507816 2476577
4960B476577r7017q6350l7376l8928j00346o3001j18799q7351N5645K33J00283
$$ 2476577 2379560 2293210 2255834 2216906 2116560 2053559 1934760 1847409 1903054 1903287 2003570
4949B003570o5281j54203o7522k3015m834P1369p3528j36577P1142K7883K7052
$$ 2003570 1938289 1784086 1716564 1693549 1688715 1760084 1686556 1549979 1621121 1649004 1676056
4938A676056M0340l9137J1104K22l4016M9937q5562n2826n7157J31355N1659m3470
$$ 1676056 1716396 1677259 1688363 1688585 1654569 1704506 1618944 1566118 1508961 1640316 1691975 1648505
4926A648505Q8217L3162J3183n1129o912k7515M1148j6114l9446l7863m306P824
$$ 1648505 1736722 1769884 1783067 1731938 1725026 1697511 1738659 1722545 1683099 1645236 1640930 1648754
4914A648754n234p8711k8650n2L83K5325j37467r3789k5713j8290K9659m4097
$$ 1648754 1643520 1564809 1536159 1536107 1536490 1561815 1424348 1330559 1304846 1286556 1316215 1272118
4902A272118l3127p6792J1212L5269n7496n5565P6179M6830k0522L3740L6806
$$ 1272118 1238991 1162199 1173411 1208680 1151184 1095619 1171798 1218628 1198106 1231846 1268652
4891A268652p4951O8206L067K327J06077J05521m1259k0800n2918j2893O7042
$$ 1268652 1193701 1261907 1264974 1267301 1373378 1478899 1437640 1416840 1363922 1351029 1418071
4880A418071M2234O0129Q1726O5156j09083r290J00727M1326J74861L9757j3235
$$ 1418071 1460305 1520434 1602160 1667316 1558233 1548943 1649670 1690996 1865857 1905614 1892379
4869A892379J42781J44691O9284J4631O3120m9367n935M9013N6373R0072N1501
$$ 1892379 2035160 2179851 2249135 2263766 2326886 2277519 2271584 2320597 2376970 2467042 2518543
4858B518543p121J54881K3037j5366J02895J80196J29007J64868J48719J89771
$$ 2518543 2511422 2666303 2689340 2673974 2776869 2957065 3086072 3250940 3399659 3589430
4848C589430N21699M34970M16908N97387Q83470J128213J252688J597658K222383
$$ 3589430 4111129 4546099 4963007 5560394 6443864 7572077 8824765 10422423 12644806
4839A2644806K784518K576489K070776J181742J286061K179432L052662J251422
$$ 12644806 15429324 18005813 20076589 21258331 22544392 24723824 27776486 29027908
4831B9027908l044564l695931l339862l701989k808313k035694j515468j145386
$$ 29027908 25983344 22287413 18947551 15245562 12437249 10401555 8886087 7740701
4823G740701r16475o73416n66735m10812k46213k77176l81014k33432j90550j90644
$$ 7740701 6824226 6150810 5584075 5173263 4927050 4649874 4268860 4035428 3844878 3654234
4813C654234j02642j68139j84297j94798k25380j25844r9904l6946k48298j24801
$$ 3654234 3551592 3383453 3199156 3004358 2778978 2653134 2553230 2516284 2267986 2143185
4803B143185P7290o0904j08879K582j03281r6706m5500j33635L2376j24823o7794
$$ 2143185 2220475 2159571 2050692 2053274 1949993 1853287 1807787 1674152 1706528 1581705 1513911
4792A513911N7203m3556K542q7293j5504N3341J6323m8145j62765l6329J9368
$$ 1513911 1571114 1527558 1530100 1442807 1427303 1480644 1496967 1448822 1286057 1249728 1269096
4781A269096j993l4902M3403j2196J8445j8850j45243q4401J19435j69774m1382
$$ 1269096 1267103 1232201 1275604 1263408 1281853 1263003 1117760 1033359 1152794 983020 941638
4770I41638P7628m5458J5409O0636N303l1814m794L2444J66356K8726l1638l0412
$$ 941638 1019266 973808 989217 1049853 1055156 1023342 1018548 1050992 1217348 1246074 1214436 1184024
4758A184024l8635k7766q9992m3454Q0950m7017J26286k9429j04R8117q0374n2469
$$ 1184024 1145389 1117623 1027631 984177 1065127 1018110 1144396 1114967 1114863 1212980 1132606 1080137
4746A080137M9856L3358k0838J26295P0631J4007J588r684N2081j8269k21591
$$ 1080137 1129993 1163351 1142513 1268808 1339439 1353446 1355034 1345350 1397431 1379162 1157571
4735A157571j53677m4167j4775l3030P8090j33600o0042K3298K5150j01786J5224
$$ 1157571 1003894 959727 944952 911922 990012 856412 796370 819668 844818 743032 758256
4724G58256J91519r8973J6303Q456o5244j64039J4868j43796O5309J40119l6626
$$ 758256 949775 850802 867105 875561 810317 646278 661146 517350 582659 722778 686152
4713F86152m086k7080J21614k2879j3502K9364k1238j16122j7084J01001j6572
$$ 686152 682066 654986 776600 753721 740219 769583 748345 632223 615139 716140 699568
4702F99568q6902j0415L1749Q3888o6707M5259J08908M8984p998P406L6282P3956
$$ 699568 612666 602251 634000 717888 651181 696440 805348 854332 846334 853740 890022 963978
4690I63978J9037o1343K4252J5525N2854J30449L9909Q524J19045O4570o8841
$$ 963978 983015 921672 945924 961449 1014303 1144752 1184661 1193185 1312230 1376800 1307959
4679A307959o1519J7145j96147M1527O8316o4700p9332r9272J25016J8749l5632
$$ 1307959 1246440 1263585 1067438 1108965 1177281 1112581 1033249 933977 1058993 1077742 1042110
4668A042110R6122r03J27467K0249q1865J10003Q7712J396K8294m3898M1927m2600
$$ 1042110 1138232 1137329 1264796 1285045 1203180 1313183 1400895 1402291 1430585 1386687 1428614 1386014
4656A386014j1311o5561m1665m7817K4773P1317Q3414L0709j46930j7350J07772
$$ 1386014 1374703 1309142 1267477 1219660 1244433 1315750 1399164 1429873 1282943 1265593 1373365
4645A373365k8160q8673O8477L645k596q4950K19590Q5195q8735r6441j02275
$$ 1373365 1345205 1256532 1325009 1328654 1326058 1241108 1460698 1545893 1457158 1360717 1258442
4634A258442K809l7620P1976l3961j00169J2557P4845p7515o3025P2846n486q8
$$ 1258442 1261251 1223631 1295607 1261646 1161477 1174034 1248879 1171364 1108339 1181185 1175699 1175611
4622A175611K9669j35569k2094J12459R8051L9864j55151P6557L8509O0457M1521
$$ 1175611 1205280 1069711 1047617 1160076 1258127 1297991 1142840 1219397 1257906 1318363 1359884
4611A359884M6366q9613o9381N3549p929M8837M7632K6332q1518K0766J7601L1241
$$ 1359884 1406250 1316637 1247256 1300805 1292876 1341713 1389345 1415677 1334159 1354925 1372526 1403767
4599A403767L3324K0999n3041m9982O7480L6047J43869o9033j47114J07749J4401
$$ 1403767 1437091 1458090 1405049 1355067 1422547 1458594 1602463 1533430 1386316 1494065 1508466
4588A508466q9067m6381J00904L578j1360K8433P5981o2564P1869M1462q3247
$$ 1508466 1419399 1373018 1473922 1477500 1466140 1494573 1570554 1507990 1579859 1621321 1538074
4577A538074K1532k5308L2140J7248N1017o5951J01566k8961J1067J6609J9350
$$ 1538074 1559606 1534298 1566438 1583686 1634703 1568752 1670318 1641357 1652424 1669033 1688383
4566A688383O3743J2627Q6130O8626L2777r392K086p154j8605P8560O7103K7157
$$ 1688383 1752126 1764753 1850883 1919509 1952286 1942894 1944980 1937826 1919221 1997781 2064884 2092041
4554B092041Q9448q3072J76063P2169N081L3586N9611L8823n7139J7570R2152
$$ 2092041 2181489 2098417 2274480 2346649 2351730 2385316 2444927 2483750 2426611 2444181 2536333
4543B536333j0273n7631k2597L6923K5861L6698J72490K975O2676j1401J9568
$$ 2536333 2526060 2468429 2445832 2482755 2508616 2545314 2717804 2720779 2783455 2772054 2791622
4532B791622J17346O2193m234L1045L7934P0411p482K1183J18741N5804N8655
$$ 2791622 2908968 2971161 2966927 2997972 3035906 3106317 3098835 3120018 3238759 3294563 3353218
4521C353218O6224J44880N3665J40791K24392L9226J07696J71320K45952L7158
$$ 3353218 3419442 3564322 3617987 3758778 3983170 4022396 4130092 4301412 4547364 4584522
4511D584522k8662J6249J13800P7636L9772K52057J18971J48740J46035K41353
$$ 4584522 4555860 4572109 4685909 4763545 4803317 5055374 5174345 5323085 5469120 5710473
4501E710473K13297J50798N7094K22463K10806J49500J49763J14954L16449K12138
$$ 5710473 5923770 6074568 6131662 6354125 6564931 6714431 6864194 6979148 7295597 7507735
4491G507735J18064K30256K97311K06383R9484K79174L21940M09849M17472L10848
$$ 7507735 7625799 7856055 8153366 8359749 8459233 8738407 9060347 9470196 9887668 10198516
4481A0198516L92486M81088N08899O25469P64365P97085R72549J253135J434396
$$ 10198516 10591002 11072090 11580989 12206458 12970823 13767908 14740457 15993592 17427988
4472A7427988J614523K051232K636737L417695M072247M792891N985863P254500
$$ 17427988 19042511 21093743 23730480 27148175 31220422 36013313 41999176 49253676
4464D9253676Q907287J0161284R947076R608870R448556O369314p82758q113542
$$ 49253676 58160963 68322247 78269323 87878193 97326749 103696063 102913305 94799763
4456I4799763j4639835j5841040j1982736q282893n662953m184680l167517k573137
$$ 94799763 80159928 64318888 52336152 44053259 38390306 34205626 31038109 28464972
4448B8464972j915414j535879j354205r03360o46210n88096m49445k74542n2311
$$ 28464972 26549558 25013679 23659474 22756114 22109904 21521808 21072363 20797821 20745510
4439B0745510j65243j83627p9397p6834L4227J07772J66824K24778K71677K53835
$$ 20745510 20580267 20396640 20317243 20240409 20274636 20382408 20549232 20774010 21045687 21299522
4429B1299522J57922K55123L67313M83841M31162N73701O63724O92921N95767
$$ 21299522 21457444 21712567 22079880 22563721 22994883 23568584 24232308 24925229 25520996
4420B5520996O68701P51752R40451J046056J266907J695828J831477K158892K680256
$$ 25520996 26189697 26941449 27881900 28927956 30194863 31890691 33722168 35881060 38561316
4411C8561316L362756M075375M944620N829050P117225Q647913J0379470J0977033
$$ 38561316 41924072 45999447 50944067 56773117 63890342 72538255 82917725 93894758
4403I3894758J0722689J1565079J1848427O687680j143461l955738q032247j2862023
$$ 93894758 104617447 116182526 128030953 134718633 133575172 129619434 121587187 108725164
4395A08725164j1145498p316419m505702k440189j072840j10783O93937J435251
$$ 108725164 97579666 90263247 85757545 83317356 82244516 82133733 82827670 84262921
4387H4262921J820208K020311K176809K191322K007552J664177J270406P45244
$$ 84262921 86083129 88103440 90280249 92471571 94479123 96143300 97413706 98158950
4379I8158950j23349j200295k036678l030412m043492m511401m788623m486094
$$ 98158950 98035601 96835306 94798628 91768216 87724724 83213323 78424700 73938606
4371G3938606m013256l189206k394477j775384r00074r77689r99042j289867k252763
$$ 73938606 69925350 66736144 64341667 62566283 61666209 60688520 59689478 58399611 56146848
4362E6146848l095190l840222m043694l644120l109439k528484k365028j918278
$$ 56146848 53051658 49211436 45167742 41523622 38414183 35885699 33520671 31602393
4354C1602393j665413j361110j172559j092274q47746o94305q37910m59165m15834
$$ 31602393 29936980 28575870 27403311 26311037 25463291 24768986 23931076 23471911 23056077
4345B3056077n76564l81964m89840m68248p15642n40202m61488o35765p10158
$$ 23056077 22479513 22097549 21607709 21139461 20423819 19883617 19422129 18786364 18076206
4336A8076206n71536n56815n54121m97697m04839l46313m79259m26682m13865
$$ 18076206 17504670 16947855 16393734 15896037 15491198 15144885 14665626 14238944 13825079
4327A3825079l82796l07916l84637l82993n47445m68229l90948j92466k11172
$$ 13825079 13442283 13134367 12749730 12366737 11819292 11351063 10960115 10767649 10556477
4318A0556477l62139l44602k06045k03112k96934j60194k69627j69207p8348j98770
$$ 10556477 10194338 9849736 9643691 9440579 9143645 8983451 8713824 8544617 8466269 8267499
4308H267499p6798j96774k15997n8242N813r8220j5565q0685j24533j2397j61671
$$ 8267499 8190701 7993927 7777930 7719688 7725501 7627281 7611716 7531031 7406498 7394101 7232430
4297G232430l08261r4714j02958k15965o8917k2437k40100j77310j73099o3225
$$ 7232430 6924169 6829455 6726497 6510532 6441615 6419178 6179078 6001768 5828669 5765444
4287E765444K7213Q471r6873m5744q0931j70097K1444r2480K1317n3744j23328
$$ 5765444 5792657 5801128 5704255 5658511 5577580 5407483 5428927 5336447 5357764 5304020 5180692
4276E180692p7637J2751l8776j99735j67788Q2211p9108J3793p7298r3223j7824
$$ 5180692 5103055 5115806 5077030 4877295 4709507 4791718 4712610 4726403 4649105 4555882 4538058
4265D538058P5007r0416j8327k6153j48222k8470q0230n9449k0522p8032O9575
$$ 4538058 4613065 4522649 4504322 4478169 4329947 4301477 4221247 4161798 4141276 4063244 4132819
4254D132819l5341J5146J600p3583J7490p513j8160l8982J06378P6241p851k1374
$$ 4132819 4097478 4112624 4114224 4040641 4058131 4050618 4032458 3993476 4099854 4176095 4168244 4146870
4242D146870n7705n499P2610N2955P7365p1022q6718n1717J17261k7369r7937
$$ 4146870 4089165 4083666 4156276 4209231 4286596 4215574 4128856 4077139 4194400 4167031 4069094
4231D069094m5841J32090J3188l4567J337N9744P8770J2340r5019l0925M6236
$$ 4069094 4023253 4155343 4168531 4133964 4135301 4195045 4273815 4286155 4191136 4160211 4206447
4220D206447L683r2602M2744P2385O1690N5705j09582L2202P0911Q6223j489l5153
$$ 4206447 4210130 4117528 4160272 4232657 4294347 4350052 4240470 4272672 4343583 4429806 4428317 4393164
4208D393164k9673l309J53876J49294Q198o8593J39599k4890J96741M9706m5951
$$ 4393164 4363491 4360182 4514058 4663352 4671550 4602957 4742556 4717666 4914407 4964113 4918162
4197D918162R1428K02852J83645L2932J88417N8429J36501J10704J92411J85910
$$ 4918162 5009590 5212442 5396087 5429019 5617436 5675865 5812366 5923070 6115481 6301391
4187F301391K09702k1066K01657J53135J97996K35142L15225J53931K06770K23509
$$ 6301391 6511093 6490027 6691684 6844819 7042815 7277957 7593182 7747113 7953883 8177392
4177H177392K62067J05092L51444K96950K7323K29673K16469J71636J60798L86228
$$ 8177392 8439459 8544551 8895995 9192945 9220268 9449941 9666410 9838046 9998844 10385072
4167A0385072L18472L15890L68937L03612M78510M94041N90174N72399N98437
$$ 10385072 10703544 11019434 11388371 11691983 12170493 12664534 13254708 13827107 14425544
4158A4425544P80668Q43636R96348R12752J015625J282071J561837J647785K188125
$$ 14425544 15206212 16049848 17046196 17958948 18974573 20256644 21818481 23466266 25654391
4149B5654391K442222K870573L387988L866383M635759N808887O708958P742738
$$ 25654391 28096613 30967186 34355174 38221557 42857316 48666203 55375161 63117899
4141F3117899R165036J0635075J2240431J3351577J2929261J1232844Q019273
$$ 63117899 72282935 82918010 95158441 108510018 121439279 132672123 140691396
4134A40691396K447129o462848j4085866j6742241j5557869j2700846j0137502
$$ 140691396 143138525 136675677 122589811 105847570 90289701 77588855 67451353
4127F7451353q127768o518201n148606m232793l480566k928353k505348k277186
$$ 67451353 59323585 52805384 47656778 43423985 39943419 37015066 34509718 32232532
4119C2232532j999294j651932j439916j285496j188405j105325r76708q52389
$$ 32232532 30233238 28581306 27141390 25855894 24667489 23562164 22585456 21733067
4111B1733067p22691n69705n81939n66024m23606l52268k98265l02825m20276
$$ 21733067 21010376 20440671 19858732 19292708 18869102 18516834 18218569 17915744 17495468
4102A7495468k69365p7713r7263q7173o0554j5665P4849K46397J87958L20093
$$ 17495468 17226103 17148390 17051127 16963954 16903400 16887735 16962584 17208981 17396939 17717032
4092A7717032L80438M79801O78311P60334P70328R57123J442504J524598J482316
$$ 17717032 18097470 18577271 19255582 20015916 20786244 21743367 23185871 24710469 26192785
4083B6192785J705035J993671J992410J945655J690358J285574P71485j41767
$$ 26192785 27897820 29891491 31883901 33829556 35519914 36805488 37576973 37435206
4075C7435206r89415j457105j537567j330839r29860o15129k18173l7447K18671
$$ 37435206 36445791 34988686 33451119 32120280 31190420 30575291 30357118 30319671 30538342
4066C0538342O34597R75351J357751J537533J949678K410432L044945L527290
$$ 30538342 31172939 32148290 33506041 35043574 36993252 39403684 42448629 45975919
4058D5975919M215447N150061N918778P068639Q160513R181362J0016793J0710729
$$ 45975919 50191366 55341427 61260205 68328844 76489357 85670719 95687512 106398241
4050A06398241J1363207J1055549J0281940R660820R250761P702911L768837j157116
$$ 106398241 117761448 128816997 139098937 148759757 158010518 165713429 169482266 168325150
4042A68325150o859024j2108976j5237431j6247086j5739054j3436529j0489781
$$ 168325150 161466126 149357150 134119719 117872633 102133579 88697050 78207269
4035G8207269q121841o361200m969686m024918l195264k431252j792230j363112
$$ 78207269 70085428 63724228 58754542 54729624 51534360 49103108 47310878 45947766
4027D5947766r41870m84526l11550m25577o73063j245991j768800k456933k848815
$$ 45947766 45005896 44521370 44209820 43784243 43111180 41865189 40096389 37639456 34790641
4018C4790641k928217k675189k222888j955299j781847j511630j301231j140062
$$ 34790641 31862424 29187235 26964347 25009048 23227201 21715571 20414340 19274278
4010A9274278j127904q59652q85283p11537o25072p01464n41008m14444n56444
$$ 19274278 18146374 17286722 16401439 15689902 15064830 14363366 13822358 13407914 12851470
4001A2851470m73152l81324n01434m02737l35616m20166o03369k99601j97149
$$ 12851470 12378318 11996994 11495560 11092823 10757207 10337041 9733672 9434071 9236922
3992I236922l14069k76893k40885l14801j99251k83640j75284j98236j74575j22897
$$ 9236922 8922853 8645960 8405075 8090274 7891023 7607383 7432099 7233863 7059288 6936391
3982F936391j22842j67459k73930j96620n6302k01489k12318j21435j83450j76497
$$ 6936391 6813549 6646090 6372160 6175540 6119238 5917749 5705431 5583996 5400546 5224049
3972E224049n3935j64147j08708o8929n5150q5890l6404k1953j12016m0095m7787
$$ 5224049 5170114 5005967 4897259 4828330 4773180 4687290 4650886 4628933 4516917 4476822 4429035
3961D429035k14003J10591j32445j59551K2344L389p4202n3670j95632j84512
$$ 4429035 4215032 4325623 4193178 4033627 4055971 4059360 3985158 3931488 3735856 3551344
3951C551344p975m8264j40296q8143n5791k39913J19323O9520j81610J20545J2783
$$ 3551344 3543369 3495105 3354809 3266666 3210875 2970962 3090285 3159805 2978195 3098740 3111523
3940C111523j7532J0044J8881o6608J2115j7874O9009J2161m1493N7823R075n6049
$$ 3111523 3093991 3104035 3122916 3056308 3068423 3050549 3119558 3131719 3090226 3148049 3157124 3101075
3928C101075L7675n3264o5957j2878j3567P1955Q0752O279k3760j07290p507M7639
$$ 3101075 3138750 3085486 3019529 3006651 2993084 3065039 3145791 3152070 3128310 3021020 3013513 3061152
3916C061152J0264J30526j59720n011J16279L7055l8932J53517J21930P1916R9623
$$ 3061152 3071416 3201942 3042222 3037211 3153490 3190545 3151613 3305130 3427060 3498976 3598599
3905C598599K37571K04292J07671O6961K01937L18631J76274J67764K31048J28230
$$ 3598599 3836170 4040462 4148133 4215094 4417031 4735662 4911936 5079700 5310748 5438978
3895E438978J47375J72534L69766L43958N41236P69417P12738Q27522J174133
$$ 5438978 5586353 5758887 6128653 6472611 7013847 7783264 8496002 9323524 10497657
3886A0497657J020421Q43096O82848J69972r50837j629435j529586j014123p43917
$$ 10497657 11518078 12361174 13044022 13213994 12263157 10633722 9104136 8090013 7346096
3877G346096n80846m22379j86235k44903k67409j32225j60406L337j76841k77468
$$ 7346096 6765250 6342871 6156636 5911733 5644324 5512099 5351693 5355030 5178189 4900721
3867D900721j37194j74852j38920p2589j34109j9740n0710J22467k4812k43521
$$ 4900721 4763527 4588675 4449755 4377166 4243057 4223317 4172607 4295074 4270262 4026741
3857D026741m4461k2487p6611M2445M4948M2081M1010J3818k9190K15688M6338
$$ 4026741 3982280 3959793 3883182 3925627 3970575 4012656 4053666 4067484 4038294 4253982 4300320
3846D300320o6182p26l6302J7164N5069J21909J70794K17135K04832L34298M90892
$$ 4300320 4234138 4233412 4197110 4214274 4269343 4391252 4562046 4779181 4984013 5318311 5809203
3835E809203N74320N97788P32035P83599J093922J228554J660123J724043J253443
$$ 5809203 6383523 6981311 7713346 8496945 9590867 10819421 12479544 14203587 15457030
3826A5457030J330019J654760k33252k553747k558534j799368j296066q97007
$$ 15457030 16787049 18441809 18208557 15654810 13096276 11296908 10000842 9103835
3818I103835p10709n12911k62875l14925j85708j48868O301j92034l00393m4936
$$ 9103835 8393126 7880215 7617340 7302415 7116707 6967839 6974140 6782106 6481713 6436777
3808F436777j03555R640L9008o441j8905R6554O5037k1819o8722L1452L6555J14571
$$ 6436777 6333222 6342862 6381870 6375429 6356524 6453078 6518115 6496296 6427574 6459026 6495581 6610152
3796F610152O2801j25339J6879O4944J27527J16302K39685R9708J00297K10418
$$ 6610152 6672953 6547614 6564493 6629437 6756964 6873266 7112951 7212659 7312956 7523374
3786G523374J21852M1647O2380O7660r368j51470J19517O7904P5169P0519J54323
$$ 7523374 7645226 7686873 7749253 7816913 7807545 7656075 7775592 7843496 7918665 7989184 8143507
3775H143507K13995L20518J52963K11012M02584M29588N00174L78004K57216K36979
$$ 8143507 8357502 8678020 8830983 9041995 9444579 9874167 10374341 10752345 11009561 11246540
3765A1246540L04026J78619K57949L79562M37663O08578O63250P35005Q59225
$$ 11246540 11550566 11729185 11987134 12366696 12804359 13412937 14076187 14811192 15670417
3756A5670417Q21675N10756N54912L15915r3609q8601o5837k0543K56070N50170
$$ 15670417 16492092 17002848 17557760 17873675 17780066 17691465 17625628 17605085 17861155 18411325
3746A8411325N76845O62639Q98800O84250L57773j0637k73952n16910p14126p52008
$$ 18411325 18988170 19650809 20549609 21233859 21591632 21580995 21307043 20790133 20076007 19323999
3736A9323999o17840l53777r9205J06541P6261K32914J98340k6809k15147m73094
$$ 19323999 18706159 18352382 18253177 18359718 18435979 18668893 18867233 18840424 18625277 18152183
3726A8152183q25791r83977q80315q22328o79512m64480l83286k91274j72187
$$ 18152183 17326392 16342415 15462100 14639772 13960260 13495780 13112494 12821220 12649033
3717A2649033k71411k21326m44136m92695n35125p01265p77484n71587n63200
$$ 12649033 12377622 12156296 11712160 11219465 10684340 9983075 9205591 8634004 8070804
3708H070804l58097l59323l75618k40137k86656j62142l71743l66935k77212j41644
$$ 8070804 7712707 7353384 6977766 6737629 6450973 6288831 5917088 5550153 5272941 5131297
3698E131297k10993k26002k1744n3277k38605l4327j97683J4520k58503q5035
$$ 5131297 4920304 4694302 4672558 4619281 4380676 4346349 4148666 4163186 3904683 3819648
3688C819648l019p5494j72593j21777m819j33300j99265j05149q1983J404m8265
$$ 3819648 3816629 3741135 3568542 3446765 3441946 3308646 3109381 3004232 2922249 2923653 2875388
3677B875388p8444r4545j67687r497M7505j39673r8199J19674j04217j54041P6298
$$ 2875388 2796944 2702399 2534712 2525215 2572720 2433047 2334848 2454522 2350305 2196264 2272562
3666B272562o1963p9012J7501P218L9933j12990K3812j1296k6586k1250p2759
$$ 2272562 2210599 2131587 2149088 2156306 2196239 2083249 2107061 2095765 2069179 2047929 1975170
3655A975170k8274R9334j5118j0016Q0538j91531J63031R4651n7281l8662k1453
$$ 1975170 1946896 2046230 2031112 2021096 2101634 1910103 2073134 2167785 2110504 2071842 2050389
3644B050389l3930k2363J1086n334R8961M9250p2114n4304l7341O0703M7910l2824
$$ 2050389 2016459 1994096 2005182 1999848 2098809 2148059 2075945 2021641 1984300 2045003 2092913 2060089
3632B060089K0556m9909o0106J07068M0071j56971n4005L414N7794p0815M7840
$$ 2060089 2080645 2030736 1970630 2077698 2117769 1960798 1906793 1910207 1968001 1897186 1945026
3621A945026O171J09217r1000j6477o1642P4477J08652l7428j7506l1133J5494
$$ 1945026 1951197 2060414 1969414 1952937 1891295 1965772 2074424 2036996 2019490 1988357 2003851
3610B003851J03012j3450m0406K5670P5302N1978j74741R143J58324O6462J16872
$$ 2003851 2106863 2093413 2053007 2078677 2153979 2205957 2031216 2040359 2198683 2265145 2382017
3599B382017O5399o035l2406K24328K17096L6612J01278n6678P1122L8148R0965
$$ 2382017 2447416 2441381 2408975 2633303 2850399 2887011 2988289 2931611 3002733 3040881 3131846
3588C131846M9446K08173P6196n252P7933J02504m1958L7813J19966M576j4414
$$ 3131846 3181292 3389465 3465661 3460409 3538342 3640846 3598888 3636701 3756667 3761243 3746829
3577C746829Q6810Q7984J2545r8365q6000J03784R8339J98626n5529n5784L0989
$$ 3746829 3833639 3921623 3934168 3835803 3749803 3853587 3951926 4150552 4095023 4039239 4070228
3566D070228M9864j0652l4458K5264p7637M3182O5910j0847J10432R9283L8164
$$ 4070228 4120092 4109440 4074982 4100246 4022609 4065791 4131701 4120854 4231286 4330569 4368733
3555D368733j5589K60579K37127J26228J71506K41009J63796L25009K40114K78173
$$ 4368733 4353144 4613723 4850850 4977078 5148584 5389593 5553389 5878398 6118512 6396685
3545F396685L03702K20288J83163J70618J08851n1567j4277n676Q1446j06950
$$ 6396685 6700387 6920675 7103838 7274456 7383307 7331740 7317463 7311787 7393233 7286283
3535G286283j63463m2811k4223l9346p45j15956k25312m8869j28233q8752r9428
$$ 7286283 7122820 7080009 7055786 7016440 7015695 6899739 6674427 6625558 6497325 6408573 6309145
3524F309145k03310j41911k06633k07655o0121k67893n3163k25682m54366j22647
$$ 6309145 6105835 5963924 5757291 5549636 5489515 5221622 5168459 4942777 4488411 4365764
3514D365764q3988r4476p4478j2788j49661q8737j33474o8663L3770L8192r5876
$$ 4365764 4281776 4187300 4112822 4100034 3950373 3861636 3728162 3659499 3693269 3731461 3635585
3503C635585j45063o2406J03826j36348o4682j7655j70Q7035l6740Q2490M322
$$ 3635585 3490522 3428116 3531942 3395594 3330912 3313257 3313087 3400122 3363382 3445872 3450194
3492C450194O0360m8229l4471L7391l7927M3251K6072m5565Q7384M8341N6464
$$ 3450194 3510554 3462325 3427854 3465245 3427318 3470569 3496641 3451076 3538460 3586801 3643265
3481C643265K39687J2375p2701M8002N0028N0301L4949R9436o1634L6381J1577
$$ 3643265 3882952 3895327 3822626 3870628 3920656 3970957 4005906 4105342 4043708 4080089 4091666
3470D091666r8018N614L3759M5083j15316J0018Q9477o7742M678J21131P2175
$$ 4091666 3993648 3999262 4033021 4078104 3962788 3972806 4062283 3994541 3999219 4120350 4192525
3459D192525O1505J43212R9286l4659J07872L0902J34293J71234J17319R2548
$$ 4192525 4254030 4397242 4496528 4461869 4569741 4600643 4734936 4906170 5023489 5116037
3449E116037J70867O1146J82478J93462J69556J98612K82098K22515K73365K35136
$$ 5116037 5286904 5348050 5530528 5723990 5893546 6092158 6374256 6596771 6870136 7105272
3439G105272M53191L79727K27018K67968L51741L28695L20140K38669J22195K99268
$$ 7105272 7558463 7938190 8165208 8433176 8784917 9113612 9433752 9672421 9794616 10093884
3429A0093884J34078P7630P7592L5585O2327M1409M5057J2374n5529m1855P4990
$$ 10093884 10227962 10305592 10383184 10418769 10481096 10522505 10567562 10579936 10524407 10482552 10557542
3418A0557542q4151k2532J40485N1765J74326O4480J61581J35688K89738K32741
$$ 10557542 10473391 10450859 10591344 10643109 10817435 10881915 11043496 11179184 11468922 11701663
3408A1701663M15527L46575L54180M67935L57488O42348O41524Q29534N57130
$$ 11701663 12117190 12463765 12817945 13285880 13643368 14285716 14927240 15756774 16313904
3399A6313904P31071J113720J149490J351991J440308J653053J889679K200138
$$ 16313904 17044975 18158695 19308185 20660176 22100484 23753537 25643216 27843354
3391B7843354K625345K837829L087476L554619L609107L796100L595942L403588
$$ 27843354 30468699 33306528 36394004 39948623 43557730 47353830 50949772 54353360
3383E4353360K842385K353155J528094O88482J84326l61832o58362p13627n02953
$$ 54353360 57195745 59548900 61076994 61765476 61949802 61587970 60929608 60215981 59713028
3374E9713028m99450l26930j27844k53841m98685p94735j265180k071246k783641
$$ 59713028 59213578 58886648 58758804 58504963 58006278 57211543 55946363 53875117 51091476
3365E1091476l081467l442043l667363l459184l306434k974616k611460k370336
$$ 51091476 48010009 44567966 40900603 37441419 34134985 31160369 28548909 26178573
3357B6178573j955985j813141j703445j260292j120307j124960q43241q30044
$$ 26178573 24222588 22409447 20706002 19445710 18325403 17200443 16357202 15527158
3349A5527158p98161n91391n92904n73834m12897m86227l69604l21958l63661
$$ 15527158 14728997 14137606 13544702 12970868 12557971 12071744 11702140 11380182 11016521
3340A1016521l82185l42830o7121k37362k28133j38057k18405j47553m6269j70529
$$ 11016521 10634336 10291506 10224385 9987023 9758890 9620833 9402428 9254875 9208606 9038077
3330I038077j84151q7334j79860j41321J0122j6557j49107q8258J6593L8737K7280
$$ 9038077 8853926 8766592 8586732 8445411 8455533 8438976 8289869 8201611 8218204 8256941 8284221
3319H284221j11161q8410r4755j52806j75951L4630r7299j01555p476M7544n5539
$$ 8284221 8173060 8084650 7989895 7837089 7661138 7695768 7598469 7496914 7489438 7536982 7481443
3308G481443l6375N0202r349j61858r2939m6157N4429k8928j35218r336P5403
$$ 7481443 7445068 7495270 7485921 7324063 7231124 7184967 7239396 7210468 7075250 7065914 7141317
3297G141317J36034M1735K865O8673L04840M0982Q8935R9367J37432J19896J21044
$$ 7141317 7277351 7319086 7321951 7390624 7695464 7736446 7825381 7924748 8062180 8182076 8303120
3286H303120J57813J55357R1205K9738m3819R4050J9579P4019N0342Q7038J5244
$$ 8303120 8460933 8616290 8707495 8737233 8693414 8787464 8807043 8881062 8931404 9018442 9033686
3275I033686o4981J45732N7688K4994J27366K40893J84602m3923K27783J52908
$$ 9033686 8968705 9114437 9172125 9197119 9324485 9565378 9749980 9706057 9933840 10086748
3265A0086748o9105N8530J74602J99771l4166J48381J9198J41951K28288K04119
$$ 10086748 10017643 10076173 10250775 10450546 10416380 10564761 10583959 10725910 10954198 11158317
3255A1158317K52378K18743L23785K96867L38109L28438M73997L13812M04206
$$ 11158317 11410695 11629438 11953223 12250090 12588199 12916637 13390634 13704446 14108652
3246A4108652M96518M18303O11489N74955N50282P18918Q79271R62971J111099
$$ 14108652 14605170 15023473 15634962 16209917 16760199 17479117 18358388 19321359 20432458
3237B0432458J298943J404240J659632K016113K302637K654428K985050L552653
$$ 20432458 21731401 23135641 24795273 26811386 29114023 31768451 34753501 38306154
3229C8306154M431513N011564N844251O804201P727817Q632591R760935J0551211
$$ 38306154 42737667 47749231 53593482 60397683 68125500 76758091 86519026 97070237
3221I7070237J1165875J1213334J0729768R569298P522372M432898N80963l008037
$$ 97070237 108236112 119449446 130179214 139748512 147270884 151703782 152284745 149276708
3213A49276708o408549r264498j1050577j1783074j1711741j0889403r786670
$$ 149276708 142868159 133603661 122553084 110770010 99058269 88168866 78382196
3206G8382196q481458p199203o045541n188864m439127l756358l127290k819386
$$ 78382196 69900738 62701535 56655994 51467130 47028003 43271645 40144355 37324969
3198C7324969k380558k158657j874754j642231j369753j223722j063552r74069
$$ 37324969 34944411 32785754 30911000 29268769 27899016 26675294 25611742 24637673
3190B4637673r41802q23338o44211o39739o65483m54333m91601l47612j99253
$$ 24637673 23695871 22872533 22228322 21588583 20923100 20468767 19977166 19629554 19430301
3181A9430301k66011l40312M306p3904j05170l351r629J07268O1362J35917J46601
$$ 19430301 19164290 18823978 18828284 18754380 18649210 18645859 18636230 18743498 18804860 18940777 19087378
3170A9087378J39322J45321J99426J68551J16925J30338Q4844K10403K07255L00732
$$ 19087378 19226700 19372021 19571447 19739998 19856923 19987261 20072105 20282508 20489763 20790495
3160B0790495L07152J63937L65374M95075L78686N28192M13881L48417L19126
$$ 20790495 21097647 21261584 21626958 22122033 22500719 23028911 23442792 23791209 24110335
3151B4110335M3594J41920Q2785j79700N4385J562o7300L5888J6095j5958J417
$$ 24110335 24153929 24295849 24378634 24198934 24253319 24254881 24187581 24223469 24239564 24223606 24225023
3140B4225023J29623j5608j05627j34230j32218l29093l60124j92355j48204j10500
$$ 24225023 24354646 24339038 24233411 24099181 23966963 23637870 23277746 23085391 22937187 22826687
3130B2826687j33142j1063P8956L7876J68242K04720J56550K81542M07533L06072
$$ 22826687 22693545 22682482 22761438 22799314 22967556 23172276 23328826 23610368 24017901 24323973
3120B4323973M33859M72960O63222O25870P60666J082660J226230J222112J446445
$$ 24323973 24757832 25230792 25894014 26519884 27280550 28363210 29589440 30811552 32257997
3111C2257997J896605K124742K207983K561182K843056K781915K782651K436688
$$ 32257997 34154602 36279344 38487327 41048509 43891565 46673480 49456131 51892819
3103E1892819K317258J975770J616081J423430R93991Q65483P26922P81239P91179
$$ 51892819 54210077 56185847 57801928 59225358 60219349 61084832 61811754 62592993 63384172
3094F3384172J137761J463906J458506J617266J574601J409050J311573Q30334
$$ 63384172 64521933 65985839 67444345 69061611 70636212 72045262 73356835 74187169
3086G4187169P94517J74918k37125m73585q24721r27482j163033j340846j429066
$$ 74187169 74981686 75156604 74919479 74445894 73621173 72693691 71530658 70189812 68760746
3077F8760746j448542j394981j155496j051314p15319o23754o79066p51904r24931
$$ 68760746 67312204 65917223 64761727 63710413 62995094 62371340 61692274 60940370 60015439
3068F0015439j357467j519354j959983k763502l268509l316467l006088l104713
$$ 60015439 58657972 57138618 55178635 52415133 49146624 45830157 42824069 39719356
3060C9719356k806806k609018k333108k081221j912560j504613j420836j210946
$$ 39719356 36912550 34303532 31970424 29889203 27976643 26472030 25051194 23840248
3052B3840248j111086q94266q87524n96755n02241l66880j88984k15283n5502
$$ 23840248 22729162 21834896 20947372 20350617 19848376 19481496 19292512 19077229 19021727
3043A9021727L03988J16797J85985K86199M14681N13825J19489n35834q17947
$$ 19021727 19325715 19442512 19628497 19914696 20329377 20843202 20962691 20426857 19608910
3034A9608910n92282k88540j63627j22073k35201j26555j89078j22575j16683
$$ 19608910 19016628 18728088 18564461 18442388 18207187 18080632 17891554 17768979 17652296
3025A7652296k03426j20811m7712J06949j11507R2270J10784K8243Q9809J411
$$ 17652296 17448870 17328059 17280347 17387296 17275789 17368059 17478843 17507086 17596895 17598306
3015A7598306j57116k802m9106j05102q2724m3226j16406j97843l86087m77114
$$ 17598306 17441190 17438388 17389282 17284180 17201456 17158230 17041824 16843981 16457894 15980780
3005A5980780l36622k69609j59271O988J21459o8066K8985j7579J60673Q1336
$$ 15980780 15644158 15374549 15215278 15222266 15343725 15275659 15304644 15287065 15447738 15529074
2995A5529074M3182j736j9108l5726L6600j3451m7675j05062k10398r5183j38922
$$ 15529074 15572256 15570520 15551412 15515686 15552286 15538835 15491160 15386098 15175700 15080517 14941595
2984A4941595j64352j66599l17708j94340j41112j47201j5565j14572k07425k80418
$$ 14941595 14777243 14610644 14292936 14098596 13957484 13810283 13794718 13680146 13472721 13192303
2974A3192303j8128P0508j16659K6888P7531j3936k5540J01455K73765J41444
$$ 13192303 13174175 13244683 13128024 13154912 13232443 13218507 13192967 13294422 13568187 13709631
2964A3709631K27932M03115K90765L44007N25763L41226M66762O66773Q04416
$$ 13709631 13937563 14340678 14631443 14975450 15501213 15842439 16309201 16975974 17780390
2955A7780390R90103J193233J334400J633002J963072K417861K762756L145713
$$ 17780390 18770493 19963726 21298126 22931128 24894200 27312061 30074817 33220530
2947C3220530L615846L902431M221200M394687M590769M380958L897453L694135
$$ 33220530 36836376 40738807 44960007 49354694 53945463 58326421 62223874 65918009
2939F5918009K743170J701090O29459o56357j948318l258927l817049m309222
$$ 65918009 68661179 70362269 70991728 70335371 68387053 65128126 61311077 57001855
2931E7001855m717327m712128m463999m135414l788697l256578k866026k471381
$$ 57001855 52284528 47572400 43108401 38972987 35184290 31927712 29061686 26590305
2923B6590305k096689j939801j616054j492130j296048j078519j144465q42284
$$ 26590305 24493616 22553815 20937761 19445631 18149583 17071064 15926599 15084315
2915A5084315j004196p35937p40157p00419o22546n43863m92881l58595m62590
$$ 15084315 14080119 13344182 12604025 11903606 11281060 10737197 10244316 9885721 9423131
2906I423131l56838l49541l85239l72017k66646j22050k60820j87549j74948j90825
$$ 9423131 9066293 8716752 8331513 7959496 7692850 7570800 7309980 7122431 6947483 6756658
2896F756658j79895j01949o1543j81863o9941m518j48521j960M84P5876k54273
$$ 6756658 6576763 6474814 6413271 6231408 6161467 6156949 6008428 6006468 6006952 6082828 5828555
2885E828555j21621o8154j00855k45612k20643n4699q3487n8674j94909j58277
$$ 5828555 5706934 5638780 5537925 5292313 5071670 5016971 4933484 4874810 4679901 4521624
2875D521624j3250k3815j09944j05494j7031j0853N8676j32727j70052j25645
$$ 4521624 4508374 4484559 4374615 4269121 4252090 4241237 4299913 4167186 3997134 3871489
2865C871489j2134l8823j11314P4486L9253q047j25046j94128N3943N1561M923
$$ 3871489 3859355 3820532 3709218 3783704 3822957 3814910 3689864 3495736 3549679 3601240 3606163
2854C606163m2369j16414O9743O4171l2529l6046L1061L7368M354P8189Q8242
$$ 3606163 3563794 3447380 3517123 3581294 3548765 3512719 3543780 3581148 3585502 3663691 3751933
2843C751933L399J09138R6995p1556R2824q174j66255R3350j2167n7102j05250
$$ 3751933 3755332 3864470 3961465 3889909 3982733 3974559 3808304 3901654 3889487 3832385 3727135
2832C727135p9628O4310n7988P4650J88136K3136k555J01287l7779N9265R4945
$$ 3727135 3647507 3711817 3653829 3728479 3916615 3939751 3937196 4038483 4000704 4059969 4154914
2821D154914Q9405M6017N2205P0497o4752Q8229K2630P7593J04809J24945j4337
$$ 4154914 4244319 4290336 4342541 4413038 4348286 4436515 4459145 4536738 4641547 4766492 4752155
2810D752155R1318K25830L7599K28055Q7655k7250P4086J49750L3353J83062J09282
$$ 4752155 4843473 5069303 5106902 5334957 5422612 5395362 5469448 5619198 5652551 5835613 5944895
2799E944895P3179J02562K06560R8357J11741N3251J27132J35676J15938J95480
$$ 5944895 6018074 6120636 6327196 6425553 6537294 6590545 6717677 6853353 6969291 7164771
2789G164771J00706J07534L02101L11784K18837L88497K57569L38316K54607L89637
$$ 7164771 7265477 7373011 7675112 7986896 8205733 8594230 8851799 9190115 9444722 9834359
2779I834359L49787L35903L22887K18589L53597J98801M41997N07381N64927N58374
$$ 9834359 10184146 10520049 10842936 11061525 11415122 11613923 12055920 12563301 13128228 13686602
2769A3686602P74451R67630P02038J060770J060504J073494J209653J215794J519784
$$ 13686602 14461053 15428683 16130721 17191491 18251995 19325489 20535142 21750936 23270720
2760B3270720J570437J420396J608808J710301J622978J858473J907137J825304
$$ 23270720 24841157 26261553 27870361 29580662 31203640 33062113 34969250 36794554
2752C6794554K109435K145013K030792J958423K026730K112574K150313K022999
$$ 36794554 38903989 41049002 43079794 45038217 47064947 49177521 51327834 53350833
2744E3350833J389808P15775n44572j477832j942834k066335j857073j830806
$$ 53350833 54740641 55456416 54911844 53434012 51491178 49424843 47567770 45736964
2736D5736964j718890j604860j117193r21592l46417r686K83995N56092R44348
$$ 45736964 44018074 42413214 41296021 40374429 40028012 40018326 40302321 40858413 41802761
2727D1802761J382073J544526K193529K840277L557506M280089N113448O296749
$$ 41802761 43184834 44729360 46922889 49763166 53320672 57600761 62714209 69010958
2719F9010958P380183R004086J0887914J2767121J4816500J7266650K0549039
$$ 69010958 76391141 85395227 96283141 109050262 123866762 141133412 161682451
2712A61682451K4168606K7285867K8150538K5090779J7587948M391180j3949971
$$ 161682451 185851057 213136924 241287462 266378241 283966189 288357369 274407398
2705B74407398k8994929l4083369l1548679k5740227k0077994j5864754j2812473
$$ 274407398 245412469 211329100 179780421 154040194 133962200 118097446 105284973
2698A05284973j0575277r127427q124789p029602o195881n343920m426239m002514
$$ 105284973 94709696 85582269 77457480 70427878 64231997 58888077 54461838 50459324
2690E0459324l347036l152535k893303k475315k418416k152278j847820j680584
$$ 50459324 47112288 43959753 41066450 38591135 36172719 34020441 32172621 30492037
2682C0492037j538766j314657j331006j329681j124164j080106j138575j026762
$$ 30492037 28953271 27638614 26307608 24977927 23853763 22773657 21635082 20608320
2674B0608320r41288p86611r03796p26541p02335o50407o66375n35071n45571
$$ 20608320 19667032 18880421 17976625 17250084 16547749 15897342 15230967 14695896 14150325
2665A4150325m88033l10593m22949m10353n29080l96213k88053m28384m10010
$$ 14150325 13662292 13351699 12928750 12518397 11989317 11593104 11305051 10876667 10466657
2656A0466657l07284l59381l19232l60370j70390k42424j72167j50239l34351
$$ 10466657 10159373 9799992 9480760 9120390 8950000 8707576 8535409 8385170 8050819
2647H050819k40755j25392k60937j93531k97326j90884j24157j49344l22567k45518
$$ 8050819 7810064 7684672 7423735 7230204 6932878 6741994 6617837 6468493 6145926 5900408
2637E900408j93035k24877r2285k22842j86847q5552N111k50622k12989q9020
$$ 5900408 5707373 5482496 5390211 5167369 4980522 4894970 4900081 4649459 4436470 4347450
2627D347450j09976j50080q6426k3840l1959k47435k04670j97397j56778j54882
$$ 4347450 4237474 4087394 4000968 3977128 3945169 3697734 3493064 3295667 3138889 2984007
2617B984007M4893k7674q2829n8753j96035N722j09714R987l815k1321j42763
$$ 2984007 3028900 3001226 2918397 2859644 2663609 2669331 2559617 2569604 2565789 2544468 2401705
2606B401705p7086j44067j24361m1066l4008J42774p6940J22222M6254n8867j53506
$$ 2401705 2324619 2180552 2056191 2015125 1981117 2123891 2046951 2169173 2215427 2156560 2003054
2595B003054j184j11844p2050O1731n7641n0490J8912N4441r7216l7521L6468
$$ 2003054 2001870 1890026 1817976 1879707 1822066 1771576 1790488 1844929 1747713 1710192 1746660
2584A746660j04340m6366P019n4671L8450r7663j35205j32659p4049n331K3848
$$ 1746660 1642320 1595954 1602973 1548302 1586752 1489089 1353884 1221225 1147176 1141845 1165693
2573A165693L3759m9129o1404j360L9548L9675j10695j2264J38773j2073j7929
$$ 1165693 1199452 1150323 1088919 1087559 1127107 1166782 1056087 1043823 1182596 1170523 1152594
2562A152594o4547l6939n626k8402l6435Q2461j1460o7229q1702Q9755R9334r0305
$$ 1152594 1088047 1051108 1045482 1017080 980645 1063106 1051646 984417 902715 992470 1091804 1001499
2550A001499j3355K6112p8497n8183M1541n261l5943p3002k1755O2546l539J9477
$$ 1001499 988144 1014256 935759 877576 919117 913856 877913 804911 783156 845702 842163 861640
2538H61640o6590J5500j0406N8415j20979j0240M4494M7961m719R96k4994k15789
$$ 861640 795050 810550 800144 858559 737580 727340 771834 819795 815076 816072 791078 575289
2526E75289R1130l6150l1112R9765N6303o2469n5677j22416R7246j127j15310
$$ 575289 666419 630269 599157 698922 755225 692756 637079 514663 611909 610782 495472
2515D95472o4M4541j8349J6595n4235l8825J35030P7059p458k8045j25469J45096
$$ 495472 495408 539949 521600 538195 483960 445135 580165 657224 649766 621721 496252 641348
2503F41348j4821p8753R7432L3676J0576m5807M9984j16124k3964J47860n2927
$$ 641348 626527 547774 645206 678882 689458 643651 693635 577511 553547 701407 648480
2492F48480J17711Q902M909k0795Q8271r0350j31720P4016O9126J5732k7162k4192
$$ 648480 766191 775093 780002 759207 847478 757128 625408 699424 768550 784282 757120 732928
2480G32928m8858J30324j10168k7665P9300l5494N3758m2683l8944k2170J9227
$$ 732928 684070 814394 704226 676561 755861 720367 774125 731442 692498 670328 689555
2469F89555L8068O3776j35394o0083o096J4083J28309P1001l9142K6930J83719
$$ 689555 727623 791399 656005 595922 589826 603909 732218 803219 764077 791007 974726
2458I74726J23701Q5129J19244O1415P2828K42325N9532l0975j18437j98056j45178
$$ 974726 1098427 1183556 1302800 1364215 1437043 1679368 1738900 1707925 1589488 1391432 1246254
2447A246254j10535p7274k73877m0732K1074l5921M5105j55378r9854l7397N0146
$$ 1246254 1135719 1058445 784568 743836 764910 728989 774094 618716 518862 481465 531611
2436E31611m9203j1188n2027N122K7347k699r4912J01750j18759j20194M2788
$$ 531611 482408 471220 419193 424315 451662 448963 354051 455801 337042 216848 259636
2425B59636O7091J41214j21319m2502p749j71780K7413K6719O3391o0951J6099
$$ 259636 326727 467941 346622 304120 296371 124591 152004 178723 242114 181163 197262
2414A97262o948K8285l0685m6717Q3727N5499r0214J871n6782L505N717j4770
$$ 197262 190314 218599 187914 141197 224924 280423 190209 192080 135298 138803 144520 129750
2402A29750K0866J6298M709J8540R3108r0603M2226l2232l8604m5049O7416k4543
$$ 129750 150616 166914 171623 190163 283271 192668 234894 202662 164058 119009 186425 161882
2390A61882L4795m835J5180p4619O822l8174K6480J14307K0713R412R895L4846
$$ 161882 196677 191842 207022 132403 139225 101051 127531 241838 262551 271963 281858 316704
2378C16704j13766j03496J11234k4072j03702L0584R0681j19490O3484P5802m3064
$$ 316704 202938 99442 210676 186604 82902 113486 204167 84677 148161 223963 180899
2367A80899j17167l7318N4840R2618r1504N7574n0183r4082N4655N351Q7833o5272
$$ 180899 63732 26414 81254 173872 82368 139942 89759 -4323 50332 55683 143516 78244
2355G8244k6846l8667M5657N0858N8962m313r9873p997r921m2168l5615R1057
$$ 78244 51398 12731 58388 109246 168208 163895 64022 56025 46104 3936 -31679 59378
2343E9378L3022q9512R9101p2181o1966M4821L0843k8273P7749p6146M0048P0235
$$ 59378 92400 2888 101989 29808 -32158 12663 43506 15233 92982 16836 56884 127119
2331A27119j07232k0150j8009J7506M1911l7065J29895p2438J1873l3118p2292
$$ 127119 19887 -263 -18272 -766 41145 4080 133975 61537 73410 40292 -32000
2320c2000n3034J17956M4256j39429k5075J06781J43666k4692j05745O5889m8020
$$ -32000 -85034 32922 77178 -62251 -87326 19455 163121 138429 32684 98573 50553
2309E0553N0421L6321K514q6672J8458Q1391n9036J8389l1202J01689m8941L4717
$$ 50553 100974 137295 139809 53137 71595 152986 93950 112339 81137 182826 133885 168602
2297A68602m4351P6889m2691p6700k464L8233K0837k6911l6225l7898J33163r2469
$$ 168602 124251 201140 158449 81749 79285 117518 138355 111444 75219 37321 170484 78015
2285G8015n1159j55008L5435J37405K8473K7933j82182l1428l419J29154J40339
$$ 78015 26856 -128152 -92717 44688 73161 101094 -81088 -112516 -115935 13219 153558
2274A53558r5003r692L8704j6477k4688K7986j2461J1921r6702l4245L4151K7159
$$ 153558 58555 48863 87567 71090 46402 74388 61927 73848 -22854 -57099 -22948 4211
2262D211K6196M9033k8955j17739J3818J356J11657j4641n7975m6727J50315m0238
$$ 4211 30407 79440 50485 -67254 -53436 -52080 59577 44936 -13039 -59766 90549 50311
2250E0311J5749J23814p5277m3967J37669n2712r1324J40693P3513r6670j27044
$$ 50311 66060 189874 114597 70630 208299 155587 64263 204956 278469 181799 54755
2239E4755n7109O7990o3964P1765q58O7440j61033j9649j5608M2054P3263P8130
$$ 54755 -2354 65636 1672 73437 72579 140019 -21014 -40663 -56271 -14217 59046 137176
2227A37176j15809k6041l1277j01140J5874R0292J56685N1527j04366Q758K1473
$$ 137176 21367 -4674 -35951 -137091 -121217 -30925 125760 177287 72921 81679 103152
2216A03152O1428j0420k7116o7952n9020K3934j6631M0848o2832Q2311K4213j1850
$$ 103152 164580 154160 127044 59092 72 24006 7375 48223 -14609 67702 91915 80065
2204H0065p5102J30627m1761K4856k5036R1225K0963p6357p7425R3706Q1813l1883
$$ 80065 4963 135590 93829 118685 93649 184874 205837 129480 52055 145761 227574 195691
2192A95691j2476J15222J150j63318j4225O3655k2739m4448p7014j7792k9349
$$ 195691 183215 298437 299587 136269 122044 185699 162960 118512 41498 23706 -5643
2181e643J10625m2564k0751o9744K2473K1170J06602m1233P1434l0717r66j1703
$$ -5643 104982 62418 41667 -28077 -5604 15566 122168 80935 152369 121652 120686 108983
2169A08983k2178M3881Q0551m3015N4735k4269o1298L5067n0333K4820l7246j710
$$ 108983 86805 130686 211237 168222 222957 198688 137390 172457 122124 146944 109698 107988
2157A07988O3867N4627j18664J21798n1700q1427J33737M3644j00805o1681J18265
$$ 107988 171855 226482 107818 229616 177916 96489 230226 273870 173065 111384 229649
2146B29649N8421p453m2085j09579J687J19503J3356m6351J0335K0269J57272
$$ 229649 288070 280617 238532 128953 130640 250143 263499 217148 227483 247752 405024
2135D05024o8957k4310J3756k2886k1741P3037p5654m0388j3210N573J06212O6892
$$ 405024 336067 311757 325513 302627 280886 353923 278269 237881 224671 230244 336456 403348
2123D03348k5796r2737l0343J71108k8757o1020n9765J14671k9213K4493Q4336
$$ 403348 377552 284815 254472 425580 396823 335803 276038 390709 361496 385989 470325
2112D70325P766l52o115P3612n7745L8173R332M9375J03009M4516j6353M6051
$$ 470325 478091 477739 471624 545236 487491 525664 534996 584371 687380 731896 715543 761594
2100G61594k0319K5529J14099M2019n2449n1448J43225J31129j362R7332K0458
$$ 761594 741275 766804 880903 922922 870473 819025 962250 1093379 1092017 1189349 1209807
2089A209807k787Q6316q4268J1324P8500J67445M1889J07593K14399J54219k8453
$$ 1209807 1207020 1293336 1209068 1220392 1298892 1466337 1508226 1615819 1830218 1984437 1955984
2078A955984P3478P1892J74678L97936M03630L55104L31152M07396M89345L86581
$$ 1955984 2029462 2101354 2276032 2673968 3077598 3432702 3763854 4171250 4660595 5047176
2068E047176O09981Q72861J114135J334327J537241J958220K697916L390192M236553
$$ 5047176 5657157 6530018 7644153 8978480 10515721 12473941 15171857 18562049 22798602
2059B2798602L492957L052954K258560l538914o308983n334737l658997k285352
$$ 22798602 26291559 29344513 31603073 28064159 21755176 16420439 12761442 10476090
2051A0476090j626254j153940q33513p16012m85622m79956l49711k54383k96960
$$ 10476090 8849836 7695896 6862383 6146371 5660749 5180793 4831082 4576699 4279739
2042D279739k99704m16275k99961k24136j93210j59188k25182j73397j20088q1694
$$ 4279739 3980035 3563760 3263799 3039663 2846453 2687265 2462083 2288686 2168598 2086904
2032B086904q6336r3593j62529m8266k0085q9570j41358j11788O623j93762j9095
$$ 2086904 2000568 1906975 1744446 1696180 1676095 1586525 1445167 1333379 1340002 1146240 1127145
2021A127145J27316m2037l7667n6222k15927M6756l082l3906R397J0551p5746
$$ 1127145 1254461 1212424 1174757 1118535 902608 949364 946282 912376 921773 932324 856578
2010H56578j035j12227P896m6430N9987p7601N2467j00853o6897R0403j50010
$$ 856578 855543 743316 751212 704782 764769 687168 739635 638782 571885 662288 512278
1999E12278j3245k365k3420K7688R6072r9400q4898P5387L560j7896m7841r8005
$$ 512278 499033 496668 473248 500936 597008 497608 412710 488097 491657 473761 425920 327915
1987C27915q6173N7869J10022j24163J2588J04258l4185q2275L9344N3364R336
$$ 327915 241742 299611 409633 285470 298058 402316 368131 285856 325200 378564 387900
1976C87900q2924Q1816r9417k6078k0634m0057M6695J23431j51194j52616J1692
$$ 387900 304976 386792 287375 261297 240663 200606 247301 370732 219538 66922 78614
1965G8614o712k5533j9343M5564j2651O3752J2427k1775J8561l4314j19070J8270
$$ 78614 71902 46369 27026 72590 59939 123691 136118 114343 132904 98590 -20480 -2210
1953b210R3106O4755q7809j07845l7189J45092O6289n7394K545p1909k9917Q0322
$$ -2210 90896 155651 67842 -40003 -77192 67900 134189 76795 79340 7431 -22486 57836
1941E7836k3995k2900M6688k1118l4550M6345o5232l8495J09339N8787M2649k5381
$$ 57836 33841 10941 57629 36511 1961 48306 -16926 -55421 53918 112705 155354 129973
1929A29973n8863M54L957p7668j0362K1423m1227J14224j3520n1664j5651O5678
$$ 129973 71110 71564 75521 -2147 -12509 8914 -32313 81911 68391 16727 1076 66754
1917F6754J2761p8596J53672p4621j20340J53281k8015m7160l7118K4112L2519
$$ 66754 79515 919 154591 79970 -40370 112911 84896 37736 618 24730 57249
1906E7249j05417K3975N3475M1499N817q3959K9266j06451m805Q4981j7840L8147
$$ 57249 -48168 -24193 29282 70781 76598 -7361 21905 -84546 -89351 -4370 -22210 15937
1894A5937P7971n613J7324k9655l1067q1485N4010l2615j9911O6920m3833j2135
$$ 15937 93908 88295 105619 75964 44897 -36588 17422 -15193 -35104 31816 -12017 -24152
1882b4152J21938l7943p4635J0415k9581J20482l6941o6933o3507N4227O5166
$$ -24152 97786 59843 -14792 -4377 -33958 86524 49583 -17350 -80857 -26630 38536
1871C8536J02149q3058p3192m7026K045k5043J9812P6314r07M7277P6167j94363
$$ 38536 140685 57627 -15565 -62591 -60546 -85589 -65777 10537 9630 56907 133074 -61289
1859f1289N9618N7170j42242O6804K9503m7492K8054n9788M533j3237O7776j911
$$ -61289 -1671 55499 -86743 -19939 9564 -37928 -9874 -69662 -65129 -78366 -10590 -12501
1847a2501J6654Q5119r1081O7732L3961r8841L0213O7734L2309N4544j29801j54540
$$ -12501 4153 89272 -1809 65923 99884 1043 31256 98990 131299 185843 56042 -98498
1835i8498L9029j5873J1355P2803p3350q70R3427q515m6158j734N9866l316n8559
$$ -98498 -59469 -75342 -63987 8816 -64534 -65404 28023 19508 -26650 -28384 31482 28166 -30393
1822c0393N6264K2775j13539J13324R9147m9851P0185L0401L0964r6229r897O4802
$$ -30393 25871 48646 -64893 48431 147578 97727 167912 198313 229277 133048 123151 187953
1810A87953l4708m9268l8331p1382P495K398n2156J98048q7258j01725j0016j2881
$$ 187953 153245 103977 65646 -5736 1759 4157 -47999 150049 62791 -38934 -48950 -61831
1798f1831J12642l0982l0633p4313l8148J3548R0649O316J29298j13670r20p6799
$$ -61831 50811 19829 -10804 -85117 -123265 -109717 -19068 -12752 116546 2876 1956 -74843
1786g4843o2550J26057J17838j3046m1292P6816n3350r9406J6006n360J12954
$$ -74843 -137393 -11336 106502 93456 52164 128980 75630 -23776 -7770 -13130 99824
1775I9824J3339j23532p4149J4281J02368l1706K0618J1553J888J9955k5266o4008
$$ 99824 113163 -10369 -84518 -70237 32131 425 21043 32596 34484 54439 29173 -34835
1763c4835J5518K9086K0288k1810o0286m2941J20756J9452l9167m9236l2528M6598
$$ -34835 -19317 9769 30057 8247 -52039 -94980 25776 45228 6061 -43175 -75703 -29105
1751b9105O9579q4267M8549P9759j00150L829J23142j3606m8494l12r9152R1267
$$ -29105 40474 -43793 4756 84515 -15635 -11806 111336 97730 49236 48924 -50228 41039
1739D1039L8622j59474m920R3720j25362J15296o2162Q8365J58693o4632j28949
$$ 41039 79661 -79813 -84733 8987 -116375 -1079 -63241 25124 183817 119185 -9764
1728i764J63707j44622o2769J10620p6589R4367j01247J7033k6259P076p4944
$$ -9764 153943 9321 -53448 57172 -19417 74950 -26297 -9264 -35523 -28447 -103391
1717a03391M6709Q0921k9356n1290O9246N6310o3088j33962n7076J1838P3083
$$ -103391 -56682 24239 -5117 -56407 12839 69149 6061 -127901 -184977 -173139 -100056
1706a00056p7421J72685J952j09333L2506K5666O0538P3128O1501n2513j04779
$$ -100056 -177477 -4792 -2840 -112173 -79667 -54001 6537 79665 141166 88653 -16126
1695a6126p5946P0663N8377J454j5839j07312K4825O6619m1455J2783o29l5445
$$ -16126 -92072 -21409 36968 38422 22583 -84729 -59904 6715 -34740 -21957 -22586 -58031
1683e8031K4952L5718o0361r1474j2767Q9420l6185P2200n8583M9968L9377m9889
$$ -58031 -33079 2639 -57722 -149196 -161963 -72543 -108728 -36528 -95111 -45143 -5766 -55655
1671e5655k0539j3955P2383m9251r9434P6488J8021K9099j8090K8577O1272J6211
$$ -55655 -76194 -90149 -17766 -67017 -166451 -89963 -71942 -42843 -60933 -32356 28916 45127
1659D5127l7621J01430q9810p4310J75846j03196l3815J6315q724M1401Q6343
$$ 45127 7506 108936 19126 -55184 120662 17466 -16349 -34 -8758 32643 118986
1648A18986P4306l798k13220q7382l1049J24800N9185l5629m2162J53975n3870
$$ 118986 193292 189494 -23726 -111108 -142157 -17357 41828 6199 -35963 118012 64142
1637F4142j40728m6953K3135O3044p286m7713P3144O0310m0356M9333P2501j12423
$$ 64142 -76586 -123539 -100404 -37360 -44646 -92359 -19215 41095 739 50072 122573 10150
1625A0150K0883j8558n1207p3120j4028N556k9531R6686M165n0741M2865N3931
$$ 10150 31033 12475 -38732 -111852 -125880 -120324 -149855 -53169 -49004 -99745 -56880 -2949
1613b949k8506R5432n0978k3686P3880l2772o8379K6064K5926k4705K7977Q6205
$$ -2949 -31455 63977 12999 -10687 63193 30421 -37958 -11894 14032 -10673 17304 103509
1601A03509q0390l271M6168j16294O6958L4380k5154J59973p0416j0163q4545
$$ 103509 23119 19848 66016 -50278 16680 51060 25906 185879 115463 105300 20755
1590B0755q9942R1741N1994l1700j16750o5557O2234O889J92K2388j5427j21288
$$ 20755 -69187 22554 74548 42848 -73902 -139459 -77225 -70336 -70144 -47756 -63183 -184471
1578a84471R7825J25663q8211r2291O1674M3096L0252J8232O2693m5075K1297
$$ -184471 -86646 39017 -49194 -141485 -79811 -36715 -6463 11769 74462 29387 50684
1567E0684O5471q4068j14791J3399k759k8349N1431L6460l8459k7586P1123K8007
$$ 50684 116155 32087 -82704 -69305 -72064 -100413 -48982 -12522 -50981 -78567 -7444 20563
1555B0563l1219m8568k1857Q471j256N4144k8690q751K0603j1828N9342m5781
$$ 20563 -10656 -59224 -81081 -72610 -73866 -19722 -48412 -57163 -36560 -48388 10954 -34827
1543c4827J37011j4517j44347M2346l0732n6067O356L4240J6439N1874l7718O4066
$$ -34827 102184 87667 -56680 -14334 -45066 -101133 -94777 -60537 -44098 7776 -29942 34124
1531C4124M2562m1405m5724m5792M1668j0917l3397M2275k7178L2613o2285K7310
$$ 34124 76686 35281 -10443 -56235 -14567 -25484 -58881 -16606 -43784 -11171 -73456 -46146
1519d6146J0563r7557K0795J38149J3246m5396K7279K202O5817n4515N2670j11113
$$ -46146 -35583 -133140 -112345 25804 39050 -6346 20933 23135 88952 34437 87107 -24006
1507b4006P3492n0460J9820R092o3280K6173O0847k37j44150L1653Q223J9557
$$ -24006 49486 -974 18846 27938 -35342 -9169 51678 51441 -92709 -61056 -52833 -33276
1495c3276J8894o0252J216O5682J9625o7571j19849K9898K09498j01245L080Q4345
$$ -33276 -14382 -74634 -73418 -7736 11889 -55682 -175531 -145633 63865 -37380 -34300 50045
1483E0045p9226J515l1892m9330J1263J6329M405n8562K4945P2413O162K7693
$$ 50045 -29181 -27666 -59558 -108888 -97625 -81296 -76891 -135453 -110508 -38095 -31933 -4240
1471d240m1006P1613J3873j47610J17817M8681k2711p8060k6186K1705M6525r1811
$$ -4240 -45246 26367 40240 -107370 10447 59128 36417 -41643 -67829 -46124 401 -91410
1459i1410J1664K0727m6735q520J20286M2102j05106m8881j5250K1905M0943j707
$$ -91410 -79746 -59019 -105754 -114274 6012 48114 -56992 -105873 -121123 -99218 -58275 -59982
1447e9982M9221k2768p4622Q6697n1467M8598J825j0720o4442j24029J5088R5804
$$ -59982 -10761 -33529 -108151 -21454 -72921 -24323 -22498 -33218 -97660 -221689 -206601 -110797
1435a10797L0905M4792k1421j3359j5344J27212k332R3963j9676j04862n1877
$$ -110797 -79892 -35100 -56521 -69880 -85224 41988 39656 133619 113943 9081 -42796
1424d2796Q7848K2432j11232m6891l8910J906O7838J39372j10521j09099P6596
$$ -42796 45052 67484 -43748 -90639 -129549 -127643 -59805 79567 -30954 -140053 -63457
1413f3457M5929J9177j0059k8580J28123j18691j6272J6277j66543N6550q243
$$ -63457 -17528 1649 -8410 -36990 91133 -27558 -43830 -27553 -194096 -137546 -145789
1402a45789Q7164k2630J5948K6483m7363M2350N2434K2423O3170k03569O9183
$$ -145789 -58625 -81255 -65307 -38824 -86187 -43837 8597 31020 94190 -109379 -40196
1391d0196N0993O506M4843m8597j6501o1896O4535K0256L1818o3092M7414M1406
$$ -40196 10797 17303 62146 13549 -2952 -64848 -313 19943 51761 -11331 36083 77489
1379G7489L7824r5492o9555o7421J13979l4714r078Q4244j318P4767m5970j22587
$$ 77489 115313 19821 -49734 -117155 -3176 -37890 -46968 37276 35958 110725 64755 -57832
1367e7832Q0381N761q0292N4171Q4017M1976k34694o1374J01427J4146P4273l1057
$$ -57832 22549 28310 -51982 2189 86206 128182 -106512 -167886 -66459 -52313 21960 -9097
1355i097p9654M3100J18370j07219q7478J70947n5021k519J4996o5134R6990P6034
$$ -9097 -88751 -45651 72719 -34500 -121978 48969 -6052 -8571 6425 -58709 38281 114315
1343A14315K3542j03701n8385K5558q734J0138L4421q3492n133r541n0065J38695
$$ 114315 137857 34156 -24229 1329 -7405 2733 37154 -46338 -51471 -61012 -111077 27618
1331B7618P103l7700P6064l2034M10j9909M046K9797N1273n0148M1485q2436n835
$$ 27618 34721 -2979 73085 41051 41461 21552 25598 55395 106668 56520 98005 15569 9734
1318I734q2808o496R5647K7585N3027p7014Q9690l720j08290n7763M297n4138
$$ 9734 -73074 -79570 16077 43662 96689 19675 109365 105645 -2645 -60408 -56111 -110249
1306a10249l4678K0228R0857L1133p5837P4856N1850r4633N7340M9810N3145n1277
$$ -110249 -144927 -124699 -33842 -2709 -78546 -3690 48160 -46473 10867 60677 113822 62545
1294F2545j6508j10306N3559r056N2950j21118M6518J53691j5919k2302k2404
$$ 62545 46037 -64269 -10710 -19766 33184 -87934 -41416 112275 96356 74054 51650
1283E1650l9118n4466L9087K0325j4333o6546N6772N2051p5063L4213M9998q5750
$$ 51650 12532 -41934 -2847 17478 3145 -63401 -6629 45422 -29641 4572 54570 -31180
1271c1180l1451N2833m7604l463K20662j09513j16287m4365P5267J7523o6687
$$ -31180 -62631 -9798 -57402 -60865 159797 50284 -66003 -110368 -35101 -17578 -84265
1260h4265J18700P2785j83450R349Q6535M794o518j00733o42M9800l5188N9347
$$ -84265 34435 107220 -76230 -66881 19654 24448 17930 -82803 -83445 -33645 -68833 -9486
1248i486M7380J4177M256o5234q5115R6108M3622M7438k1753j05211l9207J01896
$$ -9486 37894 52071 56327 -8907 -94022 2086 45708 93146 71393 -33818 -73025 28871
1236B8871O4978o2193j4411p7853N1364l9483o4146J33985N2438j02065m9880
$$ 28871 93849 31656 17245 -60608 -9244 -48727 -112873 21112 73550 -28515 -78395
1225g8395O8400J22749p8674J13127R0464j10754J363j56386m8630J50726n3948
$$ -78395 -9995 112754 34080 147207 237671 126917 128280 -28106 -76736 73990 20042
1214B0042J186j21196K7623l7197j07691R5613M9443R0009o8109j3292N5251n0540
$$ 20042 21228 -99968 -72345 -109542 -217233 -121620 -72177 17832 -50277 -63569 -8318 -58858
1202e8858R5003k2551n6707Q8146m6741j5199O9506K0516j8814K9584o1063k669
$$ -58858 36145 13594 -43113 45033 -1708 -16907 52599 73115 54301 83885 22822 20153
1190B0153n4648l862l8025K4176P7320k3814r9239L175O2969l1526J7402J8013
$$ 20153 -34495 -38357 -76382 -52206 25114 1300 -97939 -94764 -31795 -63321 -45919 -27906
1178b7906K0320L2313P6374M2668j14047q8635Q9633J4914K9615N4367j5936j06508
$$ -27906 -7586 24727 101101 143769 29722 -58913 30720 45634 75249 129616 113680 7172
1166G172K4379N0748m6088M0193j92153J8963J73650n0619K3777N2525r0843k8491
$$ 7172 31551 82299 36211 76404 -115749 -96786 76864 26245 50022 102547 11704 -16787
1154a6787P9847N044l5197J3970M4143o5192p2190K0040L1087J1001k7718N3323
$$ -16787 63060 68104 32907 46877 91020 25828 -46362 -26322 4765 15766 -11952 41371
1142D1371j0814K929K3570M563k8430o0131K2376r2153M7529J22387q2217M299
$$ 41371 30557 33486 57056 61619 33189 -26942 -4566 -96719 -49190 73197 -9020 -4721
1130d721M2923J5885R3199j05572L4044M2580j24763J7347R1519n1598J8771R536
$$ -4721 38202 54087 147286 41714 75758 118338 -6425 10922 102441 50843 69614 79150
1118G9150q1528O2302r0732o4909K0306m3019J24245N8192j08159O8076j17058
$$ 79150 -2378 59924 -30808 -95717 -75411 -118430 5815 64007 -44152 23924 -93134
1107i3134n4933J29984q9781M7510O0922k1491m0737O1137l3910K0655k3438k0478
$$ -93134 -148067 -18083 -107864 -60354 568 -20923 -61660 -523 -34433 -13778 -37216 -57694
1095e7694K7603N111p6673K3041j9899M8769m004P1315N4066l6145l1820q2506
$$ -57694 -30091 -24980 -101653 -78612 -98511 -49742 -53746 17569 71635 35490 3670 -78836
1083g8836J37850J5331o1269j36710r0678J16832J47217M1589j01141K5669j8902
$$ -78836 59014 74345 13076 -123634 -214312 -97480 49737 91326 -9815 15854 -3048
1072c048p2542J29531r2853Q2426N7337M7416r1295K7790Q3494p3768m3267M6190
$$ -3048 -75590 53941 -38912 43514 100851 148267 56972 84762 168256 94488 51221 97411
1060I7411l1539K231l1416o4383R5012k6299J7853n3670p090J27516j38875j35435
$$ 97411 65872 68103 36687 -27696 67316 41017 58870 5200 -1890 125626 -13249 -148684
1048a48684J78226k3836j16667N8940Q441m7073o4362j6547J09441J23517O4524
$$ -148684 29542 5706 -110961 -52021 -43580 -90653 -155015 -171562 -62121 61396 125920
1037A25920j1018p1187q2173J05372l8785j45739J19585k936n7534L8514J393
$$ 125920 114902 43715 -38458 66914 28129 -117610 1975 -961 -58495 -19981 -18588
1026a8588L5891r744J0622Q6452o619o0603n0968R8129r686k4521j15259J8795
$$ -18588 17303 7559 18181 104633 98014 37411 -13557 84572 74886 50365 -64894 -46099
1014d6099J3223j15514K0288J58241J22504p5911j8269j48172l7892O4514Q7770
$$ -46099 -32876 -148390 -128102 30139 152643 76732 58463 -89709 -127601 -63087 24683
1003B4683j7539l1921j168j0474M5543J145O1250j26963J24811q4803r4138J38228
$$ 24683 7144 -24777 -25945 -36419 9124 10269 71519 -55444 69367 -15436 -109574 28654
991B8654q5281P7067O1727m6116J9679P4281K5049r5874k5142m6017J5392R3258
$$ 28654 -56627 20440 82167 36051 55730 130011 155060 59186 34044 -11973 3419 96677
979I6677n9792L3502J5768K5781j12486l8100j6427n3145j244j3995J00471q816
$$ 96677 36885 70387 86155 111936 -550 -38650 -55077 -108222 -109466 -123461 -22990 -31806
967c1806K2666J18191k0585j53265O7136R5625n0243R1628m1517j885p3373K7795
$$ -31806 -9140 109051 88466 -64799 2337 97962 47719 139347 97830 95945 22572 50367
955E0367r3285R26P6028J6785j1951k0137q6227Q4189J8723P3297j4042p0947
$$ 50367 -42918 -41992 34036 50821 38870 18733 -67494 16695 35418 108715 94673 23726
943B3726M5762k4962M5455j83494k3727R6068k8508L5397k9023K4540q3499m2444
$$ 23726 69488 44526 89981 -93513 -117240 -21172 -49680 -14283 -43306 -18766 -102265 -144709
931a44709J04325P281R725K8828j2318q2784p1507O8103J03741K6767j5351o1031
$$ -144709 -40384 -33103 -23378 5450 -6868 -89652 -161159 -93056 10685 37452 22101 -38930
919c8930j0019p7048R6278Q59n9974n9340R4782k4193J08204m7303o7245j62581
$$ -38930 -48949 -125997 -29719 -28860 -88834 -148174 -53392 -77585 30619 -16684 -83929 -246510
907b46510J49105O7675K4953P0340L8520n9860l091L4548j27916O3050r543M7156
$$ -246510 -97405 -29730 -4777 65563 104083 44223 41132 75680 -52236 10814 1271 48427
895D8427n2900j18174N5501J06716J17301O0199j97066J0633N1619J6842o3855
$$ 48427 -4473 -122647 -67146 39570 156871 217070 20004 30637 82256 99098 35243
884C5243n6081Q730J3654o9192O6831j7246q7467M9215R2502Q2051p4748j14090
$$ 35243 -20838 -12108 1546 -67646 -815 -18061 -105528 -56313 36189 118240 43492 -70598
872g0598j783J499l2038j3377m4136M4109J61074k9300M2291o1892j23496J42412
$$ -70598 -72381 -70882 -102920 -116297 -160433 -116324 44750 15450 57741 -4151 -127647 14765
860A4765K3248p2227k0642O9833L9478O8120o0028P4584j209j49847m3670P6452
$$ 14765 38013 -34214 -54856 14977 54455 122575 62547 137131 135922 -13925 -57595 18857
848A8857j0780K4313J62510q2432Q441o4559L777q7522L6459m2192R3511N386
$$ 18857 8077 32390 194900 112468 120909 56350 60127 -27395 9064 -33128 60383 65769
836F5769k9948m0231r1087J18061J7026L8037N475O2709k0976q0908n1876o662
$$ 65769 35821 -4410 -95497 22564 39590 77627 83102 145811 124835 43927 -7949 -14611
824a4611m5084J56570p523j10632j1416M3961l0844N5577Q877L1886N016n9440
$$ -14611 -59695 96875 89352 -21280 -32696 11265 -19579 35998 44875 76761 81777 22337
812B2337j28545K9774Q2363p2087P4570p0203L678o2969N6304J18411M2779q1868
$$ 22337 -106208 -76434 5929 -66158 8412 -61791 -58113 -121082 -64778 53633 96412 14544
800A4544j02483L1131K0231k7789J61624P487j65184J8809M4723n9228K5713K0297
$$ 14544 -87939 -56808 -36577 -64366 97258 104745 -60439 -41630 3093 -56135 -30422 -10125
788a0125j4808l9187m2774J08497k8651n1689N4526N0613r665N9939L6403p5292
$$ -10125 -24933 -64120 -106894 1603 -27048 -78737 -24211 26402 16737 76676 113079 37787
776C7787p0078N072N3654P1360r8143J0498m2973j3828N8588l3623K3583J2404
$$ 37787 -32291 -27219 26435 97795 -348 10150 -32823 -46651 11937 -21686 1897 14301
764A4301J6949Q593o6058l3715L3856N9119j11117m0074J21001L3880p672q6310
$$ 14301 31250 39843 -26215 -59930 -26074 33045 -78072 -118146 2855 36735 29063 -57247
752e7247Q3113r7670O0765J15019j15219k3734O3583n7452K3820L9565p7839o4674
$$ -57247 25866 -71804 -11039 103980 -11239 -34973 28610 -28842 -5022 34543 -43296 -107970
740a07970R0729L2010o561o828J4977P2143r8335o9715J6136k1439m8601M7785
$$ -107970 -17241 14769 8208 1380 16357 88500 -9835 -79550 -63414 -84853 -133454 -85669
728h5669K6329J04817L0601m5892j6606M8139k1027j23796m8324N3173K3743K5597
$$ -85669 -59340 45477 76078 30186 13580 61719 40692 -83104 -131428 -78255 -54512 -28915
716b8915M7130N5163n6508K5450J6629j31084N2505M0915J5037l80j18299o930
$$ -28915 18215 73378 16870 42320 58949 -72135 -19630 21285 36322 35942 -82357 -89287
704h9287L3256K841R9475m6411o6943J7106K978j8787J22901K8954j3291p9991
$$ -89287 -56031 -53190 46285 -126 -67069 -49963 -46985 -65772 57129 86083 72792 -7199
692g199j07641j0226j9056m6460P9104J39552J2157r4061o3126J10610k2417M3492
$$ -7199 -114840 -125066 -144122 -190582 -111478 28074 40231 -53830 -116956 -6346 -28763 14729
680A4729R271O5573p5429j7399k1741K7554K1721m048L6946k7023r9495Q8879
$$ 14729 24000 89573 14144 -3255 -24996 2558 24279 20231 57177 30154 -69341 19538
668A9538Q3461l0739P0740J9791l1476q3432M5091q604j7591l1939p0859J24613
$$ 19538 102999 72260 143000 162791 131315 47883 92974 84370 66779 34840 -36019 88594
656H8594k9160P875N8608q2581k0997o1302R104j7809N2648j09021k896N5285
$$ 88594 59434 67309 125917 43336 22339 -38963 -29859 -47668 4980 -104041 -106937 -51652
644e1652q0266J26214J45267J1280p7602K6669k060Q085j39101L9337L0532j40451
$$ -51652 -131918 -5704 139563 150843 73241 99910 97850 105935 -33166 6171 36703 -103748
632a03748K8610L2896J56658q3116N1033j298r0199N1119Q040J3852m3925R3240
$$ -103748 -75138 -42242 114416 31300 82333 81035 -9164 41955 49995 63847 19922 113162
620A13162p2437N9507R157l3243J94007j56888r8642n7206K9146L850m1510J01119
$$ 113162 40725 100232 109389 76146 270153 113265 14623 -42583 -13437 -9587 -51097 50022
608E0022j7682O1370l4425j12467K3409j19708J13349O6754l9775j9740l0646
$$ 50022 32340 93710 59285 -53182 -29773 -149481 -36132 30622 -9153 -28893 -59539
597e9539J067P566J6757Q0282J07578p6719q2059k9819n049R1141P9249m7689
$$ -59539 -58472 -50906 -34149 46133 153711 76992 -5067 -34886 -39935 51206 130455 82766
585H2766j1690p9950O9251K2141o6912l4530M0004N5365j1759J5666j1663j1596
$$ 82766 71076 -8874 60377 82518 15606 -18924 21080 76445 64686 80352 68689 57093
573E7093p0448J02075K4306r7918J6772J06321k4800r4210J2353n7701j07880
$$ 57093 -13355 88720 113026 15108 31880 138201 113401 19191 31544 -26157 -134037
562a34037M3392J05651O2110M541o5541k3699l9014n6629P3111j4842l2381Q5550
$$ -134037 -90645 15006 77116 81657 16116 -7583 -46597 -103226 -30115 -44957 -77338 8212
550H212O0298r2453o2315p2881J7208l9805J09645R629P1234j563r6539Q3651
$$ 8212 68510 -23943 -86258 -159139 -141931 -181736 -72091 -62462 8772 7209 -89330 -5679
538e679j3281o9686o5646M9061J0210J43135o2231L8620p1574k0199J38210m7346
$$ -5679 -18960 -88646 -154292 -105231 -95021 48114 -14117 24503 -47071 -67270 70940 23594
526B3594j54639K5095P4601M3375j00264N3369J9448R8910K7018j6319P5992Q686
$$ 23594 -131045 -105950 -31349 12026 -88238 -34869 -15421 83489 110507 94188 170180 178866
514A78866L134k48115J2528P4823j00163j2747N7161l9296J15408k9632n7487
$$ 178866 182000 -66115 -53587 21236 -78927 -91674 -34513 -73809 41599 11967 -45520
503d5520j2160l5847Q9105J46728j07050j16360J25822r073k4534o719J03647
$$ -45520 -57680 -93527 -4422 142306 35256 -81104 44718 35645 11111 4392 108039
492A08039m4204j3732r462l941J4961j20805L5453J30714K9937P4490q1320j98423
$$ 108039 63835 50103 40641 36700 51661 -69144 -33691 97023 126960 201450 120130 -78293
480g8293J73170j03722n5679Q9234o6600M3602r5548l2897P8364k5109l751J17094
$$ -78293 94877 -8845 -64524 24710 -41890 1712 -93836 -126733 -48369 -73478 -77229 39865
468C9865M446p8476P5161R0529l3532k24074J7738J77179r5995k0093J45780J91373
$$ 39865 44311 -34165 40996 131525 97993 -126081 -108343 68836 -27159 -47252 98528 289901
456B89901p9917j21574J0995k2411n0645j7138l6340K9683M6129J3416Q846j4309
$$ 289901 209984 88410 99405 76994 26349 9211 -27129 2554 48683 62099 70945 56636
444E6636K4557J7321m2217j8047q4445o2701N2195J30575r3679j46158N2326L6653
$$ 56636 81193 98514 56297 38250 -46195 -108896 -56701 73874 -19805 -165963 -113637 -76984
432g6984m8579N849O7879l6313J22866N1127L0734q9559j20388J6244K9530M3163
$$ -76984 -125563 -119714 -51835 -88148 34718 85845 116579 27020 -93368 -77124 -47594 -4431
420d431M1775L1221p7661p2114P2896j13389q1799R778L4750J43905L1262L286
$$ -4431 37344 68565 -9096 -81210 -8314 -121703 -203502 -193724 -158974 -15069 16193 19479
408A9479l1943M108N048m3986O7412L4756n8397L131k7034R1304m957p5430R4309
$$ 19479 -12464 -8356 -3308 -47294 20118 54874 -3523 -392 -27426 63878 58921 -16509 77800
395G7800Q2175q7116l4877K6240k2323k4787l6889O105j11043Q2316J27151j9265
$$ 77800 159975 72859 37982 64222 41899 17112 -19777 -13672 -124715 -42399 84752 65487
383F5487j08831J2961Q0587M6689o8278M1215L7714j19733j20531R2116J36258
$$ 65487 -43344 -30383 50204 96893 28615 69830 107544 -12189 -132720 -40604 95654
372I5654l0310n4446o7392R1854j2633k7806N2163J3259r7047k0762P5838P2165
$$ 95654 65344 10898 -56494 35360 22727 -5079 47084 60343 -36704 -57466 18372 90537
360I0537j33371K4592J00227n458j03971j20324P8534L758J7053M0994M8901j7181
$$ 90537 -42834 -18242 81985 76527 -27444 -147768 -69234 -65476 -48423 -7429 41472 24291
348B4291j5779O7124r5621N8599l3307r0361L8412N540R2164j07282R9618P1944
$$ 24291 8512 75636 -19985 38614 5307 -85054 -46642 -41102 51062 -56220 43398 115342
336A15342j32623P228k5132k3431N9184o709J11700n1363k0389M5692j21198l2042
$$ 115342 -17281 -10053 -35185 -58616 568 -6141 105559 54196 33807 79499 -41699 -73741
324g3741Q3332M9517Q337K2276o0460p3030l2572O7765J37081j20728L0537n0761
$$ -73741 9591 59108 67445 89721 29261 -43769 -76341 -8576 128505 7777 38314 -12447
312a2447k8818M9554k4058k1756L7844K529m9744Q6843n4231l2266Q2835K6533
$$ -12447 -41265 8289 -15769 -37525 319 2848 -46896 39947 -14284 -46550 36285 62818
300F2818k3954O9096R141l9519r1823O6681J5678n9065q990l6180j5312L3306
$$ 62818 38864 107960 117101 77582 -14241 52440 68118 9053 63 -36117 -51429 -18123
288a8123K0614O3892M5790m3562l8817K4751j5113j725o3971l3079J33522n4050
$$ -18123 2491 66383 112173 68611 29794 54545 39432 37707 -26264 -59343 74179 20129
276B0129l1116l372J8825M1369j35675R5266K281l3739K79k6951J02085K8695
$$ 20129 -10987 -14359 4466 45835 -89840 5426 7707 -26032 -25753 -52704 49381 78076
264G8076M7404L2648m6830k6888n214r2479p2817n0765O1035K8010o6900J31400
$$ 78076 125480 158128 111298 84410 79196 -13283 -86100 -136865 -75830 -47820 -114720 16680
252A6680Q5561n1526r3234M372J11064q6620r2529J59207j8115m4035O8191J3387
$$ 16680 102241 50715 -42519 -38147 72917 -13703 -106232 52975 34860 -9175 59016 72403
240G2403l9108q5780p6820J46478J7148O8473K5826l7690j8772R0026o3702r2825
$$ 72403 33295 -52485 -129305 17173 34321 102794 128620 90930 72158 162184 98482 5657
228E657M7706O0651P198j63776J04428N3026j29871k5246M9439N1752n2766O4197
$$ 5657 53363 114014 121212 -42564 61864 114890 -14981 -40227 9212 60964 8198 72395
216G2395r1781k7451N0904k6564L3378k7765l05L0907K5255K14J7333n9370M3995
$$ 72395 -19386 -46837 4067 -22497 10881 -16884 -17189 13718 38973 39187 56520 -2850 41145
203D1145p4524l2484o4126O9635M1485q8477r6856O1395M4438J12330J4349r7660
$$ 41145 -33379 -65863 -129989 -60354 -18869 -107346 -204202 -142807 -98369 13961 28310 -69350
191f9350k4501J00523k6238L7798J20367P594l2653l0430R1165j0444k8952m1597
$$ -69350 -93851 6672 -19566 18232 138599 146193 113540 83110 174275 163831 134879 93282
179I3282l0155l8930j29386j443K7532M9915N4600j130l58q390l4876m3115O4889
$$ 93282 63127 24197 -105189 -106632 -79100 -29185 25415 24285 23927 15537 -19339 -62454 2435
166B435N8282k2741j31480J0109l0453K9033Q50P8775o6439L0742N3426K8051
$$ 2435 60717 37976 -93504 -83395 -113848 -84815 -83965 -5190 -71629 -40887 12539 40590
154D0590r3742R688M6139l017r312K1421P8488q7191O0073l8483K2287n5527Q3876
$$ 40590 -53152 -43464 2675 -342 -9654 11767 90255 3064 63137 24654 46941 -8586 75290
141G5290O4509p5206L3503J3917q4472k0922p180N848l058Q2472j2851p2356O0988
$$ 75290 139799 64593 98096 112013 27541 6619 -561 5287 2229 84701 71850 -506 60482
128F0482Q3634j38413N124L234q4581m0760Q0718k298O8186j7494k5682r976L7841
$$ 60482 144116 5703 10827 14061 -70520 -111280 -30562 -32860 35326 17832 -7850 -17826 20015
115B0015J9023O1091Q1720j71378k6488P5472K1200k8857p0964N4704q9663j5867
$$ 20015 39038 100129 181849 10471 -16017 59455 80655 51798 -19166 35538 -54125 -69992
103f9992m9989O6747K8795k8151L6694L184p96n3182P4132n3246J5997J7869Q3855
$$ -69992 -119981 -53234 -24439 -52590 -15896 -12712 -13508 -66690 7442 -45804 -29807 -11938 71917
90G1917m5418j1621K1662k3209M1409O5468o2627o4816K561R271o9282O3731m5174
$$ 71917 26499 14878 36540 13331 54740 120208 57581 -7235 -4674 4597 -64685 -954 -46128
77d6128O7144J210L6398k5342M1438M941j24900M6022P37n5516J03317m9343Q2988
$$ -46128 21016 22226 58624 33282 74720 79661 -45239 783 1520 -53996 49321 -22 82966
64H2966o2564K7035O9032q652J3839J4506j30860o8375J19092J0414j01335o0872
$$ 82966 20402 47437 116469 107817 121656 136162 5302 -63073 56019 66433 -34902 -95774
52i5774R106l672M0917p408N2011k2418N6395O9826j5908l8596m6815l2068O7928
$$ -95774 -86668 -90340 -49423 -56831 -4820 -27238 29157 98983 83075 44479 -2336 -34404 33524
39C3524m9113N8002n030k1623l3990J5731K0258l6667O2307j5469n4392K2995
$$ 33524 -15589 42413 37383 15760 -18230 -2499 17759 -18908 43399 27930 -26462 -3467
27c467J1790r223j2158K6395k6561J9633K7755j3119M5637k9614j49844L7400
$$ -3467 8323 -900 -13058 13337 -13224 6409 34164 21045 66682 37068 -112776 -75376
15g5376J24972J1842l6650P6540r4250J467J2301R683N8414j50998l4110P6762
$$ -75376 49596 61438 24788 101328 7078 8545 20846 30529 88943 -62055 -96165 -19403
3a9403O1890j2855n6164
$$ -19403 42487 29632 -26532
0b6532
$$ -26532
$$ Imaginary data points
##PAGE= N=2
##DATA TABLE= (X++(I..I)), XYDATA
16383a425783P4597p452m2298j6262l2410P120R5232N2497l7122k2108L9945M8970
$$ -1425783 -1351186 -1358638 -1400936 -1417198 -1449608 -1442488 -1347256 -1294759 -1331881 -1353989 -1314044 -1265074
16371a265074k4693k8364L1175P7432K4317k7189M1048l2215J28945Q4500j2426
$$ -1265074 -1289767 -1318131 -1286956 -1209524 -1185207 -1212396 -1171348 -1203563 -1074618 -990118 -1002544
16360a002544j7838j1599L0631n2970M895M817R6891N3748J5092K0853L3643l8409
$$ -1002544 -1020382 -1031981 -1001350 -1054320 -1049425 -1044608 -947717 -893969 -878877 -858024 -824381 -862790
16348h62790m5733L0715O2082L3938P4701Q4725k4696M552k704P838L1803P8198
$$ -862790 -908523 -877808 -815726 -781788 -707087 -622362 -647058 -642506 -645210 -637372 -605569 -527371
16336e27371p875n3131j4133M0997J41178k5105J0390P2920l0052m0509L180J8781
$$ -527371 -535246 -588377 -602510 -561513 -420335 -445440 -435050 -362130 -392182 -432691 -429511 -410730
16324d10730J8982J02120N3825m0945m0361m1369M515J21298j0026o2278J05028
$$ -410730 -391748 -289628 -235803 -276748 -317109 -358478 -353963 -232665 -242691 -304969 -199941
16313a99941Q630P070k086o2484N2553p906J9273Q2605J03220j3668n4458L8689
$$ -199941 -191311 -184241 -186327 -248811 -196258 -204164 -184891 -102286 934 -12734 -67192 -28503
16301b8503J05648O6238o7603K5114N3333J03232j69616j8903R9963k4725n223
$$ -28503 77145 143383 75780 100894 154227 257459 87843 68940 168903 144178 138955
16290A38955m1142O3707Q4442K5547j47541R2512O6091J550P2142o5799m6872
$$ 138955 97813 161520 245962 271509 123968 216480 282571 284121 356263 290464 243592
16279B43592J01507J01492J04512k1048n3148o1452K4621N415J4225L779j5913
$$ 243592 345099 446591 551103 530055 476907 415455 440076 445491 459716 463495 447582
16268D47582l809K3327l1624J8025Q9817m4644L750L7251k9106p4298Q5553J5633
$$ 447582 443773 467100 435476 453501 543318 498674 502424 539675 510569 436271 521824 537457
16256E37457J9875K07528j0972j77506o7846J75494O7813Q0127r839o6964m7984
$$ 537457 557332 764860 753888 576382 508536 684030 751843 831970 822131 755167 707183
16245G07183L8845M8068m6566L4202M1111N6686o6433q351l63M8720j7782k7505
$$ 707183 746028 794096 747530 781732 822843 879529 813096 804745 804382 853102 835320 807815
16233H07815l6557N4210l3053o810J00239J08357p4111j30959m2295M9045J11171
$$ 807815 771258 825468 792415 785605 885844 994201 920090 789131 746836 795881 907052
16222I07052R8843k1824O4920M3195l2534l8233J60601m5881n1711K4427J3239
$$ 907052 1005895 984071 1048991 1092186 1059652 1021419 1182020 1136139 1084428 1108855 1122094
16211A122094l5191l773m1977L2825k9225J2506k2578M9104M7598l5978Q379M8416
$$ 1122094 1086903 1083130 1041153 1073978 1044753 1057259 1034681 1083785 1131383 1095405 1103784 1152200
16199A152200J04559J3536L9317k1909j15044l5517K8681O5570K6306m8300r079
$$ 1152200 1256759 1270295 1309612 1287703 1172659 1137142 1165823 1231393 1257699 1209399 1200320
16188A200320J63053O664j38168M1654K8191L2832l090q055o2535j4637m0267
$$ 1200320 1363373 1370037 1231869 1273523 1301714 1334546 1331456 1323401 1260866 1246229 1205962
16177A205962M9901J56482N4284q5651K5109K4515P718p9966M4164k8128O1131
$$ 1205962 1255863 1412345 1466629 1380978 1406087 1430602 1438320 1358354 1402518 1374390 1435521
16166A435521q3957M3247n8494J2917L086M0491L2031R759n8583j4359p734j14667
$$ 1435521 1351564 1394811 1336317 1349234 1352320 1392811 1424842 1434601 1376018 1361659 1353925 1239258
16154A239258j9924P2964K26969m7422j95327J20200N775j2223O5773Q3266m175
$$ 1239258 1219334 1292298 1519267 1471845 1276518 1396718 1402493 1390270 1456043 1539309 1535134
16143A535134r827k6386k7829N3098j6059n3013P3771j08779k6711O1391J0648
$$ 1535134 1525307 1498921 1471092 1524190 1508131 1455118 1528889 1420110 1393399 1454790 1465438
16132A465438J8797k472K0033M4738q7944o6321J44094k0183j13377Q4406Q6384
$$ 1465438 1484235 1481763 1501796 1546534 1458590 1392269 1536363 1516180 1402803 1487209 1573593
16121A573593j4264j00691m3284L4412K3392J2421M1091J2344o1178Q677J5499
$$ 1573593 1559329 1458638 1415354 1449766 1473158 1485579 1526670 1539014 1477836 1486513 1502012
16110A502012L7011o3873P9699o359m8206l0684M9483K9379k5398j19437M2893
$$ 1502012 1539023 1475150 1554849 1548490 1500284 1469600 1519083 1548462 1523064 1403627 1446520
16099A446520L2959K9449m3779J09401o1089M8748p418J7666k1874Q8238n874
$$ 1446520 1479479 1508928 1465149 1574550 1513461 1562209 1554791 1572457 1550583 1638821 1632947
16088A632947O0910j22314n0355L8627l3565J67807n6516J3892j0892m7930m5829
$$ 1632947 1693857 1571543 1521188 1559815 1526250 1694057 1637541 1651433 1640541 1592611 1546782
16077A546782j9027J3898K3142o1412k7840L7821J12328M961N2949j02035o6638
$$ 1546782 1527755 1541653 1564795 1503383 1475543 1513364 1625692 1630653 1683602 1581567 1514929
16066A514929M0196n3420J51658k0181l8642K9633m5009m1993r09m088Q6887n6238
$$ 1514929 1555125 1501705 1653363 1633182 1594540 1624173 1579164 1537171 1536262 1532174 1619061 1562823
16054A562823k7556J4638Q1163K6574j11743J5627o6212M60Q0163M8746O1221
$$ 1562823 1535267 1549905 1631068 1657642 1545899 1561526 1495314 1495774 1575937 1624683 1685904
16043A685904K9567m706n8319p2890J54285J3872j81343l7640j22956J42930O1878
$$ 1685904 1715471 1710765 1652446 1579556 1733841 1747713 1566370 1528730 1405774 1548704 1610582
16032A610582m8694N1248k6364J8409k0843P5693j06882N8540O7404n3924O2422
$$ 1610582 1561888 1613136 1586772 1605181 1584338 1660031 1553149 1611689 1679093 1625169 1687591
16021A687591R1704p6384o6937r552M8404j3813j515n5561m1122m9388J16847
$$ 1687591 1779295 1702911 1635974 1626422 1674826 1661013 1659498 1603937 1562815 1513427 1630274
16010A630274K4614L3085l7868r230j7934N8852j06864o1454n557J50655O4128
$$ 1630274 1654888 1687973 1650105 1640875 1622941 1681793 1574929 1513475 1507918 1658573 1722701
15999A722701K5503L1896j49261K3890k2306l7702R351O612J24190k4584L0370
$$ 1722701 1748204 1780100 1630839 1654729 1632423 1594721 1604072 1610684 1734874 1710290 1740660
15988A740660k6263j39127m0923j5443J6691K8527R1956p9162P712P1123K0000
$$ 1740660 1714397 1575270 1534347 1518904 1535595 1564122 1656078 1576916 1584628 1655751 1675751
15977A675751l2758j3114k8096q0467m9275P2004J2154R7188O1628j40882r9110
$$ 1675751 1642993 1629879 1601783 1521316 1472041 1544045 1556199 1653387 1715015 1574133 1475023
15966A475023J12137J26710k7943j21500j03465J47678Q0152m4560k0224M798
$$ 1475023 1587160 1713870 1685927 1564427 1460962 1608640 1688792 1644232 1624008 1628806
15956A628806P8698l5388Q3023k1223L0136p7656j30386m963R0386k3733Q9687
$$ 1628806 1707504 1672116 1755139 1733916 1764052 1686396 1556010 1551047 1641433 1617700 1707387
15945A707387o045R6615j01187p7124L283O3777j0962k2652J3325j8486L0370
$$ 1707387 1701342 1797957 1696770 1619646 1622929 1686706 1675744 1653092 1666417 1647931 1678301
15934A678301j65278J5319R6340K3158l7433n4305L5643J5036J10233N3700K3642
$$ 1678301 1513023 1528342 1624682 1647840 1610407 1556102 1591745 1606781 1717014 1770714 1794356
15923A794356l4736N357n7956j25105J26856K1656K2563j0234L9812K5452j00684
$$ 1794356 1759620 1764977 1707021 1581916 1708772 1730428 1752991 1742757 1782569 1808021 1707337
15912A707337j28911L2708m342J00080n6594m9004J7097J00347Q9086p8380k4195
$$ 1707337 1578426 1611134 1606792 1706872 1650278 1601274 1618371 1718718 1807804 1729424 1705229
15901A705229j26580m2950Q705P2765k1348m3454J92029K7272j32119k8138j8038
$$ 1705229 1578649 1535699 1544404 1617169 1595821 1552367 1744396 1771668 1639549 1611411 1593373
15890A593373k2109K5841K8558L0805O0815q3493o7785J2410O4517p408j497L2180
$$ 1593373 1571264 1597105 1625663 1656468 1717283 1633790 1566005 1578415 1642932 1635524 1634027 1666207
15878A666207p6936L3387P8813J5060k0029j03920k6430q0299k7004J02929Q7944
$$ 1666207 1589271 1622658 1701471 1716531 1696502 1592582 1566152 1485853 1458849 1561778 1649722
15867A649722r975p9717K239n678N2049l3242J06181R886O698r1516k3702M3468
$$ 1649722 1639747 1560030 1562269 1556591 1608640 1575398 1681579 1691465 1698163 1606647 1582945 1626413
15855A626413j7986r6918o5103J08558R3094M4364m6886L1032j20313N03O6589
$$ 1626413 1608427 1511509 1446406 1554964 1648058 1692422 1645536 1676568 1556255 1556758 1623347
15844A623347j92873R4580N9393l653R4280J4801n0053L0199K8212o7495n8257
$$ 1623347 1430474 1525054 1584447 1580794 1675074 1689875 1639822 1670021 1698233 1630738 1572481
15833A572481J39335o2549J7179O2804J6201j4858q2817m639L1360q764R191j42216
$$ 1572481 1711816 1649267 1666446 1729250 1745451 1730593 1647776 1643137 1674497 1665733 1674924 1532708
15821A532708m0444R8494k1749O6268j18208K2860J69670K6576p681m2831J4286
$$ 1532708 1492264 1590758 1569009 1635277 1517069 1539929 1709599 1736175 1728494 1685663 1699949
15810A699949n9929O8542M6332j01512j5340j37484Q1992N424L7893K1576k0296
$$ 1699949 1640020 1708562 1754894 1653382 1638042 1500558 1582550 1587974 1625867 1647443 1627147
15799A627147l0382L2895j46151R9859K1006o8159N2483m0494L2385O778N8080
$$ 1627147 1596765 1629660 1483509 1583368 1604374 1536215 1588698 1548204 1580589 1587367 1645447
15788A645447l319P2586j9131q9004N5887M0189j7055L1481Q971q5697r4348j6667
$$ 1645447 1642128 1714714 1695583 1606579 1662466 1702655 1685600 1717081 1726052 1640355 1546007 1529340
$$ [...]
##END NTUPLES=NMR SPECTRUM
##END=
