##TITLE=1H_CG-1142-B2
 CDCl3, 8 sc, 
 13.05.2021
##JCAMPDX= 6.0         $$ Bruker NMR JCAMP-DX V2.0
##DATA TYPE= NMR SPECTRUM
##DATA CLASS= NTUPLES
##ORIGIN= UXNMR, Bruker Analytische Messtechnik GmbH
##OWNER= root
$$ XWIN-NMR		Version 3.5
$$ Thu May 13 10:28:17 2021 Russian Standard Time (UT+4h)  she@DPX200
##.OBSERVE FREQUENCY= 200.131506
##.OBSERVE NUCLEUS= ^1H
##.ACQUISITION MODE= SIMULTANEOUS
##.ACQUISITION SCHEME= undefined
##.AVERAGES= 8
##.DIGITISER RES= 18
##SPECTROMETER/DATA SYSTEM= spect
##.PULSE SEQUENCE= zg30
##.SOLVENT NAME= CDCl3
##.SHIFT REFERENCE= (INTERNAL, CDCl3, 0, 15.9875)
##AUDIT TRAIL= $$ (NUMBER, WHEN, WHO, WHERE, WHAT)
$$ ##TITLE= Audit trail, XWIN-NMR		Version 3.5
$$ ##JCAMPDX= 5.01
$$ ##ORIGIN= Bruker BioSpin GmbH
$$ ##OWNER= she
$$ F:/spectra/data/she/nmr/H-F/1/pdata/1/auditp.txt
$$ ##AUDIT TRAIL=  $$ (NUMBER, WHEN, WHO, WHERE, WHAT)
(   1,<2021-05-13 10:24:58.79 +0400>,<she>,<DPX200>,
      <created by zg, POWCHK disabled, PULCHK disabled
       configuration hash MD5:
       00 E9 B6 7A A2 85 ED C7 34 08 36 98 17 FE 4E 26
       data hash MD5: 16K
       29 FA 4F CA D8 F0 69 66 5C 89 12 30 38 8A 9A EC>)
(   2,<2021-05-13 10:25:01.46 +0400>,<she>,<DPX200>,
      <Start of raw data processing
       efp BC_mod = 2 LB = 0.24 FT_mod = 6 PKNL = 1 PHC0 = -11122.74 PHC1 = 9.801 SI = 16K 
       data hash MD5: 16K
       6F 0D F1 CF B9 51 84 F1 44 4E D6 D4 6C D6 91 02>)
(   3,<2021-05-13 10:25:29.04 +0400>,<she>,<DPX200>,
      <pk PHC0 = -0.4519579 PHC1 = 5.2 
       data hash MD5: 16K
       B7 4D B1 F0 E7 91 D2 AF F2 B4 A3 14 2D 87 69 5B>)
(   4,<2021-05-13 10:25:32.51 +0400>,<she>,<DPX200>,
      <abs ABSG = 5 
       data hash MD5: 16K
       BF 00 2D 8F 6C 8A 58 77 F6 27 45 9C 2C B5 55 22>)
$$ ##END=
$$ 
$$ hash MD5
$$ 6B CB 26 32 F5 1F 83 46 67 BC A1 EA 5D F9 C8 99
##$RELAX= 
##$RELAX= 
##$RELAX= 
##$RELAX= 
##$RELAX= 
##$RELAX= 
$$ Bruker specific parameters
$$ --------------------------
##$DU= <F:/spectra>
##$EXPNO= 1
##$NAME= <H-F>
##$PROCNO= 1
##$TYPE= <nmr>
##$USER= <she>
##$AMP= (0..31)
100 100 100 100 100 100 100 100 100 100 100 100 100 100 100 100 100 100 
100 100 100 100 100 100 100 100 100 100 100 100 100 100 
##$AQSEQ= 0
##$AQ_mod= 1
##$AUNM= <au_zg>
##$AUTOPOS= <>
##$BF1= 200.13
##$BF2= 200.13
##$BF3= 200.13
##$BF4= 200.13
##$BF5= 200.13
##$BF6= 200.13
##$BF7= 200.13
##$BF8= 200.13
##$BYTORDA= 1
##$CFDGTYP= 0
##$CFRGTYP= 5
##$CHEMSTR= <none>
##$CNST= (0..31)
1 1 145 1 1 1 1 1 1 1 1 1 1 1 1 1 1 1 1 1 1 1 1 1 1 1 1 1 1 1 1 1 
##$CPDPRG= <>
##$CPDPRG1= <>
##$CPDPRG2= <>
##$CPDPRG3= <>
##$CPDPRG4= <mlev>
##$CPDPRG5= <mlev>
##$CPDPRG6= <mlev>
##$CPDPRG7= <mlev>
##$CPDPRG8= <mlev>
##$CPDPRGB= <>
##$CPDPRGT= <>
##$D= (0..31)
0 1.2 0 0 0 0 0 0 0 0.06 0 0.03 0 0 0 0 0.0002 0 0 0 0 0 0 0 0 0 0 0 0 
0 0 0 
##$DATE= 1620887098
##$DBL= (0..7)
120 120 120 120 120 120 120 120 
##$DBP= (0..7)
150 150 150 150 150 150 150 150 
##$DBP07= 0
##$DBPNAM0= <>
##$DBPNAM1= <>
##$DBPNAM2= <>
##$DBPNAM3= <>
##$DBPNAM4= <>
$$ [...]
##$SUBNAM3= <"">
##$SUBNAM4= <"">
##$SUBNAM5= <"">
##$SUBNAM6= <"">
##$SUBNAM7= <"">
##$SUBNAM8= <"">
##$SUBNAM9= <"">
##$SW= 16.9725357007746
##$SWIBOX= (0..15)
0 0 2 0 0 0 0 0 0 0 0 0 0 0 0 0 
##$SW_h= 3396.73913043478
##$TD= 16384
##$TD0= 1
##$TE= 0
##$TE2= 300
##$TE3= 300
##$TEG= 300
##$TL= (0..7)
0 120 120 120 120 120 120 120 
##$TP= (0..7)
150 150 150 150 150 150 150 150 
##$TP07= 0
##$TPNAME0= <>
##$TPNAME1= <>
##$TPNAME2= <>
##$TPNAME3= <>
##$TPNAME4= <>
##$TPNAME5= <>
##$TPNAME6= <>
##$TPNAME7= <>
##$TPOAL= (0..7)
0.5 0.5 0.5 0.5 0.5 0.5 0.5 0.5 
##$TPOFFS= (0..7)
0 0 0 0 0 0 0 0 
##$TUNHIN= 0
##$TUNHOUT= 0
##$TUNXOUT= 0
##$USERA1= <user>
##$USERA2= <user>
##$USERA3= <user>
##$USERA4= <user>
##$USERA5= <user>
##$V9= 5
##$VALIST= <valist>
##$VCLIST= <CCCCCCCCCCCCCCC>
##$VD= 0
##$VDLIST= <DDDDDDDDDDDDDDD>
##$VPLIST= <PPPPPPPPPPPPPPP>
##$VTLIST= <TTTTTTTTTTTTTTT>
##$WBST= 1024
##$WBSW= 4
##$XGAIN= (0..3)
0 0 0 0 
##$XL= 0
##$YL= 0
##$YMAX_a= 464136
##$YMIN_a= -543266
##$ZGOPTNS= <>
##$ZL1= 120
##$ZL2= 120
##$ZL3= 120
##$ZL4= 120
##$ABSF1= 15.99475
##$ABSF2= -0.9779139
##$ABSG= 5
##$ABSL= 3
##$ALPHA= 0
##$AQORDER= 0
##$ASSFAC= 0
##$ASSFACI= 0
##$ASSFACX= 0
##$ASSWID= 0
##$AUNMP= <proc_1d>
##$AZFE= 0.1
##$AZFW= 0.1
##$BCFW= 0
##$BC_mod= 2
##$BYTORDP= 0
##$COROFFS= 0
##$CY= -3
##$DATMOD= 1
##$DC= 0
##$DFILT= <>
##$DTYPP= 0
##$F1P= 0
##$F2P= 0
##$FCOR= 1
##$FTSIZE= 16384
##$FT_mod= 6
##$GAMMA= 0
##$GB= 0
##$INTBC= 1
##$INTSCL= 1.334414e-10
##$ISEN= 128
##$LB= 0.24
##$LEV0= 0
##$LPBIN= 0
##$MAXI= 10000
##$MC2= 0
##$MEAN= 0
##$ME_mod= 0
##$MI= 1.114404
##$NCOEF= 0
##$NC_proc= -6
##$NLEV= 6
##$NOISF1= 3.799351
##$NOISF2= 2.8
##$NSP= 0
##$NTH_PI= 0
##$NZP= 0
##$OFFSET= 15.98749
##$PC= 1
##$PHC0= -11123.19
##$PHC1= 15.001
##$PH_mod= 1
##$PKNL= yes
##$PPARMOD= 0
##$PSCAL= 0
##$PSIGN= 0
##$REVERSE= no
##$SF= 200.130004792993
##$SI= 16384
##$SIGF1= 3
##$SIGF2= 2
##$SINO= 5.538805
##$SIOLD= 16384
##$SREGLST= <1H.CDCl3>
##$SSB= 0
##$STSI= 16384
##$STSR= 0
##$SW_p= 3396.73913043479
##$SYMM= 0
##$S_DEV= 0
##$TDeff= 16384
##$TDoff= 0
##$TI= <>
##$TILT= no
##$TM1= 0
##$TM2= 0
##$TOPLEV= 0
##$USERP1= <user>
##$USERP2= <user>
##$USERP3= <user>
##$USERP4= <user>
##$USERP5= <user>
##$WDW= 1
##$XDIM= 16384
##$YMAX_p= 444032482
##$YMIN_p= -294790
$$ End of Bruker specific parameters
$$ ---------------------------------
##NTUPLES= NMR SPECTRUM
##VAR_NAME=  FREQUENCY,     SPECTRUM/REAL,   SPECTRUM/IMAG
##SYMBOL=    X,             R,               I
##VAR_TYPE=  INDEPENDENT,   DEPENDENT,       DEPENDENT
##VAR_FORM=  AFFN,          ASDF,            ASDF
##VAR_DIM=   16384,         16384,           16384
##UNITS=     HZ,            ARBITRARY UNITS, ARBITRARY UNITS
##FACTOR=    0.207333158178282, 1,           1
##FIRST=     3199.57639035244, 0,            0
##LAST=      -197.162740082346, 0,           0
##MIN=       -197.162740082346, -294790,     0
##MAX=       3199.57639035244, 444032482,    0
$$ Real data points
##PAGE= N=1
##DATA TABLE= (X++(R..R)), XYDATA
$$ [...]
6061G40992J09669J8607l6102J74013O6870j986J04847j8069P3131J46987L1854
$$ 740992 850661 869268 833166 1007179 1074049 1072063 1176910 1158841 1231972 1378959 1410813
6050A410813N0712M2671P3840J63950Q9816j8193N1536M1644p0217l0199N1202
$$ 1410813 1461525 1504196 1578036 1741986 1831802 1813609 1865145 1906789 1836572 1806373 1857575
6039A857575L6318l6064j0112q6630p4841k2571K0005n44K6881p447r5091j17740
$$ 1857575 1893893 1857829 1847717 1761087 1686246 1663675 1683680 1683136 1710017 1702570 1607479 1489739
6027A489739j0400q7071j49441p5713P7959j49274o9211O905l8935J0041M5548
$$ 1489739 1479339 1392268 1242827 1167114 1245073 1095799 1026588 1033493 994558 1004599 1050147
6016A050147j69777j29182N4283l2578o3706J05787M3610j40522M4842m0791o4309
$$ 1050147 880370 751188 805471 772893 709187 814974 858584 718062 762904 722113 657804
6005F57804k1972M9729q9362k3808J9436o3432N9601Q3964j26989n8972o4819
$$ 657804 635832 685561 596199 572391 591827 528395 587996 671960 544971 485999 421180
5994D21180k4045l3508j7481p91K9163K7843n0434j06916j02417k4380J20044
$$ 421180 397135 363627 346146 345355 374518 402361 351927 245011 142594 118214 238258
5983B38258k7679M6168P8084j5289m0840L5464M7841q830m3001M5866J15437j19001
$$ 238258 210579 256747 334831 319542 278702 314166 362007 353177 310176 356042 471479 352478
5971C52478j32558J16325j02639L4247Q5853j03051j40753N9565M0629m0810J31655
$$ 352478 219920 336245 233606 267853 353706 250655 109902 169467 210096 169286 300941
5960C00941p032j8795M0312j5767j45717O3141N1798k9506l7215l482r1614l8610
$$ 300941 293909 275114 315426 299659 153942 217083 268881 239375 202160 198678 107064 68454
5948F8454J06400J6016L2012L698j2497j4974K8622N5333r9258k9038O6945k4763
$$ 68454 174854 190870 222882 226580 214083 199109 227731 283064 183806 154768 221713 196950
5936A96950p2241J10294k6760J2911L3435o5651J9697O5471P2907J5693M2573
$$ 196950 124709 235003 208243 221154 254589 188938 208635 274106 347013 362706 405279
5925D05279k15013J26796k8279j49297l5220L4554l3878n3156Q4700o5938N7785
$$ 405279 190266 317062 288783 139486 104266 138820 104942 51786 136486 70548 128333
5914A28333N7385j02143J6778J6062n5297J3560Q6687l5821p6988R5466R4550
$$ 128333 185718 83575 100353 116415 61118 74678 161365 125544 48556 144022 238572
5903B38572l3963l4334K7988l0215J23268m6584j41673k0945J18691k5962l092
$$ 238572 204609 170275 198263 168048 291316 244732 103059 82114 200805 174843 171751
5892A71751N2626j7192r5368J23081K7743m3753j9330K6927m6986l9251J10342
$$ 171751 224377 207185 111817 234898 262641 218888 199558 226485 179499 140248 250590
5881B50590m3782j6320K2163j2814k8683L1208N9194n6797L245K7731p1266L2999
$$ 250590 206808 190488 212651 199837 171154 202362 261556 204759 208004 235735 164469 197468
5869A97468P2815M6970M5208O793q0120j12650J00155R7084l1926r1832j6224
$$ 197468 270283 317253 362461 369254 289134 176484 276639 373723 341797 249965 233741
5858B33741k5221j4570R2914J1951k9532P5151n820j33602J4390J15884k6982
$$ 233741 208520 193950 286864 298815 269283 344434 338614 205012 219402 335286 308304
5847C08304o155L3632o116j7257j01170M8978j3484L6943m583p7616J3070L3159
$$ 308304 302149 335781 329665 312408 211238 260216 246732 283675 279092 201476 214546 247705
5835B47705J53104o4100m4627P0201j22963j2943o224N121R9881o2441K9686O1886
$$ 247705 400809 336709 292082 362283 239320 226377 220153 225274 325155 262714 292400 354286
5823C54286o9312R3655l3116K0594J8159L1482p1001N9700m1479o1461J8246j3866
$$ 354286 284974 378629 345513 366107 384266 415748 344747 404447 362968 301507 319753 305887
5811C05887K3381j00386M8689M4854P2055L8795l0598j06847K8412j2037j8517
$$ 305887 329268 228882 277571 322425 394480 433275 402677 295830 324242 312205 293688
5800B93688K2207O2609q55L3267O2085k2909q319K8938l4772p0437j6586r6305
$$ 293688 315895 378504 377649 410916 473001 450092 441773 470711 435939 365502 348916 252611
5788B52611q3658N3077m0486R9437R1564O5486j0639p910N2707o5762J20495o0424
$$ 252611 168953 222030 181544 280981 372545 438031 427392 419482 472189 406427 526922 466498
5776D66498k2252N4769M3463o2249k4692o661m3278K2561M9929O3328o8617j05461
$$ 466498 444246 499015 542478 480229 455537 448876 405598 428159 478088 541416 472799 367338
5764C67338j4979J8207J18065K2599p3934m1512n1923N594J43171J8116r619R8567
$$ 367338 352359 370566 488631 511230 437296 395784 343861 349455 492626 510742 501123 599690
5752E99690m5169l0359j3761J26511n6004O0127N376o4896j06258L7232J11702
$$ 599690 554521 524162 510401 636912 580908 641035 646411 581515 475257 512489 624191
5741F24191J15342Q54n3875m254L0468l7839j8802m1769l5087P6541l9295m7543
$$ 624191 739533 740387 686512 682258 712726 674887 656085 614316 579229 655770 616475 568932
5729E68932k3744J74347l7090k2353n9420J7434K9030J09133j0900K9289J4552
$$ 568932 545188 719535 682445 660092 600672 618106 647136 756269 745369 774658 789210
5718G89210R330o2620O7854k8680L5617M0633O1244m0315l0033n84K0506k6784
$$ 789210 798540 735920 803774 775094 810711 851344 912588 872273 842240 841656 862162 835378
5706H35378L6787N2963J2113j2406J2345N0104m8219n190n851N3017m0215J5703
$$ 835378 872165 925128 937241 924835 937180 987284 939065 933875 928024 981041 940826 956529
5694I56529O3630j1906k2449l3317K9231O1080Q97R9238K6169J48213l9745j5513
$$ 956529 1020159 1008253 985804 952487 981718 1042798 1043695 1142933 1169102 1317315 1277570 1262057
5682A262057J327J10132L9338q4281j519M2293K4326P8763p1031J0191O0987J5663
$$ 1262057 1263384 1373516 1412854 1328573 1327054 1369347 1393673 1472436 1401405 1411596 1472583 1488246
5670A488246J5015p3532L2058M6736J10102R8220m6598J26758L1600p457L6924
$$ 1488246 1503261 1429729 1461787 1508523 1618625 1716845 1670247 1797005 1828605 1821148 1858072
5659A858072k4510J01654J22152J3449O8728K8538P4290K1620j78841L6501J07909
$$ 1858072 1833562 1935216 2057368 2070817 2139545 2168083 2242373 2263993 2085152 2121653 2229562
5648B229562J03891M733J47345J2735m004J29196M3840M8320R2631J45143j7213
$$ 2229562 2333453 2338186 2485531 2498266 2494262 2623458 2667298 2715618 2808249 2953392 2936179
5637B936179Q0429J05103J13182J18232J06142O738O5668J06799J52319K1918
$$ 2936179 3016608 3121711 3234893 3353125 3459267 3466005 3531673 3638472 3790791 3812709
5627C812709O7234L8741J59069K30068J76191J36086K6235J45903N5823J03210
$$ 3812709 3879943 3918684 4077753 4307821 4484012 4620098 4646333 4792236 4848059 4951269
5617D951269R7704K37141J28163J59933J43378J24842J84424P740J81765J35975
$$ 4951269 5048973 5286114 5414277 5574210 5717588 5842430 6026854 6034594 6216359 6352334
5607F352334N9545Q8371J39198J07340J61289o7742J4641L4472M5389L7736J2923
$$ 6352334 6411879 6500250 6639448 6746788 6908077 6840335 6854976 6889448 6934837 6972573 6985496
5596F985496m6395k46199j79745p1689j15620j74524j08601j17247j81780r4836
$$ 6985496 6939101 6692902 6513157 6441468 6325848 6151324 6042723 5925476 5743696 5648860
5586E648860j77280j90017k25384j04974j85175j40617o0036l2368m5971k48159
$$ 5648860 5471580 5281563 5056179 4951205 4766030 4625413 4565377 4533009 4487038 4238879
5576D238879N304j51830m2132K0458j01817k35473q158j09405m025j13836q9857
$$ 4238879 4244183 4092353 4050221 4070679 3968862 3733389 3725231 3615826 3611801 3497965 3408108
5565C408108p2062q6272o033k00869r9867l9659N801j33308q4477m3279m8466
$$ 3408108 3336046 3249774 3243741 3042872 2943005 2903346 2909147 2775839 2691362 2648083 2599617
5554B599617L2997q4477J01839p6565N3790j52490m5224l4721p8490q8872j58656
$$ 2599617 2632614 2548137 2649976 2573411 2627201 2474711 2429487 2394766 2316276 2227404 2068748
5543B068748O5333p8162o6917k8980l1957n8724J08582L4799j21515K9602N003
$$ 2068748 2134081 2055919 1989002 1960022 1928065 1869341 1977923 2012722 1891207 1920809 1925812
5532A925812m7188o1841L5815m0575J2695j2599k4330j45427o243P7800r6817
$$ 1925812 1878624 1816783 1852598 1812023 1824718 1812119 1787789 1642362 1636119 1713919 1617102
5521A617102Q0149m7612p3742r8226J0041j16119k6671L9025K5945j15380j3657
$$ 1617102 1697251 1649639 1575897 1477671 1487712 1371593 1344922 1383947 1409892 1294512 1280855
5510A280855l9950n6102N7377O1247Q4449p1742l3415j84489m552M8014R3585
$$ 1280855 1240905 1184803 1242180 1303427 1387876 1316134 1282719 1098230 1093678 1141692 1235277
5499A235277K0575j25424j8683m1610N6551o3289L0805n7430l198P2831m7390
$$ 1235277 1255852 1130428 1111745 1070135 1126686 1063397 1094202 1036772 1033574 1106405 1059015
5488A059015j1516q2276J13389o4076k7175L2877k0466j58733M9352k9317p439
$$ 1059015 1047499 965223 1078612 1014536 987361 1020238 999772 841039 890391 861074 853635
5477H53635N0445l6227p017K5611J09464j02967m0722M2097M0301r2486Q2946
$$ 853635 904080 867853 860836 886447 995911 892944 852222 894319 934620 842134 925080
5466I25080K3789O1806m7003L5779j79646r2067K10194j4774j7364J09862p6231
$$ 925080 948869 1010675 963672 999451 819805 727738 937932 923158 905794 1015656 939425
5455I39425n7192J3844l3387l3920o0364p7668J09091j2823l506j20323L0819
$$ 939425 882233 896077 862690 828770 768406 690738 799829 787006 783500 663177 693996
5444F93996L1886k3467j30575q741N2845O422R9959L0730M9635m2949P7958o2274
$$ 693996 725882 702415 571840 563099 615944 622366 722325 753055 802690 759741 837699 775425
5432G75425n2712P4982k0751J7137J4549R309l0306p5884j9307P0122Q7061r3501
$$ 775425 722713 797695 776944 794081 808630 817939 787633 711749 692442 762564 849625 756124
5420G56124j08619p3997K1640O6153k871j03098n1226o2892L8756K5128M7216
$$ 756124 647505 573508 595148 661301 658430 555332 504106 441214 479970 505098 552314
5409E52314p7113L5256o1897o610O9099O127K4379M688o8680j62518J22443R6330
$$ 552314 475201 510457 448560 441950 511049 517176 541555 546243 477563 315045 437488 533818
5397E33818K366l4295P6499M2220M2467o43j0237j06639k8135M5167l9995K5003
$$ 533818 536184 501889 578388 620608 663075 662432 652195 545556 517421 562588 522593 547596
5385E47596K4154P295j11525Q6607m3492l7212P4676K9062j29595j21081J13802
$$ 547596 571750 579045 467520 554127 510635 473423 548099 577161 447566 326485 440287
5374D40287n2249l1137P5548R2737j02119r4393K0436k5018Q4164L1103Q3846
$$ 440287 388038 356901 432449 525186 423067 328674 349110 324092 408256 439359 523205
5363E23205m9559m6302O7760L7206j00988o5163M2130n188K6228J27730J47936
$$ 523205 473646 427344 495104 532310 431322 366159 408289 403101 429329 557059 704995
5352G04995j17318R7712l4121j23591q8818o3577Q2070R0711N8080j31835q1733
$$ 704995 587677 685389 651268 527677 438859 375282 457352 548063 606143 474308 392575
5341C92575K778l3427q0812J20651l2014j54748j88103J40763K3753R0797j7792
$$ 392575 395353 361926 281114 401765 369751 215003 26900 167663 191416 282213 264421
5330B64421r0312P6611O2776J03293k4691P8805o4m1061R0287k3594j7432n253
$$ 264421 174109 250720 313496 416789 392098 470903 470839 429778 520065 496471 479039 473786
5318D73786o8575p2643Q6592n8702K1321q2555k183K7488n1011l2720R704j7154
$$ 473786 405211 332568 419160 360458 381779 299224 297041 324529 273518 240798 250502 233348
5306B33348L8639Q2179j3538M47j07062l3774N2188N4798p833O9136M1524j7250
$$ 233348 271987 354166 340628 341075 234013 200239 252427 307225 299392 368528 410052 392802
5294C92802m9569N7336O1019l2043p1629M4502J4495L7643j18351J4410r6898
$$ 392802 343233 400569 461588 429545 357916 402418 416913 454556 336205 350615 253717
5283B53717M8921J6751M4061j1056J32920L430m2946l4151J9920J7353o5019N8737
$$ 253717 302638 319389 363450 352394 485314 488744 445798 411647 431567 448920 383901 442638
5271D42638j67866j1503J1391J22557k9220N704m2790j96218M9444J06271Q2303
$$ 442638 274772 263269 274660 397217 367997 373701 330911 134693 184137 290408 372711
5260C72711k8935J0403o5028n7415Q034J21849K8944Q2023p663k12641k1830P7328
$$ 372711 343776 354179 289151 231736 239770 361619 390563 472586 464923 252282 230452 307780
5248C07780O3918k6652J26766n8688n9652l8703O5919M3377o7703k0920m5589
$$ 307780 371698 345046 471812 413124 353472 314769 380688 424065 356362 335442 289853
5237B89853R6611N8035M8224n4401M9806j06366k7209L9169P685l0920l6176l0440
$$ 289853 386464 444499 492723 438322 488128 381762 354553 393722 401407 370487 334311 303871
5225C03871o2617J55391k9000m044r380O1018O9846J04825r0110q8603j8918M3511
$$ 303871 241254 396645 367645 363601 354221 415239 485085 589910 499800 411197 392279 435790
5213D35790N1606L8757J11309j54199j5084j01258l0598m7809O045J05554O6185
$$ 435790 487396 526153 637462 483263 468179 366921 336323 288514 294559 400113 466298
5202D66298J20715k9335o9750k5538Q7671j2046m3633J09199j5785q4078p3951
$$ 466298 587013 557678 487928 462390 550061 538015 494382 603581 587796 503718 429767
5191D29767K05112q5493J5256M7306q2660k820m1248L5798k5149M0939j36511
$$ 429767 634879 549386 564642 611948 529288 526468 485220 521018 495869 536808 400297
5180D00297o3881J9645P2234P0229K0912q1566M5352M5474r797N4090m2674R9197
$$ 400297 336416 356061 428295 498524 519436 437870 483222 528696 518899 572989 530315 629512
5168F29512J49359k9514n4909p5401n298k2987J34124q6750j4712j1733N8711
$$ 629512 778871 749357 694448 619047 613749 590762 724886 638136 623424 611691 670402
5157F70402m8097L6359L8750m9612j0966L9126J16229o0919n3189M2844J7514
$$ 670402 622305 658664 697414 647802 636836 675962 792191 731272 678083 720927 738441
5146G38441J0438J40330k023L7496k2699P2935R4019L7125J31108M1242N8882
$$ 738441 748879 889209 887186 924682 901983 974918 1068937 1106062 1237170 1278412 1337294
5135A337294L2143J15141n6811J55300l5452L0123J50772L7696J61601J44815
$$ 1337294 1369437 1484578 1427767 1583067 1547615 1577738 1728510 1766206 1927807 2072622
5125B072622J17268N4908K10217l714J91754p3458k40210m062L9831j18572j88286
$$ 2072622 2189890 2244798 2455015 2451301 2643055 2569597 2329387 2325325 2365156 2246584 2058298
5114B058298j32401p2225R7818k6162n6270n2388M3910M9832k0162R8545J5809
$$ 2058298 1925897 1853672 1951490 1925328 1869058 1816670 1860580 1910412 1890250 1988795 2004604
5103B004604J57311M7856Q1271J03265J54059J35591L47287J24134J28343K40971
$$ 2004604 2161915 2209771 2291042 2394307 2548366 2683957 3031244 3155378 3283721 3524692
5093C524692K83444K37298J33217K01961J39914r8950j41741k62258m38573l23361
$$ 3524692 3808136 4045434 4178651 4380612 4520526 4421576 4279835 4017577 3579004 3255643
5083C255643l38146j75510k05607k06673k14529o1590p2432q9197p976o1030l3062
$$ 3255643 2917497 2741987 2536380 2329707 2115178 2053588 1981156 1891959 1883983 1822953 1789891
5072A789891O785m6887N8867m2740J09573L1798P2872q0262K1589J66263J71047
$$ 1789891 1796676 1749789 1808656 1765916 1875489 1907287 1980159 1899897 1921486 2087749 2258796
5061B258796K3179Q5155R9951j04874J34821J839j18816k91741p7733j01896o6565
$$ 2258796 2281975 2367130 2467081 2362207 2497028 2498867 2380051 2088310 2010577 1908681 1842116
5050A842116k03993n7197p3187r3880k3775q5391j52901l8286l8851o5210q6465
$$ 1842116 1638123 1580926 1507739 1413859 1390084 1304693 1151792 1113506 1074655 1009445 922980
5039I22980p9047k419m2670O5249q0085l6111r4560J13229m7046o2070N643r7589
$$ 922980 843933 841514 798844 864093 784008 747897 653337 766566 719520 657450 663093 565504
5027E65504L3285P9126l0421n9176K6922K7280p063L5631p2394l5489O8896N8587
$$ 565504 598789 677915 647494 588318 615240 642520 635457 671088 598694 563205 632101 690688
5015F90688n5512o9138m7999P082O5289K2648N0739j07928q1132Q0039Q8353l2106
$$ 690688 635176 566038 518039 525121 590410 613058 663797 555869 474737 554776 643129 611023
5003F11023L6228j28200o1746L8698q6004M8090O6789Q3221p3593O595j20922
$$ 611023 647251 519051 457305 496003 409999 458089 524878 608099 534506 541101 420179
4992D20179R2328O0621Q975j28506j73j2447L1361j4034L9040n0604K7608P8910
$$ 420179 512507 573128 582103 453597 453424 440977 472338 458304 497344 446740 474348 553258
4980E53258j68844J2401O0067P0022p3467k1415o8634P6921R5457p6q0307j45868
$$ 553258 384414 396815 456882 526904 453437 432022 363388 440309 535766 535690 455383 309515
4968C09515n0952K2422J3643Q0562p2369K13o1751Q0946j7299J15055j0971q627
$$ 309515 258563 280985 294628 375190 302821 303034 241283 322229 304930 419985 409014 400387
4956D00387j10049Q8745n2011M2260J742J08109j2817j33034Q1117l6336K9902
$$ 400387 290338 379083 327072 369332 371074 479183 466366 333332 414449 378113 408015
4945D08015m8118O7770l1506m3896m0505P8216l2481J14832N3979j08302k0691
$$ 408015 359897 427667 396161 352265 311760 389976 357495 472327 526306 418004 397313
4934C97313K280J0951l396L0318N3478n5535n4771N6313p8383q3172N6032R577
$$ 397313 399593 410544 407148 437466 490944 435409 380638 436951 358568 275396 331428 341005
4922C41005j4226N4214N0472l2819R4673m9925m5641O8012m7144m8385P7188Q1090
$$ 341005 326779 380993 431465 398646 493319 443394 397753 465765 418621 370236 447424 528514
4910E28514o5561r6314j22215Q1435O9591M0677o3020r0680K9417K2493J44640
$$ 528514 462953 366639 244424 325859 395450 436127 373107 282427 311844 334337 478977
4899D78977K3184n4460j34468Q2794l300J06054n7758q9707N3725P1313K5479
$$ 478977 502161 447701 313233 396027 392727 498781 441023 351316 405041 476354 501833
4888E01833j4863M2168O4665K0078j98018o938N7025L3435K6384k3105k6072L9173
$$ 501833 486970 529138 593803 613881 415863 408925 465950 499385 525769 502664 476592 515765
4876E15765R4225J681m7884j1393k5686n2516M0733M9733J3372Q3612L6689L2335
$$ 515765 609990 611671 563787 552394 526708 474192 514925 564658 578030 661642 698331 730666
4864G30666j62518j9418n4267M5781P0913J1403j25412r5490k7732M0274O9362
$$ 730666 568148 548730 494463 540244 611157 622560 497148 401658 373926 414200 483562
4853D83562n1009L0690r5634L7716m8250J24747K5920J28612n6702k05644N7043
$$ 483562 432553 463243 367609 405325 357075 481822 507742 636354 579652 374008 431051
4842D31051K04878j0184q9k9086l4518j0055K7577J790L5344l4809j9932J8465
$$ 431051 635929 625745 625656 596570 562052 551997 579574 581364 616708 581899 561967 580432
4830E80432r6712P5539J04545j3625L5722J1534j53877q427K5514J57848P0638
$$ 580432 483720 559259 663804 650179 685901 697435 543558 535131 560645 718493 789131
4819G89131j1058r8681m32R3180R6740M116l3800P1426O8506o3475q4598j2898
$$ 789131 778073 679392 678960 772140 868880 872996 839196 910622 979128 915653 831055 818157
4807H18157L7319j01015J01146m1235j14670N317M1352m4594m9146N7378n1703
$$ 818157 855476 754461 855607 814372 699702 705019 746371 701777 652631 710009 658306
4796F58306j7795L5304k5728j36354P9912Q607p3807N1170L8092j17238j0636
$$ 658306 640511 675815 650087 513733 593645 602252 528445 579615 617707 500469 489833
4785D89833J3074j0865Q3423P5581P1621q92l2430o0744q6009J07448J24462m9900
$$ 489833 502907 492042 575465 651046 722667 721775 689345 628601 542592 650040 774502 724602
4773G24602K9239J056j5322k8108L615k4603l3232K8605k5784l660M0417m6001
$$ 724602 753841 754897 739575 711467 715082 690479 657247 685852 660068 656408 696825 650824
4761F50824j002j2465k2823M4729M5741o4143k813l5837p6749P6920L3500P117
$$ 650824 649822 637357 614534 659263 705004 640861 638048 602211 525462 602382 635882 642999
4749F42999P6529N5436n1957k9379n9608J6751j0998R7025K4477r7105L7820J4316
$$ 642999 719528 774964 723007 693628 634020 650771 639773 736798 761275 664170 701990 716306
4737G16306O695o0257P4269m0120P639o4758m1544J49145M6760l3078l5126m0658
$$ 716306 723001 662744 737013 696893 704532 639774 598230 747375 794135 761057 725931 685273
4725F85273K9799K5970P9214j3573q3428M4695m2683J4536Q1345m3140j00567
$$ 685273 715072 741042 820256 806683 723255 767950 725267 739803 821148 778008 677441
4714F77441M1101K3309J3019P1842q7947j5435P280Q843M8718p1094j8739L1481
$$ 677441 718542 741851 754870 826712 738765 723330 730610 739453 788171 717077 698338 729819
4702G29819Q8755M1898J4339l8976J8826k4743l5509J0623R8464k1035m2188N9060
$$ 729819 818574 860472 874811 835835 854661 829918 794409 805032 903496 882461 840273 899333
4690H99333P9016K3934p8960o0855J13478Q3041j8632M5716m894n869o0679K1888
$$ 899333 978349 1002283 923323 862468 975946 1058987 1040355 1086071 1081177 1075308 1014629 1036517
4678A036517P0271m3188j2574n1597M311P0577q4970j4303m3864R4029M746o5609
$$ 1036517 1106788 1063600 1051026 999429 1003740 1074317 989347 975044 931180 1025209 1029955 964346
4666I64346L0962J80545p8348o5875P6764J5174J930K6842N9705r7357O7217l5892
$$ 964346 995308 1175853 1097505 1031630 1108394 1123568 1125498 1152340 1212045 1114688 1181905 1146013
4654A146013J9106Q1830J4542m6307o0482K9271l3402J9427L0637N1135M9448
$$ 1146013 1165119 1246949 1261491 1215184 1154702 1183973 1150571 1169998 1200635 1251770 1301218
4643A301218Q4552M1368p5568M304J10648K0872j58796P0300m5001N8590R6848
$$ 1301218 1385770 1427138 1351570 1355874 1466522 1487394 1328598 1398898 1353897 1412487 1509335
4632A509335K1702l8279Q2978m020K0841N8725K5133K3127j5730J1824q55o087
$$ 1509335 1531037 1492758 1575736 1571716 1592557 1651282 1676415 1699542 1683812 1695636 1694781 1688694
4620A688694K6926P4328l471O8560J24517l9637o208O9621Q1197j54902J37939
$$ 1688694 1715620 1789948 1786477 1855037 1979554 1939917 1933709 2003330 2084527 1929625 2067564
4609B067564P5500N4022k9202Q1162K0293M4259P3792q1916J80758m2697J04652
$$ 2067564 2143064 2197086 2167884 2249046 2269339 2313598 2387390 2305474 2486232 2443535 2548187
4598B548187o8139N6994Q289J25137J68766O1696R935O123L1091R3059R9258R8854
$$ 2548187 2480048 2537042 2545331 2670468 2839234 2900930 2910865 2916988 2948079 3041138 3140396 3239250
4586C239250Q6764l4152J55305J01305P2025K71455J60798K39223J28765K07269
$$ 3239250 3326014 3291862 3447167 3548472 3620497 3891952 4052750 4291973 4420738 4628007
4576D628007J94168K67597r297j27198l9873j57308r0590r6186j83898j02360
$$ 4628007 4822175 5089772 5080475 4953277 4913404 4756096 4665506 4569320 4385422 4283062
4566D283062l1403q4902J04692M9031j6129l3960Q6057j1488R8435P3077n3637
$$ 4283062 4251659 4166757 4271449 4320480 4304351 4270391 4356448 4344960 4443395 4516472 4462835
4555D462835k7215R8843J59598P912J56763M9445P5784J52379R6720Q9768J22945
$$ 4462835 4435620 4534463 4694061 4701973 4858736 4908181 4983965 5136344 5233064 5322832 5445777
4544E445777K75298J06460J68471J50949J10601J58646J98087K74759P4415q382
$$ 5445777 5721075 5827535 5996006 6146955 6257556 6416202 6614289 6889048 6963463 6955081
4534F955081P5243K01338J75630L24715J98442L12466L47549L05421K90471L05019
$$ 6955081 7030324 7231662 7407292 7732007 7930449 8242915 8590464 8895885 9186356 9491375
4524I491375L43314L47693N47968M13467M35259M48062N53446M20227O62664P11293
$$ 9491375 9834689 10182382 10730350 11143817 11579076 12027138 12580584 13000811 13663475 14374768
4514A4374768P07200O81237Q45466Q65483J016542J263191J304029J475099J523297
$$ 14374768 15081968 15763205 16608671 17474154 18490696 19753887 21057916 22533015 24056312
4505B4056312J659454J836285K070751K145118K333982K801211L114175L295358
$$ 24056312 25715766 27552051 29622802 31767920 34101902 36903113 40017288 43312646
4497D3312646L736754L871584M006009L917375M014362L849624L563759L136309
$$ 43312646 47049400 50920984 54926993 58844368 62858730 66708354 70272113 73408422
4489G3408422K521069J360943J06060j699167l125869m175212m471266m498854
$$ 73408422 75929491 77290434 77396494 75697327 72571458 68396246 63924980 59426126
4481E9426126m343089m341200m179035l909237l742965l405638l052217k664411
$$ 59426126 55083037 50741837 46562802 42653565 38910600 35504962 32452745 29788334
4473B9788334k418537k004897j860013j665303j603011j400073j494729j068405
$$ 29788334 27369797 25364900 23504887 21839584 20236573 18836500 17341771 16273366
4465A6273366r19220r51709q02661p26720o88919o23673m98326m70399m53419
$$ 16273366 15354146 14402437 13599776 12873056 12184137 11560464 11062138 10591739 10138320
4456A0138320l59863l03853k57122k98162k83135k53788j28348k24014j97845
$$ 10138320 9778457 9474604 9217482 8919320 8636185 8382397 8254049 8030035 7832190
4447G832190j92484l2962j89678r4118o3568j38089r7539m5695r3931q8087M625
$$ 7832190 7639706 7606744 7417066 7322948 7259380 7121291 7023752 6978057 6884126 6796039 6800664
4436F800664k84526j23935j89125j93056j78000j18068j15070j62342k72527q7003
$$ 6800664 6516138 6392203 6203078 6010022 5832022 5713954 5598884 5436542 5164015 5077012
4426E077012l8665j13105J4513j60836o2599j03652l5262j54987N1836J8283j31454
$$ 5077012 5038347 4925242 4939755 4778919 4716320 4612668 4577406 4422419 4474255 4492538 4361084
4415D361084m2457R233O6941M8407N8829j38609n3589L7011j5654N8215L936j44469
$$ 4361084 4318627 4327860 4394801 4443208 4502037 4363428 4309839 4346850 4331196 4389411 4393347 4248878
4403D248878j63462j3510j83869L7107M3718J6311j39051j22773J11415j23371
$$ 4248878 4085416 4071906 3888037 3925144 3968862 3985173 3846122 3723349 3834764 3711393
4393C711393m59M7973L0294n2396j4351k4863Q4748P44R536M6474M94R15L185
$$ 3711393 3710934 3758907 3789201 3736805 3722454 3697591 3782339 3783083 3792619 3839093 3839587 3840502 3843687
4380C843687k692j29545p788J22256O9188J2842l7859j30708O2336J01205O5527
$$ 3843687 3840995 3711450 3703662 3825918 3895106 3907948 3870089 3739381 3801717 3902922 3968449
4369C968449K7855M4009R4164J3825Q8672L1873k5140J20973R6499N0262J01804
$$ 3968449 3996304 4040313 4134477 4148302 4236974 4268847 4243707 4364680 4461179 4511441 4613245
4358D613245J28200j13630k0770M6542k9117l909J07032N134o0348l3721M6704
$$ 4613245 4741445 4627815 4607045 4653587 4624470 4620561 4727593 4732727 4672379 4638658 4685362
4347D685362Q2745K5853J06744N5802O2415J44723K16801Q1399J92588J59237
$$ 4685362 4768107 4793960 4900704 4956506 5018921 5163644 5380445 5461844 5654432 5813669
4337E813669K07976J37319J63344K16460K77760J39896k8334J52580J99364K9374
$$ 5813669 6021645 6158964 6322308 6538768 6816528 6956424 6928090 7080670 7280034 7309408
4327G309408J52849R5066K6709J01598P9562r7185J1478M5387J01111O133K3691
$$ 7309408 7462257 7557323 7584032 7685630 7765192 7668007 7679485 7724872 7825983 7832116 7855807
4316G855807p579O1159K46654N3320R1355J8007J51765J3506J60557N2536N8981
$$ 7855807 7848228 7909387 8156041 8209361 8300716 8318723 8470488 8483994 8644551 8697087 8756068
4305H756068J50299J23587q495R9744K04310J90917K16373K07144J07248J13666
$$ 8756068 8906367 9029954 9021459 9121203 9325513 9516430 9732803 9939947 10047195 10160861
4295A0160861L11752J29662L00558K62973L37097K59977K73957K36549M30095
$$ 10160861 10472613 10602275 10902833 11165806 11502903 11762880 12036837 12273386 12703481
4286A2703481M62747M02845L20786L76668M22374M58166N61349O75398N15027
$$ 12703481 13166228 13569073 13889859 14266527 14688901 15147067 15708416 16383814 16898841
4277A6898841O23088O97473P01049P31023J052207J007642R75719R74894J328225
$$ 16898841 17521929 18219402 18920451 19651474 20703681 21711323 22687042 23661936 24990161
4268B4990161J098906R93159J160924J161184J168223J199401J412409J706476
$$ 24990161 26089067 27082226 28243150 29404334 30572557 31771958 33184367 34890843
4260C4890843J849652J930889K139395K390879K688622L325053L963375M733532
$$ 34890843 36740495 38671384 40810779 43201658 45890280 49215333 53178708 57912240
4252E7912240N302687N636987O048402O789721P681334Q866281J0798565J3739869
$$ 57912240 63214927 68851914 74900316 81690037 89371371 98237652 109036217 122776086
4244A22776086J7456847K2033218K8261985L3719764L1982835K8967300K5216879
$$ 122776086 140232933 162266151 190528136 224247900 256230735 285198035 310414914
4237C10414914O745241j7909661j8169825k1231863m8642694m7462715l1825405
$$ 310414914 317160155 299250494 281080669 259848806 211206112 163743397 131917992
4230A31917992k2542175j5776142j2518858r651548p709821o266861n222758m058856
$$ 131917992 109375817 93599675 81080817 71429269 63719448 57452587 52229829 48170973
4222D8170973l574783l184174k733204k372410k157162j880846j668262j659835
$$ 48170973 44596190 41412016 38678812 36306402 34149240 32268394 30600132 28940297
4214B8940297j522330j262643j122541j265310j078876r59719j006145r09699
$$ 28940297 27417967 26155324 25032783 23767473 22688597 21728878 20722733 19813034
4206A9813034r35353o66699p59052m29416n02474n51627m84685l77817o20368
$$ 19813034 18877681 18210982 17451930 17022514 16520040 15968413 15483728 15105911 14485543
4197A4485543n52700m42326l87229l34351k21538l85211k20753j22622k67901
$$ 14485543 13932843 13490517 13103288 12768937 12547399 12162188 11941435 11818813 11550912
4188A1550912l92540p6114k65083j94360j72927j26695m03803j32344j80616j84648
$$ 11550912 11158372 11082258 10817175 10622815 10449888 10323193 9919390 9787046 9606430 9421782
4178I421782k04854k65696j41611j22224j51318k22655j70062k75789j69849j12289
$$ 9421782 9216928 8951232 8809621 8687397 8536079 8313424 8143362 7867573 7697724 7585435
4168G585435k60222q8599m7312j26865m5182o9059j62776j83861k6316j7887m7808
$$ 7585435 7325213 7236614 7189302 7062437 7017255 6948196 6785420 6601559 6575243 6557356 6509548
4157F509548j50453j09741n6979N59J8938j33865j71146r3870j32552o21o8469
$$ 6509548 6359095 6249354 6192375 6192934 6211872 6078007 5906861 5812991 5680439 5679818 5611349
4146E611349m2448k50309p1356j71348l4441n5602k07281j66838j36312k938j04633
$$ 5611349 5568901 5318592 5247236 5075888 5041447 4985845 4778564 4611726 4475414 4472476 4367843
4135D367843j65904q3414q1255n4566j32265j04211k3949j1504r7626r2674l0125
$$ 4367843 4201939 4118525 4037270 3982704 3850439 3746228 3722279 3710775 3613149 3520475 3490350
4124C490350r8054P107r5584M2875L3436L2941j04614m9319O1367L2619k9730
$$ 3490350 3392296 3399403 3303819 3346694 3380130 3413071 3308457 3259138 3320505 3353124 3323394
4113C323394n1864j04670o5721O5506M7598j59427J9665j7625j01951n108J35676
$$ 3323394 3271530 3166860 3101139 3166645 3214243 3054816 3074481 3056856 2954905 2949797 3085473
4102C085473l9506M1665m1706k9760r0084J15563r869j03297r843p556j25693
$$ 3085473 3045967 3087632 3045926 3016166 2926082 3041645 3031776 2928479 2918636 2911080 2785387
4091B785387L6558O1561l662j5189L1596j00377j17554J36735M2276q7531l851
$$ 2785387 2821945 2883506 2879844 2864655 2896251 2795874 2678320 2815055 2857331 2769800 2765949
4080B765949n100l5427l0930J9157J08780P2340k710n8095J40682n7629O604j3792
$$ 2765949 2760849 2725422 2694492 2713649 2822429 2894769 2892059 2833964 2974646 2917017 2923621 2909829
4068B909829O7413N554J02434k37932q0061K373J29521j23744O4638r7140q5057
$$ 2909829 2977242 2982796 3085230 2847298 2767237 2769610 2899131 2775387 2840025 2742885 2657828
4057B657828K9645N9458j06897k7833O1817j73433O5849J00959J58859j0495l498
$$ 2657828 2687473 2746931 2640034 2612201 2674018 2500585 2566434 2667393 2826252 2815757 2812259
4046B812259P3960n940M6467J27794j0018j26806L7417P8391j5859R2108p0150
$$ 2812259 2886219 2880279 2926746 3054540 3044522 2917716 2955133 3033524 3017665 3109773 3039623
4035C039623R6385l9845M6545q6653J61779K9845N1105j03578K1824L4570p0333
$$ 3039623 3136008 3096163 3142708 3056055 3217834 3247679 3298784 3195206 3217030 3251600 3181267
4024C181267Q8095L0153J19966J880K5808Q8304R1630m3832P4571L4502j419l014
$$ 3181267 3269362 3299515 3419481 3421361 3447169 3535473 3627103 3583271 3657842 3692344 3690925 3687911
4012C687911L5657j42915Q8803K907L7389N2223J48257O4760K071J05106R2706
$$ 3687911 3723568 3580653 3669456 3672363 3709752 3761975 3910232 3974992 3977063 4082169 4174875
4001D174875K7915J66129K4305M4313J57827Q4762M6818R6681J5322J49124P2675
$$ 4174875 4202790 4368919 4393224 4437537 4595364 4680126 4726944 4823625 4838947 4988071 5060746
3990E060746J97450L2547L9547k3265l5941O7613m0863q001o0686J53070J3754
$$ 5060746 5258196 5290743 5330290 5307025 5271084 5338697 5297834 5289833 5229147 5382217 5395971
3979E395971l5582J12736J72128L7587k3354o656J5995J08733J88169N0053k3631
$$ 5395971 5360389 5473125 5645253 5682840 5659486 5652830 5668825 5777558 5965727 6015780 5992149
3968E992149J2855J14787J08167J70219J35997p4280J3641J60464Q2957R295J61059
$$ 5992149 6005004 6119791 6227958 6398177 6534174 6459894 6473535 6633999 6716956 6726251 6887310
3957F887310O8365k2744J82427n8096M1314o1032J93230J10035J2869M3257O2711
$$ 6887310 6955675 6932931 7115358 7057262 7098576 7037544 7230774 7340809 7353678 7396935 7459646
3946G459646k3347R7767k0054J36317J3180J3080J32194J18462O3991J40942N2899
$$ 7459646 7436299 7534066 7514012 7650329 7663509 7676589 7808783 7927245 7991236 8132178 8185077
3935H185077J33203J39562M4034J43216Q8391J56309L6779P5669N2595O6844J03806
$$ 8185077 8318280 8457842 8501876 8645092 8733483 8889792 8926571 9002240 9054835 9121679 9225485
3924I225485K22762J51892J80152N9210J41692j6020K71115L20575L7583Q8881
$$ 9225485 9448247 9600139 9780291 9839501 9981193 9965173 10236288 10556863 10594446 10683327
3914A0683327L19173J29539K20104J67667K44442J45848J97536K70469J92356
$$ 10683327 11002500 11132039 11352143 11519810 11764252 11910100 12107636 12378105 12570461
3905A2570461L02944L58843K15243L02813L08465K90212L78114M42309M08732
$$ 12570461 12873405 13232248 13447491 13750304 14058769 14348981 14727095 15169404 15578136
3896A5578136L00335K83217J58989J79810J41039M5688l4478J34856P7386L45645
$$ 15578136 15878471 16161688 16320677 16500487 16641526 16687214 16652736 16787592 16864978 17210623
3886A7210623K71293L26830J44043K64629J95720N05634K46259L47445L56816
$$ 17210623 17481916 17808746 17952789 18217418 18413138 18918772 19165031 19512476 19869292
3877A9869292L94800L82073L95487M92962N16061M98575N17915N91465M89565
$$ 19869292 20264092 20646165 21041652 21534614 22050675 22549250 23067165 23658630 24148195
3868B4148195M57481O06411P25672P60297O07451N53369N75898N15974P25853
$$ 24148195 24605676 25212087 25937759 26698056 27305507 27858876 28434774 28950748 29676601
3859B9676601N51620M87981O22866O41422N34657O20866N15803P73712M73822
$$ 29676601 30228221 30716202 31339068 31980490 32515147 33136013 33651816 34425528 34899350
3850C4899350O58272P33924O82935P23475Q01990P05174P55203O54326P58707
$$ 34899350 35557622 36291546 36974481 37697956 38499946 39205120 39960323 40614649 41373356
3841D1373356O89101P56058N61472N68394N35206L95868M42527K91041K55747
$$ 41373356 42062457 42818515 43379987 43948381 44483587 44879455 45321982 45613023 45868770
3832D5868770J34286N1434K8556K2586o1712r7855k23299k98765l40255l12842
$$ 45868770 46003056 46054490 46083046 46105632 46043920 45946065 45722766 45424001 45083746 44770904
3822D4770904l60060m97965n37934n07900n72542m86249l57482l10776n07251
$$ 44770904 44410844 43912879 43374945 42867045 42294503 41808254 41450772 41139996 40632745
3813D0632745m87212k72097k11005j38586j49876j04679O047M5751q159J50613
$$ 40632745 40145533 39873436 39662431 39523845 39373969 39269290 39275337 39321088 39312929 39463542
3803C9463542K77060K86688J91556K36056K87844L00004L18445K88464L89041
$$ 39463542 39740602 40027290 40218846 40454902 40742746 41042750 41361195 41649659 42038700
3794D2038700K31857J53914K46362K97922L9919j44337l87997n94953p17961p69047
$$ 42038700 42270557 42424471 42670833 42968755 43008674 42864337 42476340 41881387 41163426 40394379
3784D0394379q15091p90650p57471o10916p49256o44460o27074p01714n14368
$$ 40394379 39579288 38788638 38031167 37420251 36670995 36026535 35399461 34697747 34183379
3775C4183379o58828o73053n82538o88557o39855n85735o51758n33597n69644
$$ 34183379 33524551 32851498 32268960 31580403 30940548 30354813 29703055 29169458 28599814
3766B8599814n91501o33620n82949m39252m98128l89382m15994m61757l49872
$$ 28599814 28008313 27374693 26791744 26352492 25854364 25464982 25048988 24587231 24237359
3757B4237359n65479l12236j86505k14669l65773k23740k56661j93631l10770
$$ 24237359 23671880 23359644 23173139 22958470 22592697 22368957 22112296 21918665 21607895
3748B1607895j10836j86832j96948p7253j16141l8404k12488m3645k2360K346
$$ 21607895 21497059 21310227 21113279 21036026 20919885 20881481 20668993 20625348 20602988 20605334
3738B0605334R0957K7949J1946J76933J66547K75966J87841M10651L67639M70795
$$ 20605334 20696291 20724240 20736186 20913119 21079666 21355632 21543473 21954124 22321763 22792558
3728B2792558N01746M27128M72309L42514K07619R7542o9581J77935K4450K16084
$$ 22792558 23294304 23721432 24193741 24536255 24743874 24841416 24771835 24949770 24974220 25190304
3718B5190304K82707M07952N31523M71190M65597M61556L81417M06033M44782
$$ 25190304 25473011 25880963 26412486 26883676 27349273 27810829 28192246 28598279 29043061
3709B9043061L09051J72593l4246j42605r0272o6529j94536k6251m9708m7298
$$ 29043061 29352112 29524705 29490459 29347854 29257582 29191053 28996517 28970266 28920558 28873260
3699B8873260j04243q3284p6407p77J64722K60626K44360L84849N18671O76330
$$ 28873260 28769017 28685733 28609326 28608549 28773271 29033897 29278257 29663106 30181777 30858107
3689C0858107P01242Q33607Q33318Q82062J050339J229844J578690J648222J838966
$$ 30858107 31559349 32392956 33226274 34108336 35158675 36388519 37967209 39615431 41454397
3680D1454397J997274K264043K681132L058002L571056L953836M437274M952238
$$ 41454397 43451671 45715714 48396846 51454848 55025904 58979740 63417014 68369252
3672F8369252N590063O295910P114214P945174Q641929R169539R693107R500336
$$ 68369252 73959315 80255225 87369439 95314613 103956542 113126081 122819188 132319524
3664A32319524Q910987P559873N424350K701171p88252m281766p424641r774181
$$ 132319524 141230511 148790384 154214734 156915905 156127653 151845887 144421246 134647065
3656A34647065j0990335j1422743j1020990j0151670r235989q277639p109385
$$ 134647065 123656730 112233987 101212997 91061327 81825338 73547699 66438314
3649F6438314o196633n310972m601311l981870l409161k955657k515329k468103
$$ 66438314 60241681 54930709 50329398 46347528 42938367 39982710 37467381 34999278
3641C4999278k028715j632505j554600j499713j371839j309457j076087r86439
$$ 34999278 32970563 31338058 29783458 28283745 26911906 25602449 24526362 23539923
3633B3539923q85487r19941o98898q35863p01287o65478n11497n19864n28952
$$ 23539923 22654436 21734495 21035597 20199734 19498447 18832969 18321472 17801608 17272656
3624A7272656m91354m04051l89538m36688l89815k77866l07020l47791l78967
$$ 17272656 16781302 16377251 15987713 15551025 15161210 14883344 14576324 14228533 13849566
3615A3849566k80079j75397k99227k60081j79297j86333k60502q9231k74596k81772
$$ 13849566 13569487 13394090 13094863 12834782 12655485 12469152 12208650 12119419 11844823 11563051
3605A1563051j39825q4178k31669k44734k31082k20137n7775q5123k10078j02371
$$ 11563051 11423226 11339048 11107379 10862645 10631563 10411426 10353651 10268528 10058450 9956079
3595I956079j29890q6082j35689q3420l8789j19311j09972q1750k31964q0924
$$ 9956079 9826189 9740107 9604418 9520998 9482209 9362898 9252926 9171176 8939212 8858288
3585H858288j13490j88554j36051q3141j35608j39793j6165o230p2059j21702
$$ 8858288 8744798 8556244 8420193 8337052 8201444 8061651 8045486 8039256 7967197 7845495
3575G845495j8773m3189j29466j76638l7998j5396q1922J3776j56271n9863q1851
$$ 7845495 7826722 7783533 7654067 7477429 7439431 7424035 7342113 7355889 7199618 7139755 7057904
3564G057904o217j00971j10125j32714n7682j12064o4203o3744j5151r306J3196
$$ 7057904 7051687 6950716 6840591 6707877 6650195 6538131 6473928 6410184 6395033 6385727 6398923
3553F398923L239q7639k8437M8726K5562o6734M8386r9182m2938Q9583R5809k0877
$$ 6398923 6402162 6314523 6286086 6334812 6360374 6293640 6342026 6242844 6199906 6289489 6385298 6364421
3541F364421O2177k1111O7690Q0159L802o696O4378M803R2014o424J63368n1650
$$ 6364421 6426598 6405487 6473177 6553336 6557138 6550442 6614820 6619623 6711637 6705213 6868581 6816931
3529F816931q4187o0214k4859j0537Q0132L5628k0702m8054M1727R1812r7050
$$ 6816931 6732744 6672530 6647671 6637134 6717266 6752894 6732192 6684138 6725865 6817677 6720627
3518F720627J49695M0797J22664k115J46433M8068K21306J63347M6594R9727J64987
$$ 6720627 6870322 6911119 7033783 7031668 7178101 7226169 7447475 7610822 7657416 7757143 7922130
3507G922130J28345L7972J56679K01648J02296L9070K06900J36181k3426Q1338
$$ 7922130 8050475 8088447 8245126 8446774 8549070 8588140 8795040 8931221 8907795 8989133
3497H989133J23650J56070O4620n1869Q3798J10315J24848L9066J55591q5679
$$ 8989133 9112783 9268853 9333473 9281604 9365402 9475717 9600565 9639631 9795222 9709543
3487I709543J2623j5900J16774N4637N6105n9927J66182R4403Q7599J88336K18662
$$ 9709543 9722166 9706266 9823040 9877677 9933782 9873855 10040037 10134440 10222039 10410375 10629037
3476A0629037M4240K1095K08423J07282K82556K43763K02939Q9453K22272K50163
$$ 10629037 10673277 10694372 10902795 11010077 11292633 11536396 11739335 11828788 12051060 12301223
3466A2301223K09989J86293K72417J67303K61838L84266L11461K47459K48064
$$ 12301223 12511212 12697505 12969922 13137225 13399063 13783329 14094790 14342249 14590313
3457A4590313K38541L30647L66127K93137L88239M42179L45310M98183N59699
$$ 14590313 14828854 15159501 15525628 15818765 16207004 16649183 16994493 17492676 18052375
3448A8052375O59663N87738O77579P77460O20496P71583R75533R10733Q78629
$$ 18052375 18712038 19299776 19977355 20754815 21375311 22146894 23122427 24033160 24911789
3439B4911789R67857R27708R77988P95760Q85875R21982R81612J222358J316145
$$ 24911789 25879646 26807354 27785342 28581102 29466977 30388959 31370571 32592929 33909074
3430C3909074J359139J641118J916990K035787K436751K543258L072110L333992
$$ 33909074 35268213 36909331 38826321 40862108 43298859 45842117 48914227 52248219
3422E2248219L798160M045553M538129N040831N584626O484197P594667R024327
$$ 52248219 56046379 60091932 64630061 69670892 75255518 81739715 89334382 98358709
3414I8358709J0456057J1951540J3169169J3658539J3097474J1671097Q452545
$$ 98358709 108814766 120766306 133935475 147594014 160691488 172362585 180815130
3407A80815130K898702m219893j2257871j8061049j8921630j6328430j3234833
$$ 180815130 183713832 179493939 167236068 149175019 130253389 113924959 100690126
3400A00690126j0400731q070122o362566m988007l991286k943188k519308k012244
$$ 100690126 90289395 82219273 75856707 70868700 66877414 63934226 61414918 59402674
3392E9402674j530229r68556p66256j87017K71670Q04368J210411J782128K316276
$$ 59402674 57872445 56903889 56137633 55950616 56222286 57026654 58237065 60019193 62335469
3383F2335469K606288L082334L038096K823643K354841J233188m83663k224383
$$ 62335469 64941757 68024091 71062187 73885830 76240671 77473859 76990196 74765813
3375G4765813l369328l946611m073218m252389m382010m033466l397144k578425
$$ 74765813 71396485 67449874 63376656 59124267 54742257 50708791 47311647 44733222
3367D4733222j988319j565634j159994p66477n09807j07971o5695J36609M48897
$$ 44733222 42744903 41179269 40019275 39252798 38742991 38635020 38569325 38705934 39154831
3358C9154831P79972Q42183J154943J309255J573738J778277K138026K338151
$$ 39154831 39934803 40776986 41931929 43241184 44814922 46593199 48731225 51069376
3350E1069376K085011K048951J247151j3187j403820k559721l508746l807980
$$ 51069376 53154387 55203338 56450489 56437302 55033482 52473761 48965015 45157035
3342D5157035l657875l135276k697688k030293j538268j355497j044712p22810
$$ 45157035 41499160 38363884 35666196 33635903 32097635 30742138 29697426 28974616
3334B8974616o05389n51303l28246k92753k23904J3565o2538k5448K17253K51003
$$ 28974616 28369227 27817924 27489678 27196925 26973021 26986586 26924048 26898600 27115853 27366856
3324B7366856J97447L68085N32757L86541M11694N90721O72235N20091O42587
$$ 27366856 27564303 27932388 28465145 28851686 29263380 29854101 30526336 31046427 31689014
3315C1689014P25961P99504Q49511P29167Q87962J062385J253166J398513J662304
$$ 31689014 32414975 33214479 34063990 34793157 35681119 36743504 37996670 39395183 41057487
3306D1057487J962445K221368K572170L004049L495979L769385M299115M761067
$$ 41057487 43019932 45241300 47813470 50817519 54313498 58082883 62381998 67143065
3298F7143065N412210N968970O948114P682792Q347241R334434J0152710J0819921
$$ 67143065 72555275 78524245 85472359 93155151 101502392 110836826 120989536 131809457
3290A31809457J0435942Q558031N087568Q77661l347993p700846j1393730j3465954
$$ 131809457 142245399 150803430 155890998 156768659 153420666 145719820 134326090 120860136
3282A20860136j4381961j4044490j2323780r822463p710130o056588m791134m051068
$$ 120860136 106478175 92433685 80109905 70287442 62577312 56520724 51729590 47678522
3274D7678522l454323k835749k375377k357909k073925j625267j526673j343385
$$ 47678522 44224199 41388450 39013073 36655164 34581239 32955972 31429299 30085914
3266C0085914j225694j065438j024155q19845o45606p19191o48203n36018n28091
$$ 30085914 28860220 27794782 26770627 25950782 25305176 24585985 23937782 23401764 22873673
3257B2873673m86748m35054m00837l03506k53472k10139k17313q6664k24662k36660
$$ 22873673 22386925 21951871 21551034 21247528 20994056 20783917 20566604 20479940 20255278 20018618
3247B0018618k33859l03522k41417l60529k11856k05856j88584j70029j16931
$$ 20018618 19784759 19481237 19239820 18879291 18667435 18461579 18272995 18102966 17986035
3238A7986035j80232k05259o2689n9777k24769k77526q1658j34079k86316j28391
$$ 17986035 17805803 17600544 17537855 17478078 17253309 16975783 16894125 16760046 16473730 16345339
3228A6345339j86616q7145o3348O3244J01079m4999M5562J11084P6517J97802
$$ 16345339 16158723 16071578 16008230 16071474 16172553 16127554 16173116 16284200 16360717 16558519
3218A6558519L16036J69828K36687J57094J49920J27646K28742J75671O5600K44879
$$ 16558519 16874555 17044383 17281070 17438164 17588084 17715730 17944472 18120143 18185743 18430622
3208A8430622P8388P4582K51548K4596L3087J31300K02807m7430J90307J19374
$$ 18430622 18509010 18583592 18835140 18859736 18892823 19024123 19226930 19179500 19369807 19489181
3198A9489181Q1329K58657K44098J46982K59627L02403Q8248K53229L20827K70897
$$ 19489181 19570510 19829167 20073265 20220247 20479874 20782277 20870525 21123754 21444581 21715478
3188B1715478K70681J74250K26287K62464K55674L70898L25118L74432M27971
$$ 21715478 21986159 22160409 22386696 22649160 22904834 23275732 23600850 23975282 24403253
3179B4403253M80844N31217O01255N95493P05767P69716Q79704R83946J031600
$$ 24403253 24884097 25415314 26016569 26612062 27317829 28087545 28967249 29951195 30982795
3170C0982795R94499J199758J290184J395778J290357J541951J799027K013487
$$ 30982795 31977294 33177052 34467236 35863014 37153371 38695322 40494349 42507836
3162D2507836K382003K571172K910786L479869L752002M012991M358752M266472
$$ 42507836 44889839 47461011 50371797 53851666 57603668 61616659 65975411 70241883
3154G0241883L822355K739544J379515j34480j383328k136448k246691j596856
$$ 70241883 74064238 76803782 78183297 78048817 76665489 74529041 72282350 70685494
3146G0685494q34977j76339M01333R49366J462524J753517K359245K928171L367007
$$ 70685494 69850517 69674178 70075511 71024877 72487401 74240918 76600163 79528334 82895341
3137H2895341M029851M917358N589815O644327P791275Q928523R936021J1060112
$$ 82895341 86925192 91842550 97432365 104076692 111867967 120796490 130732511 141792623
3129A41792623J2137614J3424012J5067405J6790940J8645280K0909937K4500806
$$ 141792623 153930237 167354249 182421654 199212594 217857874 238767811 263268617
3122B63268617K8745217L1426196L1397845L0909719K9297556K2432434O554898
$$ 263268617 292013834 323440030 354837875 385747594 415045150 437477584 444032482
3115D44032482k0848868n0716241o1314279n2363506l9816949k9890171k2998415
$$ 444032482 423183614 372467373 311153094 258789588 218972639 189082468 166084053
3108A66084053j7966332j4138296j1321635r156088p624069o485950n735364m964975
$$ 166084053 148117721 133979425 122657790 113501702 105877633 99391683 93656319 88691344
3100H8691344m094520l185707k528866k067228j443219j321433j429237j765023
$$ 88691344 84596824 81411117 78882251 76815023 75371804 74050371 72621134 70856111
3092G0856111k522093k977352l216062l528439l702387l676511l258444k958021
$$ 70856111 68334018 65356666 62140604 58612165 54909778 51233267 47974823 45016802
3084D5016802k352342j787707j674797j521981j332528j359851j394725j169077
$$ 45016802 42664460 40876753 39201956 37679975 36347447 34987596 33592871 32423794
3076C2423794r77699j079453j015508q42332q75989p05704o26562p74835o76936
$$ 32423794 31446095 30366642 29351134 28508802 27632813 26927109 26300547 25525712 24848776
3067B4848776n28006n87951o07354l48964m47556m73424m65589m93651m22084
$$ 24848776 24320770 23732819 23125465 22776501 22328945 21855521 21389932 20896281 20474197
3058B0474197l35423k37755l07420k87111l37945j91581k52925k79425j58304
$$ 20474197 20138774 19901019 19593599 19306488 18968543 18776962 18524037 18244612 18086308
3049A8086308q8404j97708j52633L3659j04986k7830Q1796J35919m3624K5841
$$ 18086308 17997904 17800196 17647563 17681222 17576236 17548406 17630202 17766121 17722497 17748338
3039A7748338Q0059j04016J6659K10837J11680K58520M58883L03907L95733N42501
$$ 17748338 17828397 17724381 17741040 17951877 18063557 18322077 18780960 19084867 19480600 20023101
3029B0023101L60832L27390L62907J71650P4875k9338J1928J89759K34751K75959
$$ 20023101 20383933 20711323 21074230 21245880 21320755 21291417 21303345 21493104 21727855 22003814
3019B2003814M40912O16954P23795Q32721P44232R42996Q05561M85880J91628
$$ 22003814 22444726 23061680 23785475 24618196 25362428 26305424 27110985 27596865 27788493
3010B7788493j72384m03854n53819m10090l21942J01887J76757M87376Q48994
$$ 27788493 27616109 27212255 26658436 26248346 25926404 26028291 26205048 26692424 27541418
3001B7541418R95726Q87529R33474P08000M27294J3876n51834r42700j210668
$$ 27541418 28537144 29424673 30358147 31066147 31493441 31507317 30955483 30012783 28802115
2992B8802115j170975j077139q01907m12956q1018P0142K11428L05465L77217
$$ 28802115 27631140 26554001 25752094 25339138 25258120 25328262 25539690 25845155 26222372
2983B6222372K82436O8846l44768o35202j195812j333974j400768j300728j157924
$$ 26222372 26504808 26573654 26228886 25593684 24397872 23063898 21663130 20362402 19204478
2974A9204478p81975o95722m22959l28411k24507k91136j31547r4858m28781m69011
$$ 19204478 18422503 17726781 17303822 16975411 16750904 16459768 16328221 16233363 15804582 15335571
2964A5335571m98001o52219q72637m97566n37364o09861m90032l18023l33380
$$ 15335571 14837570 14185351 13312714 12815148 12277784 11667923 11177891 10859868 10526488
2955A0526488k08012j50927j87320l36722r3078k11152k41868l93835j35599k32676
$$ 10526488 10318476 10167549 9980229 9643507 9550429 9339277 9097409 8703574 8567975 8335299
2945H335299k46184j83748j20554k31533j59693j57176j36239o3441j68615o6496
$$ 8335299 8089115 7905367 7784813 7553280 7393587 7236411 7100172 7036731 6868116 6801620
2935F801620p9623j03237j61805k2671o8145O6205n9905P5632K264n2541n2358
$$ 6801620 6721997 6618760 6456955 6434284 6366139 6432344 6372439 6448071 6450335 6397794 6345436
2924F345436K5165l5886j021p4998j27473j72208j21566q1027j64013j85268j29259
$$ 6345436 6370601 6334715 6333694 6258696 6131223 5959015 5837449 5756422 5592409 5407141 5277882
2913E277882k2662M7619k2207p8761l8992q7534P849r2985q3493p158n2777j95549
$$ 5277882 5255220 5302839 5280632 5201871 5162879 5075345 5083194 4990209 4906716 4899558 4846781 4651232
2901D651232o5186K0328j05662q9078J9418O4525m7450Q042q6590k25971j9712
$$ 4651232 4586046 4606374 4500712 4411634 4431052 4495577 4448127 4456169 4369579 4143608 4123896
2890D123896k2902q9715R003j32298k2265j41N2094n7757j17757L6481J3330n7919
$$ 4123896 4100994 4011279 4020282 3887984 3865719 3865578 3917672 3859915 3742158 3778639 3791969 3734050
2878C734050k7501M0004o5159J8434k289n3035J281j10757n7938r676j2981R04
$$ 3734050 3706549 3746553 3681394 3699828 3697539 3644504 3645785 3535028 3477090 3467414 3454433 3455337
2866C455337l9528o0379n3846j1024o6249Q2663l4135l537p8577J4680l9643N3632
$$ 3455337 3415809 3355430 3301584 3290560 3224311 3306974 3272839 3269302 3190725 3205405 3165762 3219394
2854C219394Q053J28188J7609M9722O9765j29102J15907P9790l1027j2989L4277
$$ 3219394 3227447 3355635 3373244 3422966 3492731 3363629 3479536 3559326 3528299 3515310 3549587
2843C549587m6283Q922N7121L3987j07483J21229n8429p6162Q3701P5002l1645
$$ 3549587 3503304 3512226 3569347 3603334 3495851 3617080 3558651 3482489 3566190 3641192 3609547
2832C609547J18176J5322O3322R5145J33424p9826M6541J20943J08558j4055J76515
$$ 3609547 3727723 3743045 3806367 3901512 4034936 3955110 4001651 4122594 4231152 4217097 4393612
2821D393612J43310N1937O1184K9237R2212Q9520K2190Q337R8183o4191J19895
$$ 4393612 4536922 4588859 4650043 4679280 4771492 4861012 4883202 4891539 4989722 4925531 5045426
2810E045426q6557P6351M7167J23628o0296J06694j0320O5377R7206R7599J61116
$$ 5045426 4958869 5035220 5082387 5206015 5145719 5252413 5242093 5307470 5404676 5502275 5663391
2799E663391J42697J39335K46684J25664J77893K24861O7355Q7753P8505j35007
$$ 5663391 5806088 5945423 6192107 6317771 6495664 6720525 6787880 6875633 6954138 6819131
2789F819131j98346j06757k59510j03141j60120N3909j07423n59j8332n3834o7430
$$ 6819131 6620785 6514028 6254518 6151377 5991257 6045166 5937743 5937184 5918852 5865018 5797588
2778E797588P3798m8183l8173P1653J60557J9075J5823J30792N8361M5063J31986
$$ 5797588 5871386 5823203 5785030 5856683 6017240 6036315 6052138 6182930 6241291 6286354 6418340
2767F418340P832K448J57728J46483L1918J6516R2322N4803P6196J70871J25053
$$ 6418340 6426172 6428620 6586348 6732831 6764749 6781265 6873587 6928390 7004586 7175457 7300510
2756G300510M1370K13563J02339O1250J65046K73331J20484R1251K10518K64170
$$ 7300510 7341880 7555443 7657782 7719032 7884078 8157409 8277893 8369144 8579662 8843832
2746H843832K56481K94744J66980L18199L06647K85251K61220K84526L31006L90760
$$ 8843832 9100313 9395057 9562037 9880236 10186883 10472134 10733354 11017880 11348886 11739646
2736A1739646L88416M67055M41891N19198N60477O95247N46430P29941J022229
$$ 11739646 12128062 12595117 13037008 13556206 14116683 14811930 15358360 16088301 17110530
2727A7110530R64420J038270J220045J399262J449323J737583J800467J926511
$$ 17110530 18074950 19113220 20333265 21732527 23181850 24919433 26719900 28646411
2719B8646411K301218K667999K861502L102585L364024L596125L681094L759729
$$ 28646411 30947629 33615628 36477130 39579715 42943739 46539864 50220958 53980687
2711E3980687L585023L102222K683080K041933J569984Q23744L25637j31926n74751
$$ 53980687 57565710 60667932 63351012 65392945 66962929 67786673 68112310 67980384 67405633
2702F7405633p82353q30642q41650o45506l86107j25283M9921j7091k40087m83092
$$ 67405633 66623280 65792638 64950988 64305482 63919375 63794092 63844013 63826922 63586835 63103743
2692F3103743q95054j413519j785779k344014k743186l168456l301063l475799
$$ 63103743 62208689 60795170 59009391 56665377 53922191 50753735 47452672 43976873
2684D3976873l441274l433173l150610k874821k494563k269702j839138j763857
$$ 43976873 40535599 37102426 33951816 31076995 28582432 26312730 24473592 22709735
2676B2709735j465326j282454j078361j063266p86432p66539p49813o08538o03739
$$ 22709735 21244409 19961955 18883594 17820328 17033896 16267357 15517544 14909006 14305267
2667A4305267m83794l83685k32865m57645l49856l88999k34020k85860k36829
$$ 14305267 13821473 13437788 13204923 12747278 12397422 12008423 11774403 11488543 11251714
2658A1251714k64817k35425k16589o6392j34326o5771j13108j72458q8980q7176
$$ 11251714 10986897 10751472 10534883 10468491 10334165 10268394 10155286 9982828 9893848 9806672
2648I806672K1967j6522j07477L6597j20830j79757o9820k0283j05111n7121j18972
$$ 9806672 9828639 9812117 9704640 9741237 9620407 9440650 9370830 9350547 9245436 9188315 9069343
2637I069343j62843o4164K3783k0165K4893J3839j40833n3059l5045L4918p0851
$$ 9069343 8906500 8842336 8866119 8845954 8870847 8884686 8743853 8690794 8655749 8690667 8619816
2626H619816l3070K2975M7385j10916J22388P6018M0350m210K5869Q8986K6804
$$ 8619816 8586746 8609721 8657106 8546190 8668578 8744596 8784946 8780736 8806605 8895591 8922395
2615H922395K1973R3371Q3238O1900P3478O4241J59440O4284N8945J58594J3391
$$ 8922395 8944368 9037739 9120977 9182877 9256355 9320596 9480036 9544320 9603265 9761859 9775250
2604I775250N5086J67768J76283J28447J7863J86373M6667J5827J76994K69104
$$ 9775250 9830336 9998104 10174387 10302834 10320697 10507070 10553737 10569564 10746558 11015662
2594A1015662O0685K14184J80504J04201K93786K61159K69124K42643M34593L44854
$$ 11015662 11076347 11290531 11471035 11575236 11869022 12130181 12399305 12641948 13076541 13421395
2584A3421395L59942L53177M94222M49482O11852P43614N86509O68512O85876
$$ 13421395 13781337 14134514 14628736 15078218 15690070 16433684 17020193 17688705 18374581
2575A8374581O40760N28552M12963L50505J96481Q2350j06138j81927j45391j96039
$$ 18374581 19015341 19543893 19956856 20307361 20503842 20586192 20480054 20298127 20152736 19956697
2565A9956697k50439l15689l89185k23844j46424l05404j00704j30483J55282
$$ 19956697 19706258 19390569 19001384 18777540 18631116 18325712 18225008 18094525 18249807
2556A8249807J28787K77450J07179K66767K84732L08964L86824M94180M57655
$$ 18249807 18378594 18656044 18763223 19029990 19314722 19623686 20010510 20504690 20962345
2547B0962345L59194N68114O18959P10174O62518Q79951Q51882R23914J039699
$$ 20962345 21321539 21889653 22508612 23218786 23881304 24761255 25613137 26537051 27576750
2538B7576750J257960J363620J489307J559021J729677J929998K198381K315296
$$ 27576750 28834710 30198330 31687637 33246658 34976335 36906333 39104714 41420010
2530D1420010K749230K972642L550191L903260M422255M979999N577802O100835
$$ 41420010 44169240 47141882 50692073 54595333 59017588 63997587 69575389 75676224
2522G5676224O544903P013864P043767O892808O558522O141587N561074N001604
$$ 75676224 82221127 89234991 96278758 103171566 109730088 115871675 121432749 126434353
2514A26434353M177487L589887K656130J682072N40693m74376j419332j941621
$$ 126434353 130611840 134201727 136857857 138539929 139080622 138606246 137186914 135245293
2506A35245293k670330l024162l431600l669094l888761m158121m347786m391720
$$ 135245293 132574963 129550801 126119201 122450107 118561346 114403225 110055439 105663719
2498A05663719m405147m585182m732671m968970n054456m985016n026516m920215
$$ 105663719 101258572 96673390 91940719 86971749 81917293 76932277 71905761 66985546
2490F6985546m709763m414572m171359l819091l455592l042228k685668k265151
$$ 66985546 62275783 57861211 53689852 49870761 46415169 43372941 40687273 38422122
2482C8422122j936636j743750j533571j523399j227347j315040j173357j126134
$$ 38422122 36485486 34741736 33208165 31684766 30457419 29142379 27969022 26842888
2474B6842888j023401r08085q80945q56280p26955q40552o68461n43545m45222
$$ 26842888 25819487 24911402 24030457 23174177 22447222 21606670 20938209 20394664 19949442
2465A9949442l52512k70349l13875k99647k26076j33153j94246l6148R273K0665
$$ 19949442 19596930 19326581 19012706 18713059 18486983 18353830 18159584 18123436 18132709 18153374
2455A8153374N2786J08445J11910L10173K76328J43463J57356J92789J30532j9428
$$ 18153374 18206160 18314605 18426515 18736688 19013016 19156479 19313835 19506624 19637156 19617728
2445A9617728N3050l1367j98740l22846k13407l73442m45665m87254n61526o19896
$$ 19617728 19670778 19639411 19440671 19117825 18904418 18530976 18085311 17598057 17036531 16416635
2435A6416635o83633o28752o44461m33896n41009m93524l76719m68893l20282
$$ 16416635 15733002 15104250 14459789 14025893 13484884 12991360 12614641 12145748 11825466
2426A1825466k83788k54933k83423j73715j77766j83411k62736k4491j40957m1400
$$ 11825466 11541678 11286745 11003322 10829607 10651841 10468430 10205694 10181203 10040246 9998846
2416I998846j51409j30854j56943n5412j61266q1271k4499p3576j16361j39400
$$ 9998846 9847437 9716583 9559640 9504228 9342962 9261691 9237192 9163616 9047255 8907855
2406H907855k2686m1069r5805p9848m9729n1513r574k2052R13P3609J143n4804
$$ 8907855 8885169 8844100 8748295 8668447 8618718 8567205 8557631 8535579 8536492 8610101 8611244 8556440
2394H556440q4568j03245P8413J2380M9611o5801N7634r4613p1719l4414O8116
$$ 8556440 8471872 8368627 8447040 8459420 8509031 8443230 8500864 8406251 8334532 8300118 8368234
2383H368234q5728n9959p1675O6231N1132N7860l420J5756p2021N2613M6691K2887
$$ 8368234 8282506 8222547 8150872 8217103 8268235 8326095 8322675 8338431 8266410 8319023 8365714 8388601
2371H388601N0968r9136J17607Q6150Q2072j6325M8781L4383J41859J25037J17612
$$ 8388601 8439569 8340433 8458040 8544190 8626262 8609937 8658718 8693101 8834960 8959997 9077609
2360I077609J26900J58353J36612J0814J53729J92702K09704J19658K0551J48933
$$ 9077609 9204509 9362862 9499474 9510288 9664017 9856719 10066423 10186081 10206632 10355565
2350A0355565J11650J74043J30453K57373J77701J20198J76269K33320J98926
$$ 10355565 10467215 10641258 10771711 11029084 11206785 11326983 11503252 11736572 11935498
2341A1935498K35973J94584J05493L15175M26904M52879M30628N39739N65369
$$ 11935498 12171471 12366055 12471548 12786723 13213627 13666506 14097134 14636873 15202242
2332A5202242O62794P11749P26376P67607Q02545Q74236P97105Q13550P70060
$$ 15202242 15865036 16576785 17303161 18070768 18873313 19747549 20544654 21358204 22128264
2323B2128264O78192O40643M60047M68862M67281L64043M59613L64101J74645
$$ 22128264 22806456 23447099 23907146 24376008 24843289 25207332 25666945 26031046 26205691
2314B6205691K23296K46246K15707J80391J27479J05442q1852q062J27355N989
$$ 26205691 26428987 26675233 26890940 27071331 27198810 27304252 27222400 27214338 27341693 27347682
2304B7347682J38998J50463M5681k9620J9134K6680R5533J98005J57118J86475
$$ 27347682 27486680 27637143 27682824 27653204 27672338 27699018 27794551 27992556 28149674 28336149
2294B8336149L78193M65119N01930O89270Q34660P23643O40129N44993M17502
$$ 28336149 28714342 29179461 29681391 30370661 31205321 31928964 32569093 33114086 33531588
2285C3531588K10529J08093Q222j05459j44922k41330j16941J19946L86911N21272
$$ 33531588 33742117 33850210 33858432 33752973 33608051 33366721 33249780 33369726 33756637 34277909
2275C4277909Q81439R94364J229778J549409J866962K065841K204789K197804
$$ 34277909 35159348 36153712 37383490 38932899 40799861 42865702 45070491 47268295
2267D7268295K179172J939704J824715J707078J533541J389133J271419J384988
$$ 47268295 49447467 51387171 53211886 54918964 56452505 57841638 59113057 60498045
2259F0498045J184587R51078R48672N48819K85491R6298j57862l87527m47242
$$ 60498045 61682632 62633710 63582382 64131201 64416692 64512990 64355128 63967601 63520359
2250F3520359n04004o29443o53044q20395p72343q34199q25170r21320j220801
$$ 63520359 63016355 62386912 61733868 60913473 60141130 59306931 58481761 57560441 56339640
2241E6339640j371851j647574j943319k088206k070957j818169j768537j281813
$$ 56339640 54967789 53320215 51376896 49288690 47217733 45399564 43631027 42349214
2233D2349214j129570q61620p36307l90267l6419J18022L33367O30153Q42252
$$ 42349214 41219644 40358024 39621717 39231450 39195031 39313053 39646420 40276573 41118825
2224D1118825R66455J183094J448272J596741J687611K082442K022498J981062
$$ 41118825 42085280 43268374 44716646 46313387 48000998 50083440 52105938 54087000
2216E4087000J967357J981263J826782J619739J488269J214627R93394Q69501
$$ 54087000 56054357 58035620 59862402 61482141 62970410 64185037 65178431 66047932
2208F6047932N64763O18337L71123K94431R8828M40P1630k35794l30046l66677
$$ 66047932 66612695 67231032 67602155 67896586 67995414 67995854 68067484 67831690 67501644 67134967
2198F7134967n22608q06122r66863j173674j375186j540463j606092j733924j810841
$$ 67134967 66612359 65806237 64839374 63665700 62290514 60750051 59143959 57410035 55599194
2189E5599194j862375j874105j770114j572038j590839j363447j326458j098451
$$ 55599194 53736819 51862714 50092600 48520562 46929723 45566276 44239818 43141367
2181D3141367r24270p21868m02842j33064l0352J09963L14698N02502N18074P16454
$$ 43141367 42217097 41495229 41092387 40959323 40928971 41038934 41353632 41856134 42374208 43090662
2171D3090662Q45852Q19244P28444P87738P99111O19534O87772O31581M94725
$$ 43090662 43936514 44755758 45484202 46271940 47071051 47690585 48378357 49009938 49504663
2162D9504663M17043M53477L73570L75747L87965L65295L08050K00383P7650M3396
$$ 49504663 49921706 50375183 50748753 51124500 51512465 51877760 52185810 52386193 52463843 52507239
2152E2507239r6298k51655n14029n81293p44859r41975j006834j116186j341843
$$ 52507239 52410941 52159286 51645257 51063964 50319105 49377130 48370296 47254110 45912267
2143D5912267j212374j025504r51538p87513q04686p37574p64340p88685o24794
$$ 45912267 44699893 43674389 42722851 41935338 41130652 40393078 39628738 38840053 38215259
2134C8215259o64104p48150q04990o80210q82508q33151r80530j089979j007640
$$ 38215259 37551155 36803005 35998015 35317805 34435297 33602146 32621616 31531637 30523997
2125C0523997r69288r27697r42657o87470n26593m74227n99307n01536n21079
$$ 30523997 29554709 28627012 27684355 26996885 26470292 25996065 25396758 24895222 24374143
2116B4374143m89631m02967l64627l58946n94083q08993q38728o10420m89865
$$ 24374143 23884512 23481545 23116918 22757972 22163889 21354896 20516168 19905748 19415883
2107A9415883l75031l22727k09522k58695j88789j01612K4384J5944O1918P618
$$ 19415883 19040852 18718125 18508603 18249908 18061119 17959507 17983891 17999835 18061753 18069371
2097A8069371J06719Q5881M1793K96862L09624J13347L06284L83634L42178M21868
$$ 18069371 18176090 18261971 18303764 18600626 18910250 19023597 19329881 19713515 20055693 20477561
2087B0477561N54119O32760N86680O78339P86194Q28910Q82204J222553J063436
$$ 20477561 21031680 21664440 22251120 22929459 23715653 24544563 25426767 26649320 27712756
2078B7712756J257373J255801J477358J765004J953807K056229K299849K264691
$$ 27712756 28970129 30225930 31703288 33468292 35422099 37478328 39778177 42042868
2070D2042868K308264K038942J776673J755219J695084J767186J994912K222816
$$ 42042868 44351132 46390074 48166747 49921966 51617050 53384236 55379148 57601964
2062E7601964K241844K108066J754771J122175M08463J58102Q768J42622J62661
$$ 57601964 59843808 61951874 63706645 64828820 65237283 65395385 65404153 65546775 65709436
2053F5709436L17800J76571k5787k82838o90920r21671j159793j558921j819269
$$ 65709436 66027236 66203807 66178020 65895182 65204262 64282591 63122798 61563877 59744608
2044E9744608k081030k335188k761048k970475k957632k941505l004713l130267
$$ 59744608 57663578 55328390 52567342 49596867 46639235 43697730 40693017 37562750
2036C7562750k824372k613974k376391k205231j896829j590913j274934j286351
$$ 37562750 34738378 32124404 29748013 27542782 25645953 24055040 22780106 21493755
2028B1493755j034568q99600q91087q47116o38347n80927n40408m99755m69371
$$ 21493755 20459187 19559587 18668500 17821384 17183037 16602110 16061702 15561947 15092576
2019A5092576l08285m19263l23970k24963k05929k49848j98144j01143k25056
$$ 15092576 14784291 14365028 14041058 13816095 13610166 13360318 13162174 13061031 12835975
2010A2835975k44748m7918n6415o7797j59892M5898m1893m1784J26342K8403j28636
$$ 12835975 12591227 12543309 12486894 12419097 12259205 12305103 12263210 12221426 12347768 12376171 12247535
1999A2247535R5512K16108J84725J87853L40001K74236J73849K42639J83690J55004
$$ 12247535 12343047 12559155 12743880 12931733 13271734 13545970 13719819 13962458 14146148 14301152
1989A4301152L00107K68886K01906J81414J56247J81222J08512J41650m7632J04287
$$ 14301152 14601259 14870145 15072051 15253465 15409712 15590934 15699446 15841096 15793464 15897751
1979A5897751L8577n0126j02809j39851k37614k82620j66355l43841m40061m44843
$$ 15897751 15936328 15886202 15783393 15643542 15405928 15123308 14956953 14613112 14173051 13728208
1969A3728208m74963m46579n58646n37545m66370l80447l92648l36891k64275
$$ 13728208 13253245 12806666 12248020 11710475 11244105 10863658 10471010 10134119 9869844
1960I869844m02632k79254j94775j53279k04606j85725k63457k26410k19622j7273
$$ 9869844 9467212 9187958 8993183 8839904 8635298 8449573 8186116 7959706 7740084 7722811
1950G722811j03942k04572j3740j37725j39470o7490j9292q4581o1913J0670o4925
$$ 7722811 7618869 7414297 7400557 7262832 7123362 7055872 7036580 6951999 6890086 6900756 6835831
1939F835831k6544k0772j1943L2870j57350j5263p713m6656k6323O276j07304
$$ 6835831 6809287 6788515 6776572 6809442 6652092 6636829 6629116 6582460 6556137 6562413 6455109
1928F455109o5424j18003j70871O3602R3810m5350k4762K890j0100J3541K1028
$$ 6455109 6389685 6271682 6100811 6164413 6258223 6212873 6188111 6191001 6180901 6194442 6215470
1917F215470M2877p29L9419L3025R2622Q4339J46348J8576M7525P3924n3618M2400
$$ 6215470 6258347 6257618 6297037 6330062 6422684 6507023 6653371 6671947 6719472 6793396 6739778 6782178
1905F782178K13421l5602R506N4648J42215J39486K8543M3448J11973Q5469q429
$$ 6782178 6995599 6959997 6969503 7024151 7166366 7305852 7334395 7377843 7489816 7575285 7566856
1894G566856P9134J05986Q5720J16381k563R5121R6271P4155P4111Q4882J72814
$$ 7566856 7645990 7751976 7837696 7954077 7951514 8046635 8142906 8217061 8291172 8376054 8548868
1883H548868R7471k0385O8475J38652P7323Q3146K3047P1984J10395L912J58533
$$ 8548868 8646339 8625954 8694429 8833081 8910404 8993550 9016597 9088581 9198976 9202888 9361421
1872I361421J24585J61175J65966L6996P0435J88607K58262J97332K84909R3222
$$ 9361421 9486006 9647181 9813147 9850143 9920578 10109185 10367447 10564779 10849688 10942910
1862A0942910L79210K96822K46193K18634L18412P8596J20313J87660J99262J77371
$$ 10942910 11322120 11618942 11865135 12083769 12402181 12480777 12601090 12788750 12988012 13165383
1852A3165383K82477J88634M8091P9953J33604K13664K21071K03260J72864J57356
$$ 13165383 13447860 13636494 13684585 13764538 13898142 14111806 14332877 14536137 14709001 14866357
1842A4866357J45706K29493K42541J75579K11786L64102K68126J22329J93593
$$ 14866357 15012063 15241556 15484097 15659676 15871462 16235564 16503690 16626019 16819612
1833A6819612K86677K98344J65004J38546J80211J96156K89205K82677L58513
$$ 16819612 17106289 17404633 17569637 17708183 17888394 18084550 18373755 18656432 19014945
1824A9014945J47012K82916K97446M42871L38692M45178N01610L87045N70467
$$ 19014945 19161957 19444873 19742319 20185190 20523882 20969060 21470670 21857715 22428182
1815B2428182M97173O55314N86021P32926O76057P38986Q45824R00572R73631
$$ 22428182 22925355 23580669 24166690 24899616 25575673 26314659 27160483 28061055 29034686
1806B9034686Q56031J110141Q44237R04822R97020Q98031Q22301Q00395Q60301
$$ 29034686 29890717 31000858 31845095 32749917 33746937 34644968 35467269 36267664 37127965
1797C7127965Q24447J126357J156104J227403J270127J336056J247739J590595
$$ 37127965 37952412 39078769 40234873 41462276 42732403 44068459 45316198 46906793
1789D6906793J865700J995910K284704K613501K738929K797156L257525L686248
$$ 46906793 48772493 50768403 53053107 55666608 58405537 61202693 64460218 68146466
1781F8146466M278572M593083N402416O165540O997085P686680Q403400R160195
$$ 68146466 72425038 77018121 82420537 88586077 95583162 103269842 111673242 120833437
1773A20833437J0154177J1436068J2835794J4928961J7711432K1609864K5756359
$$ 120833437 130987614 142423682 155259476 170188437 187899869 209509733 235266092
1766B35266092K9201745L1557032L2033051L0394223K4319615J0823280j1243660
$$ 235266092 264467837 296024869 328057920 358452143 382771758 393595038 382351378
1759C82351378l5125944m7703733m5743517l7662574k9295475k2736503j7845571
$$ 382351378 347225434 299521701 253778184 216115610 186820135 164083632 146238061
1752A46238061j4263232j1784555r903117q676171p689761p134114o271050n532214
$$ 146238061 131974829 120190274 110287157 101610986 93921225 86787111 80516061 74983847
1744G4983847m958718m175328l767221l167042k849306k673373k418309k203937
$$ 74983847 70025129 65849801 62082580 58915538 56066232 53392859 50974550 48770613
1736D8770613k061480j745130j661259j507982j335119j406524j070115q69748
$$ 48770613 46709133 44964003 43302744 41794762 40459643 39053119 37983004 37113256
1728C7113256q16529p58536n32471l95366k41129j29574r1776o3394K5936J71474
$$ 37113256 36296727 35538191 35005720 34610354 34369225 34239651 34147875 34084481 34110417 34281891
1718C4281891J46996M34910P67520R86133J251518J359358J508539J426439J423351
$$ 34281891 34428887 34863797 35631317 36617450 37868968 39228326 40736865 42163304 43586655
1709D3586655P98505O960j329060k615542l174977l109779k913399k332126j867581
$$ 43586655 44385160 44392120 43063060 40447518 37272541 34162762 31249363 28917237 27049656
1700B7049656j739573j473376j304983j027906r03350r81066q73869q94396n88685
$$ 27049656 25310083 23836707 22531724 21503818 20600468 19619402 18745533 17851137 17262452
1691A7262452o25415n93851m97033m89557m41165l51125k81482m26919l47015
$$ 17262452 16637037 16043186 15546153 15056596 14615431 14264306 13982824 13555905 13208890
1682A3208890k33105k09558l87457k73709k54872k20021l26347j95982k95502
$$ 13208890 12975785 12766227 12378770 12105061 11850189 11630168 11303821 11107839 10812337
1673A0812337k56372l03802j69398k14523j91050j48136j83051j74582k43142
$$ 10812337 10555965 10252163 10082765 9868242 9677192 9529056 9346005 9171423 8928281
1664H928281k42700j87707l37347l15196j66661k28071k48647r8533j43573k19496
$$ 8928281 8685581 8497874 8160527 7845331 7678670 7450599 7201952 7103419 6959846 6740350
1654F740350j89114p7309j54494j85026M484j90611j05653j06574J7220j88931
$$ 6740350 6551236 6473927 6319433 6134407 6138891 5948280 5842627 5736053 5753273 5564342
1644E564342n2586j66861j20132r3310J9439j66611j17814n9377Q9345k2534j93917
$$ 5564342 5511756 5344895 5224763 5131453 5150892 4984281 4866467 4807090 4896435 4873901 4679984
1633D679984j55639k11071N4039n8670q5211j16862q8598j39075l4264l5590p936
$$ 4679984 4524345 4313274 4367313 4308643 4223432 4106570 4017972 3878897 3844633 3809043 3801107
1622C801107j00026j0214K0250M7407p7323r0976J8405q5009r3717q8671p0029
$$ 3801107 3701081 3690867 3711117 3758524 3681201 3590225 3608630 3523621 3429904 3341233 3271204
1611C271204r7517k9523N0345r5691q2206o0109L3250M0058L8925N5629q4525
$$ 3271204 3173687 3144164 3194509 3098818 3016612 2956503 2989753 3029811 3068736 3124365 3039840
1600C039840j02067m2390K30p0419k8575p7193N847j03416j02094L7991n3927
$$ 3039840 2937773 2895383 2895613 2825194 2796619 2719426 2725273 2621857 2519763 2557754 2503827
1589B503827l7199o9744j29908j67896l4971K7525N9315j07622j40208o1999k4964
$$ 2503827 2466628 2396884 2266976 2099080 2064109 2091634 2150949 2043327 1903119 1841120 1816156
1578A816156k1761k2248k2910J40609k1281m5467k2864J5020N7334K3499j00016
$$ 1816156 1794395 1772147 1749237 1889846 1868565 1823098 1800234 1815254 1872588 1896087 1796071
1567A796071p8776N9722Q2098r0439n6231L7985j04195q452l9583j16642m8942
$$ 1796071 1717295 1777017 1859115 1768676 1712445 1750430 1646235 1637783 1598200 1481558 1432616
1556A432616Q1364L0644p7327k5069R280j26417J02686j10763m2681J02153K9688
$$ 1432616 1513980 1544624 1467297 1442228 1451508 1325091 1427777 1317014 1274333 1376486 1406174
1545A406174O4543o2758P3304o0702m9804J09873j0509r8737L9045k1405n2194
$$ 1406174 1470717 1407959 1481263 1420561 1370757 1480630 1470121 1371384 1410429 1389024 1336830
1534A336830n3701n0835J2504n7452q2542j3263j1089j4842j398P8489Q0871K0056
$$ 1336830 1283129 1232294 1244798 1187346 1104804 1091541 1080452 1065610 1064212 1142701 1223572 1243628
1522A243628m9688m9888J3985P2392J4368M1170q6757r6009J9426j523M5694j19428
$$ 1243628 1193940 1144052 1158037 1230429 1244797 1285967 1199210 1103201 1122627 1121104 1166798 1047370
1510A047370j7900L1609K7357j93661Q9075Q2435l7887n3244m563l7816o930J34450
$$ 1047370 1029470 1061079 1088436 894775 983850 1066285 1028398 975154 970591 932775 925845 1060295
1498A060295J8509n1876N8988L280j29743J6706M9738m9473L6200P2444j36324
$$ 1060295 1078804 1026928 1085916 1089196 959453 976159 1025897 976424 1012624 1085068 948744
1487I48744P9159K8720k8979M0705J2704m1967k4327J05070J8323k0379L4678
$$ 948744 1027903 1056623 1027644 1068349 1081053 1039086 1014759 1119829 1138152 1117773 1152451
1476A152451J19059N0902l3720M1761m8588Q2630M4131J41248N4351M1415J93839
$$ 1152451 1271510 1322412 1288692 1330453 1281865 1364495 1408626 1549874 1604225 1645640 1839479
1465A839479L0649J69198J90259K33919J47136J52316j14403j43769k62816k37652
$$ 1839479 1870128 2039326 2229585 2463504 2610640 2762956 2648553 2504784 2241968 2004316
1455B004316j69654j94912j01243j14526j46251j32788j6500l5765r3763j0397
$$ 2004316 1834662 1639750 1538507 1423981 1277730 1144942 1128442 1092677 998914 988517
1445I88517L2678r6066m1955Q333J5676p554J2865k2861k3815p9582p4171l2451
$$ 988517 1021195 925129 883174 891507 907183 899629 912494 889633 865818 786236 712065 679614
1433F79614J33002K9988o3751j20615n4511n3999J8320J09484r7621m6808m615
$$ 679614 812616 842604 778853 658238 603727 549728 568048 677532 579911 533103 528488
1422E28488o9638J36344K8998o5783j3803J8752m1207n0445l5208j9815R5454
$$ 528488 458850 595194 624192 558409 544606 563358 522151 471706 436498 416683 512137
1411E12137J4681J22685N9034k8416J9297p803J258k3311n8667r2560N2516n6778
$$ 512137 526818 649503 708537 680121 699418 691615 692873 669562 610895 518335 570851 514073
1399E14073r6323O8489l2945p8885p4890O6490j19170o3130R5984j2599P0255
$$ 514073 417750 486239 453294 374409 299519 366009 246839 183709 279693 267094 337349
1388C37349O1650p9930j032J03991n7598n4177N0360j45229K1646l3925r562J15946
$$ 337349 398999 319069 318037 422028 364430 310253 360613 215384 237030 203105 193543 309489
1376C09489L4020r5302j13288N3073N57M5771j0821n037L147q5576K3375Q3059
$$ 309489 343509 248207 134919 187992 188549 234320 223499 218462 221609 136033 159408 242467
1364B42467R8865k5777j03895J48248j7484k0945j2979M5812j1212L6985n1466
$$ 242467 341332 315555 211660 359908 342424 321479 308500 354312 343100 380085 328619
1353C28619r9186q6096j1158P6841n052M5321J4143p1079K5480L59k0718m5013
$$ 328619 229433 143337 132179 209020 203968 249289 263432 192353 217833 218192 197474 152461
1341A52461l8449N2026j9936M5775Q00j05268R3160O6263o0784P78K886K1022
$$ 152461 114012 166038 146102 191877 192677 87409 180569 246832 186048 186826 189712 210734
1329B10734o9988J50334n8472m5324l4941r5095K4472J08982O4709P367j02769
$$ 210734 140746 291080 232608 187284 152343 57248 81720 190702 255411 262778 160009
1318A60009o0247O2640K9835j751J8393j31547R0277l982j9633q425J7959N1636
$$ 160009 99762 162402 192237 190486 208879 77332 167609 163627 143994 135569 153528 205164
1306B05164j82859P3721M9266l5506m9598J8305j7764L3591M9204P3027p2470
$$ 205164 22305 96026 145292 109786 60188 78493 60729 94320 143524 216551 144081
1295A44081q099k2003l04O3111N8346r9211P00j2278J7845l667q3771L0174p9184
$$ 144081 135982 113979 113675 176786 235132 135921 136621 124343 142188 138521 54750 84924 5740
1282E740J1100Q0519J8043R4052K6264r1298j1998K9196j30442l0740j075j3140
$$ 5740 16840 97359 115402 209454 235718 144420 132422 161618 31176 436 -639 -13779
1270a3779R0080J7049p7961q2146P2988p0733M7300N2343L343j55424O6280O917
$$ -13779 76301 93350 15389 -66757 6231 -64502 -17202 35141 38484 -116940 -50660 -43743
1258d3743l8636N1554Q0461Q2146q6059Q0309K0013K4113m1301K3598L8562j1337
$$ -43743 -82379 -30825 49636 131782 45723 126032 146045 170158 128857 152455 191017 179680
1246A79680N0580j54613J0443J16044L0435m3323j8339p3039J43199k0247p4341
$$ 179680 230260 75647 86090 202134 232569 189246 170907 97868 241067 220820 146479
1235A46479N3274l7786q1633j01633M3380k1626L7271L5557l8316N0138N6751
$$ 146479 199753 161967 80334 -21299 22081 455 37726 73283 34967 85105 141856
1224A41856j1704M8218K1965p1544r5199r488J4566L3934N9333K4093m4005m7059
$$ 141856 130152 178370 200335 128791 33592 24104 38670 72604 131937 156030 112025 64966
1212F4966n240j06400l5849J68417M0969m151n2421J4618R853P2074r4371M7040
$$ 64966 59726 -46674 -82523 85894 126863 122712 70291 84909 94762 166836 72465 119505
1200A19505L0979p7426K2822K6822L0580q628j1281J741p0424j04976j5056J4245
$$ 119505 150484 73058 95880 122702 153282 144654 133373 135114 64690 -40286 -55342 -41097
1188d1097L995N9825j5219l7664L8145J9384o0494O9935R0876p625Q4296K1667
$$ -41097 -37102 22723 7504 -30160 7985 27369 -33125 36810 127686 120061 204357 226024
1176B26024j5921r6299J4067r251M33N3954k8359J5933k942r8291k7810n3535
$$ 226024 210103 113804 127871 118620 119053 173007 144648 160581 157639 59348 31538 -21997
1164b1997K5529Q4012J7787L4301l801m2150M9479J4513k3984r7697l8917L9567
$$ -21997 3532 87544 105331 139632 135831 93681 143160 157673 133689 35992 -2925 36642
1152C6642n556K2246N7406O9910K2036l2542p8096J888J710Q5948m529M462l5785
$$ 36642 31086 53332 110738 180648 202684 170142 92046 93934 95644 181592 177063 181525 145740
1139A45740L4403Q110J1267r0191j2656j05239N598m3220J51256p687j79136P7205
$$ 145740 180143 188253 199520 109329 96673 -8566 -2968 -46188 105068 97381 -81755 -4550
1127d550n247K2238L7716Q8062j50654Q3323N7009L6815l9803J22545q4536k3445
$$ -4550 -9797 12441 50157 138219 -12435 70888 127897 164712 124909 247454 162918 139473
1115A39473J644R3870j36102P2806N1969m0044j22010K1876J7196q5577J3650
$$ 139473 141117 234987 98885 171691 223660 183616 61606 83482 100678 15101 28751
1104B8751P6078J169M4477J6783m5858K4437K2334j1934L8995r359L4845J26918
$$ 28751 104829 105998 150475 167258 121400 145837 168171 156237 195232 185873 220718 347636
1092C47636o115L943j67754J5709n0999J57293q0760n4650l5215Q5953N3132l0358
$$ 347636 341521 345464 177710 193419 142420 299713 218953 164303 129088 215041 268173 237815
1080B37815R851J2429P784K0900N9717L3315o1372j957J13165O216K2330m9562
$$ 237815 247666 260095 267879 288779 348496 381811 320439 318482 431647 437863 460193 410631
1068D10631k9000L5976L8969P3073j08023p2266J7192k0792j7315L1658L9915
$$ 410631 381631 417607 456576 529649 421626 349360 366552 345760 328445 360103 400018
1057D00018n6968K1612J04256j3234j3000L3003O7433N3660K4985K3874J17317
$$ 400018 343050 364662 468918 455684 442684 475687 543120 596780 621765 645639 762956
1046G62956M3062N5473l10742n502J8220l7924j03281J09914R7098k9002N3732
$$ 762956 806018 861491 550749 545247 563467 525543 422262 532176 629274 600272 654004
1035F54004r1667J0196l2960K7141K0734q6168O0590K7129p908K6727O6926k2126
$$ 654004 562337 572533 539573 566714 587448 501280 561870 588999 581091 607818 674744 652618
1023F52618l8933K7716n1895n5115n752O5714K0958L6795n7823L4373r6734K41863
$$ 652618 613685 641401 589506 534391 528639 594353 615311 652106 594283 628656 531922 773785
1011G73785k6532n2642L598O4799l905K3849Q6149m7032J3096K5276N5393J8511
$$ 773785 747253 694611 698209 763008 759103 782952 869101 822069 835165 860441 915834 934345
999I34345p9636J3954R5406M9712J42828J1968P2560M9762J24687K1365L3263
$$ 934345 854709 868663 964069 1013781 1156609 1168577 1241137 1290899 1415586 1436951 1470214
988A470214Q28J38418K1502N8891J83027m1607M3967O7999J52683P3900K05147
$$ 1470214 1471042 1609460 1630962 1689853 1872880 1831273 1875240 1943239 2095922 2169822 2374969
977B374969J37574J39490J99884K57935J96418K58884L93479L39344L77317N89646
$$ 2374969 2512543 2652033 2851917 3109852 3306270 3565154 3958633 4297977 4675294 5264940
967E264940L01070M00248K79395M67199N09484R34922R84067J142646J685725
$$ 5264940 5566010 5966258 6245653 6712852 7222336 8157258 9141325 10283971 11969696
958A1969696K152431K393850K412828K480361K826186K430700K054253l341492
$$ 11969696 14122127 16515977 18928805 21409166 24235352 26666052 28720305 25378813
950B5378813o906512m134582k678776j659224j479542j036640r55370o49154n88100
$$ 25378813 18472301 14337719 11658943 9999719 8520177 7483537 6528167 5879013 5290913
941E290913k50030l88169l00415k48780j72641k70606l52240k54266j56077k40823
$$ 5290913 5040883 4652714 4352299 4103519 3930878 3660272 3308032 3053766 2897689 2656866
931B656866j82204j77195j51994j20730J3114j48770p9351j78936j54580j9780
$$ 2656866 2474662 2297467 2145473 2024743 2037857 1889087 1809736 1630800 1476220 1456440
921A456440p2766K2158M311q6404k0348J3962j06836q5388l0799m8590p7825J8758
$$ 1456440 1383674 1405832 1410143 1323739 1303391 1317353 1210517 1125129 1094330 1045740 967915 986673
909I86673q4423n6094o0275J45109L0627o6280o9726k0459N3818K1343o288j84939
$$ 986673 902250 846156 785881 930990 961617 895337 825611 805152 858970 880313 874025 689086
897F89086o6784Q6389o1600l024m588j8313J6209K6932k6181n5734l96O2593N7910
$$ 689086 622302 708691 647091 644067 639479 621166 637375 664307 638126 582392 581996 644589 702499
884G02499j37279n4607N0253j17219q0799R941k3550M8785J415J9006j8731j03101
$$ 702499 565220 510613 560866 443647 362848 372789 349239 398024 399439 418445 399714 296613
872B96613m4147o8247R380J25761Q0740j0422R574O4628n0351R114J08914k8631
$$ 296613 252466 184219 193599 319360 400100 389678 399252 463880 413529 422643 531557 502926
860E02926J4565Q9341r3276n5422O589p6850N618j29699p4500J4985m3734P4503
$$ 502926 517491 606832 513556 458134 464723 387873 393491 263792 189292 204277 160543 235046
848B35046L4523j27235N8265l1387j23585R3036P2727M3523K9473K2025p5311
$$ 235046 269569 142334 200599 169212 45627 138663 211390 254913 284386 306411 231100
837B31100l7581k4724m1427l4768Q0887N413n5805L2643n8941l2450p82M6641
$$ 231100 193519 168795 127368 92600 173487 178900 123095 155738 96797 64347 63565 110206
825A10206J10891l8656j09638Q596j0774K6011j16828P0874R5266K283l29N3700
$$ 110206 221097 182441 72803 81399 70625 96636 -20192 50682 145948 148231 147902 201602
813B01602l0817l576N548o1961M590J6204k7372N0196l7558o7620r65m092n8309
$$ 201602 170785 167209 172757 110796 115386 131590 104218 154414 116856 49236 48271 44179 -14130
800a4130L7593M9697J01592m5625p3425M4948m3460N30K6503o2241N613P3551
$$ -14130 23463 73160 174752 129127 55702 100650 57190 57720 84223 21982 27595 101146
788A01146p4901M0972k562p918m8735M8814R8139n0941j32084P5057O4898L6568
$$ 101146 26245 67217 64655 56737 8002 56816 154955 104014 -28070 46987 111885 148453
776A48453O0615N2299j11622q9557J054P5608Q2048J0784k9417k0217o6059r9810
$$ 148453 209068 261367 149745 60188 61242 136850 218898 229682 200265 180048 113989 14179
764A4179o5245K5443J00282j17794l5593q588k2129J1273Q298R7353k8236j02589
$$ 14179 -51066 -25623 74659 -43135 -78728 -87316 -109445 -98172 -89874 7479 -20757 -123346
752a23346l9917Q0786J16239P5836n8549k5764m3669J7340O2455L109j1908j9878
$$ -123346 -163263 -82477 33762 109598 51049 25285 -18384 -1044 61411 64520 52612 32734
740C2734R2633K3342m9174r8166L0997O0226k6330K0663o7010j58145J0023J11396
$$ 32734 125367 148709 99535 1369 32366 92592 66262 86925 19915 -138230 -128207 -16811
728a6811k844M5445j24707r4086L2128J7207J6199l8795J62635l5717l271l2698
$$ -16811 -19655 25790 -98917 -193003 -160875 -143668 -127469 -166264 -3629 -39346 -42617 -75315
716g5315K0471K0703R535k2380O6846K1805j9352Q176k6993N0901J04996k3211
$$ -75315 -54844 -34141 -24606 -46986 19860 41665 22313 30489 3496 54397 159393 136182
704A36182r2967K620J194L157n0172l1351k1946J8856Q2041p0667n8614k1872
$$ 136182 43215 45835 47029 50186 14 -31337 -53283 -34427 47614 -23053 -81667 -103539
692a03539m4122J5274j6351R0352l5918q262m629Q7010p690M7556N8508q7313
$$ -103539 -147661 -132387 -148738 -58386 -94304 -102566 -107195 -20185 -27875 19681 78189 -9124
680i124r600R3219K5033J5072K5546j3863j3279q3569M5317p6136P2482N3319
$$ -9124 -18724 74495 99528 114600 140146 126283 113004 29435 74752 -1384 71098 124417
668A24417r7253p7223Q5336J11247j14736N3064j57398K9128l6685Q1337j8497
$$ 124417 27164 -50059 35277 146524 31788 84852 -72546 -43418 -80103 1234 -17263
657a7263p0453K5806O9200o3471J5923L0177j355L1701q5706J6647M1372J4385
$$ -17263 -87716 -61910 7290 -56181 -40258 -10081 -11436 20265 -65441 -48794 -7422 6963
645F963m9516M623L2410j607r819N3262M7657p8212L024K1940K5091L022j27909
$$ 6963 -42553 -37930 -5520 -7127 -16946 36316 83973 5761 8785 30725 55816 58838 -69071
632f9071N0464l4188O4203k6032J9238p2633K3951j2595k6633j9671R6333J0631
$$ -69071 -18607 -52795 11408 -14624 4614 -68019 -44068 -56663 -83296 -102967 -6634 3997
620C997j11200l8626L9248J04168O535K789l7540L9463m3859p3979J09402o885
$$ 3997 -107203 -145829 -106581 -2413 4122 6911 -30629 8834 -35025 -109004 398 -6487
608f487j8133j2599l1204l8060o732m4429L0849N1496Q6075j0594n5068k2863
$$ -6487 -24620 -37219 -68423 -106483 -113215 -157644 -126795 -75299 10776 182 -54886 -77749
596g7749P6879L6661r4423N1209p9769J2998N7389P205J1179r504q908p7764L1336
$$ -77749 -870 35791 -58632 -7423 -87192 -74194 -16805 -9600 1579 -7925 -16833 -94597 -63261
583f3261M2819j19522J0319R1016m2524L9660K535j4968r3209N8014M8978N100
$$ -63261 -20442 -139964 -129645 -38629 -81153 -41493 -38958 -53926 -147135 -89121 -40143 -35043
571c5043R5753j21330o4795j6840N9361m1221o9066L5910Q9836l7483L4038o7803
$$ -35043 60710 -60620 -125415 -142255 -82894 -124115 -193181 -157271 -67435 -104918 -70880 -138683
559a38683K7943j1192K6176P3420j2139j1272J7220m8183P0633M8359j01777r1391
$$ -138683 -110740 -121932 -95756 -22336 -34475 -45747 -28527 -76710 -6077 42282 -59495 -150886
547a50886R9100K3086j9728M8380k7129L4318p1286L7513n1271q6273J17209L5170
$$ -150886 -51786 -28700 -48428 -48 -27177 7141 -64145 -26632 -77903 -164176 -46967 -11797
535a1797j2998k8581m7362j18928j0590K09741q4324k1416M7930J25260j16693
$$ -11797 -24795 -53376 -100738 -219666 -230256 -20515 -104839 -126255 -78325 46935 -69758
524f9758j3544N9988N2674o7871K990o7535Q253K29869p6342k1266n8699N2472
$$ -69758 -83302 -23314 29360 -38511 -35521 -103056 -94803 135066 58724 37458 -21241 31231
512C1231j23633R552n9729o6086O0913P9709L1752r8441N0001J1256J4191p2802
$$ 31231 -92402 -82850 -142579 -208665 -147752 -68043 -36291 -134732 -84731 -73475 -59284 -132086
500a32086k0234n6225N7761R6852j7408n1231l4495O6024J579M6961m8808k5895
$$ -132086 -152320 -208545 -150784 -53932 -71340 -122571 -157066 -91042 -89463 -42502 -91310 -117205
488a17205j4857N891K0790J07787N6392l4288M3114m3436p0175m1286J02335j23653
$$ -117205 -132062 -126171 -105381 2406 58798 24510 67624 24188 -45987 -87273 15062 -108591
476a08591J5621O7143j16722m2039L8757K2652r0190P4M5329O7587k8608K5133
$$ -108591 -92970 -25827 -142549 -184588 -145831 -123179 -213369 -213295 -167966 -100379 -128987 -103854
464a03854j07413J34470j5769m401K9106j6912O6678j4845L1274j53755M9103
$$ -103854 -211267 -76797 -92566 -96967 -67861 -84773 -18095 -32940 -1666 -155421 -106318
453a06318M6251J9945k8671p043q6217J6678N4485j76593L1111P0166K1785l5116
$$ -106318 -60067 -40122 -68793 -75836 -162053 -145375 -90890 -267483 -236372 -166206 -144421 -179537
441a79537K6571R5365J0756O2828K0810K813j2703j7388l9258N6792l0864k1194
$$ -179537 -152966 -57601 -46845 15983 36793 39606 26903 9515 -29743 27049 -3815 -25009
429b5009j43598O9326m931p3951L1655L9435j0821m5420N8571p414K7816K2519
$$ -25009 -168607 -99281 -104212 -178163 -146508 -107073 -117894 -163314 -104743 -112157 -84341 -61822
417f1822j5975j56075R8762k516l1691J19023R1767J1502l3086n032O6325l2527
$$ -61822 -77797 -233872 -135110 -137626 -169317 -50294 41473 52975 19889 14857 81182 48655
405D8655j39309N1420P8337j42094J6406R1754r8157n8417J23223k0328l9256
$$ 48655 -90654 -39234 39103 -102991 -86585 5169 -92988 -151405 -28182 -48510 -87766
394h7766n761j14712K7015J46265r1675l8153Q0292M6276M3011l3131K9367l9099
$$ -87766 -93527 -208239 -181224 -34959 -126634 -164787 -84495 -38219 4792 -28339 1028 -38071
382c8071j1732M8918J3971r76p249q0434p6422J00993J7840k9581q5835N8814
$$ -38071 -49803 -885 13086 12110 4861 -75573 -151995 -51002 -33162 -62743 -148578 -89764
370h9764l7835k4194N0313r183O1348J1857P8060j51087p6181M8091J03122j18479
$$ -89764 -127599 -151793 -101480 -110663 -49315 -37458 40602 -110485 -186666 -138575 -35453 -153932
358a53932Q1668p766J8949R2257l052p2771m0982N6798N659k0616n9968r007j5779
$$ -153932 -72264 -80030 -61081 31176 28124 -44647 -85629 -28831 -23172 -43788 -103756 -112763 -128542
345a28542L5764M7586J4870m1544J03808O539l9606n2149m5223J1935K5162J08991
$$ -128542 -92778 -45192 -30322 -71866 31942 38481 -1125 -53274 -98497 -86562 -61400 47591
333D7591o864j04238q865J3979M900o2635l5174k2563L2348L1880j2633L691P6058
$$ 47591 40727 -63511 -72376 -58397 -53497 -116132 -151306 -173869 -141521 -109641 -122274 -118583 -42525
320d2525J0937p589r2525J9626J47177l7902r280l8533p6425o3399M8881k7173
$$ -42525 -31588 -39177 -131702 -112076 35101 -2801 -12081 -50614 -127039 -190438 -141557 -168730
308a68730P1363k569l7095J1135M6643J9248m9896P839M8138j05705q78N879O8917
$$ -168730 -97367 -99936 -137031 -125896 -79253 -60005 -109901 -102062 -53924 -159629 -160507 -154628 -85711
295h5711J50120L9286j4843j14463O9742j00009k8077m2802M4655o7242R2913
$$ -85711 64409 103695 88852 -25611 44131 -55878 -83955 -126757 -82102 -149344 -56431
284e6431j8387q5439p7242P5037k1941L286J08029P9178o6063j238r165j01677
$$ -56431 -74818 -160257 -237499 -162462 -184403 -181117 -73088 6090 -59973 -61211 -70376 -172053
272a72053L458J9003N4066o9033M7660n9896J3737J93233K1377k03047N4934P479
$$ -172053 -168595 -149592 -95526 -164559 -116899 -176795 -163058 30175 51552 -151495 -96561 -89082
260h9082l0466j4402J56043n5932j3585n4851L7437o4008Q2618j9263l6258R3071
$$ -89082 -119548 -133950 22093 -33839 -47424 -102275 -64838 -128846 -46228 -65491 -101749 -8678
248h678n1131o1740J8923K1954o4151k8242K0159J10539k9257K5229j54983L1505
$$ -8678 -59809 -121549 -102626 -80672 -144823 -173065 -152906 -42367 -71624 -46395 -201378 -169873
236a69873M9642q324j06677n5190Q7882R9538k6548J3048L8823m2663L1761M5298
$$ -169873 -120231 -128555 -235232 -290422 -202540 -103002 -129550 -116502 -77679 -120342 -88581 -43283
224d3283J7561O954P9421q4692r1045k5302M8082p189j03423O0679Q7970k09376
$$ -43283 -25722 -18768 60653 -24039 -115084 -140386 -92304 -99493 -202916 -142237 -54267 -263643
212b63643P837Q9581R5532M204k1302k8327l5513J47552l2643j91061o6974N8524
$$ -263643 -255806 -166225 -70693 -66489 -87791 -116118 -151631 -4079 -36722 -227783 -294757 -236233
200b36233l9185P8762k947j4333N40P8376j5210j06331O2064O7467j2197N7240
$$ -236233 -275418 -196656 -199603 -213936 -213396 -135020 -150230 -256561 -194497 -127030 -139227 -81987
188h1987J0715k1769l808O3006N9701o2810Q11K1868q3867q221K7966j6385j05485
$$ -81987 -71272 -93041 -96849 -33843 25858 -36952 -36141 -14273 -98140 -106361 -78395 -94780 -200265
175b00265L5467K7511O33J5564N6329M0709j83929o4024M3443L5829O4860k3018
$$ -200265 -164798 -137287 -136654 -121090 -64761 -24052 -207981 -272005 -228562 -192733 -127873 -150891
163a50891r3776L9821M6270n3409P2715j7220j1834m4820O626N5675p4091N8866
$$ -150891 -244667 -204846 -158576 -211985 -139270 -156490 -168324 -213144 -206518 -150843 -224934 -166068
151a66068n726k5570L8474P4827j8773l8619l1232Q5781J6334j6540j1421J02786
$$ -166068 -171794 -197364 -158890 -84063 -102836 -141455 -172687 -86906 -70572 -87112 -98533 4253
139D253K9792o3047o0305j7365l693k1435m743l936m697j6348L3330m9047k440
$$ 4253 34045 -29002 -89307 -106672 -110365 -131800 -136543 -140479 -145176 -161524 -128194 -177241 -179681
$$ [...]
##END NTUPLES=NMR SPECTRUM
##END=
