##TITLE=1H_CG-1142-B1
 CDCl3, 8 sc, 
 12.05.2021
##JCAMPDX= 6.0         $$ Bruker NMR JCAMP-DX V2.0
##DATA TYPE= NMR SPECTRUM
##DATA CLASS= NTUPLES
##ORIGIN= UXNMR, Bruker Analytische Messtechnik GmbH
##OWNER= root
$$ XWIN-NMR		Version 3.5
$$ Wed May 12 10:39:02 2021 Russian Standard Time (UT+4h)  she@DPX200
##.OBSERVE FREQUENCY= 200.131506
##.OBSERVE NUCLEUS= ^1H
##.ACQUISITION MODE= SIMULTANEOUS
##.ACQUISITION SCHEME= undefined
##.AVERAGES= 8
##.DIGITISER RES= 18
##SPECTROMETER/DATA SYSTEM= spect
##.PULSE SEQUENCE= zg30
##.SOLVENT NAME= CDCl3
##.SHIFT REFERENCE= (INTERNAL, CDCl3, 0, 15.974)
##AUDIT TRAIL= $$ (NUMBER, WHEN, WHO, WHERE, WHAT)
$$ ##TITLE= Audit trail, XWIN-NMR		Version 3.5
$$ ##JCAMPDX= 5.01
$$ ##ORIGIN= Bruker BioSpin GmbH
$$ ##OWNER= she
$$ F:/spectra/data/she/nmr/H-F/1/pdata/1/auditp.txt
$$ ##AUDIT TRAIL=  $$ (NUMBER, WHEN, WHO, WHERE, WHAT)
(   1,<2021-05-12 10:37:23.87 +0400>,<she>,<DPX200>,
      <created by zg, POWCHK disabled, PULCHK disabled
       configuration hash MD5:
       00 E9 B6 7A A2 85 ED C7 34 08 36 98 17 FE 4E 26
       data hash MD5: 16K
       7F 07 A5 15 C1 AE 06 54 A9 7F 4D 16 D6 03 3F 16>)
(   2,<2021-05-12 10:37:26.73 +0400>,<she>,<DPX200>,
      <Start of raw data processing
       efp BC_mod = 2 LB = 0.24 FT_mod = 6 PKNL = 1 PHC0 = -11132.57 PHC1 = 15.601 SI = 16K 
       data hash MD5: 16K
       F0 56 07 BA 76 74 36 EF 19 2A EE 6E 34 CA 7D 3B>)
(   3,<2021-05-12 10:37:55.73 +0400>,<she>,<DPX200>,
      <pk PHC0 = 3.226622 PHC1 = -4.4 
       data hash MD5: 16K
       79 03 A6 BF F0 52 A9 DE 03 E9 A8 68 66 4A AF ED>)
(   4,<2021-05-12 10:37:59.07 +0400>,<she>,<DPX200>,
      <abs ABSG = 5 
       data hash MD5: 16K
       A1 FF 2D 70 94 09 E9 38 5F 84 EF AE 60 BA 93 9C>)
$$ ##END=
$$ 
$$ hash MD5
$$ 4C 42 DE 5B 65 CB 32 9B 19 6A 0D 64 99 1F 5B 43
##$RELAX= 
##$RELAX= 
##$RELAX= 
##$RELAX= 
##$RELAX= 
##$RELAX= 
$$ Bruker specific parameters
$$ --------------------------
##$DU= <F:/spectra>
##$EXPNO= 1
##$NAME= <H-F>
##$PROCNO= 1
##$TYPE= <nmr>
##$USER= <she>
##$AMP= (0..31)
100 100 100 100 100 100 100 100 100 100 100 100 100 100 100 100 100 100 
100 100 100 100 100 100 100 100 100 100 100 100 100 100 
##$AQSEQ= 0
##$AQ_mod= 1
##$AUNM= <au_zg>
##$AUTOPOS= <>
##$BF1= 200.13
##$BF2= 200.13
##$BF3= 200.13
##$BF4= 200.13
##$BF5= 200.13
##$BF6= 200.13
##$BF7= 200.13
##$BF8= 200.13
##$BYTORDA= 1
##$CFDGTYP= 0
##$CFRGTYP= 5
##$CHEMSTR= <none>
##$CNST= (0..31)
1 1 145 1 1 1 1 1 1 1 1 1 1 1 1 1 1 1 1 1 1 1 1 1 1 1 1 1 1 1 1 1 
##$CPDPRG= <>
##$CPDPRG1= <>
##$CPDPRG2= <>
##$CPDPRG3= <>
##$CPDPRG4= <mlev>
##$CPDPRG5= <mlev>
##$CPDPRG6= <mlev>
##$CPDPRG7= <mlev>
##$CPDPRG8= <mlev>
##$CPDPRGB= <>
##$CPDPRGT= <>
##$D= (0..31)
0 1.2 0 0 0 0 0 0 0 0.06 0 0.03 0 0 0 0 0.0002 0 0 0 0 0 0 0 0 0 0 0 0 
0 0 0 
##$DATE= 1620801443
##$DBL= (0..7)
120 120 120 120 120 120 120 120 
##$DBP= (0..7)
150 150 150 150 150 150 150 150 
##$DBP07= 0
##$DBPNAM0= <>
##$DBPNAM1= <>
##$DBPNAM2= <>
##$DBPNAM3= <>
##$DBPNAM4= <>
$$ [...]
##$SUBNAM3= <"">
##$SUBNAM4= <"">
##$SUBNAM5= <"">
##$SUBNAM6= <"">
##$SUBNAM7= <"">
##$SUBNAM8= <"">
##$SUBNAM9= <"">
##$SW= 16.9725357007746
##$SWIBOX= (0..15)
0 0 2 0 0 0 0 0 0 0 0 0 0 0 0 0 
##$SW_h= 3396.73913043478
##$TD= 16384
##$TD0= 1
##$TE= 0
##$TE2= 300
##$TE3= 300
##$TEG= 300
##$TL= (0..7)
0 120 120 120 120 120 120 120 
##$TP= (0..7)
150 150 150 150 150 150 150 150 
##$TP07= 0
##$TPNAME0= <>
##$TPNAME1= <>
##$TPNAME2= <>
##$TPNAME3= <>
##$TPNAME4= <>
##$TPNAME5= <>
##$TPNAME6= <>
##$TPNAME7= <>
##$TPOAL= (0..7)
0.5 0.5 0.5 0.5 0.5 0.5 0.5 0.5 
##$TPOFFS= (0..7)
0 0 0 0 0 0 0 0 
##$TUNHIN= 0
##$TUNHOUT= 0
##$TUNXOUT= 0
##$USERA1= <user>
##$USERA2= <user>
##$USERA3= <user>
##$USERA4= <user>
##$USERA5= <user>
##$V9= 5
##$VALIST= <valist>
##$VCLIST= <CCCCCCCCCCCCCCC>
##$VD= 0
##$VDLIST= <DDDDDDDDDDDDDDD>
##$VPLIST= <PPPPPPPPPPPPPPP>
##$VTLIST= <TTTTTTTTTTTTTTT>
##$WBST= 1024
##$WBSW= 4
##$XGAIN= (0..3)
0 0 0 0 
##$XL= 0
##$YL= 0
##$YMAX_a= 205156
##$YMIN_a= -260791
##$ZGOPTNS= <>
##$ZL1= 120
##$ZL2= 120
##$ZL3= 120
##$ZL4= 120
##$ABSF1= 16.0134
##$ABSF2= -0.9592648
##$ABSG= 5
##$ABSL= 3
##$ALPHA= 0
##$AQORDER= 0
##$ASSFAC= 0
##$ASSFACI= 0
##$ASSFACX= 0
##$ASSWID= 0
##$AUNMP= <proc_1d>
##$AZFE= 0.1
##$AZFW= 0.1
##$BCFW= 0
##$BC_mod= 2
##$BYTORDP= 0
##$COROFFS= 0
##$CY= -3
##$DATMOD= 1
##$DC= 0
##$DFILT= <>
##$DTYPP= 0
##$F1P= 0
##$F2P= 0
##$FCOR= 1
##$FTSIZE= 16384
##$FT_mod= 6
##$GAMMA= 0
##$GB= 0
##$INTBC= 1
##$INTSCL= 1.334414e-10
##$ISEN= 128
##$LB= 0.24
##$LEV0= 0
##$LPBIN= 0
##$MAXI= 10000
##$MC2= 0
##$MEAN= 0
##$ME_mod= 0
##$MI= 1.114404
##$NCOEF= 0
##$NC_proc= -7
##$NLEV= 6
##$NOISF1= 3.799351
##$NOISF2= 2.8
##$NSP= 0
##$NTH_PI= 0
##$NZP= 0
##$OFFSET= 15.97403
##$PC= 1
##$PHC0= -11129.34
##$PHC1= 11.201
##$PH_mod= 1
##$PKNL= yes
##$PPARMOD= 0
##$PSCAL= 0
##$PSIGN= 0
##$REVERSE= no
##$SF= 200.13000748777
##$SI= 16384
##$SIGF1= 3
##$SIGF2= 2
##$SINO= 5.538805
##$SIOLD= 16384
##$SREGLST= <1H.CDCl3>
##$SSB= 0
##$STSI= 16384
##$STSR= 0
##$SW_p= 3396.73913043479
##$SYMM= 0
##$S_DEV= 0
##$TDeff= 16384
##$TDoff= 0
##$TI= <>
##$TILT= no
##$TM1= 0
##$TM2= 0
##$TOPLEV= 0
##$USERP1= <user>
##$USERP2= <user>
##$USERP3= <user>
##$USERP4= <user>
##$USERP5= <user>
##$WDW= 1
##$XDIM= 16384
##$YMAX_p= 497266564
##$YMIN_p= -1370886
$$ End of Bruker specific parameters
$$ ---------------------------------
##NTUPLES= NMR SPECTRUM
##VAR_NAME=  FREQUENCY,     SPECTRUM/REAL,   SPECTRUM/IMAG
##SYMBOL=    X,             R,               I
##VAR_TYPE=  INDEPENDENT,   DEPENDENT,       DEPENDENT
##VAR_FORM=  AFFN,          ASDF,            ASDF
##VAR_DIM=   16384,         16384,           16384
##UNITS=     HZ,            ARBITRARY UNITS, ARBITRARY UNITS
##FACTOR=    0.207333158178282, 1,           1
##FIRST=     3196.88265165332, 0,            0
##LAST=      -199.856478781473, 0,           0
##MIN=       -199.856478781473, -1370886,    0
##MAX=       3196.88265165332, 497266564,    0
$$ Real data points
##PAGE= N=1
##DATA TABLE= (X++(R..R)), XYDATA
$$ [...]
$$ plain form
4462 91715424 85148391 78727921 72476539 66349380 60418209 54831423 49801113 45159390
4454 45159390 41119948 37805085 34766938 32121828 29955450 27870638 25873289 24173983
4446 24173983 22604223 21335140 20062404 18874255 17963617 16973803 16217644 15546263 14931629
4437 14931629 14257692 13742776 13262470 12692197 11966109 11560565 11183658 10776854 10477576
4428 10477576 10173553 9756708 9472356 9144506 8912819 8496493 8135373 7931471 7654178
4419 7654178 7531276 7164968 6910913 6722667 6573072 6284761 6073446 5937734 5853374 5765302
4409 5765302 5636405 5434350 5329198 5354118 5227904 5097271 5211058 5219708 5092024 4977951
4399 4977951 4848547 4743679 4639329 4470766 4437897 4468874 4387243 4476700 4387324 4261634
$$ packed form
4462I1715424o567033o420470o251382o127159n931171n586786n030310m641723
4454D5159390m039442l314863l038147k645110k166378k084812j997349j699306
4446B4173983j569760j269083j272736j188149r10638r89814p56159o71381o14634
4437A4931629o73937n14916m80306n70273p26088m05544l76907m06804k99278
4428A0477576l04023m16845k84352l27850k31687m16326l61120k03902k77293
4419G654178j22902l66308k54055j88246j49595k88311k11315j35712q4360q8072
4409E765302j28897k02055j05152K4920j26214j30633J13787Q650j27684j14073
4399D977951j29404j04868j04350j68563l2869L0977q1631Q9457q9376j25690
$$ plain form
4389 4261634 4119549 4079951 4079822 4162248 4086716 4027221 3845482 3840666 3860704 3848505 3974235
4378 3974235 3821827 3818680 3629823 3719165 3624065 3396818 3285813 3218195 3292369 3519496 3293623
4367 3293623 3335327 3157210 3068335 3115208 2973308 2923377 2957285 2937392 2828393 2713189 2721923
4356 2721923 2648646 2587489 2737989 2554504 2368954 2441144 2460344 2539178 2562830 2530007 2416559
4345 2416559 2506953 2371345 2358810 2437442 2412583 2518340 2552728 2437680 2327085 2205901
4335 2205901 2209863 2246727 2149909 2128143 2088552 2106393 2194505 2291557 2266677 2362968 2217062
4324 2217062 2252952 2156388 2015250 1958002 1969358 2061432 2223502 1972955 1951166 2147187 2114516
4313 2114516 2069516 2124905 2078985 2000740 2028371 2002517 2297819 2259890 2106279 2407242 2356056
$$ packed form
4389D261634j42085l9598j29Q2426p5532n9495j81739m816K0038j2199J25730
4378C974235j52408l147j88857Q9342r5100k27247j11005o7618P4174K27127k25873
4367C293623M1704j78117q8875M6873j41900m9931L3908j9893j08999j15204Q734
4356B721923p3277o1157J50500j83485j85550P2190J9200P8834K3652l2823j13448
4345B416559R0394j35608j2535P8632k4859J05757L4388j15048j10595j21184
4335B205901L962L6864r6818k1766l9591J7841Q8112R7052k4880R6291j45906
4324B217062L5890r6564j41138n7248J1356R2074J62070k50547k1789J96021l2671
4313B114516m5000N5389m5920p8245K7631k5854K95302l7929j53611L00963n1186
$$ plain form
4302 2356056 2136073 1995395 2177666 2076310 2000377 2128213 2136612 2233948 2219198 2200744 2219864
4291 2219864 2209176 2280607 2349882 2366944 2382745 2339557 2532284 2491144 2443350 2452783 2602544
4280 2602544 2815974 2896263 2985447 3084998 3038052 2887013 3050697 3296787 3353361 3342207 3236701
4269 3236701 3418120 3550349 3617613 3794716 3990469 4422961 4842458 5059260 5360174 5839630
4259 5839630 6350303 7021618 7947069 8796684 10008438 11339056 12725755 14402717 15047512
4250 15047512 14536434 13486661 12699702 11947449 11468635 11473876 10967965 9263769 7413468
4241 7413468 6081719 5308185 4773895 4315878 3935534 3899281 3673813 3370109 3111667 2885599
4231 2885599 2675568 2603209 2585324 2483012 2359245 2276063 2276246 2235467 2096444 2110631 2171271
$$ packed form
4302B356056k19983j40678J82271j01356p5933J27836Q399R7336j4750j8454J9120
4291B219864j0688P1431O9275J7062J5801m3188J92727m1140m7794R433J49761
4280B602544K13430Q0289Q9184R9551m6946j51039J63684K46090N6574j1154j05506
4269C236701J81419J32229O7264J77103J95753M32492M19497K16802L00914M79456
4259E839630N10673O71315R25451Q49615J211754J330618J386699J676962O44795
4250A5047512n11078j049773p86959p52253m78814N241n05911j704196j850301
4241G413468j331749p73534n34290m58017l80344l6253k25468l03704k58442k26068
4231B885599k10031p2359j7885j02312j23767q3182J83m0779j39023J4187O0640
$$ plain form
4220 2171271 2085544 2064526 1981046 1977315 1999603 1927552 1943204 1937305 1724106 1755399 1747389 1666296
4208 1666296 1704230 1712253 1581713 1600781 1607949 1802121 1734212 1630122 1662829 1582659 1404537
4197 1404537 1310517 1356385 1479342 1401556 1459432 1584523 1487766 1518390 1562380 1572959 1503814
4186 1503814 1474538 1490074 1364927 1352080 1347183 1411829 1602287 1601698 1613260 1650445 1511235
4175 1511235 1405376 1400108 1725071 1683287 1555476 1601087 1539346 1579441 1516085 1393001 1385843
4164 1385843 1487290 1714599 1544634 1457563 1697782 1767348 1650226 1637211 1634132 1638291 1581681
4153 1581681 1659013 1854742 1951183 1960130 1973454 1986950 2045233 2037918 1963227 1902719 1869986 1900279
4141 1900279 1982035 2103812 1954311 1726267 1674814 1773848 1910041 2058208 2003049 1921251
$$ packed form
4220B171271q5727k1018q3480l731K2288p2051J5652n899k13199L1293q010q1093
4208A666296L7934Q023j30540J9068P168J94172o7909j04090L2707q0170j78122
4197A404537r4020M5868J22957p7786N7876J25091r6757L0624M3990J0579o9145
4186A503814k9276J5536j25147j2847m897O4646J90458n89J1562L7185j39210
4175A511235j05859n268L24963m1784j27811M5611o1741M0095o3356j23084p158
4164A385843J01447K27309j69965q7071K40219O9566j17122j3015l079M159n6610
4153A581681P7332J95729R6441Q947J3324J3496N8283p315p4691o0508l2733L0293
4141A900279Q1756J21777j49501k28044n1453R9034J36193J48167n5159q1798
$$ plain form
4131 1921251 1970433 1993308 1872945 1862176 1912156 1793075 1622377 1623925 1591874 1581116 1580217
4120 1580217 1627037 1493384 1512462 1681441 1622258 1585760 1637179 1667507 1697121 1637127 1588618
4109 1588618 1710850 1809673 1699544 1687215 1752993 1682201 1697477 1591625 1716297 1815349 1632660
4098 1632660 1698357 1706792 1773991 1580773 1547722 1690270 1724810 1670514 1745234 1796818 1834618
4087 1834618 1757754 1851878 1811260 1880722 2043045 1929250 1781505 1928628 2051748 2008245
4077 2008245 1972157 1797445 1837022 1976022 1993452 2042311 2154460 2096423 2002624 2014197 2164885
4066 2164885 2304761 2315393 2283398 2242670 2272965 2258312 2215883 2231688 2330159 2357812 2216588
4055 2216588 2068022 1995980 2136583 2055436 1985219 2047394 2123447 2286295 2102622 2105253 2207286
$$ packed form
4131A921251M9182K2875j20363j0769M9980j19081j70698J548l2051j0758q99
4120A580217M6820j33653J9078J68979n9183l6498N1419L0328K9614n9994m8509
4109A588618J22232R8823j10129j2329O5778p0792J5276j05852J24672R9052j82689
4098A632660O5697Q435O7199j93218l3051J42548L4540n4296P4720N1584L7800
4087A834618p6864R4124m0618O9462J62323j13795j47745J47123J23120m3503
4077B008245l6088j74712L9577J39000J7430M8859J12149n8037r3799J1573J50688
4066B164885J39876J0632l1995m0728L0295j4653m2429J5805R8471K7653j41224
4055B216588j48566p2042J40603q1147p0217O2175P6053J62848j83673K631J02033
$$ plain form
4044 2207286 2160559 2158329 2116075 2228632 2276212 2199836 2267304 2306761 2364521 2470929 2366587
4033 2366587 2332873 2382946 2383661 2311070 2433097 2431809 2464548 2454787 2490720 2421567 2431074 2456982
4021 2456982 2569210 2416071 2348477 2316977 2290738 2445468 2407508 2488581 2636783 2644665 2655506
4010 2655506 2542527 2649495 2480129 2552613 2450108 2443020 2494967 2612092 2567407 2483584 2564638
3999 2564638 2435902 2487427 2547825 2586934 2562152 2677834 2631413 2603182 2543989 2513420 2486614
3988 2486614 2699563 2825532 2615522 2597862 2739294 2688227 2693638 2652658 2733141 2595709 2576573
3977 2576573 2682912 2840524 2684315 2661559 2679626 2634605 2739560 2772921 2840372 2887858 2951127
3966 2951127 2830555 2841007 2847836 2745813 2821908 2885331 2851882 2716693 2784057 2852365 2993843
$$ packed form
4044B207286m6727k230m2254J12557M7580p6376O7468L9457N7760J06408j04342
4033B366587l3714N0073P15p2591J22027j288L2739r761L5933o9153R507K5908
4021B456982J12228j53139o7594l1500k6239J54730l7960Q1073J48202P882J0841
4010B655506j12979J06968j69366P2484j02505p088N1947J17125m4685q3823Q1054
3999B564638j28736N1525O0398L9109k4782J15682m6421k8231n9193l0569k6806
3988B486614K12949J25969k10010j7660J41432n1067N411m0980Q0483j37432j9136
3977B576573J06339J57612j56209k2756J8067m5021J04955L3361O7451M7486O3269
3966B951127j20572J0452O829j02023P6095O3423l3449j35189O7364O8308J41478
$$ plain form
3955 2993843 2893106 2874963 2897836 2962086 2997232 2998469 3009889 3040879 2954962 2998264 3105781
3944 3105781 3182489 3161818 3126688 3247303 3191448 3340396 3361893 3296873 3359956 3561518 3488560
3933 3488560 3544181 3648336 3483903 3450187 3476454 3512213 3463782 3543326 3823682 3807839 3862783
3922 3862783 3883849 3777433 3905341 3897276 3783586 3910166 4119880 4182586 4134763 4094701 4159565
3911 4159565 4278741 4339668 4402887 4387421 4328701 4307222 4342953 4401033 4561795 4656090 4755805
3900 4755805 4710210 4706093 4606225 4415081 4461259 4491092 4623689 4762725 4719236 4846968 5285957
3889 5285957 5289988 5331494 5387570 5301112 5259723 5265621 5411052 5522456 5605579 5716741 5809972
3878 5809972 5873995 5889095 5965017 5927764 5939551 6104329 6225274 6388694 6307794 6460366 6559012
$$ packed form
3955B993843j00737j8143K2873O4250L5146J237J1420L0990q5917M3302J07517
3944C105781P6708k0671l5130J20615n5855J48948K1497o5020O3083K01562p2958
3933C488560N5621J04155j64433l3716K6267L5759m8431P9544K80356j5843N4944
3922C862783K1066j06416J27908q065j13690J26580K09714O2706m7823m0062O4864
3911D159565J19176O0927O3219j5466n8720k1479L5731N8080J60762R4295R9715
3900D755805m5595m117r9868j91144M6178K9833J32597J39036m3489J27732M38989
3889E285957M031M1506N6076q6458m1389N898J45431J11404Q3123J11162R3231
3878E809972O4023J5100P5922l7253J1787J64778J20945J63420q0900J52572R8646
$$ plain form
3867 6559012 6649456 6782242 6802694 6904471 6932525 7061599 7243938 7282846 7404690 7601678
3857 7601678 7722583 7760846 7852082 8064213 8260637 8351312 8281030 8390818 8557719 8758717
3847 8758717 9037284 9200997 9417470 9522378 9680855 9816703 10045402 10421679 10505330 10622672
3837 10622672 10956971 11146206 11391069 11693435 11907988 12248297 12614498 12814669 13345746
3828 13345746 13539553 13555887 13979910 14417204 14772009 15228314 15623364 16308836 16777153 17203927
3818 17203927 17928142 18870511 19667986 20445532 21575958 22934148 24293445 25921164 27836830
3809 27836830 30276214 33356898 37100935 41843439 47433188 53003967 57878801 60656914
3801 60656914 60767176 59518915 56760352 52460517 47431623 42437018 36936723 32436719
$$ packed form
3867F559012R0444J32786K0452J01777K8054J29074J82339L8908J21844J96988
3857G601678J20905L8263R1236K12131J96424R0675p0282J09788J66901K00998
3847H758717K78567J63713K16473J04908J58477J35848K28699L76277Q3651J17342
3837A0622672L34299J89235K44863L02366K14553L40309L66201K00171N31077
3828A3345746J93807J6334M24023M37294L54805M56305L95050O85472M68317M26774
3818A7203927P24215R42369P97475P77546J130426J358190J359297J627719J915666
3809B7836830K439384L080684L744037M742504N589749N570779M874834K778113
3801F0656914J10262j248261k758563m299835n028894m994605n500295m500004
$$ plain form
3793 32436719 29638674 27774745 26305206 25249188 24330719 23687752 23115878 22654925 22374435
3784 22374435 22098386 21947151 21943296 21968984 22103923 22290207 22471190 22843936 23163190 23553016
3774 23553016 24125888 24558051 24999202 25623861 26325909 26774178 27419688 27932870 28553844
3765 28553844 29389305 30009620 30517435 31303548 31996353 32747443 33534271 34201053 35125946
3756 35125946 36174067 37122592 38012167 38939871 40054784 41172781 42140963 43345373 44896818
3747 44896818 46657741 48398797 50344332 52679149 55057352 57938169 61399681 65548136
3739 65548136 70572393 76596326 83756190 91055689 98149236 104821258 109155530 111783050
3731 111783050 113985406 113611954 110575484 108464955 107134996 105035023 103483147 103184930
$$ packed form
3793C2436719k798045j863929j469539j056018r18469o42967n71874m60953k80490
3784B2374435k76049j51235l855K5688J34939J86284J80983L72746L19254L89826
3774B3553016N72872M32163M41151O24659P02048M48269O45510N13182O20974
3765B8553844Q35461O20315N07815P86113O92805P51090P86828O66782R24893
3756C5125946J048121R48525Q89575R27704J114913J117997R68182J204410J551445
3747D4896818J760923J741056J945535K334817K378203K880817L461512M148455
3739F5548136N024257O023933P159864P299499P093547O672022M334272K627520
3731A11783050K202356l73452l036470k110529j329959k099973j551876k98217
$$ plain form
3723 103184930 103624268 104428389 105821482 107348205 109164354 111259129 114015983 117228743
3715 117228743 120709208 124452038 128298165 132217604 136034016 139692405 143239393 146456781
3707 146456781 149313203 151624101 153463590 154692677 155077693 154069638 152160008 148901879
3699 148901879 144202227 138234707 131538348 124773472 118026626 111686448 106338251 102302926
3691 102302926 99437159 97336441 96078732 95399421 94753554 93590213 91465240 88306215
3683 88306215 83859798 78695865 73256239 67763153 62517508 57642472 53699333 50229119
3675 50229119 47360436 44867650 42764366 40901476 39298433 37865884 36714367 35884657
3667 35884657 34993499 34346089 33899990 33463800 32991320 32503585 31923886 31199561 30389496
$$ packed form
3723A03184930M39338Q04121J393093J526723J816149K094775K756854L212760
3715A17228743L480465L742830L846127L919439L816412L658389L546988L217388
3707A46456781K856422K310898J839489J229087L85016j008055j909630l258129
3699A48901879m699652n967520o696359o764876o746846o340178n348197m035325
3691A02302926k865767k100718j257709o79311o45867j163341k124973l159025
3683H8306215m446417n163933n439626n493086n245645m875036l943139l470214
3675E0229119k868683k492786k103284j862890j603043j432549j151517q29710
3667C5884657q91158o47410m46099m36190m72480m87735n79699p24325q10065
$$ plain form
3658 30389496 29639219 28868055 27974572 26805052 25858350 25138759 24394209 23607720 23087886
3649 23087886 22519579 21941965 21341655 20820811 20479619 20172289 19677559 19392549 18778761
3640 18778761 18208075 17590176 16947266 16527361 16061046 15721266 15379383 15176241 14747035
3631 14747035 14344510 14163752 13753199 13506957 13465197 13275563 13211279 13096990 12854449 12746190
3621 12746190 12612579 12335269 12151354 12223132 12312187 12535613 12382482 12053089 11946056 11912915
3611 11912915 11804337 11721283 11491876 11129353 10966533 10758426 10451438 10451447 10321897 10001378
3601 10001378 9722390 9592276 9564694 9441850 9309016 9295060 9242813 9199395 9178792 9103424
3591 9103424 9024458 8875753 8951210 8786737 8835105 8865066 8815857 8900678 8877016 8715553 8621194
$$ packed form
3658C0389496p50277p71164q93483j169520r46702p19591p44550p86489n19834
3649B3087886n68307n77614o00310n20844l41192l07330m94730k85010o13788
3640A8778761n70686o17899o42910m19905m66315l39780l41883k03142m29206
3631A4747035m02525j80758m10553k46242m1760j89634o4284j14289k42541j08259
3621A2746190j33611k77310j83915P1778Q9055K23426j53131l29393j07033l3141
3611A1912915j08578q3054k29407l62523j62820k08107l06988Rj29550l20519
3601A0001378k78988j30114k7582j22844j32834j3956n2247m3418k0603p5368
3591I103424p8966j48705P5457j64473M8368K9961m9209Q4821k3662j61463r4359
$$ plain form
3580 8621194 8646534 8640236 8577778 8498646 8516487 8716712 8616091 8450290 8508732 8414176 8484650
3569 8484650 8500318 8451578 8456165 8419170 8490781 8671345 8817753 8957279 8843895 8870423 8788614
3558 8788614 8897374 9071893 9204522 9346146 9384922 9346748 9316929 9395983 9525909 9672292
3548 9672292 9631777 9797335 9870420 9971346 9955227 10093994 10094571 10042665 10206649 10150563 10263750
3537 10263750 10470947 10491377 10581465 10616547 10799791 10943036 10933996 10940739 11117362 11246268 11049819
3526 11049819 11062487 11234853 11298061 11490820 11584451 11610202 11664502 11681201 11879883 11884115 11901256
3515 11901256 11981688 12007104 12095614 12414295 12359274 12247184 12505164 12637528 12743965 12875777
3505 12875777 13068825 13361121 13402113 13437648 13662922 13516305 13638383 13918582 14235511 14452336
$$ packed form
3580H621194K5340o298o2458p9132J7841K00225j00621j65801N8442r4556P0474
3569H484650J5668m8740M587l6995P1611J80564J46408J39526j13384K6528q1809
3558H788614J08760J74519J32629J41624L8776l8174k9819P9054J29926J46383
3548I672292m0515J65558P3085J00926j6119J38767N77n1906J63984n6086J13187
3537A0263750K07197K0430R0088L5082J83244J43245r040O743J76623J28906j96449
3526A1049819J2668J72366O3208J92759R3631K5751N4300J6699J98682M232J7141
3515A1901256Q0432K5416Q8510L18681n5021j12090K57980J32364J06437J31812
3505A2875777J93048K92296M0992L5535K25274j46617J22078K80199L16929K16825
$$ plain form
3495 14452336 14495754 14693943 14873796 14857113 15132242 15288695 15385004 15606095 15942227 16309254
3485 16309254 16417303 16604032 16805443 17060168 17511962 17798354 18273586 18618093 18885591
3476 18885591 19128518 19291679 19605456 19998210 20423577 20872826 21167350 21569092 22062378
3467 22062378 22332459 22922876 23336859 23717038 24268677 24896801 25461695 26066499 26625535
3458 26625535 27320748 28148882 29035268 29844527 30768380 31563178 32584748 33380174 34349073
3449 34349073 35508451 36671084 37803304 39045353 40525632 41852149 43289171 44859901
3441 44859901 46563056 48197015 50202527 52298985 54815122 57533361 60684467 64126143
3433 64126143 67985240 72302248 77104017 82482065 88493480 95152908 102435755 111114104
$$ packed form
3495A4452336M3418J98189J79853j6683K75129J56453R6309K21091L36132L67027
3485A6309254J08049J86729K01411K54725M51794K86392M75232L44507K67498
3476A8885591K42927J63161L13777L92754M25367M49249K94524M01742M93286
3467B2062378K70081N90417M13983L80179N51639O28124N64894O04804N59036
3458B6625535O95213Q28134Q86386Q09259R23853P94798J021570P95426R68899
3449C4349073J159378J162633J132220J242049J480279J326517J437022J570730
3441D4859901J703155J633959K005512K096458K516137K718239L151106L441676
3433F4126143L859097M317008M801769N378048O011415O659428P282847Q678349
$$ plain form
3425 111114104 121186024 133230012 147516265 164318514 183412181 204121694 224769180
3418 224769180 242578241 254856423 259060066 253621524 240555722 221784644 198392545
3411 198392545 174125050 152444637 134657842 120608461 109327424 99945695 92102458
3404 92102458 85529431 79780147 74876489 70605747 66968264 63744768 60955888 58524428
3396 58524428 56341292 54377461 52640232 51215964 50112335 49047786 48068134 47210682
3388 47210682 46383210 45886704 45407004 45057014 44645484 44364306 43869823 43602215 43387728
3379 43387728 43008614 42688003 42421421 42261220 42160065 42174415 42134324 42191394 42413108 42499757
3369 42499757 42865279 43528609 43932869 44546775 45311058 46177221 47232801 48316395 49783954
$$ packed form
3425A11114104J0071920J2043988J4286253J6802249J9093667K0709513K0647486
3418B24769180J7809061J2278182M203643n438542j3065802j8771078k3392099
3411A98392545k4267495k1680413j7786795j4049381j1281037r381729p843237
3404I2102458o573027n749284m903658m270742l637483l223496k788880k431460
3396E8524428k183136j963831j737229j424268j103629j064549r79652q57452
3388D7210682q27472m96506m79700l49990m11530k81178m94483k67608k14487
3379D3387728l79114l20611k66582j60201j01155J4350m0091N7070K21714Q6649
3369D2499757L65522O63330M04260O13906P64283Q66163J055580J083594J467559
$$ plain form
3360 49783954 51272448 53103238 55441606 58034986 61009013 64160216 67502595 70986844
3352 70986844 74437250 77439080 79687775 80819016 81072285 80432848 78894600 76748722
3344 76748722 74624095 72817468 71404185 70641737 70109784 70170066 70483593 71146976 72233377
3335 72233377 73854993 75739632 78125423 80973194 84425943 88361621 92841913 98209691
3327 98209691 104538005 111691085 120001480 129438239 140141600 152124642 165624451 180854341
3319 180854341 196989312 213870317 231059600 248154295 264794806 280708564 293978587
3312 293978587 303136249 307661881 306118386 296895424 281305302 260864716 236401830 210369887
3304 210369887 185488143 163133250 144189633 129034497 117385186 108146122 100658492
$$ packed form
3360D9783954J488494J830790K338368K593380K974027L151203L342379L484249
3352G0986844L450406L001830K248695J131241K53269o39437j538248k145878
3344G6748722k124627j806627j413283p62448n31953O0282L13527O63383J086401
3335G2233377J621616J884639K385791K847771L452749L935678M480292N367778
3327I8209691O328314P153080Q310395R436759J0703361J1983042J3499809J5229890
3319A80854341J6134971J6881005J7189283J7094695J6640511J5913758J3270023
3312B93978587R157662M525632j543495r222962j5590122k0440586k4462886k6031943
3304B10369887k4881744k2354893j8943617j5155136j1649311r239064p487630
$$ plain form
3297 100658492 94332480 88941208 84492914 81015628 78173759 76153552 74645603 74072949
3289 74072949 74033455 74134251 74123257 73681079 72838921 71252804 68953033 65823909 62254991
3280 62254991 58313315 54175340 50258788 46607993 43463557 40962393 38857798 36813105
3272 36813105 34663569 32969822 31591396 30110924 28632577 27565439 26404250 25378562
3264 25378562 24626015 23749369 22853380 22058646 21389807 20706519 20213459 19592824 19057886
3255 19057886 18570185 18148561 17575388 17038397 16576103 16303158 15992336 15720926 15267961
3246 15267961 15103230 15076720 14799273 14511363 14247773 14094190 13971905 13979070 13616441 13335340
3236 13335340 13009051 12821397 12595217 12231784 11832927 11631490 11746570 11737250 11574987 11266030
$$ packed form
3297A00658492o326012n391272m448294l477286k841869k020207j507949n72654
3289G4072949l9494J00796j0994m42178q42158j586117k299771l129124l568918
3280F2254991l941676m137975l916552l650795l144436k501164k104595k044693
3272C6813105k149536j693747j378426j480472j478347j067138j161189j025688
3264B5378562p52547q76646q95989p94734o68839o83288m93060o20635n34938
3255A9057886m87701m21624n73173n36991m62294k72945l10822k71410m52965
3246A5267961j64731k6510k77447k87910k63590j53583j22285P165l62629k81101
3236A3335340l26289j87654k26180l63433l98857k01437J15080r320j62263l08957
$$ plain form
3226 11266030 10956604 10908746 10678105 10696571 10500761 10482607 10557222 10514871 10404188 10212636
3216 10212636 9989044 9841624 9745610 9656860 9588417 9573876 9371734 9116374 8740573 8477664
3206 8477664 8413546 8245646 8214150 8150833 8048957 7838357 7642463 7615032 7417733 7268168
3196 7268168 7280182 7259719 7233241 7239457 7107401 6687664 6619331 6796700 6773083 6759492 6672947
3185 6672947 6673125 6653861 6482707 6282393 6294948 6439296 6418779 6546721 6506799 6575885 6571628
3174 6571628 6577693 6523525 6453056 6286976 6444016 6531284 6543060 6520849 6240741 6181719 6449994
3163 6449994 6575628 6302843 6502987 6643332 6755162 6972151 6969120 6831746 6756005 6910990
3153 6910990 7218697 7338478 7330990 7385579 7393210 7542930 7595412 7640053 7764129 8145998 8623190
$$ packed form
3226A1266030l09426m7858k30641J8466j95810j8154P4615m2351j10683j91552
3216A0212636k23592j47420r6014q8750o8443j4541k02142k55360l75801k62909
3206H477664o4118j67900l1496o3317j01876k10600j95894k7431j97299j49565
3196G268168J2014k0463k6478O216j32056m19737o8333J77369k3617j3591q6545
3185F672947J78j9264j71154k00314J2555J44348k0517J27942l9922O9086m257
3174F571628O065n4168p0469j66080J57040Q7268J1776k2211k80108n9022K68275
3163F449994J25634k72785K00144J40345J11830K16989l031j37374p5741J54985
3153F910990L07707J19781p488N4589P631J49720N2482M4641J24076L81869M77192
$$ plain form
3142 8623190 8846757 9090527 9317224 9784785 10078168 10432252 10830578 11004448 11410756 11749765
3132 11749765 12211236 12440080 12721153 13188306 13952344 15070582 16290328 17887008 19798279
3123 19798279 21852638 23788215 25340447 26249342 26038907 25080820 23655309 21569457 19094696
3114 19094696 16803954 15277517 14043462 13262306 12784541 12383728 12107925 11797621 11272503
3105 11272503 10828180 10327717 9883885 9560444 9329937 9058453 8618510 8458839 8464829 8161169
3095 8161169 8123512 8204094 8273176 8245987 8097509 7916796 7729450 7563685 7371866 7359067
3085 7359067 7191473 7223585 7155264 7150809 7060455 7037879 7070031 7027308 7078163 6911363 6739033
3074 6739033 6646707 6580132 6617669 6551767 6178086 6029731 6342212 6342358 6421822 6268693 6323740
$$ packed form
3142H623190K23567K43770K26697M67561K93383L54084L98326J73870M06308L39009
3132A1749765M61471K28844K81073M67153P64038J118238J219746J596680J911271
3123A9798279K054359J935577J552232R08895k10435r58087j425511k085852k474761
3114A9094696k290742j526437j234055p81156m77765m00813k75803l10304n25118
3105A1272503m44323n00463m43832l23441k30507k71484m39943j59671N990l03660
3095H161169l7657Q0582O9082k7189j48478j80713j87346j65765j91819j2799
3085G359067j67594L2112o8321m455r0354k2576L2152m2723N0855j66800j72330
3074F739033r2326o6575L7537o5902l73681j48355L12481J46P9464j53129N5047
$$ plain form
3063 6323740 6489896 6512719 6467720 6623679 7012194 7631944 8186313 8626455 9093290 9454634
3053 9454634 9396320 9131237 8822952 8441003 7934341 7507733 7249315 6985887 6722252 6564425
3043 6564425 6613883 6650308 6880281 6880896 6833888 6866215 6834719 6786790 6577501 6364931 6453120
3032 6453120 6757115 6926737 6792549 7013370 7121059 7272474 7498986 7593015 7667557 7846864
3022 7846864 8042337 8136584 8286917 8329002 8279558 8319622 8628080 8769068 9015311 9318865
3012 9318865 9584235 9767421 9987234 10185179 10352747 10887530 11128896 11205571 11348317 11315522
3002 11315522 11432466 11583080 11538605 11856481 12010284 12299095 12659082 12912136 13214518 13593323
2992 13593323 14029777 14470316 14867343 15344692 16032492 16844453 17527603 18096657 18521110
$$ packed form
3063F323740J66156K2823m4999J55959L88515O19750N54369M40142M66835L61344
3053I454634n8314k65083l08285l81949n06662m26608k58418k63428k63635j57827
3043F564425M9458L6425K29973O15m7008L2327l1496m7929k09289k12570Q8189
3032F453120L03995J69622j34188K20821J07689J51415K26512R4029P4542J79307
3022G846864J95473R4247J50333M2085m9444M0064L08458J40988K46243L03554
3012I318865K65370J83186K19813J97945J67568N34783K41366P6675J42746l2795
3002A1315522J16944J50614m4475L17876J53803K88811L59987K53054L02382L78805
2992A3593323M36454M40539L97027M77349O87800Q11961O83150N69054M24453
$$ plain form
2983 18521110 18902494 19451702 19831101 20321557 20754098 21028825 21846639 22466910 23314370
2974 23314370 24392787 25675942 26895604 28143699 29192337 30079972 30660233 30909558 30784862
2965 30784862 30473399 30230970 29972310 30172177 30496682 31044595 31715450 32872149 33998018
2956 33998018 35073811 36217108 36704512 36660568 36432096 35741267 34683383 33378579 32042484
2947 32042484 31289716 30525699 30135320 30022859 29867355 29958503 30225857 30678061 30754687 30365002
2937 30365002 29693375 28835538 27415208 25775776 24319865 22954906 21897899 21106699 20250893
2928 20250893 19762621 19320298 18975738 18750411 18315560 17829200 17256713 16462734 15743452
2919 15743452 14645237 13827498 13065256 12309386 11396964 10759520 10289228 9876954 9621850
$$ packed form
2983A8521110L81384N49208L79399M90456M32541K74727Q17814O20271Q47460
2974B3314370J078417J283155J219662J248095J048638Q87635N80261K49325j24696
2965C0784862l11463k42429k58660J99867L24505N47913O70855J156699J125869
2956C3998018J075793J143297M87404m3944k28472o90829j057884j304804j336095
2947C2042484p52768p64017l90379j12461j55504R1148K67354M52204P6626l89685
2937C0365002o71627q57837j420330j639432j455911j364959j057007p91200q55806
2928B0250893m88272m42323l44560k25327m34851m86360n72487p93979p19282
2919A5743452j098215q17739p62242p55870r12422o37444m70292m12274k55104
$$ plain form
2910 9621850 9219080 9039688 8636107 8220546 7856054 7477048 7140691 6944926 6702426 6481519
2900 6481519 6359139 5958279 5859354 5819927 5660070 5575454 5341048 5117232 5144046 4992949
2890 4992949 4950057 4820506 4769863 4621896 4509672 4528158 4470114 4388673 4247213 4212682 4067402
2879 4067402 3984870 3756715 3687361 3779812 3794620 3655973 3692073 3620834 3644324 3469257 3467501
2868 3467501 3425403 3254366 3300851 3335429 3257405 3183166 3036500 3083713 3013821 3174324 3309609
2857 3309609 3064615 3119794 3117754 3007013 2862204 3122062 3210943 3251167 3230003 3096787 2984175
2846 2984175 2919442 3074116 3234414 3084476 3003031 3279923 3289336 3226123 3210853 3061481 3100367
2835 3100367 3199637 3148767 3244463 3268189 3187040 3030888 3100426 3286070 3120209 2927801 3003915
$$ packed form
2910I621850m02770j79392m03581m15561l64492l79006l36357j95765k42500k20907
2900F481519j22380m00860r8925l9427j59857q4616k34406k23816K6814j51097
2890D992949m2892j29551n0643j47967j12224J8486n8044q1441j41460l4531j45280
2879D067402q2532k28155o9354R2451J4808j38647L6100p1239K3490j75067j756
2868C467501m2098j71037M6485L4578p8024p4239j46666M7213o9892J60503J35285
2857C309609k44994N5179k040j10741j44809K59858Q8881M0224k1164j33216j12612
2846B984175o4733J54674J60298j49938q1445K76892R413o3213j5270j49372L8886
2835C100367R9270n0870R5696K3726q1149j56152O9538J85644j65861j92408P6114
$$ plain form
2824 3003915 3155667 3141311 3047744 3023371 2888787 3029107 3134396 3067098 2972211 2889730 2928243
2813 2928243 2858974 2657489 2679314 2749839 2648119 2734128 2840440 2801283 2702702 2628003 2535759
2802 2535759 2573102 2632420 2821692 2758890 2637589 2572801 2530906 2625243 2555930 2611780 2625754
2791 2625754 2658252 2741416 2864159 2999740 2811098 2654398 2598163 2541083 2633992 2597054 2710419
2780 2710419 2809316 2829343 2824842 2762311 2737601 2719182 2805584 2930200 3063486 3025149 2901624
2769 2901624 2891405 2933662 2851854 2931594 2847525 2988813 3071335 2904628 2928989 2959978 2884939
2758 2884939 2963440 3055153 3093282 3180963 3111763 3129115 3168135 3137248 3174629 3221762 3218451 3275934
2746 3275934 3454542 3491894 3496302 3642917 3553807 3509941 3507027 3719242 3862102 3971027 3967362
$$ packed form
2824C003915J51752j4356r3567k4373j34584J40320J05289o7298r4887q2481L8513
2813B928243o9269k01485K1825P0525j01720Q6009J06312l9157r8581p4699r2244
2802B535759L7343N9318J89272o2802j21301o4788m1895R4337o9313N5850J3974
2791B625754L2498Q3164J22743J35581j88642j56700n6235n7080R2909l6938J13365
2780B710419R8897K0027m501o2531k4710j8419Q6402J24616J33286l8337j23525
2769B901624j0219M2257q1808P9740q4069J41288Q2522j66707K4361L0989p5039
2758B884939P8501R1713L8129Q7681o9200J7352L9020l0887L7381M7133l311N7483
2746C275934J78608L7352M408J46615q9110m3866k914K12215J42860J08925l665
$$ plain form
2735 3967362 3953889 4167876 4397267 4440379 4622166 4637899 4796530 5126553 5186319 5211733
2725 5211733 5498524 5742402 5944006 6246398 6492727 6658085 6757222 6979989 7145574 7300559
2715 7300559 7380517 7165500 7199990 7358922 7441950 7306742 7273541 7331431 7135725 7168396 7324104
2704 7324104 7537446 7578102 7371567 7307533 7162900 6920560 6883325 6870161 6677605 6311028
2694 6311028 6015573 5856023 5660242 5542064 5475000 5514431 5394344 5118838 5046650 4964581
2684 4964581 4762929 4644661 4772744 4701037 4757608 4639945 4559664 4603563 4728700 4730599 4691528
2673 4691528 4563801 4635354 4788273 4956940 5020558 5123341 5115292 5062319 5063505 4998397 5169271
2662 5169271 5271148 5185895 5277408 5317964 5358977 5646066 5644164 5688361 5812868 5794640 5826420
$$ packed form
2735C967362j3473K13987K29391M3112J81787J5733J58631L30023N9766K5414
2725E211733K86791K43878K01604L02392K46329J65358R9137K22767J65585J54985
2715G300559P9958k15017L4490J58932Q3028j35208l3201N7890j95706L2671J55708
2704G324104K13342M0656k06535o4034j44633k42340l7235j3164j92556l66577
2694F311028k95455j59550j95781j18178o7064L9431j20087k75506p2188q2069
2684D964581k01652j18268J28083p1707N6571j17663q0281M3899J25137J899l9071
2673D691528j27727P1553J52919J68667O3618J02783q049n2973J186o5108J70874
2662E169271J01877q5253R1513M0556M1013K87089j902M4197J24507j8228L1780
$$ plain form
2651 5826420 6030136 6269767 6192457 6262457 6436872 6525686 6599423 6861198 6986050 7088259
2641 7088259 7318544 7492358 7614231 7617924 7605926 7572905 7532145 7728964 7531740 7416781
2631 7416781 7546687 7431572 7332486 7398907 7420151 7298230 7424574 7377732 7319702 7294536 7396628
2620 7396628 7483506 7392699 7395041 7495486 7679376 7789102 7732661 7837918 8022142 8115950 8095551
2609 8095551 8015203 8158591 8290374 8287240 8345663 8512229 8639565 8735319 8946317 9017552 9087483
2598 9087483 9266043 9366419 9263189 9453689 9712519 9921271 9901089 10274501 10503487 10464634
2588 10464634 10491163 10733015 10886778 11054944 11248782 11422110 11561094 11646278 11894685 12090100
2578 12090100 12305336 12421524 12566359 12737948 13022162 13440014 13477387 13669427 14011029 14253070
$$ packed form
2651E826420K03716K39631p7310P0000J74415Q8814P3737K61775J24852J02209
2641G088259K30285J73814J21873L693j1998l3021m0760J96819j97224j14959
2631G416781J29906j15115r9086O6421K1244j21921J26344m6842n8030k5166J02092
2620G396628Q6878r0807K342J00445J83890J09726n6441J05257J84224R3808k0399
2609H095551q0348J43388J31783l134N8423J66566J27336R5754K10998P1235O9931
2598I087483J78560J00376j03230J90500K58830K08752k0182L73412K28986l8853
2588A0464634K6529K41852J53763J68166J93838J73328J38984Q5184K48407J95415
2578A2090100K15236J16188J44835J71589K84214M17852L7373J92040L41602K42041
$$ plain form
2568 14253070 14472381 14678951 15127021 15463405 15808690 16169980 16595692 17046782 17502975
2559 17502975 17959372 18333033 18851141 19463299 19969212 20754385 21475277 22150331 22960113
2550 22960113 23769915 24845325 25790509 26748881 28093007 29608939 31184010 32973607 34851015
2541 34851015 37251430 39626450 42279470 45573204 49077949 52898314 56981995 61613527
2533 61613527 66621781 71972486 77419140 82788499 87772835 92585691 96631560 99837958
2525 99837958 102244307 103537645 103840820 103450162 102482324 101151041 99618672 98263712 97265460
2516 97265460 96367652 96139950 95745556 95420709 94915516 94042207 92601157 90383269 87494150
2507 87494150 83788017 79539322 74685395 69437470 64016811 59144589 54565737 50172064
$$ packed form
2568A4253070K19311K06570M48070L36384L45285L61290M25712M51090M56193
2559A7502975M56397L73661N18108O12158N05913P85173P20892O75054Q09782
2550B2960113Q09802J075410R45184R58372J344126J515932J575071J789597J877408
2541C4851015K400415K375020K653020L293734L504745L820365M083681M631532
2533F1613527N008254N350705N446654N369359M984336M812856M045869L206398
2525I9837958K406349J293338L03175l90658r67838j331283j532369j354960r98252
2516I7265460q97808k27702l94394l24847n05193q73309j441050k217888k889119
2507H7494150l706133m248695m853927n247925n420659m872222m578852m393673
$$ plain form
2499 50172064 46234878 42509706 39313249 36728899 34321783 32188659 30303530 28825725
2491 28825725 27386083 26152328 25072135 24041665 23175737 22305781 21565498 21010842 20557112
2482 20557112 20124086 19491160 18997525 18712281 18436512 18088117 17771258 17558468 17471847 17209680
2472 17209680 16950855 16836735 16690138 16423466 16238060 16295564 16217721 16313402 16180413 15922512
2462 15922512 15875874 15736219 15595771 15631311 15490701 15476558 15468054 15380264 15307759 15129160 15203405
2451 15203405 15295432 15231782 15142746 15299982 15159157 15163282 15113882 15170748 15256268 15077256 14998815
2440 14998815 15231878 15306225 15079717 15068582 15072794 15068956 15010814 15161002 15188961 14895802 15074004
2429 15074004 14960998 14961272 14966577 14918699 15056314 15033685 15323022 15572451 15670814 15728116 15577234
$$ packed form
2499E0172064l937186l725172l196457k584350k407116k133124j885129j477805
2491B8825725j439642j233755j080193j030470q65928q69956p40283n54656m53730
2482B0557112m33026o32926m93635k85244k75769l48395l16859k12790q6621k62167
2472A7209680k58825j14120j46597k66672j85406N7504p7843R5681j32989k57901
2462A5922512m6638j39655j40448L5540j40610j4143q504q7790p2505j78599P4245
2451A5203405R2027o3650q9036J57236j40825M125m9400N6866Q5520j79012p8441
2440A4998815K33063P4347k26508j1135M212l838n8142J50188K7959k93159J78202
2429A5074004j13006K74N305m7878J37615k2629K89337K49429R8363N7302j50882
$$ plain form
2418 15577234 15515276 15579186 15787026 16105758 16293786 16355594 16447751 16619776 16524414 16610846
2408 16610846 16716716 16735093 16903948 17283386 17450641 17588315 17571955 17779166 17963313 18181201
2398 18181201 18664748 18894060 19060481 19281301 19689065 19953979 20126283 20453758 20710363
2389 20710363 21140512 21405597 21930951 22164103 22247009 22421356 22697841 22890614 23161209 23481355
2379 23481355 23844800 24109772 24666556 25345014 25825165 26361710 27087150 27847722 28586188
2370 28586188 29449545 30314208 31174470 31976949 32846080 33936990 34980299 36015520 37305833
2361 37305833 38486665 40077330 41697950 43074021 44874284 46879968 49050762 51346272
2353 51346272 53905846 56718799 59737586 63313182 67197991 71793496 76922544 82655296
$$ packed form
2418A5577234o1958O3910K07840L18732J88028O1808R2157J72025r5362Q6432
2408A6610846J05870J8377J68855L79438J67255J37674j6360K07211J84147K17888
2398A8181201M83547K29312J66421K20820M07764K64914J72304L27475K56605
2389B0710363M30149K65085N25354K33152Q2906J74347K76485J92773K70595L20146
2379B3481355L63445K64972N56784O78458M80151N36545P25440P60572P38466
2370B8586188Q63357Q64663Q60262Q02479Q69131J090910J043309J035221J290313
2361C7305833J180832J590665J620620J376071J800263K005684K170794K295510
2353E1346272K559574K812953L018787L575596L884809M595505N129048N732752
$$ plain form
2345 82655296 89111775 96512706 104719440 114100323 124476950 135946443 148865073 163141842
2337 163141842 178362612 194395185 210790752 226905384 241914959 254816332 264480369
2330 264480369 270299742 271556624 267621951 259216696 246867851 231548215 214127087 195856077
2322 195856077 177856245 160648307 144682526 130575496 118241047 107190703 97643459
2315 97643459 89487752 82375362 76167177 70791746 66111372 62144275 58631936 55609008
2307 55609008 52829932 50366877 48121996 46163043 44586945 42964736 41595397 40449681
2299 40449681 39249776 38436722 37467901 36390322 35640223 34967804 34375430 33800597 33219474
2290 33219474 32685921 32095829 31741863 31502637 31227569 31073072 30937006 30788200 30601697
$$ packed form
2345H2655296O456479P400931Q206734R380883J0376627J1469493J2918630J4276769
2337A63141842J5220770J6032573J6395567J6114632J5009575J2901373R664037
2330B64480369N819373J256882l934673q405255j2348845j5319636j7421128j8271010
2322A95856077j7999832j7207938j5965781j4107030j2334449j1050344r547244
2315I7643459q155707p112390o208185n375431m680374l967097l512339l022928
2307E5609008k779076k463055k244881j958953j576098j622209j369339j145716
2299D0449681j199905q13054r68821j077579p50099o72419n92374n74833n81123
2290C3219474n33553n90092l53966k39226k75068j54497j36066j48806j86503
$$ plain form
2281 30601697 30404849 30293336 30403840 30472180 30576631 30675567 30739298 30804003 30914797 31033234
2271 31033234 31224259 31489562 31683860 32034572 32432601 32814117 33338741 33772790 34316103
2262 34316103 34884063 35548142 36186793 36653542 36972972 37168196 37259734 37166706 37032717 37091105
2252 37091105 37102962 37054060 36949196 37037713 37028406 36863572 37100507 37140559 37160985 37352343 37519415
2241 37519415 37462377 37255687 37049888 36698050 36393894 36148708 35753966 35466471 35271269 35393269
2231 35393269 35343912 35275132 35438498 35620729 35972639 36358042 36847515 37315947 37858214 38479231
2221 38479231 39442495 40316021 41082655 42248611 43333947 44429825 45967918 47706818 49700359
2212 49700359 51744923 54009094 56535031 59562831 62808327 66323724 70254359 74234617
$$ packed form
2281C0601697j96848j11513J10504O8340J04451R8936O3731O4705J10794J18437
2271C1033234J91025K65303J94298L50712L98029L81516N24624M34049N43313
2262C4316103N67960O64079O38651M66749L19430J95224R1538r3028j33989N8388
2252C7091105J1857m8902j04864Q8517r307j64834K36935M0052K0426J91358J67072
2241C7519415n7038k06690k05799l51838l04156k45186l94742k87495j95202J22000
2231C5393269m9357o8780J63366J82231L51910L85403M89473M68432N42267O21017
2221C8479231R63264Q73526P66634J165956J085336J095878J538093J738900J993541
2212D9700359K044564K264171K525937L027800L245496L515397L930635L980258
$$ plain form
2204 74234617 78357765 82527998 86615928 90789334 94584645 97752964 100550960 102919952
2196 102919952 104936386 106386468 107471427 108589954 109683893 110814699 112122639 113637749
2188 113637749 115399391 117368142 119559565 121819273 124064084 126059147 127876460 129322504
2180 129322504 130166036 130695653 130670504 130076673 129175713 127996454 126340128 124296133 122058570
2171 122058570 119685806 117365131 114797091 112342065 110249120 108294907 106712802 105268569
2163 105268569 103639930 102006647 100321295 98605801 96374825 93611578 90542653 86987356
2155 86987356 83002138 78627028 74146490 69628780 65353430 61062751 57209852 53600462
2147 53600462 50273859 47340160 44680485 42398857 40259030 38552866 37020728 35506315
$$ packed form
2204G4234617M123148M170233M087930M173406L795311L168319K797996K368992
2196A02919952K016434J450082J084959J118527J093939J130806J307940J515110
2188A13637749J761642J968751K191423K259708K244811J995063J817313J446044
2180A29322504Q43532N29617k5149n93831r00960j179259j656326k043995k237563
2171A22058570k372764k320675k568040k455026k092945j954213j582105j444233
2163A05268569j628639j633283j685352j715494k230976k763247l068925l555297
2155H6987356l985218m375110m480538m517710m275350m290679l852899l609390
2147E3600462l326603k933699k659675k281628k139827j706164j532138j514413
$$ plain form
2139 35506315 34233835 33134927 32094438 31407577 30990503 30418631 29933083 29561365 29200941
2130 29200941 29218918 29261510 28938511 28516642 28321141 28341363 28344627 28194436 28061286 28140922
2120 28140922 28389136 28710414 29058345 29155225 29355178 29507684 29641849 29661200 29464105 29276449
2110 29276449 29111346 28786301 28683829 28465546 28082838 27959884 28138312 27976639 27787527
2101 27787527 27698514 27638916 27440480 27341976 27046033 26424346 26065838 25523658 24716091 23990736
2091 23990736 23154163 22443843 22121132 21806160 21170630 20631895 20302258 19958381 19820844
2082 19820844 19635878 19535395 19582914 19680019 19728330 19736391 19752450 19879089 20062241 19941154
2072 19941154 19916145 20063582 20171238 20371070 20387924 20376966 20194246 20268528 20235952 20182353
$$ packed form
2139C5506315j272480j098908j040489o86861m17074n71872m85548l71718l60424
2130B9200941J7977M2592l22999m21869j95501K0222L264j50191j33150P9636
2120B8140922K48214L21278L47931R6880J99953J52506J34165J9351j97095j87656
2110B9276449j65103l25045j02472k18283l82708j22954J78428j61673j89112
2101B7787527q9013n9598j98436r8504k95943o21687l58508n42180q07567p25355
2091B3990736q36573p10320l22711l14972o35530n38735l29637l43877j37537
2082A9820844j84966j00483M7519R7105M8311Q061J6059J26639J83152j21087
2072A9941154k5009J47437J07656J99832J6854j0958j82720P4282l2576n3599
$$ plain form
2062 20182353 20182336 20197367 20177785 20225907 20327441 20294851 20114931 19889181 19916465 20044925 19983609
2051 19983609 20127309 20224939 20201555 20338578 20769679 21025301 21352277 21847124 22162183 22508787
2041 22508787 22940703 23297265 23697150 24232181 25164505 25830635 26660533 27505106 28297964
2032 28297964 29126741 29995533 30872660 31950276 33084631 34338035 35688946 37284806 39257775
2023 39257775 41323506 43950609 46640660 49901621 53583566 57541753 62337661 67579763
2015 67579763 73111892 79111505 85433601 92028162 98563210 104784076 110543523 115878343
2007 115878343 120376793 123723419 125525517 125994497 124881598 122242854 117850859 112253847
1999 112253847 105606889 98533728 91274841 83903168 76579542 69628171 63301668 57856985
$$ packed form
2062B0182353j7J5031j9582M8122J01534l2590j79920k25750K7284J28460o1316
2051A9983609J43700R7630k3384J37023M31101K55622L26976M94847L15059L46604
2041B2508787M31916L56562L99885N35031R32324O66130Q29898Q44573P92858
2032B8297964Q28777Q68792Q77127J077616J134355J253404J350911J595860J972969
2023C9257775K065731K627103K690051L260961L681945L958187M795908N242102
2015F7579763N532129N999613O322096O594561O535048O220866N759447N334820
2007A15878343M498450L346626J802098M68980j112899k638744m391995n597012
1999A12253847o646958p073161p258887p371673p323626o951371o326503n444683
$$ plain form
1991 57856985 52824163 48104120 44142418 40798964 38001860 35410424 33094781 30948482
1983 30948482 29125107 27430686 26050094 24559201 23345902 22378533 21366778 20450973
1975 20450973 19569360 18923515 18268042 17661850 17286089 16725427 16216273 15822016 15358151
1966 15358151 15012419 14474733 13963656 13596997 13323988 13030203 12733082 12514629 12185197
1957 12185197 11972718 11940034 11698515 11324137 10965255 10982103 10811471 10646471 10705377 10672616
1947 10672616 10553248 10540862 10632821 10427387 10317873 10330503 10232929 10158097 9952893 9780806
1937 9780806 9675209 9572221 9358813 9161790 9149386 9142503 9080051 8942025 8881615 8973796 8821265
1926 8821265 8780569 8751972 8571903 8574607 8576668 8649768 8463713 8230158 8128869 8175780 8101195
$$ packed form
1991E7856985n032822m720043l961702l343454k797104k591436k315643k146299
1983C0948482j823375j694421j380592j490893j213299r67369j011755r15805
1975B0450973q81613o45845o55473o06192l75761n60662n09154l94257m63865
1966A5358151l45732n37686n11077l66659k73009k93785k97121k18453l29432
1957A2185197k12479l2684k41519l74378l58882J6848j70632j65000N8906l2761
1947A0672616j19368j2386R1959k05434j09514J2630r7574p4832k05204j72087
1937I780806j05597j02988k13408j97023j2404o883o2452j38026o0410R2181j52531
1926H821265m0696k8597j80069K704K061P3100j86055k33555j01289M6911p4585
$$ plain form
1915 8101195 8117793 8150809 8055639 8074233 7991874 7945441 7824576 7752374 7897860 8017269 8126435
1904 8126435 8240576 8166376 8287151 8390557 8393637 8255822 8086342 7973925 8125412 8111793
1894 8111793 8000303 8176708 8235689 8194422 8218248 8397451 8355411 8500002 8677354 8895626
1884 8895626 8932725 9012005 9026075 9138394 9243577 9442969 9606591 9801191 9982007 9954840
1874 9954840 9895223 9982074 10323205 10440178 10655517 10842490 10899045 10958841 10976850 11247467
1864 11247467 11405287 11382516 11417680 11550342 11705721 11733303 11817614 12040522 12122269 12306338
1854 12306338 12474083 12597176 12765760 12896751 13253650 13349495 13408125 13591430 13883851 14067181
1844 14067181 14073877 13990897 13957949 14080075 14175074 14382615 14391871 14317095 14447748 14638285 14854697
$$ packed form
1915H101195J6598L3016r5170J8594q2359m6433j20865p2202J45486J19409J09166
1904H126435J14141p4200J20775J03406L080j37815j69480j12417J51487j3619
1894H111793j11490J76405N8981m1267K3826J79203m2040J44591J77352K18272
1884H895626L7099P9280J4070J12319J05183J99392J63622J94600J80816k7167
1874I954840n9617Q6851L41131J16973K15339J86973N6555N9796J8009K70617
1864A1247467J57820k2771L5164J32662J55379K7582Q4311K22908Q1747J84069
1854A2306338J67745J23093J68584J30991L56899R5845N8630J83305K92421J83330
1844A4067181O696q2980l2948J22126R4999K07541R256p4776J30653J90537K16412
$$ plain form
1833 14854697 14953255 14950064 15094223 15064195 15345777 15432037 15645010 15794449 15944928 16304570
1823 16304570 16621206 16913597 17023430 17330252 17573018 17625801 17902612 18348651 18669273 18795584
1813 18795584 18992850 19319199 19498965 19935774 20311581 20585961 20942974 21495873 22049554
1804 22049554 22486995 22879261 23427190 23962261 24596606 25171380 25739595 26537883 27256422
1795 27256422 28165554 29147000 29925844 30916596 31943174 33203259 34533735 35977078 37316995
1786 37316995 38840275 40391727 42237656 44209083 46264092 48718400 51455223 54561775
1778 54561775 57734590 60495221 62935443 64710047 65477078 65430531 64933044 63940587 62944592
1769 62944592 62392388 62248795 62546379 62862226 63389480 64474030 65866237 67445850 69268326
$$ packed form
1833A4854697R8558l191J44159l0028K81582Q6260K12973J49439J50479L59642
1823A6304570L16636K92391J09833L06822K42766N2783K76811M46039L20622J26311
1813A8795584J97266L26349J79766M36809L75807K74380L57013N52899N53681
1804B2049554M37441L92266N47929N35071O34345N74774N68215P98288P18539
1795B7256422R09132R81446P78844R90752J026578J260085J330476J443343J339917
1786C7316995J523280J551452J845929J971427K055009K454308K736823L106552
1778E4561775L172815K760631K440222J774604P67031m6547m97487r92457r95995
1769F2944592n52204j43593K97584L15847N27254J084550J392207J579613J822476
$$ plain form
1760 69268326 71202052 73530537 75902996 78726447 82140781 85729563 89893547 94904430
1752 94904430 100789004 107646753 115367779 124233502 134186537 145177797 157149034 170851572
1744 170851572 186043647 203797989 224676068 249357643 279051708 314024126 353712786
1737 353712786 395966288 436674752 470917845 492991456 497266564 481572478 448832309
1730 448832309 403241026 351352825 302332713 260838400 227964947 201908573 180838299
1723 180838299 163267951 148213603 134774329 122843928 112175208 102918610 94859163
1716 94859163 87770901 81755380 76470412 71808053 67729289 63790008 60479259 57411838
1708 57411838 54731052 52124468 49780480 47876625 46004089 44196027 42517229 40988570
$$ packed form
1760F9268326J933726K328485K372459K823451L414334L588782M163984N010883
1752I4904430N884574O857749P721026Q865723R953035J0991260J1971237J3702538
1744A70851572J5192075J7754342K0878079K4681575K9694065L4972418L9688660
1737C53712786M2253502M0708464L4243093K2073611M275108j5694086l2740169
1730D48832309m5591283n1888201m9020112m1494313l2873453k6056374k1070274
1723A80838299j7570348j5054348j3439274j1930401j0668720r256598q059447
1716I4859163p088262o015521n284968m662359m078764l939281l310749l067421
1708E7411838k680786k606584k343988j903855j872536j808062j678798j528659
$$ plain form
1700 40988570 39242290 37711751 36325348 35025084 33621362 32249842 30899748 29727215
1692 29727215 28613646 27524151 26670058 25653319 24802311 23913850 23013811 22123363 21091807
1683 21091807 20444776 19792194 19150712 18459269 17822055 17252878 16870816 16433105 16112174
1674 16112174 15473145 15288826 15017921 14491381 14278534 14113944 13793616 13547314 13382748
1665 13382748 13212886 12973037 12643177 12212932 12064049 11909103 11790872 11678107 11631406 11471278
1655 11471278 11309677 11041699 10760190 10661052 10540972 10391884 10249442 10034934 9881996 9704177
1645 9704177 9563124 9619643 9392866 9395088 9338596 8954015 8920467 8910230 8737802 8486847 8176286
1634 8176286 7917371 7576803 7379456 7059617 6990973 7068439 6921415 6644437 6487197 6231121
$$ packed form
1700D0988570j746280j530539j386403j300264j403722j371520j350094j172533
1692B9727215j113569j089495q54093j016739q51008q88461r00039q90448j031556
1683B1091807o47031o52582o41482o91443o37214n69177l82062m37711l20931
1674A6112174o39029j84319k70905n26540k12847j64590l20328k46302j64566
1665A3382748j69862k39849l29860m30245j48883j54946j18231j12765m6701j60128
1655A1471278j61601k67978k81509r9138j20080j49088j42442k14508j52938j77819
1645I704177j41053N6519k26777K222n6492l84581l3548j0237j72428k50955l10561
1634H176286k58915l40568j97347l19839o8644P7466j47024k76978j57240k56076
$$ plain form
1624 6231121 6132118 6018768 5612349 5168703 5110761 5070280 4889327 4682688 4653996 4527340
1614 4527340 4359181 4257311 4180137 4204166 4320708 4217159 4103670 3797305 4000443 3819858
1604 3819858 3648205 3510545 3460612 3616170 3599162 3526274 3491036 3426725 3330424 3384046 3467697
1593 3467697 3324378 3229521 3216906 3126906 3160741 2965101 3000235 3047037 2988518 2889341 2974358
1582 2974358 2887115 2961239 3044987 3001189 3014246 2870102 2873786 3051908 2871694 2746871 2807200
1571 2807200 2873784 2847615 2737336 2727536 2783621 2754363 2758795 2669303 2610706 2521280 2640099
1560 2640099 2652320 2937064 2962110 2806174 2768849 2850572 2595492 2437152 2440690 2360524 2427637
1549 2427637 2238042 2070937 2024012 2056737 2172937 2185782 2123743 2107387 2015324 2022387 2118449
$$ packed form
1624F231121r9003j13350m06419m43646n7942m0481j80953k06639k8692j26656
1614D527340j68159j01870p7174K4029J16542j03549j13489l06365K03138j80585
1604C819858j71653j37660m9933J55558j7008p2888l5238o4311r6301N3622Q3651
1593C467697j43319r4857j2615r0000L3835j95640L5134M6802n8519r9177Q5017
1582B974358q7243P4124Q3748m3798J3057j44144L684J78122j80214j24823O0329
1571B807200O6584k6169j10279r800N6085k9258M432q9492n8597q9426J18819
1560B640099J2221K84744K5046j55936l7325Q1723k55080j58340L538q0166O7113
1549B427637j89595j67105m6925L2725J16200J2845o2039j6356r2063P063R6062
$$ plain form
1538 2118449 2252762 2145694 2062201 2019328 2175800 2440455 2305486 2115952 2187114 2074066
1528 2074066 2121249 2098616 2069082 2184088 2099091 1908148 2146077 2079416 1956226 1896669 1732713
1517 1732713 1836493 1893947 1866655 1794055 1741182 1835315 1642234 1561057 1692323 1795415 1665990
1506 1665990 1643741 1776829 1702113 1491703 1457505 1515069 1459867 1569863 1582178 1655346 1688877
1495 1688877 1817948 1657597 1309634 1333625 1297611 1318058 1459610 1427329 1166621 1154861
1485 1154861 1041669 1107260 1166945 979261 1018258 1133306 1176134 1180167 1213501 1137720 1363248
1474 1363248 1333132 1270965 1172125 1093523 1205386 1223006 1025609 951091 913406 858651 1023058
1463 1023058 1147990 1078284 885788 892903 1005196 1040799 1103313 1111040 1249962 1263953 1412123
$$ packed form
1538B118449J34313j07068q3493m2873J56472K64655j34969j89534P1162j13048
1528B074066M7183k2633k9534J15006q4997j90943K37929o6661j23190n9557j63956
1517A732713J03780N7454k7292p2600n2873R4133j93081q1177J31266J03092j29425
1506A665990k2249J33088p4716k10410l4198N7564n5202J09996J2315P3168L3531
1495A688877J29071j60351l47963K3991l6014K0447J41552l2281k60708j1760
1485A154861j13192O5591N9685j87684L8997J15048M2828M033L3334p5781K25528
1474A363248l0116o2167r8840p8602J11863J7620j97397p4518l7685n4755J64407
1463A023058J24932o9706j92496P115J12293L5603O2514P727J38922J3991J48170
$$ plain form
1452 1412123 1447169 1310452 1164992 1356040 1416381 1460038 1583060 1611804 1693427 1629376 1820806
1441 1820806 2107837 2124375 2086858 2209459 2407150 2741075 2781906 2907514 2962272 3046511
1431 3046511 3102695 3033376 2798742 2532156 2199898 2029207 1914548 1762177 1642692 1395750
1421 1395750 1365907 1425147 1358415 1152014 1059619 954046 1006989 1033865 1066342 1097238 862025
1410 862025 860783 933312 888067 844039 651798 692968 788726 775009 724314 741260 882410
1399 882410 819276 714547 810736 803555 792209 759704 850391 712360 516278 650121 831672
1388 831672 748302 767940 743513 605295 606418 536339 499627 437598 443092 394186 348250 387611
1376 387611 361420 338786 269023 247637 404011 501641 499909 323498 361429 371197 444233 341770
$$ packed form
1452A412123L5046j36717j45460J91048O0341M3657J23022K8744Q1623o4051J91430
1441A820806K87031J6538l7517J22601J97691L33925M0831J25608N4758Q4239
1431C046511N6184o9319k34634k66586l32258j70691j14659j52371j19485k46942
1421A395750k9843N9240o6732k06401r2395j05573N2943K6876L2477L0896k35213
1410H62025j242P2529m5245m4028j92241M1170R5758j3717n0695J6946J41150
1399H82410o3134j04729R6189p181j1346l2505R0687j38031j96082J33843J81551
1388H31672q3370J9638k4427j38218J123p0079l6712o2029N494m8906m5936L9361
1376C87611k6191k2634o9763k1386J56374R7630j732j76411L7931R768P3036j02463
$$ plain form
1364 341770 424033 738455 720758 397339 357669 556588 691138 555564 366855 173568
1354 173568 132194 331915 528264 435948 350800 507329 462912 503299 337917 334451 441869
1343 441869 535162 699097 669291 472915 396387 559616 515146 426936 238359 307344 239529
1332 239529 124965 248330 283809 320104 292035 235721 146859 240220 299009 233821 160599
1321 160599 -10628 -110536 40905 366080 511147 341309 195524 71264 125490 357049
1311 357049 307799 277616 199567 152430 200391 178283 55782 55518 27657 123512 334632 74611
1299 74611 -64761 28745 165828 26791 81820 16732 206377 371452 308149 379076 241584
1288 241584 166212 271016 288893 197288 132617 41252 175599 229567 322011 255091 51738
$$ packed form
1364C41770Q2263L14422j7697l23419l9670J98919J34550j35574j88709j93287
1354A73568m1374J99721J96349r2316q5148J56529m4417M0387j65382l466J07418
1343D41869R3293J63935k9806j96376p6528J63229m4470q8210j88577O8985o7815
1332B39529j14564J23365L5479L6295k8069n6314q8862R3361N8789o5188p3222
1321A60599j71227r9908J51441L25175J45067j69838j45785j24260N4226K31559
1311C57049m9250l0183p8049m7137M7961k2108j22501k64k7861R5855K11120k60021
1299G4611j39372R3506J37083j39037N5029o5088J89645J65075o3303P0927j37492
1288B41584p5372J04804J7877r1605o4671r1365J34347N3968R2444o6920k03353
$$ plain form
1277 51738 74448 144950 312925 328991 209992 135275 141495 117984 199535 275899 196659 253063
1265 253063 278058 247081 295628 324237 255058 356012 307064 397662 395513 417841 454876 362444
1253 362444 350155 334347 367432 406763 445483 356290 369495 364381 227104 205949 337051
1242 337051 413393 377145 229586 83808 130724 339413 371766 331070 291043 340928 228559
1231 228559 334545 160829 114346 142752 75161 196314 280949 292833 117874 157477 180849
1220 180849 181405 253628 -15656 11088 362406 395506 204445 109784 126720 184453 157466
1209 157466 -24287 -16991 165830 133333 422543 371732 259712 285003 279212 292548 174933
1198 174933 116100 249915 286318 302098 195932 97508 325069 330837 433634 387432 95769
$$ packed form
1277E1738K2710P0502J67975J6066j18999p4717O220k3511Q1551P6364p9240N6404
1265B53063K4995l0977M8547K8609o9179J00954m8948R0598k149K2328L7035r2432
1253C62444j2289j5808L3085L9331L8720q9193J3205n114j37277k1155J31102
1242C37051P6342l6248j47559j45778M6916K08689L2353m0696m0027M9885j12369
1231B28559J05986j73716m6483K8406o7591J21153Q4635J1884j74959L9603K3372
1220A80849N56P2223k69284K6744L51318L3100j91061r4661J6936N7733k6987
1209A57466j81753P296J82821l2497K89210n0811j12020K5291n791J3336j17615
1198A74933n8833J33815L6403J5780j06166r8424K27561N768J02797m6202k91663
$$ plain form
1187 95769 -79848 125357 105306 159300 111582 257475 306566 208780 226478 192190 243059
1176 243059 163627 89103 317099 362763 404195 243315 254652 390458 277494 134900 143433
1165 143433 355250 340344 218606 258990 276285 175761 173333 273888 449258 441339 395514
1154 395514 376245 316665 215195 196020 290922 312236 281907 170668 430229 398450 304923
1143 304923 174918 168537 201671 412631 426092 171987 198788 306585 547349 500411 378002
1132 378002 162641 301102 371707 373062 386853 325039 303314 388606 337432 200837 231409
1121 231409 351053 487226 353600 320778 299293 353513 694447 726647 585551 636089 531100
1110 531100 556308 513375 580440 610901 466703 557482 628650 787961 650055 693493 682022
$$ packed form
1187I5769j75617K05205k0051N3994m7718J45893M9091r7786J7698l4288N0869
1176B43059p9432p4524K27996M5664M1432j60880J1337J35806j12964j42594Q533
1165A43433K11817j4906j21738M0384J7295j00524k428J00555J75370p919m5825
1154C95514j9269n9580j01470j9175R4902K1314l0329j11239K59561l1779r3527
1143C04923j30005o381L3134K10960J3461k54105K6801J07797K40764m6938j22409
1132C78002k15361J38461P0605J355J3791o1814k1725Q5292n1174j36595L0572
1121B31409J19644J36173j33626l2822k1485N4220L40934L2200j41096N0538j04989
1110E31100K5208m2933O7065L0461j44198R0779P1168J59311j37906M3438j1471
$$ plain form
1099 682022 483274 590504 627435 713621 674608 827584 946109 816106 647691 718175
1089 718175 843441 808535 662718 899235 1075330 1090435 1236774 1012676 830161 824978
1079 824978 1041099 1205338 1119341 821635 781337 872364 794378 826557 965730 968224 1033510
1068 1033510 1004020 872710 866132 843769 840308 937356 946532 1067011 1090830 1186412 1166227 1098030
1056 1098030 1052438 1063744 1135934 1362219 1305063 1387646 1423802 1460217 1364788 1341277 1523179
1045 1523179 1553936 1397949 1241580 1238402 1165394 1256089 1365388 1244532 1082199 1019481 1240538
1034 1240538 1406751 1458945 1359734 1305598 1386141 1557103 1653922 1594878 1583937 1663632 1759758
1023 1759758 1725848 1703255 1774484 1789332 2028165 2052122 2081606 2019772 2096970 2242604 2350570
$$ packed form
1099F82022j98748J07230L6931Q6186l9013J52976J18525j30003j68415P0484
1089G18175J25266l4906j45817K36517J76095J5105J46339k24098j82515n183
1079H24978K16121J64239q5997k97706m0298R1027p7986L2179J39173K494O5286
1068A033510k9490j31310o578k2363l461R7048R176J20479K3819R5582k0185o8197
1056A098030m5592J1306P2190K26285n7156Q2583L6156L6415r5429k3511J81902
1045A523179L0757j55987j56369l178p3008R0695J09299j20856j62333o2718K21057
1034A240538J66213N2194r9211n4136Q0543J70962R6819n9044j0941P9695R6126
1023A759758l3910k2593P1229J4848K38833K3957K9484o1834P7198J45634J07966
$$ plain form
1012 2350570 2469202 2427448 2383207 2489985 2693096 2854470 3026665 3035090 3021230 2962670 3129767
1001 3129767 3221009 3265125 3418434 3743728 3835625 4026853 4351444 4760140 4982916 5201857
991 5201857 5335560 5603726 5948612 6362035 6623309 7002795 7418702 8161034 8780183 9445686
981 9445686 9995168 10932833 11702722 12450495 13435714 14773203 16431378 18753939 21500083
972 21500083 25109148 29335652 34838489 41085452 46681412 51543537 54727764 51629797
964 51629797 47064921 40982868 30921469 24037763 19844753 17074905 15127626 13512001
956 13512001 11984633 10912242 10140464 9366508 8609013 8153508 7736298 7227975 6764948
947 6764948 6370964 5858293 5302824 5042373 4853741 4364711 4313433 4121774 3995035 3765572
$$ packed form
1012B350570J18632m1754m4241J06778K03111J61374J72195Q425j3860n8560J67097
1001C129767R1242M4116J53309L25294R1897J91228L24591M08696K22776K18941
991E201857J33703K68166L44886M13423K61274L79486M15907P42332O19149O65503
981I445686N49482R37665P69889P47773R85219J337489J658175K322561K746144
972B1500083L609065M226504N502837O246963N595960M862125L184227l097967
964E1629797m564876o082053j0061399o883706m193010k769848j947279j615625
956A3512001j527368j072391p71778p73956p57495m55505m17210n08323m63027
947F764948l93984n12671n55469k60451j88632m89030n1278j91659j26739k29463
$$ plain form
937 3765572 3513932 3169431 3347681 3298695 3106174 2963206 2938647 2740802 2635066 2539459
927 2539459 2619986 2523445 2193821 1936055 1957096 2077579 2050513 1813171 1641367 1630281 1750150
916 1750150 1628694 1502792 1397471 1204810 1286337 1127814 1032671 877942 847956 1028727
906 1028727 1091966 1097175 1027373 937661 1109075 1071554 902944 869183 896439 994408 920489
895 920489 801591 946147 856822 773878 702704 835603 933727 903299 863582 797800 749425
884 749425 768039 894722 837925 717607 758183 790264 827049 754912 652005 569330 621924
873 621924 829064 851457 798353 737006 610532 670250 767154 675445 618322 495078 479284
862 479284 561774 574857 554809 332021 257035 396282 448329 472342 322817 282172 406759
$$ packed form
937C765572k51640l44501J78250m8986j92521j42968k4559j97845j05736r5607
927B539459Q0527r6541l29624k57766K1041J20483k7066k37342j71804j1086J19869
916A750150j21456j25902j05321j92661Q1527j58523r5143j54729k9986J80771
906A028727O3239N209o9802q9712J71414l7521j68610l3761K7256R7969p3919
895I20489j18898J44556q9325q2944p1174J32899R8124l0428l9717o5782m8375
884G49425J8614J26683n6797j20318M0576L2081L6785p2137j02907q2675N2594
873F21924K07140K2393n3104o1347j26474N9718R6904r1709n7123j23244j5794
862D79284Q2490J3083k0048k22788p4986J39247N2047K4013j49525m0645J24587
$$ plain form
851 406759 593912 419869 321626 527617 350280 389238 362249 262710 215405 246446 301814
840 301814 171464 293350 370537 237960 192879 143549 150698 75912 68483 139732 155644 144894
828 144894 167658 187315 284859 320289 290112 299796 243850 167645 287250 354476 246874 340263
816 340263 232287 176218 98512 -43800 35672 153147 227707 68145 -117222 -203479 6417
805 6417 210256 249726 233156 108113 86741 228862 119493 193493 190606 65266 48651
794 48651 36700 217780 278009 253389 140435 98028 217212 144531 221841 134328 95770
783 95770 292381 239344 201722 222972 224771 181459 139756 135567 132848 -149421 -75438 3995
771 3995 146367 178097 -89679 -91215 4759 167088 104527 193922 136871 180078 235504 193093
$$ packed form
851D06759J87153j74043r8243K05991j77337L8958k6989r9539m7305L1041N5368
840C01814j30350J21886P7187j32577m5081m9330P149p4786p429P1249J5912j0750
828A44894K2764J9657R7544L5430l0177R684n5946p6205J19605O7226j07602R3389
816C40263j07976n6069p7706j42312P9472J17475P4560j59562j85367q6257K09896
805F417K03839L9470j6570j25043k1372J42121j09369P4000k887j25340j6615
794D8651j1951J81080O0229k4620j12954m2407J19184p2681P7310q7513l8558
783I5770J96611n3037l7622K1250J799m3312m1703m189k719k82269P3983P9433
771C995J42372L1730k67776j536R5974J62329o2561Q9395n7051M3207N5426m2411
$$ plain form
759 193093 126553 -21846 -99767 80380 212385 174361 92154 132087 174031 128421 184051
748 184051 14449 19562 18025 26024 104736 -10935 2043 12792 22710 142104 122970 37088
736 37088 -90001 111283 151183 167086 -51706 -176856 -314216 -66017 195142 45356
726 45356 136600 159839 46839 137232 62038 48917 -15626 -135069 -187896 -61585 19965
715 19965 -57002 -117289 -198015 1985 -117719 -68131 -16731 146978 -185584 -388068 -365948
704 -365948 -228168 -110572 35141 92047 153991 11203 107898 143798 -124329 -174903 -129633
693 -129633 96307 8272 -100165 -103737 26360 -19380 -99914 -65511 148421 125400 54984
682 54984 120433 213163 90403 145893 216020 239355 163095 176218 97632 246535 242150 35798
$$ packed form
759A93093o6540j48399p7921J80147J32005l8024q2207L9933M1944m5610N5630
748A84051j69602N113j537P999P8712j15671J2978J0749R918J19394j9134q5882
736C7088j27089K01284L9900J5903k18792j25150j37360K48199K61159j49786
726D5356R1244K3239j13000R0393p5194j3121o4543j19443n2827J26311Q1550
715A9965p6967o0287q0726K00000j19704M9588N1400J63709l32562k02484K2120
704c65948J37780J17596J45713N6906O1944j42788R6695L5900k68127n0574M5270
693a29633K25940q8035j08437l572J30097m5740q0534L4403K13932k3021p0416
682E4984O5449R2730j22760N5490P0127K3335p6260J3123p8586J48903m385k06352
$$ plain form
670 35798 -77857 -66556 40985 175823 200261 19675 -60052 97663 580 53541 -44297
659 -44297 -68974 59876 166809 81377 26378 78706 9243 2083 74978 186774 -26986
648 -26986 -79524 -20296 68427 -79886 -47324 -195116 -73115 -73359 -104494 -181601 -29365 104773
636 104773 -84017 -153612 -12771 44417 -11536 45913 -23780 -124082 -185341 -124001 68097
625 68097 78458 -176260 -113835 -32306 107164 79822 -71552 10249 80651 183901 134531
614 134531 17875 -61910 -46068 32624 -33539 -89652 -116195 -121539 61236 207484 205836 82998
602 82998 14326 -46424 -125089 -132264 -86175 -140816 -37265 22057 112173 -54582 -166665 -90327
590 -90327 -156189 6989 -59984 -152042 -88915 -89048 35474 -52405 71955 67219 -4318 8052
$$ packed form
670C5798j13655J1301J07541J34838K4438j80586p9727J57715r7083N2961r7838
659d4297k4677J28850J06933q5432n4999N2328o9463p160P2895J11796k13760
648b6986n2538N9228Q8723j48313L2562j47792J22001k44l1135p7107J52236J34138
636A04773j88790o9595J40841N7188n5953N7449o9693j00302o1259O1340J92098
625F8097J0361k54718O2425Q1529J39470k7342j51374Q1801P0402J03250m9370
614A34531j16656p9785J5842P8692o6163n6113k6543n344J82775J46248j648j22838
602H2998o8672o0750p8665p175M6089n4641J03551N9322R0116j66755j12083P6338
590i0327o5862J63178o6973r2058O3127j33J24522q7879J24360m736p1537J2370
$$ plain form
578 8052 86088 130970 48189 105038 -27228 -95048 -61236 -191981 -19898 1425 -6782 -47858
566 -47858 -137336 -72838 -126517 -165805 -132059 -112417 -224573 -188589 -113528 -167343 -62545 91772
554 91772 -42248 -44473 -61761 -146747 -145305 -37499 -143140 -96729 -14454 58911 -28883 -202151
542 -202151 -167277 -207867 -190192 -102703 -46820 -90762 -107975 -141271 -175481 -165737 -198389 -58752
530 -58752 -17086 -38526 -106452 -207895 -191266 -156941 -180482 -127928 -29185 128097 125359 162797
518 162797 -133169 -174768 -202077 -95028 -128679 -215210 -109218 -102294 -50222 49970 114059
507 114059 -76144 -150518 -150721 -110983 -103089 -97303 -9012 -94014 -20814 67435 -72027 -60539
495 -60539 -99463 -216671 -53667 122937 -25559 -64327 -43777 -74163 58036 77164 180968
$$ packed form
578H052P8036M4882q2781N6849j32266o7820L3812j30745J72083K1323q207m1076
566d7858q9478O4498n3679l9288L3746J9642j12156L5984P5061n3815J04798J54317
554I1772j34020k225j7288q4986J442J07806j05641M6411Q2275P3365q7794j73268
542b02151L4874m0590J7675Q7489N5883m3942j7213l3296l4210R744l2652J39637
530e8752M1666k1440o7926j01443J6629L4325k3541N2554R8743J57282k738L7438
518A62797k95966m1599k7309J07049l3651q6531J05992O924N2072J00192O4089
507A14059j90203p4374k03L9738P894N786Q8291q5002P3200Q8249j39462J1488
495f0539l8924j17208J63004J76604j48496l8768K0550l0386J32199J9128J03804
$$ plain form
484 180968 187401 110127 121296 56164 -25260 -177700 -250123 -224577 -52997 55291 68671
473 68671 -38408 -212012 -123577 4250 28236 -51797 -227939 -368444 -230056 -109703 -184285
462 -184285 -107133 -159052 -186648 -165182 -86909 -240423 -423614 -429483 -116981 -88422 -189867
451 -189867 -183492 -170899 -242036 -171837 -97191 -193105 -245947 -150417 -157425 -99774 -108464 -81240
439 -81240 -152908 -172759 92989 -12671 -90502 -62643 -244397 -204773 -238943 -246480 -97006
428 -97006 -21147 -54678 -111873 -164193 -52086 -70111 -256877 -222395 -249065 -110634 12611
417 12611 -22431 -66569 -126174 -147827 -41512 -64087 -18550 -13198 -56346 39671 -64891 -152760
405 -152760 -325703 -286971 -267912 -229417 -301653 -299302 -166894 -128968 35500 -72944 -226410
$$ packed form
484A80968O433p7274J1169o5132q1424j52440p2423K5546J71580J08288J3380
473F8671j07079j73604Q8435J27827K3986q0033j76142j40505J38388J20353p4582
462a84285P7152n1919k7596K1466P8273j53514j83191n869L12502K8559j01445
451a89867O375J2593p1137P0199P4646r5914n2842R5530p008N7651q690K7224
439h1240p1668j9851K65748j05660p7831K7859j81754L9624l4170p537J49474
428i7006P5859l3531n7195n2320J12107j8025j86766L4482k6670J38431J23245
417A2611l5042m4138n9605k1653J06315k2575M5537N352m3148R6017j04562q7869
405a52760j72943L8732J9059L8495p2236K351J32408L7926J64468j08444j53466
$$ plain form
394 -226410 -223880 -166812 -50038 -29721 -105325 -112835 -74660 -31876 -65227 -126643 -196048 -306416
382 -306416 -279630 -254319 -209358 -32545 -78571 -138899 -258147 29974 81977 12354 -223317
371 -223317 -258285 -180895 -133321 -59664 -107031 -174642 -345031 -184544 -108744 -83838 -122346
360 -122346 -206876 -96293 -180150 -150606 -159360 -245608 -360999 -111102 149878 27617 -41252
349 -41252 -87304 -120936 -94357 -117582 -112593 -297540 -219623 -216236 -310486 -186321 -125476 -144256
337 -144256 -164068 -251715 -389819 -315821 -155846 115566 172518 26305 -179927 -245041 -124782
326 -124782 66307 -11331 50208 -75588 -28941 37153 67391 -54023 -138173 -210969 -451816
315 -451816 -454346 -300369 -231327 -206014 -311941 -325261 -321844 -334424 -169525 -145829 -312157
$$ packed form
394b26410K530N7068J16774K0317p5604p510L8175M2784l3351o1416o9405j10368
382c06416K6786K5311M4961J76813m6026o0328j19248K88121N2003o9623k35671
371b23317l4968P7390M7574P3657m7367o7611j70389J60487P5800K4906l8508
360a22346q4530J10583q3857K9544q754q6248j15391K49897K60980j22261o8869
349d1252m6052l3632K6579k3225M989j84947P7917L387r4250J24165O0845j8780
337a44256j9812q7647j38104P3998J59975K71412N6952j46213k06232o5114J20259
326a24782J91089p7638O1539j25796M6647O6094L0238j21414q4150p2796k40847
315d51816k530J53977O9042K5313j05927j3320L417j2580J64899K3696j66328
$$ plain form
304 -312157 -347622 -201079 -308310 -357248 -317707 -220419 -246898 -60253 -112527 -255767 -351721
293 -351721 -108866 -85465 -158397 -256275 -416377 -282510 -262147 -379041 -288626 -312113 -373383
282 -373383 -141847 -134746 -158045 -272954 -168079 -106995 -199797 -78417 -165333 -101126 -98971
271 -98971 -243834 -397357 -432256 -158512 -156596 -90900 -122213 -91752 -172345 -222034 -237835 -250006
259 -250006 -256860 -208776 -253367 -202823 -168738 -111004 22492 49920 11693 -64316 -383097 -367742
247 -367742 -254610 -176311 -202963 -278087 -375829 -353329 -233382 -210239 -90447 -106021 -164670
236 -164670 -217479 -183703 -275634 -523217 -446628 -274477 -133601 -109351 -194308 -237772 -260771
225 -260771 -205571 -291521 -456517 -291703 -132405 -151148 -123301 -159329 -207460 -385291 -328707
$$ packed form
304c12157l5465J46543j07231m8938L9541R7288k6479J86645n2274j43240r5954
293c51721K42855K3401p2932r7878j60102J33867K0363j16894R0415k3487o1270
282c73383K31536P101k3299j14909J04875O1084r2802J21380q6916O4207K155
271i8971j44863j53523l4899K73744J916O5696l1313L0461q0593m9689j5801j2171
259b50006o854M8084m4591N0544L4085N7734J33496K7428l8227p6009l18781J5355
247c67742J13132P8299k6652p5124r7742K2500J19947K3143J19792j5574n8649
236a64670n2809L3776r1931k47583P6589J72151J40876K4250q4957m3464k2999
225b60771N5200q5950j64996J64814J59298j8743K7847l6028m8131j77831N6584
$$ plain form
214 -328707 -242403 -195067 -192693 -49504 -73066 -81670 -157159 -159437 -263264 -287729 -125534 -138516
202 -138516 -230114 -134269 -119459 -256620 -314766 -278475 -336641 -351987 -311712 -287377 -267969 -263424
190 -263424 -325414 -305914 -242202 -162922 -164975 -293759 -231525 -301830 -414092 -330796 -301372 -298064
178 -298064 -284781 -273532 -339517 -214677 -228049 -306708 -332394 -255788 -147751 -195373 -129857
167 -129857 -133454 -269289 -236924 -143162 -129656 -102796 -201925 -319705 -443466 -361250 -351807 -334082
155 -334082 -292595 -322455 -387709 -318410 -132139 -163627 -313013 -279708 -168039 -130869 -197026
144 -197026 -268436 -278398 -219687 -382166 -379755 -341226 -323988 -253465 -330210 -371458 -201341 -171012
132 -171012 -274422 -199576 -193125 -311699 -341671 -356884 -290468 -324593 -341023 -246498 -210969 -234587
$$ packed form
214c28707Q6304M7336K374J43189k3562q604p5489k278j03827k4465J62195j2982
202a38516r1598R5845J4810j37161n8146L6291n8166j5346M0275K4335J9408M545
190b63424o1990J9500O3712P9280k053j28784O2234p0305j12262Q3296K9424L308
178b98064J3283J1249o5985J24840j3372p8659k5686P6606J08037m7622O5516
167a29857l597j35835L2365R3762J3506K6860r9129j17780j23761Q2216R443J7725
155c34082M1487k9860o5254O9299J86271l1488j49386L3305J11669L7170o6157
144a97026p1410r962N8711j62479K411L8529J7238P0523p6745m1248J70117L0329
132a71012j03410P4846O451j18574k9972j5213O6416l4125j6430R4525L5529k3618
$$ plain form
120 -234587 -232076 -174743 -381495 -345067 -311092 -221443 -178550 -274956 -241929 -284935 -250916 -149559
108 -149559 -235381 -349285 -124804 -178939 -238143 -272631 -184342 -120375 -150610 -232856 -247913
97 -247913 -268742 -249783 -194677 -241859 -191254 -213488 -225692 -235901 -164888 -280887 -467101 -447870
85 -447870 -369883 -355619 -355173 -465258 -556028 -445829 -321779 -340561 -343419 -388343 -295632 -230450
73 -230450 -300222 -439020 -444690 -423944 -314398 -200244 -260996 -275356 -236960 -284854 -283126 -367189
61 -367189 -360054 -369773 -304212 -275020 -264840 -374124 -380349 -241856 -400112 -383589 -370788 -495892
49 -495892 -398295 -370284 -256099 -263340 -308021 -201715 -229769 -257948 -258216 -284488 -323764 -307906
37 -307906 -427536 -467670 -401898 -335557 -296970 -393403 -436500 -383687 -309369 -282048 -319120 -311724
$$ packed form
120b34587K511N7333k06752L6428L3975Q9649M2893r6406L3027m3006L4019J01357
108a49559q5822j13904K24481n4135n9204l4488Q8289O3967l0235q2246j5057
97b47913k0829J8959N5106m7182N0605k2234j2204j0209P1013j15999j86214J9231
85d47870P7987J4264M46j10085r0770J10199J24050j8782k858m4924R2711O5182
73b30450o9772j38798n670K0746J09546J14154o0752j4360L8396m7894J728q4063
61c67189P135r719O5561K9192J0180j09284o225J38493j58256J6523J2801j25104
49d95892R7597K8011J14185p241m4681J06306k8054k8179k68k6272l9276J5858
37c07906j19630m0134O5772O6341L8587r6433m3097N2813P4318K7321l7072P396
$$ plain form
25 -311724 -342751 -286160 -264259 -253401 -345693 -328454 -275458 -245696 -362969 -294389 -308386 -294137
13 -294137 -269182 -225548 -302358 -334891 -315833 -325160 -381617 -407539 -371758 -362801 -334271 -309471
1 -309471 -293675
0 -293675
$$ packed form
25c11724l1027N6591K1901J0858r2292J7239N2996K9762j17273O8580j3997J4249
13b94137K4955M3634p6810l2533J9058r327n6457k5922L5781Q957K8530K4800
1c09471J5796
0b93675
$$ Imaginary data points
##PAGE= N=2
##DATA TABLE= (X++(I..I)), XYDATA
$$ plain form
16383 -4633735 -4570476 -4554444 -4488546 -4443930 -4347119 -4236382 -4349287 -4316587 -4231327 -4191713 -4043749
16372 -4043749 -4067077 -3904072 -3793896 -3873611 -3792108 -3728494 -3674393 -3668332 -3537791 -3375136 -3407154
16361 -3407154 -3450522 -3450266 -3379757 -3294910 -3345444 -3310643 -3287121 -3262558 -3155054 -3145156 -3172908 -3082483
16349 -3082483 -2968750 -2848610 -2794606 -2730120 -2679732 -2729557 -2773981 -2614807 -2514814 -2616832
16339 -2616832 -2610541 -2371652 -2336120 -2308058 -2340881 -2445706 -2384425 -2231494 -2227503 -2203387 -1991849
16328 -1991849 -1966895 -1927517 -1877283 -1821362 -1846120 -1773255 -1815371 -1706175 -1547395 -1571806 -1475532
16317 -1475532 -1363687 -1412872 -1516114 -1451964 -1383806 -1328807 -1228023 -1181488 -1179149 -1258480 -1209236
16306 -1209236 -1200537 -1177835 -1178727 -1076402 -962298 -866175 -929456 -888266 -760168 -677317 -710397
$$ packed form
16383d633735O3259J6032O5898M4616R6811J10737j12905L2700Q5260L9614J47964
16372d043749k3328J63005J10176p9715Q1503O3614N4101O061J30541J62655l2018
16361c407154m3368K56P0509Q4847n0534L4801K3522K4563J07504R898k7752R0425
16349c082483J13733J20140N4004O4486N0388m9825m4424J59174R9993j02018
16339b616832O291K38889L5532K8062l2823j04825O1281J52931L991K4116K11538
16328a991849K4954L9378N0234N5921k4758P2865m2116J09196J58780k4411R6274
16317a475532J11845m9185j03242O4150O8158N4999J00784M6535K339p9331M9244
16306a209236Q699K2702q92J02325J14104R6123o3281M1190J28098Q2851l3080
$$ plain form
16295 -710397 -820868 -556682 -500931 -583263 -475050 -494241 -515860 -408225 -340186 -297657 -190795
16284 -190795 -228847 -181973 -114931 -195845 -178531 -81628 -33965 -105321 -16935 -33852 26367
16273 26367 147480 294461 260277 205649 293254 254638 204810 204723 199699 302700 350426 343699
16261 343699 517206 482758 469724 540642 658158 723264 704747 711773 693195 759716 853697
16250 853697 840006 748768 720095 853281 976186 958697 925305 1014539 943634 1102745 1122886
16239 1122886 994984 1091930 958492 1034970 1016335 1149570 1231557 1233238 1338280 1272335 1317764
16228 1317764 1335613 1395990 1389205 1622227 1608269 1547174 1529502 1512052 1508385 1514980 1612289 1632706
16216 1632706 1757711 1679093 1605548 1734493 1850946 1619712 1755712 1788273 1780636 1865292
$$ packed form
16295g10397j10471K64186N5751q2332J08213j9191k1619J07635O8039M2529J06862
16284a90795l8052M6874O7042q0914J7314R6903M7663p1356Q8386j6917O0219
16273B6367J21113J46981l4184n4628Q7605l8616m9828q7n024J03001M7726o727
16261C43699J73507l4448j3034P0918J17516O5106j8517P026j8578O6521R3981
16250H53697j3691r1238k8673J33186J22905j7489l3392Q9234p0905J59111K0141
16239A122886j27902R6946j33438P6478j8635J33235Q1987J681J05042o5945M5429
16228A317764J7849O0377o785K33022j3958o1095j7672j7450l667O595R7309K0417
16216A632706J25005p8618p3545J28945J16453k31234J36000L2561p637Q4656
$$ plain form
16206 1865292 1837338 1797333 1712770 1860035 1943250 1926007 1855724 1811301 1776963 1806220 1945125
16195 1945125 2018021 2014810 2011594 2119619 2157431 2175178 2201912 2082159 2178132 2240696 2119501
16184 2119501 1934632 1957678 2228308 2325261 2258816 2310402 2325023 2306285 2419168 2475541 2266826
16173 2266826 2197560 2347113 2267224 2294540 2323028 2205037 2242746 2318601 2367116 2305440 2264886
16162 2264886 2404302 2450278 2482428 2493589 2532083 2487697 2636914 2658635 2563311 2424088 2428514
16151 2428514 2503831 2616290 2699793 2531759 2612273 2518782 2396282 2548370 2590632 2597577 2709142
16140 2709142 2634174 2643544 2634451 2595752 2655683 2713593 2816504 2711056 2612525 2616027 2665536
16129 2665536 2642855 2603549 2556206 2547532 2530590 2689709 2982369 2912979 2867821 2863999 2914127
$$ packed form
16206A865292k7954m0005q4563J47265Q3215j7243p0283m4423l4338K9257J38905
16195A945125P2896l211l216J08025L7812J7747K6734j19753R5973O2564j21195
16184B119501j84869K3046K70630R6953o6445N1586J4621j8738J12883N6373k08715
16173B266826o9266J49553p9889K7316K8488j17991L7709P5855M8515o1676m0554
16162B264886J39416M5976L2150J1161L8494m4386J49217K1721r5324j39223M426
16151B428514P5317J12459Q3503j68034Q0514r3491j22500J52088M2262O945J11565
16140B709142p4968R370r093l8699N9931N7910J02911j05448r8531L502M9509
16129B665536k2681l9306m7343q674j6942J59119K92660o9390m5158l822N0128
$$ plain form
16118 2914127 2795848 2700097 2719754 2755238 2715461 2640341 2668621 2784330 2957934 2921745 2864303
16107 2864303 2859714 2759872 2802565 2853680 2785848 2754315 2881120 2791038 2779903 2775630 2608840
16096 2608840 2705419 2768166 2660984 2725441 2832304 2845571 2826005 2723502 2751101 2793199 2894838
16085 2894838 2910437 2984754 2941906 2797853 2945071 2997570 3001149 2936488 2846257 3032625 2862769
16074 2862769 2889712 3060207 2860699 2624100 2717290 2972890 3033338 2785968 2625457 2814755
16064 2814755 2934126 3069404 3018821 2977556 2933513 3068505 3070670 3059871 2996506 2925856 2869567
16053 2869567 2851978 2961667 2976534 2999358 3015684 2986729 2852346 2894800 2794608 2768214 2987424
16042 2987424 3010430 2952598 2811582 2799136 2937879 2889205 2915075 2987822 2873465 2833982 2850239
$$ packed form
16118B914127j18279r5751J9657L5484l9777p5120K8280J15709J73604l6189n7442
16107B864303m589r9842M2693N1115o7832l1533J26805r0082j1135m273j66790
16096B608840R6579O2747j07182O4457J06863J3267j9566j02503K7599M2098J01639
16085B894838J5599P4317m2848j44053J47218N2499L579o4661r0231J86368j69856
16074B862769K6943J70495j99508k36599R3190K55600O0448k47370j60511J89298
16064B814755J19371J35278n0583m1265m4043J34992K165j0799o3365p0650n6289
16053B869567j7589J09689J4867K2824J6326k8955j34383M2454j00192k6394K19210
16042B987424K3006n7832j41016j2446J38743m8674K5870P2747j14357l9483J6257
$$ plain form
16031 2850239 2862435 2888670 2957730 3002484 3017726 3013624 3001835 2907062 2830384 2876999 2800671
16020 2800671 3045423 3149002 3066858 3167091 3050873 2976497 3118210 3013553 2970519 3004952
16010 3004952 3001787 3045431 2989498 2932942 2907572 3051835 3080829 3047226 2888507 2884308 2861788
15999 2861788 2797066 2918804 2890444 2981714 2948165 2821414 2875743 2982618 2851570 2899291
15989 2899291 2870242 2872964 2853132 2926706 2937018 2942803 3057793 2922306 2929573 2940980 2811650
15978 2811650 2727105 2858358 2844617 2824123 2915037 2863219 3010438 3056276 2915687 2878569 3087654
15967 3087654 3030577 2960355 2955241 2940620 2927067 3005040 3077402 2996665 2898720 2896610 2978308 3085471
15955 3085471 3090392 3054296 3090628 2998720 3027740 3078690 3057825 3091858 3016012 2910034 3121105
$$ packed form
16031B850239J2196K6235O9060M4754J5242m102j1789r4773p6678M6615p6328
16020B800671K44752J03579q2144J00233j16218p4376J41713j04657m3034L4433
16010C004952l165M3644n5933n6556k5370J44263K8994l3603j58719m199k2520
15999B861788o4722J21738k8360R1270l3549j26751N4329J06875j31048M7721
15989B899291k9049K722j9832P3574J0312N785J14990j35487P267J1407j29330
15978B811650q4545J31253j3741k0494R0914n1818J47219M5838j40589l7118K09085
15967C087654n7077p0222n114j4621j3553P7973P2362q0737r7945k110Q1698J07163
15955C085471M921l6096L6332r1908K9020N0950k0865L4033p5846j05978K11071
$$ plain form
15944 3121105 2918922 2843162 2987576 3145489 3188472 2998613 2812896 2769730 2840665 3031324
15934 3031324 3049063 2885007 2816264 2988403 3115192 3213020 3059554 2908331 2903117 3086133
15924 3086133 2941963 2833884 2935275 2940528 2890440 2764203 2784988 2931682 2938267 2958723 2933451
15913 2933451 2922535 3095868 2952719 2719326 2756221 2898019 2839512 2720508 2797857 2872848
15903 2872848 2997550 3157387 3019146 2931148 3040491 2994730 2949956 3032799 3095644 2859143
15893 2859143 2811179 3008273 3104245 3076453 3107152 3099891 3105367 2998567 2976993 3037189 2967020
15882 2967020 2975514 2989183 3062410 3116915 3132176 3089595 2930990 2882743 2959174 2972486 2996152
15871 2996152 2805745 2859914 2737704 2831039 2797507 2950456 3198468 3173657 2910720 2859487
$$ packed form
15944C121105k02183p5760J44414J57913M2983j89859j85717m3166P0935J90659
15934C031324J7739j64056o8743J72139J26789R7828j53466j51223n214J83016
15924C086133j44170j08079J01391N253n0088j26237K0785J46694O585K0456k5272
15913B933451j0916J73333j43149k33393L6895J41798n8507j19004P7349P4991
15903B872848J24702J59837j38241q7998J09343m5761m4774Q2843O2845k36501
15893B859143m7964J97094R5972k7792L0699p261N476j06800k1574O0196p0169
15882B967020Q494J3669P3227N4505J5261m2581j58605m8247P6431J3312K3666
15871B996152j90407N4169j22210R3335l3532J52949K48012k4811k62937n1233
$$ plain form
15861 2859487 2789881 2979606 3110381 3180854 3231424 3081157 3045329 3086112 3076601 3102590 2992268
15850 2992268 2892403 2930024 2915803 2929073 2937782 2980362 3071006 3028045 3021907 2907286 2919325
15839 2919325 3085904 3128793 3005501 3168488 3169512 2996947 3048908 3024081 2954862 3025110 3141991
15828 3141991 3111966 3117101 3118887 3117076 3083052 3203039 3147738 2984101 2801106 2884447 2915578
15817 2915578 2909493 2903691 3031990 3041673 3034412 3089167 3135823 3053365 2974573 2800587 2865348 3053014
15805 3053014 3005708 3017836 3053063 3083896 2865888 2926911 3013739 2942741 3019826 2908107 2918298
15794 2918298 2873499 3028148 3144726 3091763 3043447 3107462 2958284 2881014 2984623 3119566
15784 3119566 3085251 2933503 2989305 3144418 3050154 3027365 3064691 3126513 3088167 3098388 3265348
$$ packed form
15861B859487o9606J89725J30775P0473N0570j50267l5828M0783r511K5989j10322
15850B992268r9865L7621j4221J3270Q709M2580R0644m2961o138j14621J2039
15839B919325J66579M2889j23292J62987J024j72565N1961k4827o9219P0248J16881
15828C141991l0025N135J786j811l4024J19987n5301j63637j82995Q3341L1131
15817B915578o085n802J28299R683p261N4755M6656q2458p8792j73986O4761J87666
15805C053014m7306J2128L5227L0833k18008O1023Q6828p0998P7085j11719J0191
15794B918298m4799J54649J16578n2963m8316O4015j49178p7270J03609J34943
15784C119566l4315j51748N5802J55113r4264k2789L7326O1822l8346J0221J66960
$$ plain form
15773 3265348 3144937 3135880 3052318 3045915 3063920 3058218 3059414 2960922 3060028 3066052 2993280 2958527
15761 2958527 2918239 2884254 3018882 2988918 2983979 3003446 3008436 2885027 3005174 3205301 3121229
15750 3121229 3009883 3017896 2937662 3115700 3085035 3026947 2956396 2960695 3036307 2922121 3019997
15739 3019997 3141613 3243789 3121507 3220300 3094541 2994592 2944514 2960944 2984891 3174278
15729 3174278 3182995 3085012 3152856 3130370 3036076 3195830 3183700 3130387 3118288 3063020 2980244
15718 2980244 2905603 2943554 2893133 2859241 3092124 2958888 2897947 3010579 2993674 2936997 2972947
15707 2972947 2981613 2896032 3033543 3229909 3074561 2996063 3037115 2996602 2974507 2984791 3070099
15696 3070099 3014512 3109780 3242348 3110238 3003521 2915908 2978983 2995780 3000645 2883097 2896350
$$ packed form
15773C265348j20411r057q3562o403J8005n702J196r8492R9106O024p2772l4753
15761B958527m0288l3985J34628k9964m939J9467M990j23409J20147K00127q4072
15750C121229j11346Q013q0234J78038l0665n8088p0551M299P5612j14186R7876
15739C019997J21616J02176j22282R8793j25759r9949n0078J6430K3947J89387
15729C174278Q717r7983O7844k2486r4294J59754j2130n3313j2099n5268q2776
15718B980244p4641L7951n0421l3892K32883j33236o0941J12632j6905n6677L5950
15707B972947Q666q5581J37511J96366j55348p8498M1052m0513k2095J0284Q5308
15696C070099n5587R5268J32568j32110j06717q7613O3075J6797M865j17548J3253
$$ plain form
15685 2896350 2986917 3058265 3100749 3101058 3093967 2961285 2937524 3010143 3027701 3021919 2977152 2970488
15673 2970488 3134842 3208499 3117374 2954874 3042392 3104356 3137822 3268559 3320368 3173012
15663 3173012 3007708 2974035 3143887 3270875 3143662 2949388 2989007 3235163 3198105 2969056
15653 2969056 2784329 2909736 3117978 3259725 3125022 3052288 3138889 3028059 2969286 3089436
15643 3089436 3071679 3101950 3097041 2956381 2939511 2946435 3025113 3137783 3171197 3193907 3185323
15632 3185323 3122555 3044623 3052575 3224807 3104144 3263261 3263981 3183531 3008304 3006672 2965669
15621 2965669 3070837 3029264 3090426 3077721 2987764 3065916 3039870 3018412 3006234 3191454 3239012
15610 3239012 3047625 3095636 3093286 3281695 3286570 3194667 3211688 3166685 2987614 3055378 3055178
$$ packed form
15685B896350R0567P1348M2484L09p091j32682k3761P2619J7558n782m4767o664
15673B970488J64354P3657r1125j62500Q7518O1964L3466J30737N1809j47356
15663C173012j65304l3673J69852J26988j27213j94274L9619K46156l7058k29049
15653B969056j84727J25407K08242J41747j34703p2734Q6601j10830n8773J20150
15643C089436j7757L0271m909j40660j6870O924P8678J12670L3414K2710q584
15632C185323o2768p7932P952J72232j20663J59117P20q0450j75227j632m1003
15621B965669J05168m1573O1162j2705q9957P8152k6046k1458j2178J85220M7558
15610C239012j91387M8011k350J88409M875r1903J7021m5003j79071O7764k00
$$ plain form
15599 3055178 3075195 3244621 3174378 3089693 2859568 2934503 2961541 2998105 2980638 3100455 3043401
15588 3043401 3145902 3186416 3130005 3022958 3103477 3220080 3174758 3088296 2977846 2973268 3030836
15577 3030836 3061831 3167065 3101037 3001775 2904574 2913568 3137717 3110280 3257435 3282737 3205872
15566 3205872 3160489 3100223 2967991 2806506 3019213 3121928 3159502 3222781 3085333 3024974
15556 3024974 2980371 3090385 3248349 3128753 3036234 2989415 2940167 2996281 3078674 3116903 3165185
15545 3165185 3161242 3245406 3326429 3366332 3243081 3003063 3161055 3194773 3235593 3279252 3090174
15534 3090174 3048779 2996680 3096577 3114155 3082247 3283620 3315926 3357227 3268362 3080178 3150686
15523 3150686 3128361 3063745 3118996 3250793 3129422 3188448 3202906 3060472 3215068 3259296
$$ packed form
15599C055178K0017J69426p0243q4685k30125P4935K7038L6564j7467J19817n7054
15588C043401J02501M0514n6411j07047Q0519J16603m5322q6462j10450m578N7568
15577C030836L0995J05234o6028r9262r7201Q994K24149k7437J47155K5302p6865
15566C205872m5383o0266j32232j61485K12707J02715L7574O3279j37448o0359
15556C024974m4603J10014J57964j19596r2519m6819m9248N6114Q2393L8229M8282
15545C165185l943Q4164Q1023L9903j23251k40018J57992L3718M0820M3659j89078
15534C090174m1395n2099R9897J7578l1908K01373L2306M1301q8865j88184P0508
15523C150686k2325o4616N5251J31797j21371N9026J4458j42434J54596M4228
$$ plain form
15513 3259296 3046501 2976682 3001741 3007199 2998180 3029519 3081590 3000333 3256908 3324901 3151592
15502 3151592 3167966 3089937 3212826 3313020 3223107 3117584 3015993 3040549 3048012 3079013 3245122
15491 3245122 3215429 3150424 3080112 3220378 3362831 3250930 3044700 3089823 3212070 3117132
15481 3117132 3137727 3186493 3180782 3080842 3174901 3284831 3318922 3169000 3076017 3106955 3149212
15470 3149212 3150999 3086382 3120549 3112294 3055906 3074995 3092348 3188243 3203661 3134502 3151903 3204041
15458 3204041 3242918 2930357 2759337 2830785 2913286 3105758 3061197 3096559 2946558 3018371
15448 3018371 3067972 2916488 3006808 2976766 2992825 3251112 3374852 3321771 3402491 3328067 3193391
15437 3193391 3105298 3078325 3042215 3120156 3147526 3172378 3114482 2990933 2961560 3044103 3093104
$$ packed form
15513C259296k12795o9819K5059N458r019L1339N2071q1257K56575O7993j73309
15502C151592J6374p8029J22889J00194q9913j05523j01591K4556P463L1001J66109
15491C245122k9693o5005p0312J40266J42453j11901k06230M5123J22247r4938
15481C117132K0595M8766n711r9940R4059J09930L4091j49922r2983L0938M2257
15470C149212J787o4617L4167q255n6388J9089J7353R5895J5418o9159J7401N2138
15458C204041L8877l12561j71020P1448Q2501J92472m4561L5362j50001P1813
15448C018371M9601j51484R0320l0042J6059K58287J23740n3081Q0720p4424j34676
15437C193391q8093k6973l6110P7941K7370K4852n7896j23549k9373Q2543M9001
$$ plain form
15426 3093104 3152153 3184404 3044167 2986699 3024706 3148643 3070736 2883577 2863668 2923763 2854546
15415 2854546 3020959 3178197 3091549 3065939 3116283 3157850 3231838 3139634 3057947 3070442 3129367
15404 3129367 3206008 3189231 3065027 3115284 3079860 3044038 3257774 3055396 2948156 3030022
15394 3030022 3152925 3288367 3355072 3229400 3165250 3094703 3268293 3291828 3034884 3195563
15384 3195563 3243107 3153422 3237362 3304888 3150972 2985406 2876360 2924995 3036959 2851253
15374 2851253 2792722 2904724 2858100 2908697 2945692 2945688 2941819 2935524 3051540 3037791 2958741 2924198
15362 2924198 3053415 3107549 3006218 3061052 2971613 2970416 3082111 3037926 3091346 3169815 3187608
15351 3187608 3071607 2991610 3015305 3129072 3132306 3172655 3353892 3227214 3115870 3074274
$$ packed form
15426C093104N9049L2251j40237n7468L8007J23937p7907j87159j9909O0095o9217
15415B854546J66413J57238q6648k5610N0344M1567P3988r2204q1687J2495N8925
15404C129367P6641j6777j24204N0257l5424l5822K13736k02378j07240Q1866
15394C030022J22903J35442O6705j25672o4150p0547J73590K3535k56944J60679
15384C195563M7544q9685Q3940O7526j53916j65566j09046M8635J11964j85706
15374B851253n8531J12002m6624N0597L6995ml869o295J16016j3749p9050l4543
15362B924198J29217N4134j01331N4834q9439j197J11695m4185N3420P8469J7793
15351C187608j16001p9997K3695J13767L234M0349J81237j26678j11344m1596
$$ plain form
15341 3074274 3034538 3164443 3166476 3076138 3170861 3316469 3170623 3067159 2990373 2905709 3117864
15330 3117864 3262426 3186984 3111386 2903876 3013838 3160259 3151171 3273908 3115365 3073691
15320 3073691 3226092 3273331 2999752 2860161 2947421 3060672 3013756 3083835 2945132 2902993
15310 2902993 3023461 3081552 3057008 3045536 2954011 3134309 3127695 3115612 3187101 3184659 3310905
15299 3310905 3206695 3254074 3275366 3140911 3145756 3024857 3211720 3500268 3327759 3143790
15289 3143790 3163364 3276578 3106899 3128920 3127292 3197799 3314544 3254835 3224683 3144698 3065812
15278 3065812 3106060 3138270 3286920 3200437 3289401 3123551 3089219 3076879 3118034 3207408 3281867
15267 3281867 3219521 3137993 3119182 3173282 3161391 3059850 3139678 3147922 3263788 3087535 3020884
$$ packed form
15341C074274l9736J29905K033r0338R4723J45608j45846j03464p6786q4664K12155
15330C117864J44562p5442p5598k07510J09962J46421r088J22737j58543m1674
15320C073691J52401M7239k73579j39591Q7260J13251m6916P0079j38703m2139
15310B902993J20468N8091k4544j1472r1525J80298o614j2083P1489k442J26246
15299C310905j04210M7379K1292j34455M845j20899J86863K88548j72509j83969
15289C143790J9574J13214j69679K2021j628P0507J16745n9709l0152p9985p8886
15278C065812M0248L2210J48650q6483Q8964j65850l4332j2340M1155Q9374P4459
15267C281867o2346q1528j8811N4100j1891j01541P9828Q244J15866j76253o6651
$$ plain form
15256 3020884 2921264 2935558 2940880 3170438 3149661 3079050 3182594 3071925 3319975 3235200 3135660
15245 3135660 3146986 3109876 3181891 3126021 3162987 2992752 3005573 3193067 3186641 3278670 3243643
15234 3243643 3136445 3207575 3331683 3339660 3158708 3019075 3165514 3237482 3171221 3171338 3225991
15223 3225991 3137664 3085482 3134480 3145696 3255770 3221860 3166896 3074881 3213104 3097969 3013236
15212 3013236 3074606 3060874 3314065 3219569 3167231 3063570 3023952 3093379 3209204 3286269 3293726
15201 3293726 3327629 3158153 3209783 3144493 3035944 3342928 3376761 3295571 3185436 3074687
15191 3074687 3239430 3255383 3100035 3228774 3120056 3103197 3294240 3177272 3160204 3236182
15181 3236182 3286395 3319916 3272719 3192650 3333859 3277641 3262871 3297501 3203496 3070831 3101487
$$ packed form
15256C020884r9620J4294N322K29558k0777p0611J03544j10669K48050q4775r9540
15245C135660J1326l7110P2015n5870L6966j70235J2821J87494o426R2029l5027
15234C243643j07198P1130J24108P977j80952j39633J46439P1968o6261J17N4653
15223C225991q8327n2182M8998J1216J10074l3910n4964r2015J38223j15135q4733
15212C013236O1370j3732K53191r4496n2338j03661l9618O9427J15825P7065P457
15201C293726L3903j69476N1630o5290j08549L06984L3833q1190j10135j10749
15191C074687J64743J5953j55348J28739j08718j6859J91043j16968j7068P5978
15181C236182N0213L3521m7197q0069J41209n6218j4770L4630r4005j32665L0656
$$ plain form
15170 3101487 3133629 3140145 3210486 3254388 3218376 3227843 3255474 3315829 3346795 3240602 3066599
15159 3066599 3140503 3089096 3152801 3180300 3151083 3285598 3183656 3088204 3032708 3108034 3009216
15148 3009216 3137957 2984937 3120517 3293561 3205927 3212480 3195397 3105127 3143173 3163179 3165956
15137 3165956 3207060 3113681 3110312 3220161 3140409 3159220 3101387 3109862 3144370 2959506 2917547
15126 2917547 3071624 3279060 3270038 3297816 3235030 3187534 3199879 3261541 3331723 3164015 3174569
15115 3174569 3397049 3531768 3500899 3482318 3428207 3366915 3518717 3429457 3390564 3321328 3306415
15104 3306415 3269542 3235083 3100246 3260387 3386407 3342673 3241858 3353026 3387783 3373317
15094 3373317 3296601 3240525 3147896 3027405 3092300 3125610 3074352 3129560 3123659 3094397 3112999
$$ packed form
15170C101487L2142O516P0341M3902l6012R467K7631O0355L0966j06193j74003
15159C066599P3904n1407O3705K7499k9217J34515j01942r5452n5496P5326r8818
15148C009216J28741j53020J35580J73044q7634O553j7083r0270L8046K0006K777
15137C165956M1104r3379l369J09849p9752J8811n7833Q475L4508j84864m1959
15126B917547J54077K07436r022K7778o2786m7496J2345O1662P0182j67708J0554
15115C174569K22480J34719l0869j8581n4111o1292J51802q9260l8893o9236j4913
15104C306415l6873l4459j34837J60141J26020m3734j00815J11168L4757j4466
15094C373317p6716n6076r2629j20491O4895L3310n1258N5208n901k9262J8602
$$ plain form
15083 3112999 3121709 3282028 3259220 3199455 3262110 3241637 3232910 3244110 3222142 3330982 3399150
15072 3399150 3281951 3198181 3120456 3263203 3196710 3370805 3305011 3154464 3301640 3342665
$$ packed form
15083C112999Q710J60319k2808n9765O2655k0473q727J1200k1968J08840O8168
15072C399150j17199q3770p7725J42747o6493J74095o5794j50547J47176M1025
$$ [...]
##END NTUPLES=NMR SPECTRUM
##END=
