##TITLE=1H_CG-1142-B
 CDCl3, 8 sc, 
 12.05.2021
##JCAMPDX= 6.0         $$ Bruker NMR JCAMP-DX V2.0
##DATA TYPE= NMR SPECTRUM
##DATA CLASS= NTUPLES
##ORIGIN= UXNMR, Bruker Analytische Messtechnik GmbH
##OWNER= root
$$ XWIN-NMR		Version 3.5
$$ Wed May 12 10:32:48 2021 Russian Standard Time (UT+4h)  she@DPX200
##.OBSERVE FREQUENCY= 200.131506
##.OBSERVE NUCLEUS= ^1H
##.ACQUISITION MODE= SIMULTANEOUS
##.ACQUISITION SCHEME= undefined
##.AVERAGES= 8
##.DIGITISER RES= 18
##SPECTROMETER/DATA SYSTEM= spect
##.PULSE SEQUENCE= zg30
##.SOLVENT NAME= CDCl3
##.SHIFT REFERENCE= (INTERNAL, CDCl3, 0, 16.0134)
##AUDIT TRAIL= $$ (NUMBER, WHEN, WHO, WHERE, WHAT)
$$ ##TITLE= Audit trail, XWIN-NMR		Version 3.5
$$ ##JCAMPDX= 5.01
$$ ##ORIGIN= Bruker BioSpin GmbH
$$ ##OWNER= she
$$ F:/spectra/data/she/nmr/H-F/1/pdata/1/auditp.txt
$$ ##AUDIT TRAIL=  $$ (NUMBER, WHEN, WHO, WHERE, WHAT)
(   1,<2021-05-12 10:31:34.07 +0400>,<she>,<DPX200>,
      <created by zg, POWCHK disabled, PULCHK disabled
       configuration hash MD5:
       00 E9 B6 7A A2 85 ED C7 34 08 36 98 17 FE 4E 26
       data hash MD5: 16K
       82 CB 9F 3A 51 90 BF 00 6F 99 72 FD 16 4F 26 E4>)
(   2,<2021-05-12 10:31:36.64 +0400>,<she>,<DPX200>,
      <Start of raw data processing
       efp BC_mod = 2 LB = 0.24 FT_mod = 6 PKNL = 1 PHC0 = -11129.03 PHC1 = 10.601 SI = 16K 
       data hash MD5: 16K
       03 BE 23 80 C5 CE 21 D0 F6 00 6F 6C D1 41 11 E7>)
(   3,<2021-05-12 10:31:40.04 +0400>,<she>,<DPX200>,
      <abs ABSG = 5 
       data hash MD5: 16K
       5D 97 A8 6F AA 79 1E D1 38 5E 88 04 D6 4D F6 23>)
(   4,<2021-05-12 10:32:00.95 +0400>,<she>,<DPX200>,
      <pk PHC0 = -3.540154 PHC1 = 5 
       data hash MD5: 16K
       11 AE 4F 2C 4E 60 FD F8 EC 12 44 6B CC 6C F0 83>)
(   5,<2021-05-12 10:32:04.81 +0400>,<she>,<DPX200>,
      <abs ABSG = 5 
       data hash MD5: 16K
       C2 41 E3 A3 8B 7A 1C 4E 1E AA D8 8B 1B 29 11 64>)
$$ ##END=
$$ 
$$ hash MD5
$$ 3A B8 5D 3F 21 1C 6E D5 0F 81 7B 40 0D A2 3D D3
##$RELAX= 
##$RELAX= 
##$RELAX= 
##$RELAX= 
##$RELAX= 
##$RELAX= 
$$ Bruker specific parameters
$$ --------------------------
##$DU= <F:/spectra>
##$EXPNO= 1
##$NAME= <H-F>
##$PROCNO= 1
##$TYPE= <nmr>
##$USER= <she>
##$AMP= (0..31)
100 100 100 100 100 100 100 100 100 100 100 100 100 100 100 100 100 100 
100 100 100 100 100 100 100 100 100 100 100 100 100 100 
##$AQSEQ= 0
##$AQ_mod= 1
##$AUNM= <au_zg>
##$AUTOPOS= <>
##$BF1= 200.13
##$BF2= 200.13
##$BF3= 200.13
##$BF4= 200.13
##$BF5= 200.13
##$BF6= 200.13
##$BF7= 200.13
##$BF8= 200.13
##$BYTORDA= 1
##$CFDGTYP= 0
##$CFRGTYP= 5
##$CHEMSTR= <none>
##$CNST= (0..31)
1 1 145 1 1 1 1 1 1 1 1 1 1 1 1 1 1 1 1 1 1 1 1 1 1 1 1 1 1 1 1 1 
##$CPDPRG= <>
##$CPDPRG1= <>
##$CPDPRG2= <>
##$CPDPRG3= <>
##$CPDPRG4= <mlev>
##$CPDPRG5= <mlev>
##$CPDPRG6= <mlev>
##$CPDPRG7= <mlev>
##$CPDPRG8= <mlev>
##$CPDPRGB= <>
##$CPDPRGT= <>
##$D= (0..31)
0 1.2 0 0 0 0 0 0 0 0.06 0 0.03 0 0 0 0 0.0002 0 0 0 0 0 0 0 0 0 0 0 0 
0 0 0 
##$DATE= 1620801093
##$DBL= (0..7)
$$ [...]
##$SUBNAM3= <"">
##$SUBNAM4= <"">
##$SUBNAM5= <"">
##$SUBNAM6= <"">
##$SUBNAM7= <"">
##$SUBNAM8= <"">
##$SUBNAM9= <"">
##$SW= 16.9725357007746
##$SWIBOX= (0..15)
0 0 2 0 0 0 0 0 0 0 0 0 0 0 0 0 
##$SW_h= 3396.73913043478
##$TD= 16384
##$TD0= 1
##$TE= 0
##$TE2= 300
##$TE3= 300
##$TEG= 300
##$TL= (0..7)
0 120 120 120 120 120 120 120 
##$TP= (0..7)
150 150 150 150 150 150 150 150 
##$TP07= 0
##$TPNAME0= <>
##$TPNAME1= <>
##$TPNAME2= <>
##$TPNAME3= <>
##$TPNAME4= <>
##$TPNAME5= <>
##$TPNAME6= <>
##$TPNAME7= <>
##$TPOAL= (0..7)
0.5 0.5 0.5 0.5 0.5 0.5 0.5 0.5 
##$TPOFFS= (0..7)
0 0 0 0 0 0 0 0 
##$TUNHIN= 0
##$TUNHOUT= 0
##$TUNXOUT= 0
##$USERA1= <user>
##$USERA2= <user>
##$USERA3= <user>
##$USERA4= <user>
##$USERA5= <user>
##$V9= 5
##$VALIST= <valist>
##$VCLIST= <CCCCCCCCCCCCCCC>
##$VD= 0
##$VDLIST= <DDDDDDDDDDDDDDD>
##$VPLIST= <PPPPPPPPPPPPPPP>
##$VTLIST= <TTTTTTTTTTTTTTT>
##$WBST= 1024
##$WBSW= 4
##$XGAIN= (0..3)
0 0 0 0 
##$XL= 0
##$YL= 0
##$YMAX_a= 488259
##$YMIN_a= -638152
##$ZGOPTNS= <>
##$ZL1= 120
##$ZL2= 120
##$ZL3= 120
##$ZL4= 120
##$ABSF1= 15.96884
##$ABSF2= -1.003822
##$ABSG= 5
##$ABSL= 3
##$ALPHA= 0
##$AQORDER= 0
##$ASSFAC= 0
##$ASSFACI= 0
##$ASSFACX= 0
##$ASSWID= 0
##$AUNMP= <proc_1d>
##$AZFE= 0.1
##$AZFW= 0.1
##$BCFW= 0
##$BC_mod= 2
##$BYTORDP= 0
##$COROFFS= 0
##$CY= -3
##$DATMOD= 1
##$DC= 0
##$DFILT= <>
##$DTYPP= 0
##$F1P= 0
##$F2P= 0
##$FCOR= 1
##$FTSIZE= 16384
##$FT_mod= 6
##$GAMMA= 0
##$GB= 0
##$INTBC= 1
##$INTSCL= 1.334414e-10
##$ISEN= 128
##$LB= 0.24
##$LEV0= 0
##$LPBIN= 0
##$MAXI= 10000
##$MC2= 0
##$MEAN= 0
##$ME_mod= 0
##$MI= 1.114404
##$NCOEF= 0
##$NC_proc= -6
##$NLEV= 6
##$NOISF1= 3.799351
##$NOISF2= 2.8
##$NSP= 0
##$NTH_PI= 0
##$NZP= 0
##$OFFSET= 16.01339
##$PC= 1
##$PHC0= -11132.57
##$PHC1= 15.601
##$PH_mod= 1
##$PKNL= yes
##$PPARMOD= 0
##$PSCAL= 0
##$PSIGN= 0
##$REVERSE= no
##$SF= 200.129999608375
##$SI= 16384
##$SIGF1= 3
##$SIGF2= 2
##$SINO= 5.538805
##$SIOLD= 16384
##$SREGLST= <1H.CDCl3>
##$SSB= 0
##$STSI= 16384
##$STSR= 0
##$SW_p= 3396.73913043479
##$SYMM= 0
##$S_DEV= 0
##$TDeff= 16384
##$TDoff= 0
##$TI= <>
##$TILT= no
##$TM1= 0
##$TM2= 0
##$TOPLEV= 0
##$USERP1= <user>
##$USERP2= <user>
##$USERP3= <user>
##$USERP4= <user>
##$USERP5= <user>
##$WDW= 1
##$XDIM= 16384
##$YMAX_p= 355729344
##$YMIN_p= -305257
$$ End of Bruker specific parameters
$$ ---------------------------------
##NTUPLES= NMR SPECTRUM
##VAR_NAME=  FREQUENCY,     SPECTRUM/REAL,   SPECTRUM/IMAG
##SYMBOL=    X,             R,               I
##VAR_TYPE=  INDEPENDENT,   DEPENDENT,       DEPENDENT
##VAR_FORM=  AFFN,          ASDF,            ASDF
##VAR_DIM=   16384,         16384,           16384
##UNITS=     HZ,            ARBITRARY UNITS, ARBITRARY UNITS
##FACTOR=    0.207333158178282, 1,           1
##FIRST=     3204.75965185559, 0,            0
##LAST=      -191.979478579203, 0,           0
##MIN=       -191.979478579203, -305257,     0
##MAX=       3204.75965185559, 355729344,    0
$$ Real data points
##PAGE= N=1
##DATA TABLE= (X++(R..R)), XYDATA
$$ [...]
6739B154810M4309Q7158m3870L706Q8728K9581l1139j29327r4585j45968j96655
6728A766748o6124o8231p9980p9518j9973j27757j04814N7952j4344l6888L793
6717A230864q5036q6461m2458k6224N6420k814l5759R397k461K8426K2657o7191
6705I99360K750O1888J14387o9939l800p581O8230m6101L7337L0100N8450J18969
6693A364050Q7510J15630J03096m98J56225Q3519J02630j2779K969j08085k00248
6682A694019j34024j12685q2001p1614k6678r9241r1887l129R8023m3739j11019
6671A016025k4049R8000q304P9856r1307m3650P8244q078J5382M2473l7851l5858
6659A080883J13819O3388M9805P6291L0141j9596R444M6293M4489p6378o8761
$$ plain form
6739 2154810 2199119 2286277 2242407 2246113 2334841 2364422 2333283 2203956 2109371 1963403 1766748
6728 1766748 1700624 1632393 1552413 1472895 1452922 1325165 1220351 1278303 1263959 1227071 1230864
6717 1230864 1145828 1059367 1016909 990685 1047105 1044291 1008532 1017929 1015468 1043894 1066551 999360
6705 999360 1002110 1063998 1178385 1108446 1104646 1097065 1165295 1119194 1156531 1186631 1245081 1364050
6693 1364050 1451560 1567190 1670286 1669788 1826013 1909532 2012162 1999383 2002352 1894267 1694019
6682 1694019 1559995 1447310 1365309 1293695 1267017 1167776 1075889 1072760 1170783 1127044 1016025
6671 1016025 991976 1089976 1081672 1161528 1070221 1026571 1104815 1096737 1112119 1154592 1116741 1080883
6659 1080883 1194702 1258090 1307895 1384186 1414327 1394731 1404175 1450468 1494957 1418579 1349818
6648A349818j17741n4534l7857j07903m4435N1645n7682n0530r747K0160n5866
6637H85328o0414L6976k2677l9333j8037k8215n654j1421L4098M12j9621N9752
6625H11194o7981n8081O4119k4189J4401j9190n7599J75276m4420q6297n2157
6614F55076P3599M0235m163o1353Q6986j9782r2615K772J3994K1195n183o5150
6602F45611L7551P5695M3829N2955J0400m0911L9579M0843j79J05005L2244p8980
6590I63642M5411M1203L9845j4926M7705M9872M5580N3550N8051J17256n9616
6579A387573J7126m1608K4619P7930n3996j5347q0267j35624J5184M8898j2619
6568A231869J4361Q73r6530J2306k3450l7058k77l9491q3524N2644P2253r932
$$ plain form
6648 1349818 1232077 1177543 1139686 1031783 987348 1038993 981311 930781 921034 941194 885328
6637 885328 824914 861890 839213 799880 781843 753628 747974 736553 770651 771063 751442 811194
6625 811194 743213 685132 749251 725062 739463 720273 662674 837950 793530 707233 655076
6614 655076 728675 768910 764747 703394 790380 770598 677983 680755 694749 715944 710761 645611
6602 645611 683162 758857 802686 855641 866041 825130 864709 905552 905373 1010378 1042622 963642
6590 963642 1009053 1050256 1090101 1075175 1122880 1172752 1218332 1271882 1329933 1447189 1387573
6579 1387573 1404699 1363091 1387710 1465640 1411644 1396297 1316030 1180406 1195590 1244488 1231869
6568 1231869 1246230 1247103 1150573 1162879 1139429 1102371 1102094 1062603 979079 1031723 1103976 1094044
6556A094044n3680l441l3905n7632M8853K7204l9654m465j04578N0953M2461m8855
6544I17305L689L0276L4486n1870L4798L583M7761j6609l0190O3147K3547p4689
6532I85234l511M0069o7544O0639k2056J310Q223L1480k9130J6047l6408l2990
6520I51363P5055L6278L9872N7780l7612l7180K8658p8029Q3362j1773K9425M3692
6508A180891M9221l371J5296n235P1026Q425r899N1576J1682K9745L4916L3340
6496A467613N4958J6118m519J4270r311Q6726m947J9832l8804l6294J228O6511
6484A633381Q933o8809r43q860j6636k286m311m7197O8997l1588l1548L8998r452
6471A528679N4112J54J8492K5749l8144O7755L0790n3795k4767m5391P914j6579
$$ plain form
6556 1094044 1040364 1036923 1003018 945386 994239 1021443 981789 977324 872746 923699 966160 917305
6544 917305 920994 951270 985756 933886 968684 972267 1020028 1003419 973229 1036376 1059923 985234
6532 985234 981723 1021792 954248 1014887 992831 994141 1002364 1033844 1004714 1020761 984353 951363
6520 951363 1026418 1062696 1102568 1160348 1122736 1085556 1114214 1036185 1119547 1107774 1137199 1180891
6508 1180891 1230112 1226741 1242037 1236802 1307828 1316253 1306354 1357930 1369612 1399357 1434273 1467613
6496 1467613 1522571 1538689 1534170 1548440 1539129 1625855 1620908 1640740 1601936 1565642 1566870 1633381
6484 1633381 1642314 1573505 1572562 1563702 1547066 1544780 1540469 1493272 1562269 1530681 1499133 1538131 1528679
6471 1528679 1582791 1582945 1601437 1627186 1589042 1656797 1687587 1633792 1609025 1563634 1571548 1554969
6459A554969L3475M7986J8893J6672k0807k6478N989J0123m7773O8509M0716l8291
6447A663983j586R7869N73o7140J2143J18959N6272L2584k3970M3393j0573O7169
6435A989676L6611k905q892L1508J04258K2412O0569l9851M9547J01239J19231
6424B463403L6150P30P2758M3351P892L8811K5027R3526K4132n962J6450R6363
6412B912631J06822K02312J468J7536K1152Q646R7792J5656M1053J43511L4584
6401C603163l0707O1817N8188n743O1508k2631k6118R8383K4172N8331K805p5103
6389C808065o4342j01298k720J9029n7914r2520j20118m6540J007j9743p0168
6378C252738n9099q6046l8782p928K0494m3107o8843j35096q3536j4008P567p7998
$$ plain form
6459 1554969 1588444 1636430 1655323 1671995 1651188 1624710 1630699 1640822 1593049 1661558 1702274 1663983
6447 1663983 1662397 1760266 1760839 1693699 1705842 1824801 1881073 1913657 1889687 1933080 1922507 1989676
6435 1989676 2026287 2023382 2014490 2045998 2150256 2172668 2233237 2193386 2242933 2344172 2463403
6424 2463403 2499553 2500283 2573041 2616392 2624284 2663095 2688122 2781648 2805780 2799818 2816268 2912631
6412 2912631 3019453 3221765 3223233 3240769 3261921 3270567 3368359 3384015 3425068 3568579 3603163
6401 3603163 3572456 3634273 3692461 3686718 3748226 3725595 3699477 3797860 3822032 3880363 3883168 3808065
6389 3808065 3743723 3642425 3639705 3658734 3600820 3508300 3388182 3341642 3342649 3322906 3252738
6378 3252738 3193639 3107593 3068811 3060883 3081377 3038270 2969427 2834331 2750795 2736787 2744354 2666356
6366B666356j15063n0527O703Q071j9611q0595j9384N0278l066o0924q0827j6123
6354B285288P0021K0275p630m0421J3904O0691l7354p7q495M8826P1152R1393
6342B567573M299J7450L6716P8270R3953N4629J0595J29280Q3820m9935J54639
6331C181289J72532J16500J71615J04315J74981K02166J12337J31353K30108J52244
6321D749440K10587K25920J51962K01173J15834O5549N3741P9831m320K0475M8391
6310E918583M0072n0619J334K2011R4377J6814m2057j5897k4992o9861j51808
6299E737957j67381j34711j33713j71353j25142j11155O707m4578n243K09027
6289E060415J27565J44387L3610j25040r9606n1522n057m7323J19484J35109K6271
$$ plain form
6366 2666356 2551293 2500766 2507469 2515540 2495929 2415334 2395950 2446228 2443162 2382238 2301411 2285288
6354 2285288 2355309 2375584 2367954 2327533 2341437 2402128 2364774 2364697 2356202 2405028 2476180 2567573
6342 2567573 2571872 2589322 2626038 2704308 2798261 2852890 2863485 2992765 3076585 3026650 3181289
6331 3181289 3353821 3470321 3641936 3746251 3921232 4123398 4235735 4367088 4597196 4749440
6321 4749440 4960027 5185947 5337909 5539082 5654916 5720465 5774206 5854037 5849717 5870192 5918583
6310 5918583 5958655 5908036 5909370 5931381 6025758 6042572 6000515 5984618 5959626 5889765 5737957
6299 5737957 5570576 5435865 5302152 5130799 5005657 4894502 4901209 4856631 4851388 5060415
6289 5060415 5187980 5332367 5365977 5240937 5141331 5089809 5084752 5037429 5156913 5292022 5318293
6278E318293M368k11458j64099k37625k72053k05056j60282j06228m3911o3019
6268C858930j77631j91247j67785j53488j27040j15352j45606p2338l058o9682
6258B635703j17891j2061J0648L428l4744M9333Q448q0522O2157k3147p9228J08939
6246B531063K09070J34382J54411K03040J61989J19730M1332j56163j65373L5476
6236C268957L7227P3971R7545P4455M2865L9764r2509k38238k15182j83803j36551
6225B768501j30461q9484o657j23103j86420k18683k48547m1790j38506o6280
6215A518570J886q1346j04478J9202J6736j22548l4340J2016p0981o139P6051
6204A224629j12673R457J5706N8455r5208j9895l2894J7751P9876j28432m7834
$$ plain form
6278 5318293 5322661 5111203 4947104 4709479 4437426 4232370 4072088 3965860 3921949 3858930
6268 3858930 3681299 3490052 3322267 3168779 3041739 2926387 2780781 2708443 2705385 2635703
6258 2635703 2517812 2505751 2516399 2519827 2485083 2534416 2542864 2462342 2524499 2501352 2422124 2531063
6246 2531063 2740133 2874515 3028926 3231966 3393955 3513685 3555017 3398854 3233481 3268957
6236 3268957 3306184 3380155 3477700 3552155 3595020 3634784 3542275 3304037 3088855 2905052 2768501
6225 2768501 2638040 2548556 2541899 2418796 2232376 2013693 1765146 1723356 1584850 1518570
6215 1518570 1520456 1439110 1334632 1353834 1370570 1248022 1213682 1225698 1154717 1148578 1224629
6204 1224629 1111956 1121413 1137119 1195574 1100366 1080471 1047577 1065328 1145204 1016772 968938
6193I68938Q3247j5963L7501n3379M3590K5888k4626n4381k8632L7227m1230m152
6181I74028J6929k3419K8662O3662j2906j4411n4248P014R0794L503l3140P3362
6169A119830m1568L9396m8088p1837P835l3895P783N3800n7423N7633N9862J3241
6157A106569O3698o3124P3276L5880j15025R553N5430R914j3037K4032J796n1357
6145A137605J19931N7128L0140j586J6048o30k577Q4136J6061N1333Q237Q2044
6133A597870K3020p5209p41O2038J2688O2936l6822J6188N848M792L9688N6668
6121A768964N463P4365P4700o6986N6316J45681N825J6711Q0226J3929L15j5796
6109B159713L7688J34162N6526J35549k2448k7112O5298j0100J48342O5806J03310
$$ plain form
6193 968938 1052185 1036222 1073723 1020344 1063934 1089822 1065196 1010815 982183 1019410 978180 974028
6181 974028 990957 967538 996200 1059862 1046956 1032545 978297 985311 1076105 1079608 1046468 1119830
6169 1119830 1078262 1117658 1069570 997733 1005568 971673 979456 1033256 975833 1033466 1093328 1106569
6157 1106569 1170267 1107143 1180419 1216299 1101274 1110827 1166257 1176171 1163134 1187166 1188962 1137605
6145 1137605 1257536 1314664 1344804 1343218 1359266 1358636 1356059 1440195 1456256 1507589 1515826 1597870
6133 1597870 1620890 1545681 1544940 1606978 1619666 1682602 1645780 1661968 1667816 1672608 1712296 1768964
6121 1768964 1774427 1848792 1923492 1856506 1912822 2058503 2064328 2081039 2161265 2175194 2175509 2159713
6109 2159713 2197401 2331563 2388089 2523638 2501190 2474078 2539376 2529276 2677618 2743424 2846734
6098B846734L0718J24639J80813J09127Q6809J14169J35795J27702J28966J12917
6088C998389J38309J422J15921P4471R3565J08220L724O4548O1748J04621O7557
6077D832495M0881M8952L7104O188M0417r2875n7201K419n0908k150J095K5696
6065D832113K1129n5621J4600k4131l1280r3650j6861J7347j02897J9655J3833
6054D594237n180j05993o1006P9984k7641k7666j4390k8650j4160K1329J2607
6043D423471K7363J01589M185J9908j765R9141p777R0070N6635O8571J25516P7261
6031E084168N3190O9177Q1476J11918J24134J70862J84340J75530J02062J43635
6021F300492K87356J66438K23498J80087K61821J99375J89236K77763K54379K72885
$$ plain form
6098 2846734 2877452 3002091 3182904 3292031 3378840 3493009 3628804 3756506 3885472 3998389
6088 3998389 4136698 4138120 4254041 4328512 4422077 4530297 4534021 4598569 4660317 4764938 4832495
6077 4832495 4873376 4922328 4959432 4965620 5006037 4913162 4855961 4858380 4807472 4805322 4806417 4832113
6065 4832113 4853242 4797621 4812221 4788090 4756810 4663160 4646299 4663646 4560749 4580404 4594237
6054 4594237 4589057 4483064 4422058 4502042 4474401 4446735 4432345 4403695 4389535 4410864 4423471
6043 4423471 4450834 4552423 4556608 4576516 4574751 4673892 4666115 4756185 4812820 4881391 5006907 5084168
6031 5084168 5137358 5206535 5288011 5399929 5524063 5694925 5879265 6054795 6156857 6300492
6021 6300492 6587848 6754286 6977784 7157871 7419692 7619067 7808303 8086066 8340445 8613330
6011H613330K91799K04338L05407M21240L67794L22395L78178M10363M42605L79677
6001A2137126M11182M28469N06146L01807L08428L42943L88558L59639K46900
5992A5431198Q4281R4159Q0027K1985O1816j22579K714J5486r9222r7777n3593
5981A5418495k0649K761M7443l5065o5900q8228k5262k13454k87457k41034k24125
5970A4267525k42818n08003l80503m20846m89754m56698n12076n49756m41282
5961A0265789l81976m81598m21406m32011m34035l38632l49105l00584l19416
5952F807026k15041k94732l87526l18381k41724j74897k47125k39541k28256j40465
5942D319338j02973j51161q2425j56825k08711j72980j05933o7026n1106j06669
$$ plain form
6011 8613330 8905129 9109467 9414874 9836114 10203908 10526303 10904481 11314844 11757449 12137126
6001 12137126 12548308 12976777 13482923 13784730 14093158 14436101 14824659 15184298 15431198
5992 15431198 15515479 15609638 15689665 15711650 15773466 15650887 15653601 15669087 15569865 15472088 15418495
5981 15418495 15397846 15400607 15448050 15412985 15347085 15258857 15233595 15020141 14732684 14491650 14267525
5970 14267525 14024707 13516704 13136201 12715355 12225601 11768903 11256827 10707071 10265789
5961 10265789 9883813 9402215 8980809 8548798 8114763 7776131 7427026 7126442 6807026
5952 6807026 6591985 6297253 5909727 5591346 5349622 5174725 4927600 4688059 4459803 4319338
5942 4319338 4216365 4065204 3982779 3825954 3617243 3444263 3338330 3271304 3220198 3113529
5932C113529j12772j15422q3770j29578k3795r5000o4934j3778q9448p4746k1860
5921B288426R908m1647p0444r51q1417j11120K0155q6154j15355m1090K2862K1034
5909A814207o7144j6942O43l7987n1233n2792p2607k5597L0704L5507K3448j9044
5897A561163k6723p1294m4181j1905m1490J2437o5555k412o9531k0710O2201j51760
5885A130240j4056j5703M0392j8266l8070r6454q10L2879R14k5153O126j30034
5873H72005N3706R1396K290o040J6605K5093k5550k9595m7820J4667J1145P7232
5861A055134J5716J1408j0095N19L8916k1343N2542L9915j68310o1605l3498K8115
5849I47414n3281n3645Q376k6602p8007k4843L7354l0656n3643m6143P6697q638
$$ plain form
5932 3113529 3000757 2885335 2801565 2671987 2648192 2553192 2488258 2474480 2385032 2310286 2288426
5921 2288426 2298334 2256687 2186243 2185292 2103875 1992755 2012910 1926756 1811401 1770311 1793173 1814207
5909 1814207 1747063 1730121 1730764 1692777 1641544 1588752 1516145 1490548 1521252 1556759 1580207 1561163
5897 1561163 1534440 1463146 1418965 1407060 1365570 1378007 1312452 1310040 1240509 1219799 1282000 1130240
5885 1130240 1116184 1100481 1140873 1122607 1084537 988083 987273 1020152 1021066 995913 1002039 872005
5873 872005 925711 1017107 1019397 1013357 1029962 1055055 1029505 999910 952090 966757 977902 1055134
5861 1055134 1070850 1082258 1072163 1072682 1111598 1090255 1142797 1182712 1014402 952797 919299 947414
5849 947414 894133 840488 848864 822262 744255 719412 756766 726110 672467 626324 703021 694383
5837F94383j14281R037M3479q4795r327n7130k0052l4021K9004L1399m3314M0191
5825D84573p1674L604n5230m3308p790L9145R488o2083o6648N8711J3272k4909
5813B77151l4239M5096M3861M8411J6282j17581j08485Q277Q6847q214L7137n8044
5801B36499p6373j806j0739L1427N2094L9595p9900p2544J1762n104k0176j25365
5789b0630L5752J16413N2981l6710l3086K2069p1378k7976O9140K0939J1460l4702
5777A04272m461k5745k6573m434o1379L9451O218o895j7890J651l1241k8081J2920
5764d2187J04630l6405n0971N7522l3043N675j9594k2837M5161J16466Q4856l4401
5752A74872m4843n3849n4853j4624q8819l895J23862N2863m0020p1705L6322l8778
$$ plain form
5837 694383 580102 589139 632618 547823 538496 481366 461314 427293 456297 487696 444382 484573
5825 484573 412899 416503 361273 317965 310175 349320 358808 296725 230077 288788 302060 277151
5813 277151 242912 288008 331869 380280 396562 278981 170496 178773 265620 257406 294543 236499
5801 236499 160126 158320 147581 179008 231102 270697 190797 118253 130015 124911 104735 -20630
5789 -20630 15122 131535 184516 147806 114720 136789 65411 37435 106575 127514 138974 104272
5777 104272 99811 74066 47493 43059 -18320 21131 27349 20454 2564 4215 -27026 -55107 -42187
5764 -42187 62443 26038 -24933 32589 -454 5221 -14373 -37210 7951 124417 209273 174872
5752 174872 130029 76180 21327 6703 -82116 -86011 37851 90714 50694 -21011 15311 -23467
5740b3467n306l8901l6399R3676j2006K9604p759m2729p5584m8810N4754P9482
5728c3445p1951L4741k2405K9465K3183j04352j00287J0504M4270o5469O1648
5717a94098N8213K4167N3491k7897l890j5172o0649L8826N0657m477J0735j4190
5705h4284J4067J8698m6153O3083p9148K348J9147k7832M5064K6801l1532j0257
5693h9998m4022K1878J2958n9151J0441l4138l3710m4062P8525Q0672j6442J4583
5681a02466K2038r7040L751N0913o9326p4934M9393M720J7625j9780M4113P8035
5669i2958j17775m7294N8400k8591L8527M3113L812m9960j03113J3061N5391L9931
5657a87456m5812j0638N6381o9336J8551N5578K4262l7460n7498N9121l7991J3210
$$ plain form
5740 -23467 -28773 -67674 -104073 -10397 -22403 7201 -558 -43287 -118871 -167681 -112927 -33445
5728 -33445 -105396 -70655 -93060 -63595 -40412 -144764 -245051 -234547 -190277 -255746 -194098
5717 -194098 -135885 -111718 -58227 -86124 -90014 -105186 -165835 -127009 -76352 -80829 -70094 -84284
5705 -84284 -70217 -51519 -97672 -34589 -113737 -111389 -92242 -120074 -75010 -48209 -79741 -89998
5693 -89998 -134020 -112142 -99184 -158335 -147894 -182032 -215742 -259804 -181279 -100607 -117049 -102466
5681 -102466 -80428 -177468 -173717 -122804 -192130 -267064 -217671 -212951 -195326 -215106 -170993 -92958
5669 -92958 -210733 -258027 -199627 -228218 -189691 -146578 -142766 -192726 -295839 -282778 -227387 -187456
5657 -187456 -233268 -243906 -187525 -256861 -238310 -182732 -158470 -195930 -253428 -194307 -232298 -219088
5645b19088L6597j11313j1453J20472O045l1173K8729k6484p553J7092O482O5757
5633a25890L104K322q0812Q74J6002k6301k3452J0285M9591J2375k4230j800L387
5620a84545K7751j2837M736l0772j8763L3633j8967J2992k1601O2644J1448o2615
5608a96896P8397K3375j5210M0284k5028O5524p2472o9441m6321K701N2427l6123
5596a98783K9969m2299P944L3589j9602R1919J7319j1883N8879n5971o8541L869
5584a53591Q8565o0279N5898M904j00278K5305M3640o5187k1881m0627r42k8528
5572b53001K8193Q808M560M8347j1102P046k7639L184J09961L009j04123P1424
5560a11333J7981j05757J1521N0723J5466N3718R590M8646k4355j1714n9700n1045
$$ plain form
5645 -219088 -182491 -293804 -305257 -184785 -178740 -209913 -181184 -207668 -215221 -198129 -191647 -125890
5633 -125890 -122786 -120464 -201276 -200402 -184400 -210701 -234153 -223868 -174277 -161902 -186132 -187932 -184545
5620 -184545 -156794 -169631 -164895 -195667 -214430 -180797 -199764 -186772 -208373 -145729 -134281 -196896
5608 -196896 -118499 -95124 -110334 -70050 -95078 -29554 -102026 -171467 -217788 -215087 -162660 -198783
5596 -198783 -168814 -211113 -203169 -169580 -189182 -97263 -79944 -91827 -32948 -88919 -157460 -153591
5584 -153591 -65026 -125305 -69407 -64503 -164781 -139476 -95836 -161023 -182904 -223531 -224473 -253001
5572 -253001 -224808 -216000 -211440 -163093 -174195 -167149 -194788 -191604 -81643 -78634 -182757 -111333
5560 -111333 -93352 -199109 -187588 -136865 -121399 -67681 -58091 -9445 -33800 -45514 -105214 -156259
5548a56259J5387l5680J1718J3556m2199q828N3850l8877L8818l0819k5310L4767
5536a69876P6328J18676n4600o6408j2173L6845p9772O7223J1116j47132K4122
5525a95651Q4977M0360J5744p297k3295L7089k3223j3484K6190L394N022j1521
5513f1695j7360n7535N605L0705O3940M3493L2491o4864m4177k8162r00K2971
5501g5488P0513j7233K3948m066l1352n6050K8796j3098J2283j3773l626k7795
5489a06941k6575J11673L7992p3907K1389k387k0828L187l8186P9627j3176j5531
5477d3663J5880l2412j9345J03762q4152L5178R1657K066N8290p7358p501m7669
5465e267N9086n6135L6724l7503k8225j941L5906L2605k7598N7997J3769l9021
$$ plain form
5548 -156259 -140872 -176552 -164834 -151278 -193477 -202305 -148455 -187332 -148514 -179333 -204643 -169876
5536 -169876 -93548 25128 -29472 -95880 -108053 -71208 -150980 -83757 -72641 -219773 -195651
5525 -195651 -110674 -70314 -54570 -61867 -85162 -48073 -71296 -84780 -58590 -55196 -50174 -61695
5513 -61695 -79055 -136590 -130985 -100280 -36340 7153 39644 -25220 -69397 -97559 -98459 -75488
5501 -75488 -4975 -22208 1740 -2326 -33678 -89728 -60932 -74030 -61747 -75520 -79146 -106941
5489 -106941 -133516 -21843 16149 -57758 -36369 -38756 -59584 -56397 -94583 -14956 -28132 -43663
5477 -43663 -27783 -60195 -79540 24222 -59930 -24752 66905 68971 127261 49903 42402 -5267
5465 -5267 53819 -2316 34408 -3095 -31320 -33261 2645 35250 7652 65649 79418 40397
5453D0397J1423Q6922o701N4024m8425k197O218q649O1350J48610o2210q3026
5441A97736M7054L5779L572O6290q3097o780J10038K9323Q89J455j1357J31657
5429E22559k9734J4568m0203L9015l5621J7918K7231l200K1392p9954q493P8199
5417E23677J8562N88Q8606P4960P6371J17677J27139O3665M8912J57329J62123
5406A459609J46846J55184K8082J45690Q7837P2386o374l4410o6598j57655j31785
5395A698812o0180j52639j75370m1894o8464j01769j22961n2704j52012r9467
5385F71352k4827l2848l7815l4036l1629p0782o4529J2022l951L298k9445k6302
5373C30508J4938m4592P360j00293r949N3988M1195l3993J2351P084M960o7512
$$ plain form
5453 40397 51820 138742 132041 186065 137640 135443 141661 133012 194362 342972 280762 197736
5441 197736 244790 280569 284141 350431 267334 260554 370592 399915 400804 402259 390902 522559
5429 522559 492825 507393 467190 506205 470584 488502 515733 512533 533925 453971 445478 523677
5417 523677 542239 542827 631433 706393 782764 900441 1027580 1091245 1140157 1297486 1459609
5406 1459609 1606455 1761639 1789721 1935411 2023248 2095634 2089260 2054850 1988252 1830597 1698812
5395 1698812 1638632 1485993 1310623 1268729 1200265 1098496 975535 922831 770819 671352
5385 671352 646525 613677 575862 541826 510197 439415 374886 386908 382957 386255 356810 330508
5373 330508 345446 300854 308214 207921 197972 251960 293155 259162 271513 278597 283557 216045
5361B16045N8252M4613k4019k3656m9333j4743M3051J3135m4488m2060L1519j2026
5349A96290q5754Q4401k8679K408K6830K9183k1003j22881O6389N2368N1653K9802
5337B81007O769L6121m4363j3533n5905R5000N2018j5145n5122k8134p797m1322
5325B09594O9923o4074k9989J7743K2308Q4786j02558m26p701p1499l3923K1980
5313A16164q82k9523p949j0215O3856j9766O5266l3931j7633J3127N372j6978
5301A26908O1855L655k4916l3536l230L5449q3987J3998O8j3787O9710J0856q3449
5288G9594K5212O5164p128n0028K6855k2356O790J61324j1663K3931P6092p7210
5276B96577o1079R8808j17977M5361J5485r449N1715O5472P55m0882n5534N0710
$$ plain form
5361 216045 274297 318910 294891 271235 221902 207159 250210 263345 218857 176797 208316 196290
5349 196290 110536 194937 166258 168666 195496 224679 203676 80795 147184 199552 251205 281007
5337 281007 287776 323897 279534 266001 210096 305096 357114 341969 286847 258713 250916 209594
5325 209594 279517 215443 185454 203197 225505 310291 207733 207307 199606 128107 94184 116164
5313 116164 115282 85759 77810 67595 131451 111685 176951 143020 125387 138514 143886 126908
5301 126908 188763 192418 167502 133966 130736 166185 82198 96196 96264 82477 152187 163043 79594
5288 79594 104806 169970 162842 112814 139669 117313 124103 285427 273764 297695 373787 296577
5276 296577 235498 334306 216329 261690 277175 267726 319441 384913 385668 344786 289252 339962
5264C39962N6410j3130K4584l1108J5250j7217J129J3850M7650L2420r1986N6879
5252D34693q244q3974N5651Q564K7836L2074N4593J1414Q0639n5554m9447m6811
5240D61434P718k5621j8188K2287K9956R532L8304j6781j8013l7794N3385k5072
5228D81147L3263K5676M838Q6169m9294M9206j748j6512J5598O3905N8549O8657
5216H19454m8552K6932P3818K5166K0650o0705K4050j6488J9531k4216P1227N8672
5204I89539P846K7031P5697o3145o1262P0315Q4212K1870J0847m1016K3852Q3480
5192A229266M9201M9864o2398l872P3612M4354L2327j0143p1111j6133J18621
5181A433588N9881J2771k2951K8323O1622L4815M5531J711J1074O6326J19810
$$ plain form
5264 339962 396372 383242 407826 376718 391968 374751 375880 389730 437380 469800 377814 434693
5252 434693 426449 342475 398126 406690 434526 466600 521193 532607 613246 557692 508245 461434
5240 461434 469152 443531 425343 447630 477586 487118 525422 508641 490628 452834 506219 481147
5228 481147 514410 540086 544924 631093 581799 631005 629257 612745 628343 692248 750797 819454
5216 819454 770902 797834 871652 896818 917468 856763 880813 864325 883856 859640 930867 989539
5204 989539 997385 1024416 1100113 1036968 975706 1046021 1130233 1152103 1162950 1121934 1145786 1229266
5192 1229266 1278467 1328331 1265933 1262061 1335673 1380027 1412354 1402211 1331100 1314967 1433588
5181 1433588 1493469 1506240 1483289 1511612 1573234 1608049 1653580 1655291 1666365 1732691 1852501
5170A852501N3160k8114J5M2070K2081J27280n9235J0713M2403P5397J15347P1587
5158B325205J11714k4554J28182L61N1504P0338M3978o996R1743O5866K5375R1806
5146B974522O0647J34510K1397J07132J09453J18601Q5455J03442M8595N0296
5136C814050J18834R2631O7005J55494J78720M4710N3931J19757J51552J74153
5126D970837J07572J44325J72117K34655J54339J63784K28777K05278K89615K80503
5116F951802L59982L50047L31553M55266N19272N41012O74263P00784O78409Q64431
5106A2426821Q64803J060920J081393J219216J190672J173110J273885J066030
5098B1356850P70898N12045J08417p2351j31699j81877l05644m75102n64839n64777
$$ plain form
5170 1852501 1905661 1877547 1877562 1919632 1941713 2068993 2009758 2020471 2062874 2138271 2253618 2325205
5158 2325205 2436919 2412365 2540547 2540908 2592412 2662750 2706728 2699732 2791475 2857341 2882716 2974522
5146 2974522 3035169 3169679 3191076 3298208 3407661 3526262 3611717 3715159 3763754 3814050
5136 3814050 3932884 4025515 4092520 4248014 4426734 4471444 4525375 4645132 4796684 4970837
5126 4970837 5078409 5222734 5394851 5629506 5783845 5947629 6176406 6381684 6671299 6951802
5116 6951802 7311784 7661831 7993384 8448650 8967922 9508934 10183197 10883981 11562390 12426821
5106 12426821 13291624 14352544 15433937 16653153 17843825 19016935 20290820 21356850
5098 21356850 22127748 22639793 22748210 22675859 22544160 22362283 22056639 21581537 21016698 20451921
5088B0451921o32482n51550m55198l80919k54594o2912J1671L35103M72693M99602
5078A9433335O75829Q71198J027353J172694J398596J529382J830282J980053
5070B9918722K174924K315371K424689K313095J834584J136303L27785l63745
5062D2081728r65636j204623j369623j418978j561462j936416k157343k290799
5054B9176848k014205j849126j596624j272749r30218p77907o27079n19433l79478
5045A9210029k28970o9865R52J22066K29058M39359M64600N54315P04164P85982
5035B2211690O65436N72750M49904O6861k74509m97095o27647p45784r66219r84403
5025A9870984j066914j086840j223193j269620j219861j020055r41190p63162
$$ plain form
5088 20451921 19819439 19267889 18812691 18431772 18177178 18114266 18125937 18461040 18933733 19433335
5078 19433335 20109164 20980362 22007715 23180409 24579005 26108387 27938669 29918722
5070 29918722 32093646 34409017 36833706 39146801 40981385 42117688 42445473 42081728
5062 42081728 41116092 39911469 38541846 37122868 35561406 33624990 31467647 29176848
5054 29176848 27162643 25313517 23716893 22444144 21513926 20736019 20108940 19589507 19210029
5045 19210029 18981059 18911194 18912146 19034212 19263270 19702629 20167229 20721544 21425708 22211690
5035 22211690 22877126 23449876 23899780 23966641 23692132 23195037 22567390 21821606 20855387 19870984
5025 19870984 18804070 17717230 16494037 15224417 14004556 12984501 12043311 11280149
5017A1280149p53712o34816m34058n36386m13928m38377l67801k36866j97447
5008G266758k84515k70553k81492j10704k09022j52375j84475j79899k34498k31684
4998E127541j10300k37411j06200j55180j64645j25242k6711j50109j35176o9272
4988C847295o0737j2961j46278l8520j16466K2968P6341L0270K3742j8610N0397
4977C657441J06824k7029o0806o9851p1963n1095k9494p7337j51723j38162r6537
4966B990268q2213o2979r5275j70807m6747O0612j07398m3342k3186k1207n4695
4955B343031m5712K4387j22518M592n4656j15107k1096L4018K8041L2334M091
4944B111405K1525J08483P1819L2158m4531J15706O9638j3961k4572O3626l0994
$$ plain form
5017 11280149 10526437 9891621 9457563 8921177 8507249 8068872 7701071 7464205 7266758
5008 7266758 6982243 6711690 6430198 6319494 6110472 5958097 5773622 5593723 5359225 5127541
4998 5127541 5017241 4779830 4673630 4518450 4353805 4228563 4201852 4051743 3916567 3847295
4988 3847295 3786558 3773597 3627319 3588799 3472333 3495301 3571642 3601912 3625654 3607044 3657441
4977 3657441 3764265 3737236 3676430 3606579 3534616 3483521 3454027 3376690 3224967 3086805 2990268
4966 2990268 2908055 2845076 2749801 2578994 2532247 2592859 2485461 2442119 2418933 2397726 2343031
4955 2343031 2297319 2321706 2199188 2203780 2149124 2034017 2012921 2046939 2074980 2107314 2111405
4944 2111405 2132930 2241413 2313232 2345390 2300859 2416565 2486203 2472242 2447670 2511296 2480302
4933B480302O5150m7784j60396p9772m4126j9871j41996j28207j56130J7222j12987
4922A671405j32702q6567r2448R841p1140k4814k2473J4055l3815j65844N5882
4911A121380o5206k6394q584L1796n3330j14715l7676M3843k9909j1765q389n298
4899H35753N0499N338o0214K595K3384m34o8337m6095k3115m4118l5941K5443
4887F64758N6083j0587q8613j1511P4433J9007J2612K2356j0587p9581m2998K2347
4875F27719j9610q0989j1021N503R3944J173M3434K1800j2542j1623j1864J5986
4863F61910k2468n1846O870l3450L3563K0658R3716Q9156j00138q4617N8928k1977
4851F50305k9475K5830L1752J1158J05399o1408o5685M9970M0015K1267J3371
$$ plain form
4933 2480302 2545452 2497668 2337272 2257500 2213374 2193503 2051507 1923300 1767170 1784392 1671405
4922 1671405 1538703 1452136 1359688 1369529 1298389 1273575 1251102 1265157 1231342 1065498 1121380
4911 1121380 1056174 1029780 1021196 1052992 999662 884947 847271 891114 861205 849440 841051 835753
4899 835753 886252 891590 831376 833971 857355 856921 788584 742489 719374 675256 639315 664758
4887 664758 720841 710254 621641 610130 684563 703570 716182 738538 727951 648370 605372 627719
4875 627719 608109 527120 516099 521602 615546 616719 660153 681953 669411 657788 645924 661910
4863 661910 639442 587596 594466 561016 594579 615237 708953 798109 697971 613354 672282 650305
4851 650305 620830 646660 678412 689570 794969 733561 667876 717846 757861 779128 792499
4840G92499r905M9691J4091O6992n5971r1506l2454M9261K8977K4432R9050N9428
4828I94585N667j06364j6928P5131N0048J4153P8483P5976Q9986J04848l214O0601
4816A422972J52388J08241Q5103J7834N5665R3266J25614Q0212m4819p1342N0302
4805B075436j03882m1168K3696n6155q7191n9423k2917j1824p1008M8868j24809
4794A569623j0041k1743O1073O0850N116P623K9124K9239p914Q9629P9235K1546
4782A913360J7493O3104Q6510K9435j0125o7199o1873K5506r6669q4107L3846
4771A849281M5251j01401o1573J3818n4398j30538j03539j38023M3677K0176r8714
4760A284017M2328m5925J4022l5747o298p5150N1598N857J21174N7411M2828Q1105
$$ plain form
4840 792499 782594 832285 846376 913368 857397 765891 733437 782698 811675 836107 935157 994585
4828 994585 1000252 893888 876960 952091 1002139 1016292 1094775 1170751 1260737 1365585 1362371 1422972
4816 1422972 1575360 1683601 1768704 1786538 1842203 1935469 2061083 2141295 2096476 2025134 2075436
4805 2075436 1971554 1930386 1954082 1897927 1810736 1751313 1728396 1716572 1645564 1694432 1569623
4794 1569623 1559582 1537839 1598912 1659762 1664878 1672501 1701625 1730864 1722950 1812579 1891814 1913360
4782 1913360 1930853 1993957 2080467 2109902 2099777 2032578 1970705 1996211 1899542 1815435 1849281
4771 1849281 1894532 1793131 1731558 1745376 1690978 1560440 1456901 1318878 1362555 1382731 1284017
4760 1284017 1326345 1280420 1294442 1258695 1252397 1177247 1228845 1234702 1355876 1413287 1456115 1537220
4748A537220J7445L6564Q5526P7246p2292N2655q398P2245M0721j3357n0695k5324
4736A749556O8157k9764p2574Q6859m0081j18986l5666J8182o3999k721m9277
4725A509686N693q859J6093o3141l2319o8669l6349N7583M5721K7355P0776l6792
4713A486778R8073O1221k9572r9527L65L7798l9443K984K4157j48843p1466Q1201
4701A403726L8111k0997o3798o1672n1976o7143J832M96j5449K6041n3277l1870
4689A104024m1736J7734j1137j3348m9942L6988m0787l3933l3668o2510o9823
4678H01862L5779q862L2441l2770J7880P7727p3493m2444M8601N675l1490j38600
4666F92306M9848K8525N445M5598J5820N3070K8039m91m5101j6024L1993K5167
$$ plain form
4748 1537220 1554665 1591229 1676755 1754001 1681709 1734364 1725966 1798211 1838932 1825575 1774880 1749556
4736 1749556 1817713 1787949 1715375 1802234 1762153 1643167 1607501 1625683 1561684 1558963 1509686
4725 1509686 1515379 1506520 1522613 1459472 1427153 1358484 1322135 1379718 1425439 1452794 1523570 1486778
4713 1486778 1584851 1646072 1616500 1516973 1517338 1555136 1515693 1518677 1542834 1393991 1322525 1403726
4701 1403726 1441837 1420840 1357042 1295370 1243394 1176251 1178083 1178579 1163130 1189171 1135894 1104024
4689 1104024 1062288 1080022 1068885 1055537 1005595 1042583 1001796 967863 934195 871685 801862
4678 801862 837641 828779 861220 828450 846330 924057 850564 808120 856721 862396 830906 692306
4666 692306 742154 770679 776124 821722 837542 890612 918651 918160 873059 857035 889028 914195
4654I14195J0511m6148N206l1104J0381P0551L9436J825J1696N5962n4325j4851
4642I73335N2810r5060J6586L4130Q6711L2034P349J6574J1220k1229o5562k8216
4630A020682N2160M0626m004J02828P6990M2562m1472K2921P0127J13221K9457
4619A526098M3562n9693L6813J89399J01695N7868P7217N8717j52p655K18264
4608B242133M7029J71797K9412M8789K4255K2341K2058k0859K0660o196l0846
4597B570573q8344k7175r7337n7217p0860q4478m3201o4671n6356k2525r8518
4586A859891k5716q815l1535m7776m7711R6562J3161j4192j5132K3826J24279
4575A926842L769j02018J0225L7414K5323M4559k0431n8696J126K5483M1064N7521
$$ plain form
4654 914195 924706 878558 883764 852660 863041 933592 973028 974853 986549 1042511 988186 973335
4642 973335 1026145 931085 947671 981801 1068512 1100546 1107895 1124469 1135689 1114460 1048898 1020682
4630 1020682 1072842 1113468 1109464 1212292 1289282 1331844 1290372 1313293 1383420 1496641 1526098
4619 1526098 1569660 1509967 1546780 1736179 1837874 1895742 1972959 2031676 2031524 2023869 2242133
4608 2242133 2289162 2460959 2490371 2539160 2563415 2585756 2607814 2586955 2607615 2601419 2570573
4597 2570573 2482229 2455054 2357717 2300500 2229640 2145162 2101961 2037290 1980934 1958409 1859891
4586 1859891 1834175 1825360 1793825 1746049 1698338 1794900 1808061 1793869 1778737 1802563 1926842
4575 1926842 1930611 1828593 1838818 1876232 1901555 1946114 1925683 1866987 1868113 1893596 1934660 1992181
4563A992181j707L2179J5199J16521O8732P1693k909O9468J31032J8601J0120
4552B521110J56438O8400J49451K25247J72201J70145J13138J42425J67604J81630
4542D067789R3232J57208J09986J20223R0514l912m381m3890P5562k9873j1298
4531D621160q7152r6008j65826j11015j01470p6654m0656j02785o4461j8196K414
4520C759351P6509k3133J8700l2013J247J0455L3732L6579k6522J8926K3244J03299
4508D000374k1108J6445O4141N6874J4984J03867J98010J22854K2915R6732M320
4497D680408O0297M7930k748n6478l2986r078P2221N7098k6473O2339O1032J3213
4485D926775l7141j3221M0145R6019M1606N2523O4371J53675J74103J77860J53556
$$ plain form
4563 1992181 1990474 2022653 2037852 2154373 2223105 2294798 2291889 2361357 2492389 2510990 2521110
4552 2521110 2677548 2745948 2895399 3120646 3292847 3462992 3576130 3718555 3886159 4067789
4542 4067789 4161021 4318229 4428215 4548438 4638952 4635040 4630659 4586769 4662331 4632458 4621160
4531 4621160 4534008 4438000 4272174 4161159 4059689 3983035 3942379 3839594 3775133 3756937 3759351
4520 3759351 3835860 3812727 3831427 3799414 3800661 3811116 3844848 3881427 3854905 3873831 3897075 4000374
4508 4000374 3979266 3995711 4059852 4116726 4131710 4235577 4433587 4556441 4579356 4676088 4680408
4497 4680408 4740705 4788635 4785887 4729409 4696423 4687345 4759566 4816664 4790191 4852530 4913562 4926775
4485 4926775 4889634 4876413 4916558 5012577 5054183 5106706 5171077 5324752 5498855 5676715 5830271
4474E830271J50761J73778K53920L39262K37274K73818L71667L96437L92350N09598
4464H929136L66336J62263J38642R9308J65132J89476K39924M46897L02328K19246
4454A1258688K99354J87406J77301M36211L37454M01197M72881N84096O90373
4445A4844961O50338Q25607R88667R08387J023461J255022J440060J656023J848097
4436B5440623K038476K263283K554326K780931L057185L163327L227295L312068
4428D7837514L152479L084473L118121L058642K894745K360566J585325Q73864
4420F7965729k4281o81355j229618j761579k099824k466365k865869l340944l484941
4411E0010953l454749l382585l135177k973213k887115k621497k455152k187470
$$ plain form
4474 5830271 5981032 6154810 6408730 6747992 6985266 7259084 7630751 8027188 8419538 8929136
4464 8929136 9295472 9457735 9596377 9695685 9860817 10050293 10290217 10737114 11039442 11258688
4454 11258688 11558042 11745448 11922749 12358960 12696414 13097611 13570492 14154588 14844961
4445 14844961 15495299 16320906 17309573 18217960 19241421 20496443 21936503 23592526 25440623
4436 25440623 27479099 29742382 32296708 35077639 38134824 41298151 44525446 47837514
4428 47837514 50989993 54074466 57192587 60251229 63145974 65506540 67091865 67965729
4420 67965729 67941448 67260093 66030475 64268896 62169072 59702707 56836838 53495894 50010953
4411 50010953 46556204 43173619 40038442 37065229 34178114 31556617 29101465 26913995
4403B6913995k070028j757922j629739j412961j107661j087510j052646r85419
4395A5810109q95272q08277o79563p10515n69396m84863n58271m81248m39570
4386A0183134m05446l91095m57484m39803l34561k05306k52774k57477k38040
4377G201148j80914k22582k65222j01227k03641j88269j74601j80802r4927k34947
4367E354016p8051j23574o7008j00004j22977j32844j12763m5154j67351q7658
4357D316632l9387o5320j29323K1467n091m8058m6454K2600m6684j00237o6181
4346C813964M918r0199j05176k9514r952q9239L5123o1128n7090Q922p3606n8079
4334C288944j1491k4054Q1353J0700l1463K8666J7554r68k9877k0732r7974l8233
$$ plain form
4403 26913995 24843967 23086045 21456306 20043345 18935684 17848174 16795528 15810109
4395 15810109 14914837 14106560 13426997 12716482 12147086 11662223 11103952 10622704 10183134
4386 10183134 9777688 9386593 8929109 8489306 8154745 7949439 7696665 7439188 7201148
4377 7201148 7020234 6797652 6532430 6431203 6227562 6039293 5864692 5683890 5588963 5354016
4367 5354016 5275965 5152391 5085383 4985379 4862402 4729558 4616795 4571641 4404290 4316632
4357 4316632 4277245 4211925 4082602 4104069 4098978 4050920 4004466 4027066 3980382 3880145 3813964
4346 3813964 3818882 3728683 3623507 3593993 3584041 3494802 3529925 3468797 3411707 3420629 3347023 3288944
4334 3288944 3277453 3253399 3334752 3345452 3313989 3342655 3360209 3359241 3329364 3308632 3210658 3172425
4322C172425k9008K1004L4421p0675p681J0142p1634K0216L1845O8568O3502Q0590
4310C323715J718P2449R5541M3967O1583L0510J07836J38518J14711P4425J23768
4299D188741Q2666K4771J02803n358l0781j8491j59643n1249l2907r6416j36820
4288C867316j68892r0958m9978r4313k01160p5332j06442j9600j47739j5833k0752
4277B876317j77091j00424l5304K5243o9343r6258q8044n7696r25M3112l8984
4266B280603o2544R881R1488n395q6187j29481q6157P872n277J40648m1110q8132
4254B026209j6296p233J18587p7100n1119Q1701J172L0379Q9942J14166k3246
4243B287162N1508N447J05962M2823J11634J31465L3039R3264L2970L8417J4641
$$ plain form
4322 3172425 3143417 3164421 3198842 3128167 3120486 3130628 3058994 3079210 3111055 3179623 3243125 3323715
4310 3323715 3325433 3397882 3493423 3537390 3598973 3629483 3737319 3875837 3990548 4064973 4188741
4299 4188741 4271407 4296178 4398981 4393623 4362842 4344351 4184708 4133459 4100552 4004136 3867316
4288 3867316 3698424 3607466 3557488 3463175 3262015 3186683 3080241 3060641 2912902 2897069 2876317
4277 2876317 2699226 2598802 2563498 2588741 2519398 2423140 2335096 2277400 2276475 2319587 2280603
4266 2280603 2218059 2227940 2319428 2314033 2227846 2098365 2012208 2020080 2014803 2155451 2114341 2026209
4254 2026209 2009913 2002680 2121267 2044167 1993048 2074749 2075921 2106300 2196242 2310408 2287162
4243 2287162 2338670 2344117 2450079 2492902 2604536 2736001 2769040 2862304 2895274 2933691 2948332
4232B948332L3845o1911n8724J0892O2286m2353q8476r3002r9759q5982r8722
4221B426426l4552m6723k2472m3293j9068J4589r0442k6541p0267l5817j0160
4210B041680p3043J5641K7898p8718J09189K9299j34521K1776n803K0438J08994
4199B082830P4558R4628O0338R1652L7843j7567n6836k2380k1733k1639r1160
4188B210534j13871j02103Q4173K6990r179O843j07594j28414K1618k1335m8416
4177A819246n7438k7096j7228M3774j17787m4621J5235N0024L278j34883O0106
4166A592610j7089q153k3302L7281O1168N9971j4909J320p2387l5889j491N1915
4154A631045m0105P133K4663o2054J6253l5889k0310R3691n5857m5907R5570k7706
$$ plain form
4232 2948332 2982177 2920266 2861542 2872434 2934720 2892367 2803891 2710889 2611130 2525148 2426426
4221 2426426 2391874 2345151 2322679 2279386 2260318 2274907 2184465 2157924 2087657 2051840 2041680
4210 2041680 1968637 1984278 2012176 1933458 2042647 2071946 1937425 1959201 1953398 1973836 2082830
4199 2082830 2157388 2252016 2312354 2404006 2441849 2424282 2367446 2345066 2323333 2301694 2210534
4188 2210534 2096663 1994560 2078733 2105723 2096544 2103387 1995793 1867379 1888997 1867662 1819246
4177 1819246 1761808 1734712 1717484 1761258 1643471 1598850 1614085 1664109 1667387 1532504 1592610
4166 1592610 1575521 1567368 1544066 1581347 1642515 1702486 1687577 1688897 1616510 1580621 1579130 1631045
4154 1631045 1590940 1598073 1622736 1560682 1576935 1541046 1520736 1614427 1558570 1512663 1608233 1580527
4142A580527k4821N1190L7894j6473n7031N860J01633k9137q4287J07663P7917
4131A750935k5947k9514j0411k4699N3885L8119Q471k8299N143j6756p1880J4577
4119A663624N8108n5361R0552L4658l2942J8604m6008k0661j9388O0061P145J6956
4107A775348J5646R883P8742O8601K7332L4814N5390J3998M0793J31762N8975
4096B311284O3222J59212J82494J28472J22539J84780J89565K36025J91020M1446
4086C810059q0561o1961k7480o2697n7381o7880q9420q1631j29587j81298j58941
4075B811222j39644j00164p4694j7525m6949r9608L694P2235n4200n0431l417
4064B300519M95q0221q1965L5015k1254n0076J09503j3027q6043K9026Q163m051
$$ plain form
4142 1580527 1555706 1606896 1644790 1628317 1571286 1577146 1678779 1649642 1565355 1673018 1750935
4131 1750935 1724988 1695474 1685063 1660364 1714249 1752368 1760839 1732540 1737683 1720927 1649047 1663624
4119 1663624 1721732 1666371 1756923 1791581 1758639 1777243 1731235 1710574 1691186 1751247 1758392 1775348
4107 1775348 1790994 1800877 1879619 1948220 1975552 2010366 2065756 2079754 2120547 2252309 2311284
4096 2311284 2374506 2533718 2716212 2844684 2967223 3152003 3341568 3577593 3768613 3810059
4086 3810059 3729498 3667537 3640057 3577360 3519979 3452099 3362679 3281048 3151461 2970163 2811222
4075 2811222 2671578 2571414 2496720 2479195 2432246 2332638 2336332 2408567 2354367 2303936 2300519
4064 2300519 2301014 2220793 2138828 2173843 2152589 2102513 2212016 2198989 2112946 2141972 2150135 2146084
4052B146084j1232j4747o48J9667K1226K2934k4599O9641p4979P4746N5177P1366
4040B354636L7031L4164R8925L3280o6432n9464R4234J02083j0915M2006J34110
4029B793658p751N7242K9778J46856Q2206N2962P6999J97817J52488J66885J90092
4018C939232J60221J20975J19311O6525p5247j1466l9169j52831k8452o9424j41373
4007C888302l0721j12680k04569j24359o6243L2720j35744j13490n9494M5327
3997C119049O340j3063k0947L82l1241p0863L8112J39327J28969O890j5020J4310
3985C302245O5990j6469Q6656K9098l4290J05671J9673R5664M5883j6558J39374
3974C822937J24857O0261j9598O9631N7934J53711N0734Q9888J24078O3567n7890
$$ plain form
4052 2146084 2134852 2120105 2119457 2139124 2160350 2183284 2158685 2228326 2153347 2228093 2283270 2354636
4040 2354636 2391667 2425831 2524756 2558036 2491604 2432140 2526374 2628457 2617542 2659548 2793658
4029 2793658 2785907 2843149 2872927 3019783 3101989 3154951 3231950 3429767 3582255 3749140 3939232
4018 3939232 4099453 4220428 4339739 4406264 4331017 4319551 4280382 4127551 4099099 4029675 3888302
4007 3888302 3857581 3744901 3540332 3415973 3349730 3382450 3246706 3133216 3073722 3119049
3997 3119049 3125389 3112326 3091379 3091761 3060520 2989657 3027769 3167096 3296065 3302955 3287935 3302245
3985 3302245 3368235 3351766 3438422 3467520 3433230 3538901 3558574 3654238 3700121 3683563 3822937
3974 3822937 3947794 4008055 3988457 4058088 4116022 4269733 4320467 4410355 4534433 4598000 4540110
3963D540110l5834j8225j9617J4718O0686r063j26661p8981L1138n9508l4703
3952D264060j3063r096m7709l8300m805J01868m813N0346M7366j4496L5066J29807
3940D496231M0568m9268N4358P9693J31721J10697Q1299J724r262m9849L3179
3929D921091Q5740Q0422M9399o067M7620N2241K7601O6863o0636N3032O1044J6011
3917E394361J17249N9088M5545J5128O7125J68003K744J8530N5806J03359J03823
3906F150761J5939J0008R6286N1393j2133P0517Q2838N1016K311Q520J01623m6704
3894F582375N897k5648J8115M4850M4722O4727j830J01215K6201Q8021J68675
3883G117320R7495J3235J83836K36237Q0419J26731K18594J75124J7571J07745
$$ plain form
3963 4540110 4504276 4486051 4466434 4481152 4541838 4532775 4406114 4327133 4358271 4298763 4264060
3952 4264060 4250997 4241901 4194192 4155892 4151087 4252955 4248142 4298488 4345854 4331358 4366424 4496231
3940 4496231 4536799 4487531 4541889 4621582 4753303 4864000 4945299 4947023 4937761 4887912 4921091
3929 4921091 5006831 5087253 5136652 5130585 5178205 5230446 5258047 5324910 5264274 5317306 5378350 5394361
3917 5394361 5511610 5570698 5616243 5631371 5698496 5866499 5869243 5887773 5943579 6046938 6150761
3906 6150761 6166700 6176708 6272994 6324387 6312254 6382771 6465609 6516625 6518936 6527456 6629079 6582375
3894 6582375 6588272 6562624 6580739 6625589 6670311 6735038 6733208 6834423 6860624 6948645 7117320
3883 7117320 7214815 7228050 7411886 7648123 7728542 7855273 8073867 8248991 8266562 8374307
3873H374307J81751J93478K09727J18581J61544J57047K07355K23780J75311K25868
3863A0228749K40754K23681K62411K69861J92390L39038K32665K55647L87901
3854A2633097L27305K30764K14233J95585J40314J94801K73601J72129J71235
3845A4553064J87860J99292J17123J28756J72229J23644J46657J40732J54642
3836A5923999J84451J88990J11177J44693J08761P1911K02458K06199J93630J66467
3826A7502736J15284J95167J15393K35879K17400K18436K05510J33464M6247J26255
3816A9111771J89114J81440K66848K21662K19694L40104M43883M01183M28626
3807B1804325N92444O93549P05074O28392P78585O69152O44152R22965R56213
$$ plain form
3873 8374307 8556058 8749536 8959263 9077844 9239388 9396435 9603790 9827570 10002881 10228749
3863 10228749 10469503 10693184 10955595 11225456 11417846 11756884 11989549 12245196 12633097
3854 12633097 12960402 13191166 13405399 13600984 13741298 13936099 14209700 14381829 14553064
3845 14553064 14740924 14940216 15057339 15186095 15358324 15481968 15628625 15769357 15923999
3836 15923999 16108450 16297440 16408617 16553310 16662071 16733982 16936440 17142639 17336269 17502736
3826 17502736 17618020 17813187 17928580 18164459 18381859 18600295 18805805 18939269 18985516 19111771
3816 19111771 19300885 19482325 19749173 19970835 20190529 20530633 20974516 21375699 21804325
3807 21804325 22396769 23090318 23795392 24423784 25202369 25871521 26515673 27438638 28394851
3798B8394851J081353J107517J083563J315366J189974J258865J260812J273179
3790C7965480J328438J361903J382429J503351J507898J680318J832643J840773
3782E0403233J836225J836539J861576J727735K101784K395584K683417L205887
3774F8051980L781661M633919N353280O125502O886472P842421Q970695J0356461
3766A22002391J2302101J4462434J7071003K0800136K5906254L1127108L3747315
3759B77418742L2270813K2197890O092197p467365j7004038j9231159j2329941
3752B81947139q123221r892537j4561882k2785382k7186582k7315295k2924204
3745A49158036j7542846j3339975j0365746q034276o327000n355805m687165m168057
$$ plain form
3798 28394851 29476204 30583721 31667284 32982650 34172624 35431489 36692301 37965480
3790 37965480 39293918 40655821 42038250 43541601 45049499 46729817 48562460 50403233
3782 50403233 52239458 54075997 55937573 57665308 59767092 62162676 64846093 68051980
3774 68051980 71833641 76467560 81820840 87946342 94832814 102675235 111645930 122002391
3766 122002391 134304492 148766926 165837929 186638065 212544319 243671427 277418742
3759 277418742 309689555 331887445 337979642 330512277 313508239 294277080 281947139
3752 281947139 273823918 263931381 249369499 226584117 199397535 172082240 149158036
3745 149158036 131615190 118275215 107909469 99875193 93548193 88192388 83505223 79337166
3737G9337166l461144l092988k491426j980800j740508j511050j333288j156595
3729F2569367q32638o46037n69510m33553k32662O5423K19415J64900N03011M59160
3719F1266876M46206N29765N59629O01269P95931R68275J068615J271783J520967
3710F9029316J478913J654790J711473J659627J788790J837279K078564K533397
3702H3772149L326489L927022M618202N388927O216078P187394Q250500R596316
3694A32283077J1381404J3304009J5504708J8338524K2565530K7908409L1314781
3687B72600442L1701144K8084032J7593049N750677j377326r722899j4528916
3680C30100203j1100879j0875027j3718607j4288037j7305297k1537946k3969459
$$ plain form
3737 79337166 75876022 72783034 70291608 68310808 66570300 65059250 63725962 62569367
3729 62569367 61736729 61090692 60521182 60087629 59854967 59920390 60139805 60304705 60807716 61266876
3719 61266876 61713082 62242847 62802476 63403745 64199676 65167951 66236566 67508349 69029316
3710 69029316 70508229 72163019 73874492 75534119 77322909 79160188 81238752 83772149
3702 83772149 87098638 91025660 95643862 101032789 107248867 114436261 122686761 132283077
3694 132283077 143664481 156968490 172473198 190811722 213377252 241285661 272600442
3687 272600442 304301586 332385618 349978667 355729344 354352018 344629119 330100203
3680 330100203 318999324 308124297 294405690 280117653 262812356 241274410 217304951
3673B17304951k1829280j6425180j1869982q579768o310809m497025l403527k725210
3665A41664170k270787k071393k014738j894973j631272j389198j417692j646846
3657A27327271j810305k297306k506962k688878k970564l248822l453035l488310
3649A04863089l522307l423612l315052l098450k837679k607267k261024j864739
3641H1932959j557974j437068j406706j540685j838408k142001k295139k348852
3633F7366126k437997k576999k647232k608994k588286k436515k305599k260085
3625D7504419j998841j723234j529093j351124j249867j029620r07097r08760
3617C6806783p64308o68822p61310o42104o55000o05162n74956o39303o80464
$$ plain form
3673 217304951 195475671 179050491 167180509 158600741 152289932 147792907 144389380 141664170
3665 141664170 139393383 137321990 135307252 133412279 131781007 130391809 128974117 127327271
3657 127327271 125516966 123219660 120712698 118023820 115053256 111804434 108351399 104863089
3649 104863089 101340782 97917170 94602118 91503668 88665989 86058722 83797698 81932959
3641 81932959 80374985 78937917 77531211 75990526 74152118 72010117 69714978 67366126
3633 67366126 64928129 62351130 59703898 57094904 54506618 52070103 49764504 47504419
3625 47504419 45505578 43782344 42253251 40902127 39652260 38622640 37715543 36806783
3617 36806783 36042475 35373653 34612343 33970239 33315239 32710077 32135121 31495818 30815354
3608C0815354p14596o87377o31315o96760o76454o70812o77590n93933n37892
3599B4928625m88400n03288n08124m52890m85617m38660m87746m60923m05128
3590B0697849m22777n11032n22094m94945m42119m03537l94094m36744l88468
3581A6682039l83760k74890k69929l09566k46068j22595j93363k51746k39553
3572A4390569j63428q7032r8374k1699n6193p6771m6536q1402m8174M765K4999
3561A3740724p6155n8095j28654r6392m4970o020j24439r5137o6100j9820q2239
3550A2942703k1519P5995j69875L7368j1647k9563m7161n5753j7953l6232l3356
3539A2633007o7377q4049m4911o2610j02135j89228j12129m5679p6974m0649k834
$$ plain form
3608 30815354 30100758 29413381 28782066 28085306 27408852 26738040 26060450 25466517 24928625
3599 24928625 24440225 23936937 23428813 22975923 22490306 22051646 21563900 21102977 20697849
3590 20697849 20275072 19764040 19241946 18747001 18304882 17901345 17507251 17070507 16682039
3581 16682039 16298279 16023389 15753460 15443894 15197826 15075231 14881868 14630122 14390569
3572 14390569 14227141 14140109 14041735 14020036 13963843 13887072 13840536 13759134 13710960 13715725 13740724
3561 13740724 13664569 13606474 13477820 13381428 13336458 13330438 13205999 13110862 13044762 13024942 12942703
3550 12942703 12921184 12997179 12827304 12864672 12853025 12823462 12776301 12720548 12702595 12666363 12633007
3539 12633007 12565630 12481581 12436670 12374060 12271925 12082697 11970568 11924889 11847915 11807266 11804432
3528A1804432r1787m0431q1981n1244q7269p3828r4334j0092q8424m0251m4149
3517A1100642j29984j61414j45750q1367r6469j24317j21905r3823q9999l5598
3507A0020016k7478K9246j1215M8773m9433n4924L2589J3752l0449N586Q5886
3496A0062349M9259K7582J18147K1812l2153m5881J07116j4960j04439O0261J17925
3485A0367018J01587J1157J0263o0350N3244m1043r298O7373L4662M9657J66924
3474A0751194L4997P0066J04580M0919Q7795R0683Q7297J70994J86733Q6487K8579
3463A1740324O5445N2399p635n4367L6787K5645o698m1048j3329q323l4874Q0602
3451A1834928K2678k020L0838R0842R6146P4025Q2417O1683J32986J62121M7957
$$ plain form
3528 11804432 11712645 11672214 11590233 11538989 11451720 11377892 11283558 11273466 11185042 11144791 11100642
3517 11100642 10970658 10809244 10663494 10582127 10485658 10361341 10239436 10145613 10055614 10020016
3507 10020016 9992538 10021784 10010569 10059342 10009909 9954985 9987574 10001326 9970877 9976463 10062349
3496 10062349 10111608 10139190 10257337 10279149 10246996 10201115 10308231 10293271 10188832 10249093 10367018
3485 10367018 10468605 10479762 10490025 10429675 10482919 10441876 10432578 10499951 10534613 10584270 10751194
3474 10751194 10786191 10856257 10960837 11001756 11089551 11180234 11267531 11438525 11625258 11711745 11740324
3463 11740324 11805769 11858168 11850533 11796166 11832953 11858598 11851900 11810852 11797523 11789200 11754326 11834928
3451 11834928 11857606 11855586 11886424 11977266 12073412 12147437 12229854 12291537 12424523 12586644 12634601
3440A2634601R6748J55042K31521Q0977Q5906J79778J28367J22445J72241J82025
3430A4069651J41770J90793J96097J79214L45161K57861K76134J23618J10827
3421A5891126J34169J39758K0706K54797J92220J64508K23857J78090J81449K22782
3411A7603462M00675L63654M87370M19666M55455M45061N73296O57975O04089
3402B2010703O45702P88997P26705P56753P97170Q20571R07783R63609R67899
3393B9385892J010358J149581J215906J284505J426041J672057J848408K024492
3385D1017240K447342K715926L147872L465800L741968M270676M713494N311993
3377G0832311O002212O782467P683483Q582334R661095J0260817R903830Q394026
$$ plain form
3440 12634601 12731349 12886391 13117912 13198889 13284795 13464573 13592940 13715385 13887626 14069651
3430 14069651 14211421 14402214 14598311 14777525 15122686 15380547 15656681 15780299 15891126
3421 15891126 16025295 16165053 16185759 16440556 16632776 16797284 17021141 17199231 17380680 17603462
3411 17603462 18004137 18367791 18855161 19274827 19730282 20175343 20748639 21406614 22010703
3402 22010703 22656405 23445402 24172107 24928860 25726030 26546601 27454384 28417993 29385892
3393 29385892 30396250 31545831 32761737 34046242 35472283 37144340 38992748 41017240
3385 41017240 43464582 46180508 49328380 52794180 56536148 60806824 65520318 70832311
3377 70832311 76834523 83616990 91300473 99882807 109543902 119804719 129708549 138102575
3369A38102575N600073J998115j184876k916356l501559m000476n298390p309340
3361A21489766q924770r378333q847843p855630o900419n900993n085819m436915
3353F4159044l887833l281743k923222k599482k273396k083896j837292j652925
3345D3619255j581467j350550j101304j024735r37177q18560o56015o23593n81493
3336C4944361m50213l31962l16069j44817p8957M2623R3124O4403K03031L75796
3326C4401320M06885N31381P14953Q63651J014640J131968J241360J277543J246221
3317D2829922R25106P44890M43032J51154j13671k39645n02200o65545p24996
3308D2848047p69668p31217m75063m10770j65475J44054K90893M57665N47544
$$ plain form
3369 138102575 143702648 145700763 144515887 141599531 138097972 134097496 128799106 121489766
3361 121489766 112564996 103186663 94338820 86483190 79582771 73681778 68595959 64159044
3353 64159044 60271211 56989468 54066246 51466764 49193368 47109472 45272180 43619255
3345 43619255 42037788 40687238 39585934 38561199 37624022 36805462 36149447 35525854 34944361
3336 34944361 34494148 34162186 33846117 33701300 33622343 33664966 33758090 33822493 34025524 34401320
3326 34401320 34808205 35339586 36054539 36918190 37932830 39064798 40306158 41583701 42829922
3317 42829922 43755028 44499918 44942950 45094104 44980433 44740788 44238588 43573043 42848047
3308 42848047 42078379 41347162 40872099 40461329 40295854 40439908 40730801 41188466 41736010
3299D1736010Q03615R26407J258954J395618J672343J823661K115799K454196
3291E4186603K606767K964994L410638L650826L784819L891603L631994L135240
3283H1263484K325175J584451J026683R07220Q28226N46388N38540P14407J338032
3274I1072606K190176L155007M439193N947610P489876Q698693R584431R938227
3266A42515819R110169P321614N359208L014387O55793j547118l735107n672462
3258A57022303o900246p939560q478647q582548q471489p929984p259019o466784
3250I4994026n853838n318442m971718m600315m394592m099759l929344l603881
3242E8222137l410360l106579k832758k590860k294334k008531j808418j681540
$$ plain form
3299 41736010 42539625 43466032 44724986 46120604 47792947 49616608 51732407 54186603
3291 54186603 56793370 59758364 63169002 66819828 70604647 74496250 78128244 81263484
3283 81263484 83588659 85173110 86199793 87107013 87935239 88481627 89020167 89734574 91072606
3274 91072606 93262782 96417789 100856982 106804592 114294468 122993161 132577592 142515819
3266 142515819 151625988 158947602 164306810 167321197 167976990 166429872 162694765 157022303
3258 157022303 150122057 142182497 133703850 125121302 116649813 108719829 101460810 94994026
3250 94994026 89140188 83821746 78850028 74249713 69855121 65755362 61826018 58222137
3242 58222137 54811777 51705198 48872440 46281580 43987246 41978715 40170297 38488757
3234C8488757j523234j420059j223884j080113j143754j085591r59888q13065
3226B9239169p92314q00559p09256o74158n80502m74401m75306m97701l96713
3217B3838259l18503l32285l32755k87281j73682l34909m32714m59997m96494
3208B0669639l96416m14904m34073m87463m72043m85961m02163l27028l35255
3199A6914333k68848k09366j75887k15300j87464j49303m1488j10025j38155p6448
3189A5342049j44600k14235j58326j34897j37376m4255j53042m1057j34396j69737
3179A4010128j38874J5332n4517m6477p986l7618M471K6272p236l1857R8284L7533
3167A3867455o8257r9070j05140o9491r7560k7922l4893j12340j27057j04600
$$ plain form
3234 38488757 36965523 35545464 34321580 33241467 32097713 31012122 30052234 29239169
3226 29239169 28446855 27646296 26937040 26262882 25682380 25207979 24732673 24234972 23838259
3217 23838259 23519756 23187471 22854716 22567435 22393753 22058844 21626130 21166133 20669639
3208 20669639 20273223 19858319 19424246 18936783 18464740 17978779 17576616 17249588 16914333
3199 16914333 16645485 16436119 16260232 16044932 15857468 15708165 15666677 15556652 15418497 15342049
3189 15342049 15197449 14983214 14824888 14689991 14552615 14508360 14355318 14314261 14179865 14010128
3179 14010128 13871254 13886586 13832069 13785592 13777606 13739988 13744459 13770731 13763495 13731638 13829922 13867455
3167 13867455 13799198 13700128 13594988 13525497 13427937 13400015 13365122 13252782 13125725 13021125
3157A3021125k8845q4741q0177j14513q6502n7118j09984j06169j12462m5956
3147A2194658j16489r3142k1304n52Q7870O4954P526R6108J70234J27954R5009
3136A2612826Q2904P2277Q5772j4792j4396N4368J7182J7495L3341m1665l1621
3125A2873691o8879o0866L9297P7958N0122m0781j31185p1348m8973r8836j08570
3114A2411630j07945j38828r8356p5343j03608j43444r5206k7375o0331R279N6289
3103A1626762M3931M9872J2373J20552J07461K5035R7987m0183j75854j83364
3093A1684572p3060j45589j32840k31201k32802q8082r9870j22980j16198k3465
3083A0418485m552K6906P9088J47952J11964J6084Q7757O2153O8334P5971K2931
$$ plain form
3157 13021125 12992280 12907539 12827362 12712849 12626347 12569229 12459245 12353076 12240614 12194658
3147 12194658 12078169 11985027 11963723 11963171 12051041 12115995 12123521 12219629 12389863 12517817 12612826
3136 12612826 12695730 12768007 12853779 12838987 12824591 12878959 12896141 12913636 12946977 12905312 12873691
3125 12873691 12804812 12743946 12783243 12861201 12911323 12870542 12739357 12668009 12619036 12520200 12411630
3114 12411630 12303685 12164857 12066501 11991158 11887550 11744106 11648900 11621525 11561194 11570473 11626762
3103 11626762 11670693 11720565 11732938 11853490 11960951 11985986 12083973 12043790 11867936 11684572
3093 11684572 11611512 11465923 11333083 11101882 10869080 10780998 10681128 10558148 10441950 10418485
3083 10418485 10413933 10440839 10519927 10667879 10779843 10795927 10883684 10945837 11014171 11090142 11113073
3072A1113073n3795n7742j10954k20077r7476r9655j10699k0092q2558q6090r1643
3061A0082292n5392r9011M6737Q5151k1737O2139J16714J07976k6639J17797J83051
3050A0599078J65857J99636J90096P6834Q4295J50050J44325L9663k5870L1552
3040A1655516j6825K0934L4068L2186Q9798K9291J4372O8256R4855J24845J12326
3029A2259622J52995J47932J96678K39087J55649J87446J99810K84622K80127
3020A4103968K63315L12467K39923L52668L57208L73237M62687M82989N17267
3011A7465729O12287O15153O43103M88488L70221J61163R1096J17813K98215K88836
3001B1152104J30519J5019n7514j7146R4835J48287J64691K15382L31723L21291
$$ plain form
3072 11113073 11059278 11001536 10890582 10670505 10573029 10473374 10362675 10342583 10260025 10173935 10082292
3061 10082292 10026900 9927889 9974626 10059777 10038040 10100179 10216893 10324869 10298230 10416027 10599078
3050 10599078 10764935 10964571 11154667 11231501 11315796 11465846 11610171 11649834 11623964 11655516
3040 11655516 11638691 11659625 11693693 11725879 11815677 11844968 11859340 11927596 12022451 12147296 12259622
3029 12259622 12412617 12560549 12757227 12996314 13151963 13339409 13539219 13823841 14103968
3020 14103968 14367283 14679750 14919673 15272341 15629549 16002786 16465473 16948462 17465729
3011 17465729 18078016 18693169 19336272 19824760 20194981 20356144 20447240 20565053 20863268 21152104
3001 21152104 21282623 21297642 21240128 21222982 21317817 21466104 21630795 21846177 22177900 22499191
2991B2499191K32146J22933K22168J07971R5219J27197J73473J83366J14047J17735
2981B3995446J32305J40580K42071J46598J64823J75842R0921J81255Q1096J2915
2971B5363852M503J28653K8930o2006q6943M9056n321K7981j1028N5313p4048
2960B5418942o8655M3958J5669n4872j25578m5047o9089q2833M5967J009m2235
2949B5037236J32700J34402J4760K05245J35740P2831J53814J19518J74892J24737
2939B6305875J82268K32740J44199K67972M28343L75668M38410O22656M44911
2930B9443042N34151M23842L09830J86491J84522J45121Q1876k1962j6627l4987
2920C1235299J48639K22550K15352K75179L43321M89288M47900K50847J45853
$$ plain form
2991 22499191 22731337 22854270 23076438 23184409 23279628 23406825 23580298 23763664 23877711 23995446
2981 23995446 24127751 24268331 24510402 24657000 24821823 24997665 25088586 25269841 25350937 25363852
2971 25363852 25368355 25497008 25525938 25463932 25376989 25426045 25420724 25448705 25437677 25492990 25418942
2960 25418942 25350287 25394245 25409914 25355042 25229464 25184417 25115328 25032495 25078462 25079471 25037236
2949 25037236 25169936 25304338 25319098 25524343 25660083 25732914 25886728 26006246 26181138 26305875
2939 26305875 26488143 26720883 26865082 27133054 27561397 27937065 28375475 28998131 29443042
2930 29443042 29977193 30401035 30710865 30897356 31081878 31226999 31308875 31286913 31270286 31235299
2920 31235299 31383938 31606488 31821840 32097019 32440340 32929628 33377528 33628375 33774228
2911C3774228L3060r7689k14128j96575k41958k99337k31940j89791p2534k3064
2901C2240272m182J1471R8448j17344k22554k87878m03474m76234n86085n71183
2891B9681257o37730o65486o67065n93447o16501n67779m80520n19250o02111
2882B4331368o25899n35132n91076n21556n44169n52895o06947n81656m35571
2873A9336467n39324m91640l53354m14730k77211l01579j95868l24697k07923
2864A6230141k85734k12408k24792k49251l50886k29134k98334l46267l30458
2855A3702877l47477l34508k92394k23627j34430k62166k86464j75567k55175
2846A1391069m2616j30476k04737j41253l9665p3717m8522j11390p9199q0373
$$ plain form
2911 33774228 33807288 33709599 33495471 33298896 33056938 32757601 32525661 32335870 32263336 32240272
2901 32240272 32236090 32247561 32346009 32228665 32006111 31718233 31314759 30838525 30252440 29681257
2891 29681257 29043527 28378041 27710976 27117529 26501028 25933249 25452729 24933479 24331368
2882 24331368 23705469 23170337 22579261 22057705 21513536 20960641 20353694 19772038 19336467
2873 19336467 18797143 18305503 17952149 17537419 17260208 16958629 16762761 16438064 16230141
2864 16230141 15944407 15731999 15507207 15257956 14907070 14677936 14379602 14033335 13702877
2855 13702877 13355400 13020892 12728498 12504871 12370441 12108275 11821811 11646244 11391069
2846 11391069 11348453 11217977 11013240 10871987 10832322 10758605 10710083 10598693 10519494 10439121
2836A0439121k7791k16m3939J1435m3053J8252O1533j26207R0968P9411L35P2964
2824A0532813J06999J12299m2932k7177J8263m4765R3276J68433k7871p8246M2113
2813A0853205M8463j0054n7934j5302J3209l0252k9959l5163Q3422k0563j5591
2802A0783481L322l9968k7307N8853J02651M3606L4104m784M8234O5202K9809
2791A1097203O9407O8399m791k2229K682M0996J10610j0704M9794N2494O4352
2780A1518213J5017m0576O8020J02393M0871R2442o828o6254N5623J06290O9065
2769A1954276J6234Q5770M6364K5077R7460J37030Q8370R5928R2440L9922M1340
2758A2720211J01651P8163J38443M2571J51450J79627J41017J88805K22674K15271
$$ plain form
2836 10439121 10411330 10411114 10367175 10378610 10335557 10353809 10415342 10289135 10380103 10459514 10459849 10532813
2824 10532813 10639812 10752111 10709179 10682002 10700265 10655500 10748776 10917209 10889338 10811092 10853205
2813 10853205 10901668 10891614 10833680 10818378 10831587 10801335 10771376 10736213 10819635 10799072 10783481
2802 10783481 10786803 10746835 10719528 10778381 10881032 10924638 10958742 10953958 11002192 11067394 11097203
2791 11097203 11166610 11235009 11230218 11207989 11210671 11251667 11362277 11351573 11401367 11453861 11518213
2780 11518213 11533230 11492654 11560674 11663067 11703938 11796380 11789552 11723298 11778921 11885211 11954276
2769 11954276 11970510 12056280 12102644 12127721 12225181 12362211 12450581 12546509 12638949 12678871 12720211
2758 12720211 12821862 12900025 13038468 13081039 13232489 13412116 13553133 13741938 13964612 14179883
2748A4179883K55294K50635L12607L64236L07663M44674M50443M70869N01732
2739A7538036N03101M99113M87790M59831M94985N83627N00028N04413N73545
2730B2144469L84369M20293M79096L92112K91296L86440K94529J11864K6967K9056
2720B4960491J20143Q8065n2448q1101P3535o9782K7782n4485J2262L9108o8323
2709B4995247j41431j15229j24451r8377k36093k08475k41646j88913j86966j38414
2699B3315252q3762J9405M7259M4125J29669J52225J67276L56634K59601L55656
2689B4763340N01140M99729M67122M68143N99868M45812N58711N18525M68683
2680B9291073N42888M78336M69073L23719K90908K83432L10086J84480J16498
$$ plain form
2748 14179883 14435177 14685812 14998419 15362655 15670318 16114992 16565435 17036304 17538036
2739 17538036 18041137 18540250 19028040 19487871 19982856 20566483 21066511 21570924 22144469
2730 22144469 22528838 22949131 23428227 23820339 24111635 24498075 24792604 24904468 24931435 24960491
2720 24960491 25080634 25168699 25116251 25035150 25108685 25038903 25066685 25012200 25024462 25063570 24995247
2709 24995247 24853816 24738587 24614136 24515759 24279666 24071191 23829545 23640632 23453666 23315252
2699 23315252 23231490 23250895 23298154 23342279 23471948 23624173 23791449 24148083 24407684 24763340
2689 24763340 25264480 25764209 26231331 26699474 27299342 27745154 28303865 28822390 29291073
2680 29291073 29833961 30312297 30781370 31105089 31395997 31679429 31989515 32173995 32290493
2671C2290493J52560o4682j16452N414n5370k17158l19983k24418l63543m46072
2661C0640789l73997m47411l84519m67522n13438n07307l64431m22792m91317
2652B6668055n59088m17254n43808n85108n16445n09624n31728m75251m96378
2643B2033371m90239n44033m09450m03793l86726l38840l04480k62229k81673
2634A8611908k49660j35981j95613r3397j58977j45887j82327j38183o3266r070
2624A7239547k9976O670p0873n7046k1808K6583n849n9880N1172O9426j8620o0359
2612A7068987J7214J477L0264k5782o1484L7984O5856J4791P9158P6913j2099
2601A7293279R6044J29744k480J16405K8397J03747J13233J11034K24745K34416
$$ plain form
2671 32290493 32443053 32378371 32261919 32267333 32211963 31994805 31674822 31450404 31086861 30640789
2661 30640789 30266792 29819381 29434862 28967340 28453902 27946595 27582164 27159372 26668055
2652 26668055 26108967 25691713 25147905 24562797 24046352 23536728 23005000 22529749 22033371
2643 22033371 21543132 20999099 20589649 20185856 19799130 19460290 19155810 18893581 18611908
2634 18611908 18362248 18226267 18030654 17937257 17778280 17632393 17450066 17311883 17248617 17239547
2624 17239547 17209571 17216241 17145368 17088322 17066514 17093097 17087248 17027368 17078540 17147966 17129346 17068987
2612 17068987 17086201 17087678 17117942 17092160 17030676 17068660 17134516 17149307 17228465 17305378 17293279
2601 17293279 17389323 17519067 17516587 17632992 17661389 17765136 17878369 17989403 18214148 18448564
2591A8448564K61563J28662K59522L78292K54752L55051K90681L03132L57278
2582B1037497L96306M58399L40850L90667L96287N00624M54278M29955M77293
2573B4882156M29757N62087M47757M58194N65425N16189O11565O79298Q17098
2564B9969526P31256Q24493R88594J096221J171922J190094J401605J440498J517585
2555D0331794J541238J623881J697714J766633J616344J753479J619388J538702
2547E3489173J426874J234788J220041Q82067N40271M02406R6135k76723m21954
2538E8593078o90948r87476j016813j115139j091894j129274r50324r17268q38096
2529D9855846n84628m03657k85966r4658O2488L38007N46096P64064P86341Q54755
$$ plain form
2591 18448564 18710127 18838789 19098311 19476603 19731355 20086406 20377087 20680219 21037497
2582 21037497 21433803 21892202 22233052 22623719 23020006 23520630 23974908 24404863 24882156
2573 24882156 25311913 25874000 26321757 26779951 27345376 27861565 28473130 29152428 29969526
2564 29969526 30700782 31525275 32513869 33610090 34782012 35972106 37373711 38814209 40331794
2555 40331794 41873032 43496913 45194627 46961260 48577604 50331083 51950471 53489173
2547 53489173 54916047 56150835 57370876 58252943 58793214 59195620 59291755 59015032 58593078
2538 58593078 57902130 56914654 55897841 54782702 53690808 52561534 51611210 50693942 49855846
2529 49855846 49271218 48867561 48581595 48486937 48549425 48887432 49433528 50197592 50983933 51838688
2519E1838688J090712J344791J417351J589642J854759J940002K124467K426068
2511F5626480K582965K750557L023622L057812L151503L162520L044802K946746
2503H9347007K704423K319853J948539J458086J066277O48647J98652N5357o0619
2494I9686222j7095O7895J55447J06396R4156J63817O0071k48529o80895j068336
2484I8319149j698903k160295k641504l085691l436880l651250l775080l790939
2476G4078607l611511l465938l280574l068600k822715k503831k296103k170499
2468E0858836k002321j773091j717584j507352j442856j374468j273096j102218
2460C8665850j130905j080714j087869q60336p78088p77241p21951p24523n93165
$$ plain form
2519 51838688 52929400 54274191 55691542 57281184 59135943 61075945 63200412 65626480
2511 65626480 68209445 70960002 73983624 77041436 80192939 83355459 86400261 89347007
2503 89347007 92051430 94371283 96319822 97777908 98844185 99492832 99691484 99746841 99686222
2494 99686222 99669127 99737022 99892469 99998865 100093021 100256838 100316909 100068380 99387485 98319149
2484 98319149 96620246 94459951 91818447 88732756 85295876 81644626 77869546 74078607
2476 74078607 70467096 67001158 63720584 60651984 57829269 55325438 53029335 50858836
2468 50858836 48856515 47083424 45365840 43858488 42415632 41041164 39768068 38665850
2460 38665850 37534945 36454231 35366362 34506026 33727938 32950697 32228746 31504223 30911058
2451C0911058o61628o26204n46623n56363n27847l88732m11261l93852l45472
2442B6453076m09406l74565l25092k24272j76314j58945k04536k22519k07007
2433B4150420j28319p7658j10880j36517K6144p454K8262J07076n947l4491k7869
2422B3782767R3124J50797R7710J14350K07193K46701J39684J26008J88537J41695
2412B5288566Q0711J37665P3283k1213P6858Q6440j7831o9947K5652l5118J14557
2401B5739623J9525M5624M2286l2877J63449J51807Q8733R4747K57438L06568
2391B6876923J71852R9457K30085K18663J53877J58267J12614J21395L5166j34353
2381B8043946r5590k32088l12646k91836l34314l02002m19733l73041l83576l80822
$$ plain form
2451 30911058 30249430 29623226 29076603 28520240 27992393 27603661 27192400 26798548 26453076
2442 26453076 26043670 25669105 25344013 25119741 24943427 24784482 24579946 24357427 24150420
2433 24150420 24022101 23944443 23833563 23697046 23723190 23715736 23743998 23851074 23845127 23810636 23782767
2422 23782767 23875891 24026688 24124398 24238748 24445941 24692642 24832326 24958334 25146871 25288566
2412 25288566 25369277 25506942 25580225 25559012 25635870 25722310 25704479 25634532 25660184 25625066 25739623
2401 25739623 25759148 25804772 25847058 25814181 25977630 26129437 26218170 26312917 26570355 26876923
2391 26876923 27048775 27148232 27378317 27596980 27750857 27909124 28021738 28143133 28178299 28043946
2381 28043946 27948356 27716268 27403622 27111786 26777472 26475470 26055737 25682696 25299120 24918298
2371B4918298k46013k71872k59466k65535k69380j61044j58270j37039n6826j05041
2361B2987812k5526r069R2930K38041J67349K10958K61266J82472L74370M98603
2351B4979206M15882L87372O13711O18208N75735P39261P68825P78500Q22915
2342C0699615Q74733R45713R55839R19098J027450R60167J065480J012167J085332
2333C9545594J136812J252032J366263J622026J766995J997634K350487K666975
2325E3704818K996300L424593L941210M395477M937215N451763O080023O790258
2317I1721657P384193P859050Q384159Q597709Q501410Q291239P559890O433933
2309A54733240M885329L002343Q30427j232156l412733n301976o709233p841303
$$ plain form
2371 24918298 24672285 24400413 24140947 23875412 23606032 23444988 23286718 23149679 23092853 22987812
2361 22987812 22962286 22953217 23046147 23284188 23451537 23662495 23923761 24106233 24480603 24979206
2351 24979206 25395088 25782460 26396171 27014379 27590114 28329375 29098200 29876700 30699615
2342 30699615 31574348 32520061 33475900 34394998 35422448 36382615 37448095 38460262 39545594
2333 39545594 40682406 41934438 43300701 44922727 46689722 48687356 51037843 53704818
2325 53704818 56701118 60125711 64066921 68462398 73399613 78851376 84931399 91721657
2317 91721657 99105850 106964900 115349059 123946768 132448178 140739417 148299307 154733240
2309 154733240 159618569 162620912 163451339 162219183 158806450 153504474 146795241 138953938
2301A38953938q368835q543621q366364p968173p258568o545808n785389n087756
2293H1029424m469698l909536l484873l056577k676650k420414k190004j997125
2285E6824547j845941j633310j570392j511132j342629j265133j144804j112449
2277D5398757r57678q89215q93977p38086p82704o17128n63498m89527l12381
2268C9154563l89879k57446j84980q0695o680o0958o1216Q3495J31707K42721
2258C8570632K63823K38439M24570M24255M52094N16145M82983M77000N74115
2249D2424056M83877M77610N23998N25423N31366M35885M31140M82053O31568
2240D6946976N44601M36920N61333O89961P28882O60447Q11193Q04635Q14483
$$ plain form
2301 138953938 130585103 122041482 113675118 105706945 98448377 91902569 86117180 81029424
2293 81029424 76559726 72650190 69165317 66108740 63432090 61011676 58821672 56824547
2285 56824547 54978606 53345296 51774904 50263772 48921143 47656010 46511206 45398757
2277 45398757 44441079 43551864 42657887 41919801 41137097 40519969 39956471 39466944 39154563
2268 39154563 38764684 38507238 38322258 38241563 38234883 38173925 38112709 38196204 38327911 38570632
2258 38570632 38834455 39072894 39497464 39921719 40373813 40889958 41372941 41849941 42424056
2249 42424056 42907933 43385543 43909541 44434964 44966330 45402215 45833355 46315408 46946976
2240 46946976 47491577 47928497 48489830 49179791 49908673 50569120 51380313 52184948 52999431
2231E2999431Q49663Q37192J014127R41669Q71473R06541Q87852Q29042P86027
2222F0923017P59549P00062O54952O83345M95335M64050M19543M80710L44978
2213F5925541L79362L70244L54699M06703L82672K55902L50162L77520K56281
2204F9059086J96534J69074J20532Q947p5868k03952j50000j36728j77506j03730
2194F8706389J1408M59P2822J81759K14352K36367L96831K57329L52802L62501
2184G0793019K85892L15064L37813L21854L07126K76511K84955L73199N27552
2175G3822985N12260N74940O30046P63091J062971J141278J230449J313277J371550
2166H2422847J424446J595268J584109J507663J524758J315209J120420R64203
$$ plain form
2231 52999431 53849094 54686286 55700413 56642082 57513555 58420096 59307948 60136990 60923017
2222 60923017 61682566 62382628 63037580 63720925 64216260 64680310 65099853 65580563 65925541
2213 65925541 66304903 66675147 67029846 67436549 67819221 68075123 68425285 68802805 69059086
2204 69059086 69255620 69424694 69545226 69554173 69478305 69274353 69124353 68987625 68810119 68706389
2194 68706389 68717797 68718256 68791078 68972837 69187189 69423556 69820387 70077716 70430518 70793019
2184 70793019 71078911 71393975 71731788 72053642 72360768 72637279 72922234 73295433 73822985
2175 73822985 74335245 74910185 75540231 76303322 77366293 78507571 79738020 81051297 82422847
2166 82422847 83847293 85442561 87026670 88534333 90059091 91374300 92494720 93458923
2158I3458923Q61887P39651M79934N13490L87979L46402L54562L89038M66161
2149I7998027N96292P11790P25254P96522P95940Q35947N60169O33990M74443
2140A04128374L56633K90794J4256j48046l28865l95703o19174p62981p84498
2131A01750790q60123r13248r37075r88424r11389r48942q91846q58026p89414
2122I3652303q57031q42995r42732j166424j151862j401380j570598j768279j976881
2113H1974121k266446k558289k592353k598430k575680k319719k245839k288685
2105F2528680k258660k136395j965696j953923j755999j679122j599705j514225
2097D7664955j405544j235694j121893j127421j059794q71620p84076n81243o08983
$$ plain form
2158 93458923 94320810 95060461 95540395 96053885 96441864 96788266 97142828 97531866 97998027
2149 97998027 98594319 99306109 100031363 100827885 101623825 102459772 103019941 103653931 104128374
2140 104128374 104485007 104775801 104790057 104642011 104313146 103917443 103298269 102535288 101750790
2131 101750790 100890667 99977419 99040344 98051920 97140531 96191589 95299743 94441717 93652303
2122 93652303 92795272 91952277 91009545 89843121 88691259 87289879 85719281 83951002 81974121
2113 81974121 79707675 77149386 74557033 71958603 69382923 67063204 64817365 62528680
2105 62528680 60270020 58133625 56167929 54214006 52458007 50778885 49179180 47664955
2097 47664955 46259411 45023717 43901824 42774403 41714609 40842989 40058913 39477670 38868687
2088C8868687m56866l40594k79375j21020J4150K66925M22287L44523L28199k8534
2078C9018382m03465k63170o7839J6726O7318L6201r4103k86419m24576l55086
2068C7243969k38658r6038k2889Q5494Q7385K05410L24911K69151K58507L90729
2058C8507971M09917M39749M02497M83537N47832L12709M56395N86618O70595
2049D2817820O90041O54787Q33149O97059N97683M33362N07795O38196P29138
2040D8599030O61452P22199O85802M55247M21539M22982M25724L30291L10090
2031E3034356K82101K07340K26880J49743N7530l7000j54212p6242k32016l40665
2021E3117815l71661k75292k60526l53905n37638n56467n65542n71113o36547
$$ plain form
2088 38868687 38411821 38071227 37791852 37670832 37684982 37951907 38374194 38718717 39046916 39018382
2078 39018382 38614917 38351747 38283908 38300634 38367952 38404153 38310050 38023631 37599055 37243969
2068 37243969 37005311 36909273 36886384 36971878 37059263 37264673 37589584 37858735 38117242 38507971
2058 38507971 38917888 39357637 39760134 40243671 40791503 41104212 41560607 42147225 42817820
2049 42817820 43507861 44162648 44995797 45692856 46290539 46723901 47231696 47869892 48599030
2040 48599030 49260482 49982681 50668483 51123730 51545269 51968251 52393975 52724266 53034356
2031 53034356 53316457 53523797 53750677 53900420 53957950 53920950 53766738 53690496 53458480 53117815
2021 53117815 52746154 52470862 52210336 51856431 51318793 50762326 50196784 49625671 48989124
2012D8989124n86235o50539o83104o91923p04934p42974o62766o19920p07228
2003D2939501p15708p23200o26693p18126o14105n78900o02100m77984m81487
1994C7401198l70950l01608l72713k55279n2544J4315J73591K29001L57421M87169
1984C7309601P79447R76859J024123J328818J678641J912275K174076K459404
1976D9643244K728192K960976L112539L227942L310925L358865L193826L065114
1968G4601623K676706K343514J853683J043892M02549j85967q93233j602602k204118
1959G8036047k648331l128767l413218l475106l486538l483158l206116k992339
1951E2202474k774152k543853k313716k003610j907745j654259j435358j449635
$$ plain form
2012 48989124 48402889 47752350 47069246 46377323 45672389 44929415 44266649 43646729 42939501
2003 42939501 42223793 41500593 40873900 40155774 39541669 38962769 38360669 37882685 37401198
1994 37401198 37030248 36728640 36355927 36100648 36048104 36062419 36236010 36465011 36822432 37309601
1984 37309601 38089048 39065907 40090030 41418848 43097489 45009764 47183840 49643244
1976 49643244 52371436 55332412 58444951 61672893 64983818 68342683 71536509 74601623
1968 74601623 77278329 79621843 81475526 82519418 82921967 82736000 81842767 80240165 78036047
1959 78036047 75387716 72258949 68845731 65370625 61884087 58400929 55194813 52202474
1951 52202474 49428322 46884469 44570753 42567143 40659398 39005139 37569781 36120146
1943C6120146j342634j289430j268136j182021j230357j206300j160094j155672
1935B6285502j044724j029367r43528r10590p98997q27437p57251o08368o11416
1926A8753824n20509m84113m12051m32709m19842l31051l81920k73286k20227
1917A5278116k95827j97957j50096j63311j26971j36005m3616q9239j33929o6381
1907A3874784n7806j14613j38679j18572j06239j86418j60174j87937j58938p9225
1897A2566183k15556j73843o7688j34270j63172k37744r2966p4642p3880j02533
1887A1229889j40350j0979j16303p0665j3748n5132q4061k586k4823q8655o1218
1876A0561369O1423P6808n8348j55160k695P1592O8530M3844P0908L4960k9827
$$ plain form
1943 36120146 34777512 33488082 32219946 31037925 29807568 28601268 27441174 26285502
1935 26285502 25240778 24211411 23267883 22357293 21558296 20730859 19973608 19365240 18753824
1926 18753824 18233315 17749202 17337151 16904442 16484600 16153549 15771629 15498343 15278116
1917 15278116 14982289 14784332 14634236 14470925 14343954 14207949 14164333 14075094 13941165 13874784
1907 13874784 13816978 13702365 13563686 13445114 13338875 13152457 12992283 12804346 12645408 12566183
1897 12566183 12350627 12176784 12109096 11974826 11811654 11573910 11480944 11406302 11332422 11229889
1887 11229889 11089539 11078560 10962257 10891592 10877844 10822712 10738651 10736065 10711242 10622587 10561369
1876 10561369 10622792 10699600 10641252 10486092 10483397 10554989 10623519 10667363 10738271 10773231 10743404
1865A0743404J12084K6784j6345K5724O9415J12981K1779J90132J27504J39110
1855A1552572R6910R4122R1113J43345J49517J34984J16917J53189J20293J19575
1845A2772537K04386R0150J36826R9450O2499K48463J68173J28750J04055J53758
1835A4169047K6012P5666K04040J11909J47622J18620J54258J15782Q7720J28281
1825A5338957N5838J65624J66492R3611J59932J75769K05136J87254J74482K61321
1815A6984416K22483K15579K34234K68735L59712K85273K64040K26255K74239
1806A9334966L28986L44175K77372K94071L48244L30999K76323L26412M11927
1797B2273475M99462L83021L23402N31401N19247M45246L84560N44870N46934
$$ plain form
1865 10743404 10855488 10882272 10865927 10891651 10961066 11074047 11095826 11285958 11413462 11552572
1855 11552572 11649482 11743604 11834717 11978062 12127579 12262563 12379480 12532669 12652962 12772537
1845 12772537 12976923 13067073 13203899 13303349 13365848 13614311 13782484 13911234 14015289 14169047
1835 14169047 14195059 14270725 14474765 14586674 14734296 14852916 15007174 15122956 15210676 15338957
1825 15338957 15394795 15560419 15726911 15820522 15980454 16156223 16361359 16548613 16723095 16984416
1815 16984416 17206899 17422478 17656712 17925447 18285159 18570432 18834472 19060727 19334966
1806 19334966 19663952 20008127 20285499 20579570 20927814 21258813 21535136 21861548 22273475
1797 22273475 22772937 23155958 23479360 24010761 24530008 24975254 25359814 25904684 26451618
1788B6451618N27881O88165N52032O86882P59796Q34383P78983Q52265R06014
1779C3038019Q49226J026132J047018J013491J119911J128372J134240J166930
1771D1523339J274451J325440J426058J504918J698147J762264J796580K022046
1763E4333243K181861K334386K493435K665140K910751L093360L405736L896304
1755G7314216M139951M604987M991011N368686N648258N807498N940562O077539
1747A19892708O360197O814446P633124Q095121Q274628P815464O864879N657627
1739A77408194M771704M898669N216065N267255M484542K741796R44405n33553
1731B05199077j714039k909396m030159n315857o584640p550954p975627q111508
$$ plain form
1788 26451618 26979499 27667664 28219696 28906578 29666374 30500757 31279740 32132005 33038019
1779 33038019 33887245 34913377 35960395 36973886 38093797 39222169 40356409 41523339
1771 41523339 42797790 44123230 45549288 47054206 48752353 50514617 52311197 54333243
1763 54333243 56515104 58849490 61342925 64008065 66918816 70012176 73417912 77314216
1755 77314216 81454167 86059154 91050165 96418851 102067109 107874607 113815169 119892708
1747 119892708 126252905 133067351 140700475 148795596 157070224 164885688 171750567 177408194
1739 177408194 182179898 187078567 192294632 197561887 202046429 204788225 205732630 205199077
1731 205199077 203485038 200575642 196545483 191229626 184644986 177094032 169118405 161006897
1723A61006897q023549p636284p118095o389923n459832m539587l858403k963618
1715A15017606k204921j489195p32559j60894N44961J493665K392892L237042
1707A18098597M070859N016326N986660O983560Q091095R643136J1355614J3226886
1699A82472733J5453209J7923386J9829660K0548954J9399692J5409935Q952331
1692B99989900J384417m692243q044643j0136404j2924129j6906698j9588730
1685B29081470j9843224j8068463j5700303j3481728j1371972j0044857r018393
1678A31552530q196216p712171p352923o841573o457454n963889n533551n118354
1670G8376399m606469m116150l706483l393492l033050k714581k502264k329260
$$ plain form
1723 161006897 152983348 145347064 138228969 131839046 126379214 121839627 117981224 115017606
1715 115017606 112812685 111323490 110590931 110430037 110974998 112468663 114861555 118098597
1707 118098597 122169456 127185782 133172442 140156002 148247097 157890233 169245847 182472733
1699 182472733 197925942 215849328 235678988 256227942 275627634 291037569 299989900
1692 299989900 301374317 296682074 288637431 278501027 265576898 248670200 229081470
1685 229081470 209238246 191169783 175469480 161987752 150615780 140570923 131552530
1678 131552530 123356314 115644143 108291220 101449647 94992193 89028304 83494753 78376399
1670 78376399 73769930 69653780 65947297 62553805 59520755 56806174 54303910 51974650
1662E1974650k236736k065217j913315j711946j636602j555228j354697j220214
1654C8280695j239970j215245j100139j110834r89622j033676r49939q92405o67733
1645B9081132p92488q22088o20423o30352o90184o88125o46758o01916n35078
1636B3053720o02751p00119o15542n45702n93394n55468m89068n23534m76644
1627A7951498m60188l90040k91076l87220l64947k78070l20691k60213k13166
1618A4985887k90744j37245j92930l15909k57742k60015j43570l3311k16151k51021
1608A2887249k47357j68688j51173j80646n4748j59480j75326j09260j21270k30438
1598A1288863j84306j89607k07411j87743j82107j77576j97579j84703k67140
$$ plain form
1662 51974650 49737914 47672697 45759382 44047436 42410834 40855606 39500909 38280695
1654 38280695 37040725 35825480 34725341 33614507 32624885 31591209 30641270 29748865 29081132
1645 29081132 28288644 27466556 26846133 26215781 25525597 24837472 24190714 23588798 23053720
1636 23053720 22450969 21750850 21135308 20589606 19996212 19440744 18951676 18428142 17951498
1627 17951498 17491310 17101270 16810194 16422974 16058027 15779957 15459266 15199053 14985887
1618 14985887 14695143 14557898 14364968 14049059 13791317 13531302 13387732 13354421 13138270 12887249
1608 12887249 12639892 12471204 12320031 12139385 12084637 11925157 11749831 11640571 11519301 11288863
1598 11288863 11104557 10914950 10707539 10519796 10337689 10160113 9962534 9777831 9510691
1589I510691k50889j66650j12975k15223j93022j68595j69430j24085j15035k09278
1579G785509k34403j52888k0213j50624j03582j39941r0824o0025p1408k5257
1569F736344o3478l99r2000j3144j4773o1628j08968m2834k0661o339k389l8580
1557F271151n7434L2125j53089j7837k5071m8186l3114N581P0675r5701q8133
1546E860967j33053p8642J1967l0781r6267l5670m5216n3476j02082r1991j05930
1535E099826j9873n1096k5913r7734n2764n0460j58002j23096L1910P9521o3385
1524D568934j19081n7731R179q4754j40123n5319K3436Q394o9568j19064m0979
1513C923324o9790j0351J01719L111k6211J8290k8073k8296J29118J3598o7272
$$ plain form
1589 9510691 9259802 9093152 8980177 8764954 8571932 8403337 8233907 8109822 7994787 7785509
1579 7785509 7551106 7398218 7378005 7227381 7123799 6983858 6893034 6833009 6761601 6736344
1569 6736344 6672866 6672467 6580467 6567323 6552550 6490922 6381954 6339120 6318459 6312120 6309731 6271151
1557 6271151 6213717 6245842 6092753 6074916 6049845 6001659 5968545 5974126 6044801 5949100 5860967
1546 5860967 5727914 5649272 5661239 5630458 5534191 5498521 5453305 5399829 5297747 5205756 5099826
1535 5099826 5079953 5028857 5002944 4905210 4852446 4801986 4643984 4520888 4552798 4632319 4568934
1524 4568934 4449853 4392122 4401301 4316547 4176424 4121105 4144541 4152935 4083367 3964303 3923324
1513 3923324 3853534 3843183 3944902 3948013 3921802 3940092 3912019 3883723 4012841 4026439 3959167
1502C959167l0452M2994j4896L9941j0251k1412p7872q4550j9289m50l9629n9394
1490C683907q04n1665j492M5981j7674r2618m9356r145J3783N2596n2973j8098
1478C502442N020M8387j60729K076O1238q3631p153j5263O9260q2113n1643n4873
1466C233018Q994j0131p3338m3154J00641M333q2845q6333k1331j7690k819N312
1454C014657M9367J3889r8872P191L5716j7612P2633j1085O65n0685Q6062N175
1442C107101J2578J41941K3911n7264J674M3403q118n0051k0872N489q643p7540
1430C113609L121m928j02247n6303q6897k3745j2486j44772k4532l8576o1440
1419B560804j1475r2589q7644k6391m7322k7930m4315k1409l8161m3224O4990
$$ plain form
1502 3959167 3928715 3971709 3956813 3996754 3986503 3965091 3887219 3802669 3783380 3782930 3743301 3683907
1490 3683907 3683103 3631438 3629946 3675927 3658253 3565635 3516279 3507134 3520917 3573513 3520540 3502442
1478 3502442 3507462 3555849 3395120 3397196 3458434 3374803 3367650 3352387 3421647 3339534 3287891 3233018
1466 3233018 3242012 3231881 3158543 3115389 3216030 3220363 3137518 3051185 3029854 3012164 3009345 3014657
1454 3014657 3064024 3077913 2979041 2986232 3021948 3004336 3076969 3065884 3066549 3015864 3101926 3107101
1442 3107101 3119679 3261620 3285531 3228267 3229941 3273344 3265226 3215175 3194303 3199792 3191149 3113609
1430 3113609 3116730 3111802 3009555 2953252 2866355 2842610 2830124 2685352 2660820 2622244 2560804
1419 2560804 2549329 2456740 2369096 2342705 2295383 2267453 2223138 2201729 2163568 2120344 2185334
1408B185334J333L1874R0941o4000K6540J00198o9890K3896R9786L4766L7632
1397B498410R0621L9756K6402J19101J01571K9426k9359q0991R747j853R409j25759
1385B686481p8350r0239o1455p2142n5951l4699o5287j18879p7645p4024J125
1374A958935K3090l0885r9319p0325L6848j3991j9278j32174r0085j1353J6507
1363A567970j2503p4796K4789j2851p709r9004J0875J6193J6836j0299l7363M2470
1351A424608m8683j9720L8754J974o1978O824m9435m6446K0119j7509L3081n6286
1339A225303j0722O8171k9093L7936n7832m7881L1487j289q588o1874k9602J4013
1327A130029l0594L2455j9762n648J0577L7954p396o3505N6749m202J1732k8480
$$ plain form
1408 2185334 2186667 2218541 2309482 2245482 2272022 2372220 2302330 2326226 2426012 2460778 2498410
1397 2498410 2589031 2628787 2655189 2774290 2875861 2905287 2875928 2794937 2804684 2802831 2812240 2686481
1385 2686481 2608131 2517892 2456437 2384295 2328344 2293645 2228358 2109479 2031834 1957810 1958935
1374 1958935 1982025 1951140 1851821 1781496 1818344 1804353 1785075 1652901 1562816 1551463 1567970
1363 1567970 1555467 1480671 1505460 1492609 1484900 1385896 1396771 1412964 1429800 1419501 1382138 1424608
1351 1424608 1375925 1356205 1394959 1396933 1334955 1341779 1292344 1245898 1266017 1248508 1281589 1225303
1339 1225303 1214581 1282752 1253659 1291595 1233763 1185882 1217369 1216080 1207492 1145618 1116016 1130029
1327 1130029 1099435 1131890 1112128 1106480 1117057 1155011 1147615 1084110 1140859 1136657 1148389 1119909
1315A119909M0867m1292m6063J5537p2368L4771M7868j8737n1141l037k2491J04947
1303A108770N0965r4557k9030p2325r7530J01537M3458o1705M3547k2470l5223
1292I35437l16n529K502L3795K4309n7515j09737n2555K8982K1550N6842O4526
1280I42291J397o9474J5108J0970k8601l6934N499L117J5771L5261L427l1095
1268H66737q6881j3926O3983J04357o4878j47887J9257M808j4484j881K9171p2071
1256F86305q6619P1137M6667O0030M5241o9591O188j8950r110J08694K3979K6486
1244H90457p543n5285l608n0279L2033L2699o701P5512o428o3652n2937l6480
1232G47788J00552j3219q6425o6619P5622J989n2713L2110L0151J6140j0944O856
$$ plain form
1315 1119909 1160776 1119484 1073421 1088958 1016590 1051361 1099229 1080492 1029351 1026314 1003823 1108770
1303 1108770 1159735 1065178 1036148 963823 866293 967830 1011288 949583 993130 970660 935437
1292 935437 935121 929592 932094 965889 990198 932683 822946 770391 799373 820923 877765 942291
1280 942291 943688 874214 889322 900292 871691 834757 840256 843373 859144 894405 897832 866737
1268 866737 779856 765930 829913 934270 869392 721505 740762 745570 731086 729205 758376 686305
1256 686305 599686 670823 717490 777520 822761 753170 759358 740408 731298 839992 863971 890457
1244 890457 882914 827629 824021 773742 805775 838474 831773 907285 900857 837205 784268 747788
1232 747788 848340 835121 748696 682077 757699 759688 706975 739085 769236 785376 774432 781288
1220G81288o6764j8126L1883q487L763O5993L3552k9440l827M0851R593k624l4181
1207H03474p8719L0094J20498p5198j3373m5427n3268J2177J6449o1524r242L7455
1195F83396L0311N448O246l0291J1581l2825l2787l3952P3061n8761k0169m945
1183E96313o265n004k5991O2380q9245J02618p8407m0501m5850N0278R5027L5850
1171F51203q6913l1880L4360J0899p238L818O289j6075j762M6549j668n7674j634
1158E48274Q260L0354o6533k4089R358k7877K9067N7424k632K3328k6249o3282
1146D95403l774P7402n793k4541m6553J073M1845J222m5085J9758j8487J131L2173
1133E25774j2575m2626r1034M9788J396j2002O7422Q9598N5074j27083r4659j0455
$$ plain form
1220 781288 714524 696398 728281 719794 723557 789550 823102 793662 789835 830686 840279 837655 803474
1207 803474 724755 754849 875347 800149 786776 741349 688081 700258 716707 655183 645941 683396
1195 683396 713707 719155 725401 695110 706691 673866 641079 607127 680188 621427 601258 596313
1183 596313 590048 585044 559053 621433 532188 634806 556399 515898 470048 520326 615353 651203
1171 651203 564290 532410 566770 577669 570431 574249 580538 564463 562701 609250 607582 549908 548274
1158 548274 556534 586888 520355 496266 505624 477747 506814 564238 561606 584934 558685 495403
1146 495403 491629 569031 563238 538697 492144 493217 535062 536284 491199 510957 492470 493601 525774
1133 525774 513199 470573 379539 429327 430723 418721 486143 575741 630815 503732 409073 398618
1121C98618L8642M48O861N8702K4478J6940q2629p3962L5288M4689K9854p057
1109D90872k1914M3021P3624O0378l818n2812l8254M4300p7338j6028M1788K2815
1097E66634L6981o3913K0134l5612J2195n9033n7136L2093L3888N4588l4954r0113
1085D15752O2724o3069l5935K8877L1999m3025k8231R7855L5658k8138o1115N0709
1073D64061k6732j6788K9815l6634p169N9063Q622J4019l7751m7983m1455O8793
1061D29861J2289K7705m038q5783J1532N2960K6258k0572p1442P610M3935K5615
1049D55930M0906N1670j121l4997j3432Q5692P498L2896j1614K5116r15K0281
1037F57910J1177k0382p2158k9813K2757M7025L9081l736N0841k0364M6754J5794
$$ plain form
1121 398618 437260 437708 444569 503271 527749 544689 462060 388098 423386 468075 497929 490872
1109 490872 468958 511979 585603 645981 642163 589351 551097 595397 518059 502031 543819 566634
1097 566634 603615 539702 559836 524224 536419 477386 420250 452343 486231 540819 505865 415752
1085 415752 478476 415407 379472 408349 440348 397323 369092 466947 502605 474467 413352 464061
1073 464061 437329 420541 450356 413722 406553 465616 474238 488257 450506 402523 361068 429861
1061 429861 442150 469855 465817 380034 391566 444526 470784 450212 378770 386380 430315 455930
1049 455930 496836 548506 547385 512388 498956 584648 592146 625042 613428 638544 637629 657910
1037 657910 669087 648705 576547 546734 569491 616516 655597 651861 702702 682338 729092 744886
1025G44886J6521J7163m0474l1071j1074K9875l758M6829q923J6452j430N0159
1013H25155n1694J06M4837l8916O8161k2926j2366l2248K0114J4372K4250m8469
1001G90376L0493K3709k7972m9597P6034k3607k6432p54k6419J2236q9908O6911
989G55070M4365m7465J632L815M5259m7010l5249M3552Q7345o2275k9059N0168
977H10148j211J5464J16229P0973l2785J6366N347J9385Q4351N8224J19441N6463
965A338395n1127j1798O1721L1236P8760O5650J00323q058L4335J34281P8294
954A852012L4331J06436J2277Q2041Q7917J64853N6703Q7461J67463J40176K58413
$$ plain form
1025 744886 761407 778570 738096 707025 695951 725826 722068 768897 759974 776426 774996 825155
1013 825155 773461 773567 818404 779488 847649 824723 812357 780109 800223 814595 838845 790376
1001 790376 820869 844578 816606 767009 843043 819436 793004 792250 765831 778067 688159 755070
989 755070 799435 751970 753602 757417 802676 755666 720417 763969 851314 789039 759980 810148
977 810148 808937 824401 940630 1011603 978818 995184 1000531 1019916 1104267 1162491 1281932 1338395
965 1338395 1287268 1275470 1337191 1368427 1447187 1512837 1613160 1605102 1639437 1773718 1852012
954 1852012 1886343 1992779 2005056 2087097 2175014 2339867 2396570 2484031 2651494 2791670 3050083
$$ [...]
##END NTUPLES=NMR SPECTRUM
##END=
