##TITLE=1H_CG-1142-A1
 CDCl3, 8 sc, 
 27.04.2021
##JCAMPDX= 6.0         $$ Bruker NMR JCAMP-DX V2.0
##DATA TYPE= NMR SPECTRUM
##DATA CLASS= NTUPLES
##ORIGIN= UXNMR, Bruker Analytische Messtechnik GmbH
##OWNER= root
$$ XWIN-NMR		Version 3.5
$$ Tue Apr 27 14:50:02 2021 Russian Standard Time (UT+4h)  she@DPX200
##.OBSERVE FREQUENCY= 200.131506
##.OBSERVE NUCLEUS= ^1H
##.ACQUISITION MODE= SIMULTANEOUS
##.ACQUISITION SCHEME= undefined
##.AVERAGES= 8
##.DIGITISER RES= 18
##SPECTROMETER/DATA SYSTEM= spect
##.PULSE SEQUENCE= zg30
##.SOLVENT NAME= CD3CN
##.SHIFT REFERENCE= (INTERNAL, CD3CN, 0, 15.9813)
##AUDIT TRAIL= $$ (NUMBER, WHEN, WHO, WHERE, WHAT)
$$ ##TITLE= Audit trail, XWIN-NMR		Version 3.5
$$ ##JCAMPDX= 5.01
$$ ##ORIGIN= Bruker BioSpin GmbH
$$ ##OWNER= she
$$ F:/spectra/data/she/nmr/H-F/1/pdata/1/auditp.txt
$$ ##AUDIT TRAIL=  $$ (NUMBER, WHEN, WHO, WHERE, WHAT)
(   1,<2021-04-27 14:48:30.75 +0400>,<she>,<DPX200>,
      <created by zg, POWCHK disabled, PULCHK disabled
       configuration hash MD5:
       00 E9 B6 7A A2 85 ED C7 34 08 36 98 17 FE 4E 26
       data hash MD5: 16K
       06 61 EE 55 57 C1 A1 DB D7 D6 A7 C0 4B 05 73 1B>)
(   2,<2021-04-27 14:48:50.67 +0400>,<she>,<DPX200>,
      <Start of raw data processing
       efp BC_mod = 2 LB = 0.24 FT_mod = 6 PKNL = 1 PHC0 = -11106.05 PHC1 = -3.599039 SI = 16K 
       data hash MD5: 16K
       19 D3 ED 34 2C 48 FB 55 8C B6 5F AA AF 3D 2A B5>)
(   3,<2021-04-27 14:49:11.15 +0400>,<she>,<DPX200>,
      <pk PHC0 = -15.37951 PHC1 = 16.6 
       data hash MD5: 16K
       F4 87 B7 1D B8 20 EA 11 2F 9C D7 CE B7 10 1A DA>)
(   4,<2021-04-27 14:49:14.75 +0400>,<she>,<DPX200>,
      <abs ABSG = 5 
       data hash MD5: 16K
       96 78 9D BF B4 7F 58 D0 3D C1 9A 89 72 B8 E0 49>)
$$ ##END=
$$ 
$$ hash MD5
$$ B6 5B A3 17 05 69 99 44 7D F6 85 3B 9C FE E9 D0
##$RELAX= 
##$RELAX= 
##$RELAX= 
##$RELAX= 
##$RELAX= 
##$RELAX= 
$$ Bruker specific parameters
$$ --------------------------
##$DU= <F:/spectra>
##$EXPNO= 1
##$NAME= <H-F>
##$PROCNO= 1
##$TYPE= <nmr>
##$USER= <she>
##$AMP= (0..31)
100 100 100 100 100 100 100 100 100 100 100 100 100 100 100 100 100 100 
100 100 100 100 100 100 100 100 100 100 100 100 100 100 
##$AQSEQ= 0
##$AQ_mod= 1
##$AUNM= <au_zg>
##$AUTOPOS= <>
##$BF1= 200.13
##$BF2= 200.13
##$BF3= 200.13
##$BF4= 200.13
##$BF5= 200.13
##$BF6= 200.13
##$BF7= 200.13
##$BF8= 200.13
##$BYTORDA= 1
##$CFDGTYP= 0
##$CFRGTYP= 5
##$CHEMSTR= <none>
##$CNST= (0..31)
1 1 145 1 1 1 1 1 1 1 1 1 1 1 1 1 1 1 1 1 1 1 1 1 1 1 1 1 1 1 1 1 
##$CPDPRG= <>
##$CPDPRG1= <>
##$CPDPRG2= <>
##$CPDPRG3= <>
##$CPDPRG4= <mlev>
##$CPDPRG5= <mlev>
##$CPDPRG6= <mlev>
##$CPDPRG7= <mlev>
##$CPDPRG8= <mlev>
##$CPDPRGB= <>
##$CPDPRGT= <>
##$D= (0..31)
0 1.2 0 0 0 0 0 0 0 0.06 0 0.03 0 0 0 0 0.0002 0 0 0 0 0 0 0 0 0 0 0 0 
0 0 0 
##$DATE= 1619520510
##$DBL= (0..7)
120 120 120 120 120 120 120 120 
##$DBP= (0..7)
150 150 150 150 150 150 150 150 
##$DBP07= 0
##$DBPNAM0= <>
##$DBPNAM1= <>
##$DBPNAM2= <>
##$DBPNAM3= <>
##$DBPNAM4= <>
$$ [...]
##$SUBNAM3= <"">
##$SUBNAM4= <"">
##$SUBNAM5= <"">
##$SUBNAM6= <"">
##$SUBNAM7= <"">
##$SUBNAM8= <"">
##$SUBNAM9= <"">
##$SW= 16.9725357007746
##$SWIBOX= (0..15)
0 0 2 0 0 0 0 0 0 0 0 0 0 0 0 0 
##$SW_h= 3396.73913043478
##$TD= 16384
##$TD0= 1
##$TE= 0
##$TE2= 300
##$TE3= 300
##$TEG= 300
##$TL= (0..7)
0 120 120 120 120 120 120 120 
##$TP= (0..7)
150 150 150 150 150 150 150 150 
##$TP07= 0
##$TPNAME0= <>
##$TPNAME1= <>
##$TPNAME2= <>
##$TPNAME3= <>
##$TPNAME4= <>
##$TPNAME5= <>
##$TPNAME6= <>
##$TPNAME7= <>
##$TPOAL= (0..7)
0.5 0.5 0.5 0.5 0.5 0.5 0.5 0.5 
##$TPOFFS= (0..7)
0 0 0 0 0 0 0 0 
##$TUNHIN= 0
##$TUNHOUT= 0
##$TUNXOUT= 0
##$USERA1= <user>
##$USERA2= <user>
##$USERA3= <user>
##$USERA4= <user>
##$USERA5= <user>
##$V9= 5
##$VALIST= <valist>
##$VCLIST= <CCCCCCCCCCCCCCC>
##$VD= 0
##$VDLIST= <DDDDDDDDDDDDDDD>
##$VPLIST= <PPPPPPPPPPPPPPP>
##$VTLIST= <TTTTTTTTTTTTTTT>
##$WBST= 1024
##$WBSW= 4
##$XGAIN= (0..3)
0 0 0 0 
##$XL= 0
##$YL= 0
##$YMAX_a= 463248
##$YMIN_a= -606650
##$ZGOPTNS= <>
##$ZL1= 120
##$ZL2= 120
##$ZL3= 120
##$ZL4= 120
##$ABSF1= 15.99682
##$ABSF2= -0.9758434
##$ABSG= 5
##$ABSL= 3
##$ALPHA= 0
##$AQORDER= 0
##$ASSFAC= 0
##$ASSFACI= 0
##$ASSFACX= 0
##$ASSWID= 0
##$AUNMP= <proc_1d>
##$AZFE= 0.1
##$AZFW= 0.1
##$BCFW= 0
##$BC_mod= 2
##$BYTORDP= 0
##$COROFFS= 0
##$CY= -3
##$DATMOD= 1
##$DC= 0
##$DFILT= <>
##$DTYPP= 0
##$F1P= 0
##$F2P= 0
##$FCOR= 1
##$FTSIZE= 16384
##$FT_mod= 6
##$GAMMA= 0
##$GB= 0
##$INTBC= 1
##$INTSCL= 1.334414e-10
##$ISEN= 128
##$LB= 0.24
##$LEV0= 0
##$LPBIN= 0
##$MAXI= 10000
##$MC2= 0
##$MEAN= 0
##$ME_mod= 0
##$MI= 1.114404
##$NCOEF= 0
##$NC_proc= -6
##$NLEV= 6
##$NOISF1= 3.799351
##$NOISF2= 2.8
##$NSP= 0
##$NTH_PI= 0
##$NZP= 0
##$OFFSET= 15.98128
##$PC= 1
##$PHC0= -11121.43
##$PHC1= 13.00096
##$PH_mod= 1
##$PKNL= yes
##$PPARMOD= 0
##$PSCAL= 0
##$PSIGN= 0
##$REVERSE= no
##$SF= 200.130006036459
##$SI= 16384
##$SIGF1= 3
##$SIGF2= 2
##$SINO= 5.538805
##$SIOLD= 16384
##$SREGLST= <1H.CDCl3>
##$SSB= 0
##$STSI= 16384
##$STSR= 0
##$SW_p= 3396.73913043479
##$SYMM= 0
##$S_DEV= 0
##$TDeff= 16384
##$TDoff= 0
##$TI= <>
##$TILT= no
##$TM1= 0
##$TM2= 0
##$TOPLEV= 0
##$USERP1= <user>
##$USERP2= <user>
##$USERP3= <user>
##$USERP4= <user>
##$USERP5= <user>
##$WDW= 1
##$XDIM= 16384
##$YMAX_p= 516404919
##$YMIN_p= -479385
$$ End of Bruker specific parameters
$$ ---------------------------------
##NTUPLES= NMR SPECTRUM
##VAR_NAME=  FREQUENCY,     SPECTRUM/REAL,   SPECTRUM/IMAG
##SYMBOL=    X,             R,               I
##VAR_TYPE=  INDEPENDENT,   DEPENDENT,       DEPENDENT
##VAR_FORM=  AFFN,          ASDF,            ASDF
##VAR_DIM=   16384,         16384,           16384
##UNITS=     HZ,            ARBITRARY UNITS, ARBITRARY UNITS
##FACTOR=    0.207333158178282, 1,           1
##FIRST=     3198.33372828149, 0,            0
##LAST=      -198.405402153304, 0,           0
##MIN=       -198.405402153304, -479385,     0
##MAX=       3198.33372828149, 516404919,    0
$$ Real data points
##PAGE= N=1
##DATA TABLE= (X++(R..R)), XYDATA
$$ [...]
4405H794287j06184j82611l20971k41232k94399k42367j98862k99193k22006l38336
$$ 8794287 8688103 8505492 8184521 7943289 7648890 7406523 7207661 6908468 6686462 6348126
4395F348126l20275j94072j08429j25043k9022j08484k18427j14334q9956j5416
$$ 6348126 6027851 5833779 5725350 5600307 5571285 5462801 5244374 5130040 5040084 5024668
4385E024668j53021j75648j23494j41314Q5462j07072j99208r0368n7964p7864
$$ 5024668 4871647 4695999 4572505 4431191 4516653 4409581 4210373 4120005 4062041 3984177
4375C984177n3352p3308j20450n0382j365m3115q2288j29277n2703j21421o8434
$$ 3984177 3930825 3857517 3737067 3686685 3685320 3642205 3559917 3430640 3377937 3256516 3188082
4364C188082r5337l7960K9225j31279j38644M811J1890p4158R734j4385M1433
$$ 3188082 3092745 3054785 3084010 2952731 2814087 2818898 2830788 2756630 2766364 2751979 2793412
4353B793412j61991J3113L2793r2444q1960K8586J08458j6550j35832Q1883M1560
$$ 2793412 2631421 2644534 2677327 2584883 2502923 2531509 2639967 2623417 2487585 2569468 2611028
4342B611028Q126M7575o4384L7017R2559j34420l6160M8577L3041P0360M8796
$$ 2611028 2619154 2666729 2602345 2639362 2731921 2597501 2561341 2609918 2642959 2713319 2762115
4331B762115o5991l2675J6016j4876l4476L6840j21771M3542J686j47562j9927
$$ 2762115 2696124 2663449 2679465 2664589 2630113 2666953 2545182 2588724 2590410 2442848 2422921
4320B422921n3806p5647p868j4373q8559J9895q8336p3968j32309P4483p8386
$$ 2422921 2369115 2293468 2285600 2271227 2182668 2202563 2114227 2040259 1907950 1982433 1904047
4309A904047j00994O0301o5417n6623K8078O5319n3035j37326J4903p907j5412
$$ 1904047 1803053 1863354 1797937 1741314 1769392 1834711 1781676 1644350 1659253 1651346 1635934
4298A635934l325n2222N8548j7664K9055n9685n2643K5448J5122o3656N3453O0072
$$ 1635934 1632609 1580387 1638935 1621271 1650326 1590641 1537998 1563446 1578568 1514912 1568365 1628437
4286A628437q183k6423R251n712L3352Q8342J15339J2235K121k6507j9703o916
$$ 1628437 1620254 1593831 1603082 1597370 1630722 1719064 1834403 1846638 1848759 1822252 1802549 1795633
4274A795633J7307R5677J69223M9083n7001l1628O3910R192J12311J6175q748
$$ 1795633 1812940 1908617 2077840 2126923 2069922 2038294 2102204 2111396 2223707 2239882 2231134
4263B231134J30730j0751m5537r7312L5892j1528N9894o2621p1594N0111l351
$$ 2231134 2361864 2351113 2305576 2208264 2244156 2232628 2292522 2229901 2158307 2208418 2205067
4252B205067p7912N3631m5953j8362p5023j1260Q3689J23759r07j6781k1166J3764
$$ 2205067 2127155 2180786 2134833 2116471 2041448 2030188 2113877 2237636 2236729 2219948 2198782 2212546
4240B212546n7155K3246J23490O2508r6900K4433J50293N0094M3971Q9141L7034
$$ 2212546 2155391 2178637 2302127 2364635 2267735 2292168 2442461 2492555 2536526 2625667 2662701
4229B662701L0106P6547J04399J3704L3843J12139J46407J11670O3512J00412
$$ 2662701 2692807 2769354 2873753 2887457 2921300 3033439 3179846 3291516 3355028 3455440
4219C455440J23247J05658J46162K07477M2526J53236K66103K66338L57213L99775
$$ 3455440 3578687 3684345 3830507 4037984 4080510 4233746 4499849 4766187 5123400 5523175
4209E523175M79614N13746O60714Q64765R70579R44744Q41166R11979J003363
$$ 5523175 6002789 6516535 7177249 8042014 9012593 9957337 10798503 11710482 12713845
4200A2713845J187103J455186J712292K211052J780669L01342r74863j084918
$$ 12713845 13900948 15356134 17068426 19279478 21060147 21361489 20386626 19301708
4192A9301708o63168m26275J19752J97858j336036k513488k455526j955445j437553
$$ 19301708 18638540 18212265 18332017 18529875 17193839 14680351 12224825 10269380 8831827
4183H831827j031941q28788p37939m24010m21121l30841k67824k37131l04472
$$ 8831827 7799886 6971098 6233159 5809149 5388028 5057187 4789363 4552232 4247760
4174D247760k25192j97088j93861k04073r6015j71322j55040q4462m6592k01404
$$ 4247760 4022568 3825480 3631619 3427546 3331531 3160209 3005169 2920707 2874115 2672711
4164B672711J6365n2190j35845N9410p1965r4921j02234l8564p0176k0643J1321
$$ 2672711 2689076 2636886 2501041 2560451 2488486 2393565 2291331 2252767 2182591 2161948 2173269
4153B173269l2253J01918j16656q0505K0229p5893J19447l3438l0738o7057O772
$$ 2173269 2141016 2242934 2126278 2045773 2066002 1990109 2109556 2076118 2045380 1978323 1985095
4142A985095O3765R922M5473m8429M8682L1534N9466J2618m1042K141q055N6892
$$ 1985095 2048860 2058782 2104255 2055826 2104508 2136042 2195508 2208126 2167084 2169225 2161170 2218062
4130B218062L1411J5872J0191J9486j579o0961j2653m5293k2190q3575J8619k9551
$$ 2218062 2249473 2265345 2275536 2295022 2293443 2232482 2219829 2174536 2152346 2068771 2087390 2057839
4118B057839n8503l9968l0327j02957Q3036m9419m209j0707n1839j118M9956J18833
$$ 2057839 1999336 1959368 1929041 1826084 1909120 1859701 1855492 1844785 1792946 1791828 1841784 1960617
4106A960617o6536L9969k654j4659j4848K4626r1089o1838j188k5064R262K9977
$$ 1960617 1894081 1934050 1931396 1916737 1901889 1926515 1835426 1773588 1772400 1747336 1756598 1786575
4094A786575J0053J1845O3768M6575r2827m4592j467N8036p555J0100Q9199L2167
$$ 1786575 1796628 1808473 1872241 1918816 1825989 1781397 1779930 1837966 1830411 1840511 1929710 1961877
4082A961877q3127k6717n8929L9660K6734Q5552l4240o8094L6596j9960Q8760
$$ 1961877 1878750 1852033 1793104 1832764 1859498 1945050 1910810 1842716 1879312 1859352 1948112
4071A948112o1161R1591M0439q973n6891r61K1203J3349J08271j00633R4195L8500
$$ 1948112 1886951 1978542 2018981 2010008 1953117 1952156 1973359 1986708 2094979 1994346 2088541 2127041
4059B127041o114L8049j7174M1886O7345l3862j6560O5884n69m2277O0716N7733
$$ 2127041 2120927 2158976 2141802 2183688 2251033 2217171 2200611 2266495 2265926 2223649 2284365 2342098
4047B342098N2804Q6311M3387K2081p898l4981m2806P797N0704J11778J24968
$$ 2342098 2394902 2481213 2524600 2546681 2538783 2503802 2460996 2468793 2519497 2631275 2756243
4036B756243K4217J0904M7606m7216l0947l9154l8748J9775J01212m3071O7063
$$ 2756243 2780460 2791364 2838970 2791754 2760807 2721653 2682905 2702680 2803892 2760821 2827884
4025B827884k8845P3025N6966m5987r9745Q3191J31726N0413m5652q9208P5378
$$ 2827884 2799039 2872064 2929030 2883043 2783298 2866489 2998215 3048628 3002976 2913768 2989146
4014B989146N8126P9809m4531L480o274O9794M9818q504o8950L3246O2583j0137
$$ 2989146 3047272 3127081 3082550 3086030 3079756 3149550 3199368 3190864 3121914 3155160 3217743 3207606
4002C207606J8698O6189r186J1117k8450M0434P4296N8158J01264p7086L3156
$$ 3207606 3226304 3292493 3283307 3294424 3265974 3306408 3380704 3438862 3540126 3463040 3496196
3991C496196P7209k6212n7199J6029J13870o993K6473r6043r6731r8198j5416
$$ 3496196 3573405 3547193 3489994 3506023 3619893 3612900 3639373 3543330 3446599 3348401 3332985
3980C332985k0279N3958Q560p6159k1162J13592L3952k3591o9370j81012K4269
$$ 3332985 3312706 3366664 3375224 3299065 3277903 3391495 3425447 3401856 3332486 3151474 3175743
3969C175743J19746m2219l9451O0841R3808j13830m7703L0840N6575Q5338r6540
$$ 3175743 3295489 3253270 3213819 3274660 3368468 3254638 3206935 3237775 3294350 3379688 3283148
3958C283148J7663j16152j43491l7402M2421J04773N8970k6058m7994j8684L6053
$$ 3283148 3300811 3184659 3041168 3003766 3046187 3150960 3209930 3183872 3135878 3117194 3153247
3947C153247L5600M1862p1069K6142m9381P4739J4133m7183N4212k8583m6321
$$ 3153247 3188847 3230709 3159640 3185782 3136401 3211140 3225273 3178090 3232302 3203719 3157398
3936C157398L9919m887N929J5783r142K0840n2099R4997k2879j34189q906L4219
$$ 3157398 3197317 3192430 3198359 3214142 3205000 3225840 3173741 3268738 3245859 3111670 3102764 3136983
3924C136983P0947o4356R4198j7943q7863J5769O2385O7752o1930p6773J8835
$$ 3136983 3207930 3143574 3237772 3219829 3131966 3147735 3210120 3277872 3215942 3139169 3158004
3913C158004P9681j4774R472p067O0950j07076J698L0632k3982n0533K4016J7303
$$ 3158004 3237685 3222911 3232383 3225316 3286266 3179190 3180888 3211520 3187538 3137005 3161021 3178324
3901C178324L65L7428n7369J23292K3323n4766R3295K1999j0872j16158n8677
$$ 3178324 3178689 3216117 3158748 3282040 3305363 3250597 3343892 3365891 3355019 3238861 3180184
3890C180184P5967L2630K5082n5740m8125j1216J52899K6672K9500o2837L3900
$$ 3180184 3256151 3288781 3313863 3258123 3209998 3198782 3351681 3378353 3407853 3345016 3378916
3879C378916L7998p605N7871k7089j1504J9849M4200p3236M1852o7313L3153J44445
$$ 3378916 3416914 3409309 3467180 3440091 3428587 3448436 3492636 3419400 3461252 3393939 3427092 3571537
3867C571537Q4099r469J15421N2132o9335J25171J11134N4583j2911Q962R9769
$$ 3571537 3655636 3646167 3761588 3813720 3744385 3869556 3980690 4035273 4022362 4031324 4131093
3856D131093N0895j7810K2178J19719O5461l109l2272P551J8077L2444j1334O608
$$ 4131093 4181988 4164178 4186356 4306075 4371536 4368427 4336155 4343706 4361783 4394227 4382893 4389501
3844D389501Q0964Q8126P3836m0209O840J37401O6930O934P0413Q5432J02046
$$ 4389501 4470465 4558591 4632427 4592218 4599058 4736459 4803389 4810323 4880736 4966168 5068214
3833E068214J09283P321j4028J64791J60276K484K3090R4286N3695J47998J71129
$$ 5068214 5177497 5184818 5170790 5335581 5495857 5498341 5521431 5615717 5669412 5817410 5988539
3822E988539J208O5022J69802L2996J35127N8107J96821O8210O3638J15713N1672
$$ 5988539 5989747 6054769 6224571 6257567 6392694 6450801 6647622 6715832 6779470 6895183 6946855
3811F946855J06161K38815J14303K36376J86168J83495K68016J78607J63881R9432
$$ 6946855 7053016 7291831 7406134 7642510 7828678 8012173 8280189 8458796 8622677 8722109
3801H722109K09102K82698K62046J76909K88499K78001L38184L46168K56289M19780
$$ 8722109 8931211 9213909 9475955 9652864 9941363 10219364 10557548 10903716 11160005 11579785
3791A1579785M65192L63066N64246O14218O59333P98467J035959J159028J294654
$$ 11579785 12044977 12408043 12972289 13586507 14245840 15044307 16080266 17239294 18533948
3782A8533948J447693J671134K003273K314209K634986K871026L096941L443380
$$ 18533948 19981641 21652775 23656048 25970257 28605243 31476269 34573210 38016590
3774C8016590L465964K457789J086089K66981k51887j536699k712436l050931
$$ 38016590 41482554 43940343 45026432 45293413 45041526 43504827 40792391 37741460
3766C7741460l927275l859734k797132j778822j128548p71712n74568l78215k54416
$$ 37741460 33814185 29954451 27157319 25378497 24249949 23478237 22903669 22525454 22271038
3757B2271038q6154K1763Q8121J71019K08845K43711L12445L94700L91451M61999
$$ 22271038 22184884 22206647 22294768 22465787 22674632 22918343 23230788 23625488 24016939 24478938
3747B4478938M20049M13300M63601N31760N59666N97920O85723P10498O75850
$$ 24478938 24898987 25312287 25775888 26307648 26867314 27465234 28150957 28861455 29537305
3738B9537305P46602O66582P39541Q66727P73302P65586Q58439R14452Q07279
$$ 29537305 30283907 30950489 31690030 32556757 33330059 34095645 34954084 35868536 36675815
3729C6675815R94697R76756J062148J161860J371486J463955J670618J940353
$$ 36675815 37670512 38647268 39709416 40871276 42242762 43706717 45377335 47317688
3721D7317688K067601K355913K593536K790383L103082L462056L811428M203454
$$ 47317688 49385289 51741202 54334738 57125121 60228203 63690259 67501687 71705141
3713G1705141M498290M731478N096863N592570N878098N946939N680227M661734
$$ 71705141 76203431 80934909 86031772 91624342 97502440 103449379 109129606 113791340
3705A13791340L774632L656424K122856n92748p67084J26108o76297o78347O98742
$$ 113791340 117565972 121222396 123345252 122752504 121985420 122111528 121435231 120756884 121455626
3696A21455626J901134K711517L162808L412702L448465L461879L382873L116701
$$ 121455626 123356760 126068277 129231085 132643787 136092252 139554131 142937004 146053705
3688A46053705K659112K039191J547059Q06186r0974j006829k068134l242458
$$ 146053705 148712817 150752008 152299067 153105253 153014279 152007450 149939316 146696858
3680A46696858m348353n458779o164985o358881o306504n867470m996103l982346
$$ 146696858 142348505 136889726 130724741 124365860 118059356 112191886 107195783 103213437
3672A03213437k906968k125203j499311j108108j217599j475682k154891l197655
$$ 103213437 100306469 98181266 96681955 95573847 94356248 92880566 90725675 87528020
3664H7528020m126979n161843n661035n566533n039071m604150l814713l363330
$$ 87528020 83401041 78239198 72578163 67011630 61972559 57368409 53553696 50190366
3656E0190366k811608k504888k331670j885429j616322j358623j235698j172773
$$ 50190366 47378758 44873870 42542200 40656771 39040449 37681826 36446128 35273355
3648C5273355r70505o93160p26101o40308o40128o88816n83249n90285p29519
$$ 35273355 34302850 33609690 32883589 32243281 31603153 30914337 30331088 29740803 29011284
3639B9011284p50637r50764j002737q70957q34387q76695q39132o42001p71361
$$ 29011284 28260647 27309883 26307146 25436189 24601802 23725107 22885975 22243974 21472613
3630B1472613o11277m20037m89952n28964m93494n17862m55340m43304m23124
$$ 21472613 20861336 20441299 19951347 19422383 18928889 18411027 17955687 17512383 17089259
3621A7089259m73205n17508m38692m85019n01672m09013l32355l83306k56859
$$ 17089259 16616054 16098546 15659854 15174835 14673163 14264150 13931795 13548489 13291630
3612A3291630l75634l18395k23830k91043k69741j09377k26535j44782j06431
$$ 13291630 12915996 12597601 12373771 12082728 11812987 11703610 11477075 11332293 11225862
3603A1225862p1482j63281j28273m2834n5776j45389k98582l47514j97768k08959
$$ 11225862 11154380 10991099 10862826 10819992 10764216 10618827 10320245 9972731 9774963 9566004
3593I566004k78640k19430j94635k66204j95534q4106j43635j48689r1248m303
$$ 9566004 9287364 9067934 8873299 8607095 8411561 8327455 8183820 8035131 7943883 7939580
3583G939580j78878q9947o6274k7606j0843j7162l9662j24742q1196K4332l5519
$$ 7939580 7760702 7670755 7604481 7576875 7566032 7548870 7509208 7384466 7303270 7327602 7292083
3572G292083j16363j1998j13817j83941j16708m7437n4516o6918n7393j01141
$$ 7292083 7175720 7163722 7049905 6865964 6749256 6701819 6647303 6580385 6522992 6421851
3562F421851k7430n6952n563l1490j6819J3100m0223L2360L337o0179r4396M7875
$$ 6421851 6394421 6337469 6331906 6300416 6283597 6296697 6256474 6288834 6292171 6231992 6137596 6185471
3550F185471K2304q5748n090L2630p3929k9694N4551l5223Q9472j07811j23869
$$ 6185471 6207775 6122027 6116937 6149567 6075638 6045944 6100495 6065272 6154744 6046933 5923064
3539E923064N2891n3288J0927K1138j4127k5044M3744J24522k1121j04681l1826
$$ 5923064 5975955 5922667 5933594 5954732 5940605 5915561 5959305 6083827 6062706 5958025 5926199
3528E926199P8237l6457K445Q1295M6099K5370O3487O9567n6258q6719P1371R8909
$$ 5926199 6004436 5967979 5970424 6051719 6097818 6123188 6186675 6256242 6199984 6113265 6184636 6283545
3516F283545P1171j8555q8263O4859l330j1332N7522N0756J04299k2358k409L2443
$$ 6283545 6354716 6336161 6247898 6312757 6309427 6298095 6355617 6406373 6510672 6488314 6485905 6518348
3504F518348o482P3483K6299J97796Q3948Q5895Q1724J15871M0429j0686K0755
$$ 6518348 6511866 6585349 6611648 6809444 6893392 6979287 7061011 7176882 7217311 7206625 7227380
3493G227380Q5861K00676J07878M0393J54026J67402J55511J48322K02435J85162
$$ 7227380 7313241 7513917 7621795 7662188 7816214 7983616 8139127 8287449 8489884 8675046
3483H675046K38383J68475J14594N6437J04022K76256J32630J59210K14872J42593
$$ 8675046 8913429 9081904 9196498 9252935 9356957 9633213 9765843 9925053 10139925 10282518
3473A0282518N0216P7197K21092K07895K21868K31102K61274J75378K04888J69251
$$ 10282518 10332734 10409931 10631023 10838918 11060786 11291888 11553162 11728540 11933428 12102679
3463A2102679K17837K09749K65825L69773L27046L08647K99045K88507K97224
$$ 12102679 12320516 12530265 12796090 13165863 13492909 13801556 14100601 14389108 14686332
3454A4686332L69285L19933L39701K60504L44568L98859L88034M91373N04107
$$ 14686332 15055617 15375550 15715251 15975755 16320323 16719182 17107216 17598589 18102696
3445A8102696N48609N95509O33142N64888O10720O91457O91234P77724R11357
$$ 18102696 18651305 19246814 19879956 20444844 21055564 21747021 22438255 23215979 24127336
3436B4127336Q45990Q93378J095352J041675J216097J207066J267540J293326
$$ 24127336 24973326 25866704 26962056 28003731 29219828 30426894 31694434 32987760
3428C2987760J387335J432533J635533J777395J879072J942858K110719K349486
$$ 32987760 34375095 35807628 37443161 39220556 41099628 43042486 45153205 47502691
3420D7502691K556839K880031L392255L896269M459236N154506N798000O494669
$$ 47502691 50059530 52939561 56331816 60228085 64687321 69841827 75639827 82134496
3412H2134496P544968Q557355R694802J1324566J3188840J5158835J7042818J8331639
$$ 82134496 89679464 98236819 107931621 119256187 132445027 147603862 164646680 182978319
3404A82978319J8806386J7916124J5653079J1148616L606755o346634j6796356
$$ 182978319 201784705 219700829 235353908 246502524 250109279 243762645 226966289
3397B26966289k3822535k4953272k2237326j8522906j5069047j2320940r922328
$$ 226966289 203143754 178190482 155953156 137430250 122361203 110040263 100117935
3390A00117935q187978o798032n912356n105587m326646l933144l486952l173495
$$ 100117935 91929957 85131925 79219569 74113982 69787336 65854192 62367240 59193745
3382E9193745k789436k425019k300321k073432j795113j644665j389002j245085
$$ 59193745 56404309 53979290 51678969 49605537 47810424 46165759 44776757 43531672
3374D3531672j086201q58537o81667o13594n33886n19836l17821k31988j00392
$$ 43531672 42445471 41586934 40905267 40291673 39757787 39237951 38920130 38688142 38587750
3365C8587750k0565J35390K76308M23274N40125O24248P80314P51775Q23311P80416
$$ 38587750 38567185 38702575 38978883 39402157 39942282 40566530 41346844 42098619 42921930 43702346
3355D3702346O86045N99782M96728L09648J84337J02544J10950K63909L55354
$$ 43702346 44388391 44988173 45484901 45794549 45978886 46081430 46192380 46456289 46811643
3346D6811643O56281R72392J148378J525084J851369K124521K398125K840618
$$ 46811643 47467924 48440316 49588694 51113778 52965147 55089668 57487793 60328411
3338F0328411L158400L504857L811235M008858L964927L876991L527097K918839
$$ 60328411 63486811 66991668 70802903 74811761 78776688 82653679 86180776 89099615
3330H9099615K109718J188759L39192j83960o15165p20709o44376o85250p00447
$$ 89099615 91209333 92398092 92737284 92553324 91938159 91217450 90573074 89887824 89187377
3321H9187377o21157k57888K66889P36253J275039K179268K921020L708514M880740
$$ 89187377 88566220 88308332 88575221 89311474 90586513 92765781 95686801 99395315 104276055
3312A04276055N917384P153516Q517974R960059J1701083J3815962J6320881J8946709
$$ 104276055 110193439 117346955 125864929 135824988 147526071 161342033 177662914 196609623
3304A96609623K1618652K3951613K5658510K6198322K4578552J9502499J1047722
$$ 196609623 218228275 242179888 267838398 294036720 318615272 338117771 349165493
3297C49165493J151112q997243j8640319k6305393l0001255l0682695k9079854
$$ 349165493 350316605 341319362 322679043 296373650 266372395 235689700 206609846
3290B06609846k5263331k0424476j6104701j2867333j0519161q850982p608415
$$ 206609846 181346515 160922039 144817338 131950005 121430844 112579862 104971447
3283A04971447o509066n746837m948920m241448l715562l200208k643728k078614
$$ 104971447 98462381 92715544 87766624 83525176 79809614 76609406 73965678 71887064
3275G1887064j700700j284038q16566l57701r4310N4078Q1220j83805o57145j171274
$$ 71887064 70186364 68902326 68085760 67728059 67633749 67687827 67769047 67585242 66928097 65756823
3265F5756823j995616k779160l357206l789948l766461l495498l193129k706720
$$ 65756823 63761207 60982047 57624841 53834893 50068432 46572934 43379805 40673085
3257D0673085k350286k027374j831837j693116j653488j373469j229212j240769
$$ 40673085 38322799 36295425 34463588 32770472 31116984 29743515 28514303 27273534
3249B7273534j138758j025838r93267q87338p43492q51086o63146o29502o59640
$$ 27273534 26134776 25108938 24115671 23228333 22484841 21633755 20970609 20341107 19681467
3240A9681467n99166n83012n52519n25630m58124k96204m29802l76594l75201
$$ 19681467 19082301 18499289 17946770 17421140 16963016 16666812 16237010 15860416 15485215
3231A5485215k07333k60666k90901k26688k89571k82429j86765j30169l23597
$$ 15485215 15277882 15017216 14726315 14499627 14210056 13927627 13740862 13610693 13287096
3222A3287096k72305j78677j03326j77510k10320k39086j53049j94183j68996
$$ 13287096 13014791 12836114 12732788 12555278 12344958 12105872 11952823 11758640 11589644
3213A1589644k15894k08325j12218n4667j65167j12679j08949r9658j90303j96220
$$ 11589644 11373750 11165425 11053207 10998540 10833373 10720694 10611745 10512087 10321784 10125564
3203A0125564q0292p8848r5217q8147o5868q33n7081m9957q6181J7075k9668r6487
$$ 10125564 10045272 9966424 9871207 9783060 9717192 9716359 9659278 9609321 9523140 9540215 9510547 9414060
3191I414060n3294J7732P9891R0889K4671J03822P9729M088j9266J589q3731q2182
$$ 9414060 9360766 9378498 9458389 9549278 9573949 9677771 9757500 9761588 9742322 9743911 9660180 9577998
3179I577998l3676J8270J30668N8586O6324J35955P7671P2986R7694J14619J95978
$$ 9577998 9544322 9562592 9693260 9751846 9818170 9954125 10031796 10104782 10202476 10317095 10513073
3168A0513073J69414l3782J04525J47901N9912J67479K6824J59133K11482J49864
$$ 10513073 10682487 10648705 10753230 10901131 10961043 11128522 11155346 11314479 11525961 11675825
3158A1675825J57999J42991J57254K62368J47887K13322K16580J57554K38151
$$ 11675825 11833824 11976815 12134069 12396437 12544324 12757646 12974226 13131780 13369931
3149A3369931J99362L50911M04548K57217L27681L95349L59032L69000L57372
$$ 13369931 13569293 13920204 14324752 14581969 14909650 15304999 15664031 16033031 16390403
3140A6390403L15026M53443L89191M98445O83528N73371O38864O50032O33036
$$ 16390403 16705429 17158872 17548063 18046508 18730036 19303407 19942271 20592303 21225339
3131B1225339P23677P99121R59612Q69482R66371J169975J095794J291414J389277
$$ 21225339 21949016 22748137 23707749 24577231 25543602 26713577 27809371 29100785 30490062
3122C0490062J624302J800153K099092K615599L013345L462123M162368M768860
$$ 30490062 32114364 33914517 36013609 38629208 41642553 45104676 49267044 54035904
3114E4035904N468964O084430O909433P928307R321897J0882379J2619442J4246142
$$ 54035904 59504868 65589298 72498731 80427038 89748935 100631314 113250756 127496898
3106A27496898J4920833J4740968J3957047J2058659P242155p21108r996970k0390505
$$ 127496898 142417731 157158699 171115746 183174405 190416560 189695452 179698482 159307977
3098A59307977k5571046k2299567j6911457j2199331r014428o827365n132033
$$ 159307977 133736931 111437364 94525907 82326576 73312148 66484783 61352750
3091F1352750l953865l068521k483579k087774j648092j320160q83856o88776
$$ 61352750 57398885 54330364 51846785 49759011 48110919 46790759 45906903 45218127
3083D5218127l81827k73261k99175k72489j69248l27979o61168j164052j412572
$$ 45218127 44836300 44563039 44263864 43991375 43822127 43494148 42832980 41668928 40256356
3074D0256356j682668j743744j915857k184882k346994k153816j914052j601578
$$ 40256356 38573688 36829944 34914087 32729205 30382211 28228395 26314343 24712765
3066B4712765j215816q91682o82529n67248n54837l69522l11588j67717q3438
$$ 24712765 23496949 22605267 21922738 21355490 20800653 20431131 20119543 19951826 19868388
3057A9868388l4722p367K31781K56335J94182K57782J78797K30488J4090j03343
$$ 19868388 19833666 19826299 20058080 20314415 20508597 20766379 20945176 21175664 21189754 21086411
3047B1086411j54369l88812n79668q29315p80826q04626o91341p55808n95527
$$ 21086411 20932042 20543230 19963562 19134247 18353421 17548795 16857454 16101646 15506119
3038A5506119m43033m43984k16591j82149r4224j20056R4654Q5992J08818Q0537
$$ 15506119 15063086 14619102 14402511 14220362 14126138 14006082 14100736 14186728 14295546 14376083
3028A4376083L8021K450J31050J60358M8965K6970O4415j23761J14907J52716
$$ 14376083 14414104 14416554 14547604 14707962 14756927 14783897 14848312 14724551 14839458 14992174
3018A4992174K07809K16042L40897M04438L88174M60499M46149L55241K32202
$$ 14992174 15199983 15416025 15756922 16161360 16549534 17010033 17456182 17811423 18043625
3009A8043625J95676J6866r1816j7980j49407O977J85284K69061M42825N82124
$$ 18043625 18239301 18256167 18164351 18146371 17996964 18003941 18189225 18458286 18901111 19483235
2999A9483235N61471N67448O83087O42845M37094K52847J05474k94745l43446
$$ 19483235 20044706 20612154 21295241 21938086 22375180 22628027 22733501 22438756 22095310
2990B2095310k50835j95073j36094j7852Q6021J86617K55527L65646N00355N16604
$$ 22095310 21844475 21649402 21513308 21495456 21581477 21768094 22023621 22389267 22889622 23406226
2980B3406226M53912L57071J50715l1165J23750J07707L25789J76042K08735J99950
$$ 23406226 23860138 24217209 24367924 24336759 24460509 24568216 24894005 25070047 25278782 25478732
2970B5478732K88812K50767L23036L89927M41124N81722O56180Q07635R27549
$$ 25478732 25767544 26018311 26341347 26731274 27172398 27754120 28410300 29217935 30145484
2961C0145484Q89901R52760Q25572P00573N56591K87434l1383j26156k69282l20737
$$ 30145484 31035385 31988145 32813717 33514290 34070881 34358315 34326932 34200776 33931494 33610757
2951C3610757q3579J45611N18207O50545Q41138R10885J073219Q65286P49693
$$ 33610757 33527178 33672789 34190996 34841541 35682679 36593564 37666783 38532069 39281762
2942C9281762N01535j99711n45194j136267j303518j293126j134968q21901n65656
$$ 39281762 39783297 39583586 39038392 37902125 36598607 35305481 34170513 33348612 32782956
2933C2782956l56535n3612J96901K68155J42999Q5374j54656o07274q68677j257952
$$ 32782956 32426421 32372809 32569710 32837865 32980864 33066238 32911582 32304308 31435631 30177679
2923C0177679j476716j352756j340498j230916r91378q10396n82962n04546l56358
$$ 30177679 28700963 27348207 26007709 24776793 23785415 22975019 22392057 21887511 21531153
2914B1531153l53790m00252n19134n60328p91409p46296q66323r54829q92991
$$ 21531153 21177363 20777111 20257977 19697649 18906240 18159944 17293621 16338792 15445801
2905A5445801p67239p99585o69059o87389m49908m04340m57649m92945m21131
$$ 15445801 14678562 13878977 13209918 12522529 12072621 11668281 11210632 10717687 10296556
2896A0296556l23574l17476m49460l79859l11417k92286m22255k50937l40614
$$ 10296556 9972982 9655506 9206046 8826187 8514770 8222484 7800229 7549292 7208678
2887G208678j72836j66599k21023j34800j10102K722j06126k06330j75530j17971
$$ 7208678 7035842 6869243 6648220 6513420 6403318 6406040 6299914 6093584 5918054 5800083
2877E800083q8316j06896j21447j31624p7911j14528k41290j02912p1025j05999
$$ 5800083 5711767 5604871 5483424 5351800 5273889 5159361 4918071 4815159 4744134 4638135
2867D638135k28752j32286j14282O467N529r3460n8039j35450r58J2860j01091
$$ 4638135 4409383 4277097 4162815 4169282 4174811 4081351 4023312 3887862 3886904 3899764 3798673
2856C798673n6494K6284n6399m0004n1100q0648L1259l1427p1894n8275N362j4190
$$ 3798673 3742179 3768463 3712064 3672060 3620960 3540312 3571571 3540144 3468250 3409975 3415337 3401147
2844C401147L2288R102p991m20m6366K525K0208l933O666n8075J17432j084O0099
$$ 3401147 3433435 3442537 3434546 3434126 3387760 3390285 3410493 3406560 3413226 3355151 3472583 3471499 3531598
2831C531598j03826J4773Q5765m179P0846N1309k9527j432j6606k2005R6669p2867
$$ 3531598 3427772 3442545 3528310 3524131 3594977 3646286 3616759 3615327 3598721 3576716 3673385 3600518
2819C600518m1320K6466Q4592k3486M0817q223p3659o683N2M6518r1366l5998
$$ 3600518 3559198 3585664 3670256 3646770 3687587 3679364 3605705 3599022 3599074 3645592 3554226 3518228
2807C518228r164k4281j18295K981K7474p2118K966L3283q4425J22460J23649
$$ 3518228 3509064 3484783 3366488 3369469 3396943 3324825 3327791 3361074 3276649 3399109 3522758
2796C522758l2487m7618l5705P0059J2953L1749j4071N7171J73807P3763p7849
$$ 3522758 3490271 3442653 3406948 3477007 3489960 3521709 3507638 3564809 3738616 3812379 3734530
2785C734530J8180K2657O8912J72587L2559J64261J02858K8738K3407J6170J1732
$$ 3734530 3752710 3775367 3844279 4016866 4049425 4213686 4316544 4345282 4368689 4384859 4396591
2774D396591M0341l8754n6229m1277j7769O4112J12293J7448O9498j0353l069
$$ 4396591 4436932 4398178 4341949 4300672 4282903 4347015 4459308 4476756 4546254 4535901 4532832
2763D532832R6743K4237J71718J5156J24381L2915J7036J12408R106M3631J17445
$$ 4532832 4629575 4653812 4825530 4840686 4965067 4997982 5015018 5127426 5136532 5180163 5297608
2752E297608P2732L7707P2247J1094N7528Q6856J70310J35041J9333L3028O5919
$$ 5297608 5370340 5408047 5480294 5491388 5548916 5635772 5806082 5941123 5960456 5993484 6059403
2741F059403P2483J62000J25286J03773K19804J61724J56162Q7486J72165J67870
$$ 6059403 6131886 6293886 6419172 6522945 6742749 6904473 7060635 7148121 7320286 7488156
2731G488156J48472K64959K13053K59922L17280L83591K84344L51152N62059N22133
$$ 7488156 7636628 7901587 8114640 8374562 8691842 9075433 9359777 9710929 10272988 10795121
2721A0795121M39865O15718Q17066Q09435R20803J007241J076087J281158J488345
$$ 10795121 11234986 11850704 12667770 13477205 14398008 15405249 16481336 17762494 19250839
2712A9250839J611714J584401J694177J679239J572031J399045J337428R98788
$$ 19250839 20862553 22446954 24141131 25820370 27392401 28791446 30128874 31127662
2704C1127662P25654N70864K26724K2072k36859l01822l65853j81554j87778k05719
$$ 31127662 31853316 32424180 32650904 32672976 32436117 32134295 31768442 31586888 31399110 31193391
2694C1193391j42649J9072k9032j52278j21309k94363n18972q06730j082975j224515
$$ 31193391 31050742 31069814 31040782 30888504 30767195 30472832 29953860 29147130 28064155 26839640
2684B6839640j437277j470219j446631j472425j569141j423106j296997j214536
$$ 26839640 25402363 23932144 22485513 21013088 19443947 18020841 16723844 15509308
2676A5509308j032076q82467p83361p83173n92916m86668m92539m75782l36317
$$ 15509308 14477232 13594765 12811404 12028231 11435315 10948647 10456108 9980326 9644009
2667I644009l18514k76695k64258k56989k96129k25843j10428k37811j17617k4729
$$ 9644009 9325495 9048800 8784542 8527553 8231424 8005581 7895153 7657342 7539725 7514996
2657G514996m7730j31300j13218m073n4090j32928n9277L2837k9631n8924j0952
$$ 7514996 7467266 7335966 7222748 7218675 7164585 7031657 6972380 7005217 6975586 6916662 6905710
2646F905710k4562N2102o523P8587O5945k2131R6951J18595O9344J9829M4362
$$ 6905710 6881148 6933250 6926727 7005314 7071259 7049128 7146079 7264674 7334018 7353847 7398209
2635G398209O6147o1811N1623K1913P2087J3571j1004N084p1024n375m2089m2939
$$ 7398209 7464356 7402545 7454168 7476081 7548168 7561739 7550735 7555819 7484795 7479420 7437331 7394392
2623G394392j3936L6786J0302j9878q931n3923O9709K8246j3997J83974Q8544
$$ 7394392 7380456 7417242 7427544 7407666 7398735 7344812 7414521 7442767 7428770 7612744 7701288
2612G701288O9374M382K17592J19639M4005J38662J53318J75046K45375J63276
$$ 7701288 7770662 7775044 7992636 8112275 8156280 8294942 8448260 8623306 8868681 9031957
2602I031957K08848J97566J73729J20091K41779K61252K14727J44805J86163L00994
$$ 9031957 9240805 9438371 9612100 9732191 9973970 10235222 10449949 10594754 10780917 11081911
2592A1081911L13185K80071R0141L07507K86253L22515K45708L70471M07245L02581
$$ 11081911 11395096 11675167 11765308 12072815 12359068 12681583 12927291 13297762 13705007 14007588
2582A4007588L82604M45741M89705L95293M86556N62131M22742L83869M13501
$$ 14007588 14390192 14835933 15325638 15720931 16207487 16769618 17192360 17576229 17989730
2573A7989730L53399K61720K42065K73283J97954K54385J35287J59551K48917
$$ 17989730 18343129 18604849 18846914 19120197 19318151 19572536 19707823 19867374 20116291
2564B0116291J09073J47986J43477K09323K18247K97742K00741K46363M56714
$$ 20116291 20225364 20373350 20516827 20726150 20944397 21242139 21442880 21689243 22145957
2555B2145957M51541M84525N89399N08378O04395O82809O69533P69755Q43791
$$ 22145957 22597498 23082023 23671422 24179800 24784195 25467004 26136537 26906292 27750083
2546B7750083R62197J016507J155804J272974J375715J516043J615161J881357
$$ 27750083 28712280 29728787 30884591 32157565 33533280 35049323 36664484 38545841
2538C8545841K150813K369988K600745K918548L427301L686206M205113M627167
$$ 38545841 40696654 43066642 45667387 48585935 52013236 55699442 59904555 64531722
2530F4531722N169691N561242O112168O650686P102215P131115P267385P322966
$$ 64531722 69701413 75262655 81374823 88025509 95127724 102258839 109526224 116849190
2522A16849190O791347O336057N519596M775184L880641K981025K413537J684907
$$ 116849190 123640537 129976594 135496190 140271374 144152015 147133040 149546577 151231484
2514A51231484J283914J194563J021663P90650K59560j93373r20535j769563k690249
$$ 151231484 152515398 153709961 154731624 155522274 155781834 155588461 154667926 152898363 150208114
2505A50208114l748962m643123n737972o592738p277041p617654p647294p647348
$$ 150208114 146459152 141816029 136078057 129485319 122208278 114590624 106943330 99295982
2497I9295982p494435p171866o637026o229234n664801n010908m357135m014306
$$ 99295982 91801547 84629681 77992655 71763421 66098620 61087712 56730577 52716271
2489E2716271l715822l260420k829675k604211k368903k044219j792980j604545
$$ 52716271 49000449 45740029 42910354 40306143 37937240 35893021 34100041 32495496
2481C2495496j526145j375991j228021j088744r92506r90313q77311o62833o68840
$$ 32495496 30969351 29593360 28365339 27276595 26284089 25293776 24416465 23753632 23084792
2472B3084792o66521n02847m87024m63575l81212l34112l83734l54156l33362
$$ 23084792 22418271 21915424 21428400 20964825 20583613 20249501 19865767 19511611 19178249
2463A9178249k91659j91932j43398k07273j12407j55841j12544l5091j52560q2543
$$ 19178249 18886590 18694658 18551260 18343987 18231580 18075739 17963195 17928104 17775544 17693001
2453A7693001k0100N805L5362J28745P2244l7394m4955n5428o4519j34145j95074
$$ 17693001 17672901 17678706 17714068 17842813 17915057 17877663 17832708 17777280 17712761 17578616 17383542
2442A7383542j90562k48474j13073j45442k96502k98163j93294j53767k02413
$$ 17383542 17192980 16944506 16831433 16685991 16389489 16091326 15898032 15744265 15541852
2433A5541852j84152j80304j55066q9099j90391j80167j26585j01020O2287k899
$$ 15541852 15357700 15177396 15022330 14933231 14742840 14562673 14436088 14335068 14397355 14394456
2423A4394456M6212p1598j5995J67250J70880k1903L3006K19663K30371K76639
$$ 14394456 14440668 14369070 14353075 14520325 14691205 14669302 14702308 14921971 15152342 15428981
2413A5428981K01245K71531K30332L47413K46941K60244K50759J29074K13688
$$ 15428981 15630226 15901757 16132089 16479502 16726443 16986687 17237446 17366520 17580208
2404A7580208J53164O7362J9132J45512J08525r17L315K0186J12096M5021O7942
$$ 17580208 17733372 17800734 17819866 17965378 18073903 18072986 18076301 18096487 18208583 18253604 18321546
2393A8321546J63139J79054K39138K00594K35745J84239K45576J92504J92894
$$ 18321546 18484685 18663739 18902877 19103471 19339216 19523455 19769031 19961535 20154429
2384B0154429K13922J92265K18680J44033J50374J29399J95206J67889J84998
$$ 20154429 20368351 20560616 20779296 20923329 21073703 21203102 21398308 21566197 21751195
2375B1751195L31457K30695L36519L11007M13798M75011N28928N90717O13552
$$ 21751195 22082652 22313347 22649866 22960873 23374671 23849682 24378610 24969327 25582879
2366B5582879O76123P32443P25494Q39239Q87031R25497J123427J132491J331193
$$ 25582879 26259002 26991445 27716939 28556178 29443209 30368706 31492133 32624624 33955817
2357C3955817J309196J280967J388914J589482J773742J859109K017599K102792
$$ 33955817 35265013 36545980 37934894 39524376 41298118 43157227 45174826 47277618
2349D7277618K405554K649077K909575L190431L610911M210042M849874N444976
$$ 47277618 49683172 52332249 55241824 58432255 62043166 66253208 71103082 76548058
2341G6548058O118618P051123Q109032R123940J0311894J1539185J2737551J3945532
$$ 76548058 82666676 89717799 97826831 106950771 117262665 128801850 141539401 155484933
2333A55484933J5194717J6260421J6793585J6862113J6300831J4682808J2060205
$$ 155484933 170679650 186940071 203733656 220595769 236896600 251579408 263639613
2326B63639613Q577785L943446p82901n910381j0544763j4156326j6709590j8037242
$$ 263639613 272217398 276160844 275377943 269467562 258922799 244766473 228056883 210019641
2318B10019641j8144879j7371662j6021595j4359364j2647425j1088483r738623
$$ 210019641 191874762 174503100 158481505 144122141 131474716 120386233 110647610
2311A10647610q516086p378119o526252n772573n177303m575101m183228l754126
$$ 110647610 102131524 94753405 88227153 82454580 77277277 72702176 68518948 64764822
2303F4764822l485990l177767k877087k680193k265268k137331j848185j731143
$$ 64764822 61278832 58101065 55223978 52543785 50278517 48141186 46293001 44561858
2295D4561858j466165j197188j355125j030077r30788q25535p82321o06634m59950
$$ 44561858 43095693 41898505 40543380 39513303 38582515 37756980 36974659 36368025 35908075
2286C5908075m56809l02558l25871j42693k6693J77724K89936L81787N43238O08114
$$ 35908075 35451266 35148708 34822837 34680144 34653451 34831175 35121111 35502898 36046136 36654250
2276C6654250P64674R02090Q30096R73422R14895Q90874R03007P78182O94333
$$ 36654250 37418924 38321014 39151110 40124532 41039427 41930301 42833308 43611490 44305823
2267D4305823O46300O51155O60012O56019O49112N99389N57725N42980M24789
$$ 44305823 44952123 45603278 46263290 46919309 47568421 48167810 48725535 49268515 49693304
2258D9693304N69606M21292M28623M97561M41539L95784M19530M33060L47489
$$ 49693304 50262910 50684202 51112825 51610386 52051925 52447709 52867239 53300299 53647788
2249E3647788L42953K36745o0423l02233m91963p29306r01899j102731q21797
$$ 53647788 53990741 54227486 54167063 53864830 53372867 52643561 51741662 50638931 49817134
2240D9817134r13756p23359n22995l54362l74723k01136J8358j70583r6533r5461
$$ 49817134 48903378 48180019 47657024 47302662 46927939 46726803 46745161 46574578 46478045 46382584
2230D6382584j02722j94474j87396j7042L0809J96513L42635M25093M67587P09859
$$ 46382584 46279862 46085388 45897992 45880950 45911759 46108272 46450907 46876000 47343587 48053446
2220D8053446R00099R04545J139224J098024J127081J151146J209446J173554
$$ 48053446 48953545 49858090 50997314 52095338 53222419 54373565 55583011 56756565
2212E6756565J028280R84907J010260J109160J061068J269721J241886J334834
$$ 56756565 57784845 58769752 59780012 60889172 61950240 63219961 64461847 65796681
2204F5796681J601850J839253J771689K022131K271036K483470K742366K886343
$$ 65796681 67398531 69237784 71009473 73031604 75302640 77786110 80528476 83414819
2196H3414819L143004L331961L493297L479476L263054L069656K815351K424285
$$ 83414819 86557823 89889784 93383081 96862557 100125611 103195267 106010618 108434903
2188A08434903K126662J562623J184066P95366O07402M66605L64684M75327P23402
$$ 108434903 110561565 112124188 113308254 114103620 114711022 115177627 115542311 116017638 116741040
2179A16741040J071111J313076J716153J883181K057975J956577J851243J705431
$$ 116741040 117812151 119125227 120841380 122724561 124782536 126739113 128590356 130295787
2171A30295787J337882R07672M60578J68332k38686o16452j035402j358433j529332
$$ 130295787 131633669 132541341 133001919 133170251 132931565 132315113 131279711 129921278 128391946
2162A28391946j748634j873353j999956k126058j971474j994408j913503j570358
$$ 128391946 126643312 124769959 122770003 120643945 118672471 116678063 114764560 113194202
2154A13194202j241321j226937j167856j203021j424001j766145k182286k496610
$$ 113194202 111952881 110725944 109558088 108355067 106931066 105164921 102982635 100486025
2146A00486025l020497l520775l902904m005173m222735m257353m078476l893320
$$ 100486025 97465528 93944753 90041849 86036676 81813941 77556588 73478112 69584792
2138F9584792l595199l396949l024184k748891k617280k299102k089068j811107
$$ 69584792 65989593 62592644 59568460 56819569 54202289 51903187 49814119 48003012
2130D8003012j700304j622615j698773j580967j267068j310600j463890j519658
$$ 48003012 46302708 44680093 42981320 41400353 40133285 38822685 37358795 35839137
2122C5839137j236091j077517r49572q75348n46693n74191m21482j96575j03189
$$ 35839137 34603046 33525529 32575957 31700609 31153916 30579725 30158243 29961668 29858479
2113B9858479K0340J35377J27083L00820L31548M07084N12033M00066M50560M64589
$$ 29858479 29878819 30014196 30141279 30442099 30773647 31180731 31692764 32092830 32543390 33007979
2103C3007979L28525K94327K80683K09018J96128M70273L92794L74810J90752
$$ 33007979 33336504 33630831 33911514 34120532 34316660 34786933 35179727 35554537 35745289
2094C5745289j72256j42603M9192m7478n92813p75591n70681n16112m23276k87528
$$ 35745289 35573033 35430430 35479622 35432144 34839331 34063740 33493059 32976947 32553671 32266143
2084C2266143k83277k58633k27348k5734J18174L95998N17202M18863M61949N25016
$$ 32266143 31982866 31724233 31496885 31471151 31589325 31985323 32502525 32921388 33383337 33908353
2074C3908353N80949N23688M38535N87180Q26410Q71580R85296J046114Q95265
$$ 33908353 34489302 35012990 35451525 36038705 36865115 37736695 38721991 39768105 40663370
2065D0663370Q65056O60640K91344K14412J95659j41256l119K43256K32473j59220
$$ 40663370 41528426 42189066 42480410 42694822 42890481 42749225 42746106 42989362 43221835 43062615
2055D3062615k22878j32031k80942k00008j06429j22598j78795l42932l43374
$$ 43062615 42839737 42707706 42426764 42226756 42120327 41997729 41818934 41476002 41132628
2046D1132628n90083p72774q12657r39646j188005j183763j058612r67709r33196
$$ 41132628 40542545 39769771 38957114 38017468 36829463 35645700 34587088 33619379 32686183
2037C2686183r37268o89625o79939m78914l73141k48308j41101j16306k5884R8053
$$ 32686183 31748915 31059290 30379351 29900437 29527296 29278988 29137887 29021581 28995697 29093750
2027B9093750K56876L46016M53375M27132N51671N39394N66997O52112O60664
$$ 29093750 29350626 29696642 30150017 30577149 31128820 31668214 32235211 32887323 33547987
2018C3547987O89711Q02652J040964J302843J454173J736450K047586K413930
$$ 33547987 34237698 35040350 36081314 37384157 38838330 40574780 42622366 45036296
2010D5036296K768115L126416L698340M171290M703550N199192N656317O123952
$$ 45036296 47804411 50930827 54629167 58800457 63504007 68703199 74359516 80483468
2002H0483468O491255O707421O457681O312533N758906N297650M430894L330320
$$ 80483468 86974723 93682144 100139825 106452358 112211264 117508914 121939808 125270128
1994A25270128K027313M00492j170772k897032m278585n582195o369369o883088
$$ 125270128 127297441 127697933 126527161 123630129 119351544 113769349 107399980 100516892
1986A00516892p215083p309189p008921o523041o031837n408033m795752m275795
$$ 100516892 93301809 85992620 78983699 72460658 66428821 61020788 56225036 51949241
1978E1949241l774522l454637l088302k709376k425608k264035j951286j818550
$$ 51949241 48174719 44720082 41631780 38922404 36496796 34232761 32281475 30462925
1970C0462925j725355j527740j456085j264322j193596j152976r83357r16027
$$ 30462925 28737570 27209830 25753745 24489423 23295827 22142851 21159494 20243467
1962B0243467r62589p25028o13586p24996o92675o05453n33415l44317n06249
$$ 20243467 19280878 18555850 17942264 17217268 16524593 15919140 15385725 15041408 14535159
1953A4535159l90989l35836l74022m04321m41008k99291k39523k45815k31868
$$ 14535159 14144170 13808334 13434312 13029991 12588983 12289692 12050169 11804354 11572486
1944A1572486j57872j92552j67893p0780j17067k06508j16882j37544r2880j01677
$$ 11572486 11414614 11222062 11054169 10983389 10866322 10659814 10542932 10405388 10312508 10210831
1934A0210831j65761o8877j70757j17977j25368k23710q0007k01051o7342j49705
$$ 10210831 10045070 9976193 9805436 9687459 9562091 9338381 9258374 9057323 8989981 8840276
1924H840276k47547k25237j78742j01851j37793k36718k9361o2331q8234j50096
$$ 8840276 8592729 8367492 8188750 8086899 7949106 7712388 7683027 7620696 7532462 7382366
1914G382366P094p2234j84144N366k6927j53892L0389p0909J6355j1287o9808
$$ 7382366 7389460 7317226 7133082 7138448 7111521 6957629 6988018 6917109 6933464 6922177 6852369
1903F852369O8229n2818J0339O6584j01894j27744j01666N9111j0343j3480r4871
$$ 6852369 6920598 6867780 6878119 6944703 6842809 6715065 6613399 6672510 6662167 6648687 6553816
1892F553816o0330L5640J2265J75n2247m8784K5288P3200K7180K33614Q1762J35029
$$ 6553816 6493486 6529126 6541391 6541566 6489319 6440535 6465823 6539023 6566203 6799817 6881579 7016608
1880G016608J17556Q7704L6243j630R8657N5085j6581J26825J09609Q2755o6968
$$ 7016608 7134164 7221868 7258111 7256481 7355138 7410223 7393642 7520467 7630076 7712831 7645863
1869G645863J19441N2199P6990L3436K7721K831Q1442O1946R7681P3873N9109
$$ 7645863 7765304 7817503 7894493 7927929 7955650 7958481 8039923 8101869 8199550 8273423 8332532
1858H332532R8855P9359J24083J01602R2885J70778J78925J60828J35826J21360
$$ 8332532 8431387 8510746 8634829 8736431 8829316 9000094 9179019 9339847 9475673 9597033
1848I597033J33184J97641L65373J87051K12154K31125K08318J21246Q8572J05287
$$ 9597033 9730217 9927858 10293231 10480282 10692436 10923561 11131879 11253125 11341697 11446984
1838A1446984K27227K07247J15498J53943K76925L28038K57515K39414K65457
$$ 11446984 11674211 11881458 11996956 12150899 12427824 12755862 13013377 13252791 13518248
1829A3518248K85082L69876K98664K17944L16311K78422K56639L23823L15480
$$ 13518248 13803330 14173206 14471870 14689814 15006125 15284547 15541186 15865009 16180489
1820A6180489L09236L88266L99660L87602M98122M97423M26546M92097O23617
$$ 16180489 16489725 16877991 17277651 17665253 18163375 18660798 19087344 19579441 20203058
1811B0203058P33353P01839O73859P47791P02257O98327P27718O59849O83687
$$ 20203058 20936411 21638250 22312109 23059900 23762157 24460484 25188202 25848051 26531738
1802B6531738P50113Q56470Q90100R21271R33123J049032J155226J181017J232972
$$ 26531738 27281851 28138321 29028421 29949692 30882815 31931847 33087073 34268090 35501062
1793C5501062J358511J405747J533237J507526J587349J833724J790691J948357
$$ 35501062 36859573 38265320 39798557 41306083 42893432 44727156 46517847 48466204
1785D8466204K165405K333731K642537K997958L370743L808114M393793M791087
$$ 48466204 50631609 52965340 55607877 58605835 61976578 65784692 70178485 74969572
1777G4969572N357552O006451O801363P592018Q460114R737975J1242793J2980542
$$ 74969572 80327124 86333575 93134938 100726956 109187070 118925045 130167838 143148380
1769A43148380J4790829J5875940J6180949J5628000J3001130O964760l100317
$$ 143148380 157939209 173815149 189996098 205624098 218625228 225589988 222489671
1762B22489671j4261756k0462783k0062423j6718732j3065140r897877p652948
$$ 222489671 208227915 187765132 167702709 150983977 137918837 128020960 120368012
1755A20368012n629945l869349k868693k182400j517413j054898o80872J9386
$$ 120368012 114738067 110868718 108000025 105817625 104300212 103245314 102564442 102583828
1747A02583828O28706J039874J809788K530843L305896M379063N369617O607003
$$ 102583828 103212534 104252408 106062196 108593039 111898935 116277998 121647615 128254618
1739A28254618P936733R628417J1080826J2810629J4467077J6591440J9054016
$$ 128254618 136191351 145819768 156900594 169711223 184178300 200769740 219823756
1732B19823756K1928816K5550035K9937283L4500735L8148576M0108794L9586480
$$ 219823756 241752572 267302607 297239890 331740625 369889201 409997995 449584475
1725D49584475L5131457K5043360O645627j9334531m3844040n5503245n3550108
$$ 449584475 484715932 509759292 516404919 497070388 453226348 397723103 344172995
1718C44172995m5316130l6537240k9174456k3380590j9156326j5894213j3852241
$$ 344172995 298856865 262319625 233145169 209764579 190608253 174714040 160861799
1711A60861799j2362166j1437267j0539455r617929q487956p496996o748075n938520
$$ 160861799 148499633 137062366 126522911 116904982 108417026 100920030 94171955 88233435
1703H8233435n291988m864497m500204m108931l836765l451421l056889k739525
$$ 88233435 82941447 78076950 73576746 69467815 65631050 62179629 59122740 56383215
1695E6383215k625270k368409k107734k166502k089400j702628j839476j779962
$$ 56383215 53757945 51389536 49281802 47115300 45025900 43323272 41483796 39703834
1687C9703834j538664j451941j381285j353744j243831j244191j168324j080757
$$ 39703834 38165170 36713229 35331944 33978200 32734369 31490178 30321854 29241097
1679B9241097r76413q92881q78851q45085p72915o76642o75962p06788p98559
$$ 29241097 28264684 27371803 26492952 25647867 24874952 24198310 23522348 22815560 22017001
1670B2017001p06559p02534n58155m92841n87096m77167n49077l39535m78256
$$ 22017001 21310442 20607908 20049753 19556912 18969816 18492649 17943572 17604037 17125781
1661A7125781m28910l28446l38370k68195l15778k85638k81951m08579l05690
$$ 17125781 16696871 16368425 16030055 15761860 15446082 15160444 14878493 14469914 14164224
1652A4164224k10103k78446l44887j88284k31648k33785k19915l02947l34808
$$ 14164224 13954121 13675675 13330788 13142504 12910856 12677071 12457156 12154209 11819401
1643A1819401k40615l37007k08760k88826k33442j69789j80489r7156k28019k56782
$$ 11819401 11578786 11241779 11033019 10744193 10510751 10340962 10160473 10063317 9835298 9578516
1633I578516k23543k72606k30319j17803k49127j81843k62407k42981j07390j01748
$$ 9578516 9354973 9082367 8852048 8734245 8485118 8303275 8040868 7797887 7690497 7588749
1623G588749j44202k04500k16155q1123j06520j32391j43492j46344k03729p1810
$$ 7588749 7444547 7240047 7023892 6942769 6836249 6703858 6560366 6414022 6210293 6138483
1613F138483n1082p3329r0779j67860k18504K4763k2168m8890j37923r9060j1120
$$ 6138483 6087401 6014072 5923293 5755433 5536929 5561692 5539524 5490634 5352711 5253651 5242531
1602E242531j5498n8023j42943l4606q7204j24918j26417n8232r1649q7887j23231
$$ 5242531 5227033 5169010 5026067 4991461 4904257 4779339 4652922 4594690 4503041 4415154 4291923
1591D291923P2370k9033p8766j01464p8561o3001p3889j7148r0777j80704m7616
$$ 4291923 4364293 4335260 4256494 4155030 4076469 4013468 3939579 3922431 3831654 3650950 3603334
1580C603334n561l8195j3678J886j1273j16407j03708m8721q7295J1514P5917
$$ 3603334 3597773 3559578 3545900 3547786 3536513 3420106 3316398 3267677 3180382 3191896 3267813
1569C267813j76026q6803m2669K2919N1358j03879j2204P0082j115j36493j13306
$$ 3267813 3091787 3004984 2962315 2985234 3036592 2932713 2920509 2990591 2989476 2852983 2739677
1558B739677K732p8748o1135o7598j35636J3941p138k0242j22944j7607p163m7225
$$ 2739677 2742409 2663661 2602526 2534928 2399292 2413233 2406095 2385853 2262909 2245302 2238139 2190914
1546B190914k2205J0642m8901j435K8719q7328l1927M0163P0413k4526R0845k279
$$ 2190914 2168709 2179351 2130450 2129015 2157734 2070406 2038479 2078642 2149055 2124529 2215374 2213095
1534B213095L927j2729j01830n03n1779m8193j6488j7635p1136r7796p5126n0373
$$ 2213095 2217022 2204293 2102463 2101960 2050181 2001988 1985500 1967865 1896729 1798933 1723807 1673434
1522A673434J8505M2013L322N259N5086j5125o5515j828l2215m3777p3775O956
$$ 1673434 1691939 1733952 1737274 1742533 1797619 1782494 1716979 1715151 1682936 1639159 1565384 1572340
1510A572340L6116q7057k0518j43543j3112O2503P1820J5903J9720q3709r6529
$$ 1572340 1608456 1521399 1500881 1357338 1344226 1406729 1478549 1494452 1514172 1430463 1333934
1499A333934l2085R683M8202L7378m8773M1310r4954m0337M2324Q6862P1024p2660
$$ 1333934 1301849 1311532 1359734 1397112 1348339 1389649 1294695 1254358 1296682 1383544 1454568 1381908
1487A381908L8985j0409q8267m0265K7324N5561j9324q9010L0850N6240Q3643
$$ 1381908 1420893 1410484 1322217 1281952 1309276 1364837 1345513 1256503 1287353 1343593 1427236
1476A427236N1082l2835N0835J80824j6726j1283O3435M6975l143L0206Q7493
$$ 1427236 1478318 1445483 1496318 1677142 1660416 1649133 1712568 1759543 1756400 1786606 1874099
1465A874099N8905J06374J0402o6442j8631j23225j79525o8783M6332m4456n0206
$$ 1874099 1933004 2039378 2049780 1983338 1964707 1841482 1661957 1593174 1639506 1595050 1544844
1454A544844m8207M419l2670M0080p5237j4323J4330p3960K1981k9525Q827J9972
$$ 1544844 1496637 1501056 1468386 1508466 1433229 1418906 1433236 1359276 1381257 1351732 1360559 1380531
1442A380531Q394r931j965L0379Q0182k265P048q411J90044J11714N9322J58487
$$ 1380531 1388925 1378994 1377029 1407408 1487590 1485325 1492373 1483962 1674006 1785720 1845042 2003529
1430B003529R0002j5577J04568K20316K17489J65881J74021P7686J03899J94j91547
$$ 2003529 2093531 2077954 2182522 2402838 2620327 2786208 2960229 3037915 3141814 3142008 2950461
1419B950461j63963j89422k11217j85908k95002j92418n9174j22801j5298r0831
$$ 2950461 2786498 2597076 2385859 2199951 1904949 1712531 1653357 1530556 1515258 1424427
1409A424427p1909n5425j00756k1813l4743j34859K535n5858N8857p0488q4359
$$ 1424427 1352518 1297093 1196337 1174524 1139781 1004922 1007457 951599 1010456 939968 855609
1398H55609N178L1242L6659n0940K7822J7286p5125r3570o5138P6840K9434p6530
$$ 855609 860787 892029 928688 877748 905570 922856 847731 754161 689023 765863 795297 718767
1386G18767m1677m759k4307N2611J1391m5739j00068J21800L8983j00486L564
$$ 718767 677090 672331 648024 700635 712026 666287 566219 688019 727002 626516 630080
1375F30080J841L1924m7598l9540m5873J02484L8335p1474m1978O0543o4922n7063
$$ 630080 631921 663845 616247 576707 530834 633318 671653 600179 558201 618744 553822 496759
1363D96759O3260j2089n9726m3683N3179m777m3113l9239j6640q087J068J07738
$$ 496759 560019 547930 488204 444521 497700 492923 449810 410571 393931 385844 386912 494650
1351D94650j2482j29328l1330M618j9495m2619M6923K9037k4583n1026j7479Q2003
$$ 494650 482168 352840 321510 326128 306633 264014 310937 339974 315391 264365 246886 328889
1339C28889N0600n7411J7780P5020R4424j13316j5077M0898o9706K5143j3392
$$ 328889 379489 322078 339858 414878 509302 395986 380909 421807 352101 377244 363852
1328C63852Q478J6610Q8615k9819r2830r342M0769j4254r0175J0758L3282M2902
$$ 363852 372330 388940 477555 447736 354906 345564 386333 372079 281904 292662 325944 368846
1316C68846k144j07144O5961N5j0715r27l0427o4199L4621N8152n8868M0723K2706
$$ 368846 366702 259558 325519 325574 314859 313932 283505 219306 253927 312079 253211 293934 316640
1303C16640m647n1691O683P0735O945k4229n1793R142J210j7042O4107o2856n5005
$$ 316640 311993 260302 266985 337720 344665 320436 268643 277785 278995 261953 326060 263204 208199
1290B08199k78P3905J00678M530j8480k0199K2318k6695k1279n3680K4027n3428
$$ 208199 207921 281826 382504 387034 368554 348355 370673 343978 322699 269019 293046 239618
1278B39618k8149K5976O8179J9306J3553n9017K3746p890j7852J4785L7928m235
$$ 239618 211469 237445 305624 324930 338483 279466 303212 295322 277470 292255 330183 325948
1266C25948p1512J02226j5326j3484j27436r115j8384q5766n2374J44209J12282
$$ 325948 254436 356662 341336 327852 200416 191301 172917 87151 34777 178986 291268
1255B91268l4171m1096l921P7612J4354J8948L7109j0748j06672J48440K2572
$$ 291268 257097 216001 212080 289692 304046 322994 360103 349355 242683 391123 413695
1244D13695J382o778m1792o736L3136K6487j34379j9026P6509j10373k208J0519
$$ 413695 415077 408299 366507 359771 392907 419394 285015 265989 342498 232125 229917 240436
1232B40436P3021k8332m7351N252J0121j2211J7478k1526p6395K0957N318m3032
$$ 240436 313457 285125 237774 243026 253147 240936 258414 236888 160493 181450 186768 143736
1220A43736J3995j3315J7895M3409o1314j34912m0267J27193Q768J3293K3969
$$ 143736 157731 144416 162311 205720 144406 9494 -30773 96420 105188 118481 142450
1209A42450p0406j2002Q2955J826l7423J02846K3209l7371N8976j4687Q831n2935
$$ 142450 72044 60042 142997 144823 107400 210246 233455 196084 255060 240373 249204 196269
1197A96269k0348L8707P3792J6043o7270m2368N0444j0030k9699O901j8324l1618
$$ 196269 175921 214628 288420 304463 237193 194825 245269 235239 205540 212441 194117 162499
1185A62499J51330K745l1348n9382l3754j8724O196J4497Q0423k4019K2889J1106
$$ 162499 313829 316574 285226 225844 192090 173366 179562 194059 274482 250463 273352 284458
1173B84458j44869p9482J19520K7043q2876l841K0382P0512J6388j3409K41q1598
$$ 284458 139589 60107 179627 206670 123794 119953 140335 210847 227235 213826 214067 132469
1161A32469l2897R7270J5258o4864m3919n4936n5671j6239K8978Q6304M0808p3408
$$ 132469 99572 196842 212100 147236 103317 48381 -7290 -23529 5449 91753 132561 59153
1149E9153l1272p161j2844l872R583l4622Q3841L3865R8296M9968j73028l1464
$$ 59153 27881 20720 7876 4004 13587 -21035 62806 96671 194967 244935 71907 40443
1137D0443P1782K4117M1865j01891L5275L4799p7199K1261j0911l6863j5692Q132
$$ 40443 112225 136342 178207 76316 111591 146390 69191 90452 79541 42678 26986 35118
1125C5118L2005P4936j2464n0999k2258M761O6406J58000j04113O766K8238m2636
$$ 35118 67123 142059 129595 78596 56338 61099 127505 285505 181392 188158 216396 173760
1113A73760m5999q534l1104k0173K2184Q162J09926J5821l7379j994k2214P070
$$ 173760 127761 119227 88123 67950 90134 98296 208222 224043 186664 184670 162456 169526
1101A69526M1780J2891m543N8002K60o1278j3219k3301o8251L1309N0215J9707
$$ 169526 211306 224197 219654 277656 277916 216638 203419 180118 111867 143176 193391 213098
1089B13098J0667m0007N3816K0818j34908l2150J6727N9966N5644J4205o0826
$$ 213098 223765 183758 237574 258392 123484 91334 108061 168027 223671 237876 177050
1078A77050Q8892M0889P07j5966J459l5097n5850J1534J11389k2523j64504J39619
$$ 177050 265942 306831 307538 291572 293031 257934 202084 213618 325007 302484 137980 277599
1066B77599P479j2919N0450L5500M4245p7107M6660K7427q5984n5759l1626O8431
$$ 277599 285078 272159 322609 358109 402354 325247 371907 399334 313350 257591 225965 294396
1054B94396Q3010j9780J5541L3357p2929O1307M1284k7964m8495j328R5257k0405
$$ 294396 377406 357626 373167 406524 333595 394902 436186 408222 359727 358399 453656 433251
1042D33251o2013P0146O5507o2296j0759K2139l5161R8737J01678L6678L9254
$$ 433251 371238 441384 506891 444595 433836 455975 420814 519551 621229 657907 697161
1031F97161q1884Q678o8290O867M1491o697J0380P4216Q4280n3461l3104P6576
$$ 697161 615277 623955 555665 562532 604023 597326 607706 681922 766202 712741 679637 756213
1019G56213Q7511J46263J38227N874m8013m9692R6404L9704j46602l4201r568
$$ 756213 843724 989987 1128214 1134088 1086075 1036383 1132787 1172491 1025889 991688 982120
1008I82120n6647K2334R764Q3663J15762N6797k818j0794J39052j8344J534k1510
$$ 982120 925473 947807 957571 1041234 1156996 1213793 1210975 1200181 1339233 1320889 1322423 1300913
996A300913R4886M5223J62025K8965K6673n8503J19662J48536J86882J44933J86347
$$ 1300913 1395799 1441022 1603047 1632012 1658685 1600182 1719844 1868380 2055262 2200195 2386542
985B386542k1697J62501J54930J0501M7301K15232L08673J88439L30318L06001
$$ 2386542 2364845 2527346 2682276 2692777 2740078 2955310 3263983 3452422 3782740 4088741
975D088741K04751M22775N19623K41304K63374N51450O85297Q54293R88194J288432
$$ 4088741 4293492 4716267 5235890 5477194 5740568 6292018 6977315 7831608 8819802 10108234
965A0108234J569418J921219K418034K614153L063023L300425K967734L451596
$$ 10108234 11677652 13598871 16016905 18631058 21694081 24994506 27962240 31413836
957C1413836J319504p376750p099083l842984k628910j822030j420401r45832
$$ 31413836 32733340 25356590 18257507 14414523 11785613 9963583 8543182 7597350
949G597350p43298m95399m33836k90550l77063k28737l07830k14917k50628l56136
$$ 7597350 6854052 6358653 5924817 5634267 5257204 5028467 4720637 4505720 4255092 3898956
939C898956m41546j70207k58960j43089l01381j68075j34943j61503n1710r9429
$$ 3898956 3457410 3287203 3028243 2885154 2583773 2415698 2280755 2119252 2067542 1968113
929A968113o0967j48773j30910k2932K3264r4759j12212K6521o4892j58730p7648
$$ 1968113 1907146 1758373 1627463 1604531 1627795 1533036 1420824 1447345 1382453 1223723 1146075
918A146075r4795K1481j3485m7520O9344o258j3625q8201j04483j14912J9915
$$ 1146075 1051280 1072761 1059276 1011756 1081100 1074842 1061217 973016 868533 753621 773536
907G73536K9425N252m8647K5636o1832Q10m8389L0959q7457n9109J3130K6569
$$ 773536 802961 808213 759566 785202 723370 724180 675791 706750 619293 560184 573314 599883
895E99883n8411O5284j8051m0L4887P4423M8192j26683l8111O0983n1525j08584
$$ 599883 541472 606756 588705 588665 623552 697975 746167 619484 581373 642356 590831 482247
883D82247P370K0468j01171K2464Q3606m7188l8356M2125m9035K2337j07319m5933
$$ 482247 489617 510085 408914 431378 514984 467796 429440 471565 422530 444867 337548 291615
871B91615K1052Q3443p9121q0553l1645m9040L1302Q1590j1767O2693K2192p3630
$$ 291615 312667 396110 316989 236436 204791 155751 187053 268643 256876 319569 341761 268131
859B68131M9508m5090j26253K8965O0956l311M8533M7281k8434m6519j04811K1438
$$ 268131 317639 272549 146296 175261 236217 232906 281439 328720 300286 253767 148956 170394
847A70394J4698l1701J5054O0784n1825q9691N9375N7758p211m8671K9753k7800
$$ 170394 185092 153391 168445 229229 177404 87713 147088 204846 197635 148964 178717 150917
835A50917j5981L4860n3749L9372k3133J1958K3919j32455L6567O6469R334J12659
$$ 150917 134936 169796 116047 155419 132286 144244 168163 35708 72275 138744 148078 260737
823B60737j28540p6441o910n4103N9533q72K836K2867Q9230r6746j9575K0396
$$ 260737 132197 55756 48846 -5257 54276 53404 56240 79107 168337 71591 52016 72412
811G2412K5012K228M0506j11506M5330N5895K981p0568k9850l3026P3244J4499
$$ 72412 97424 99652 140158 28652 73982 129877 132858 62290 32440 -586 72658 87157
799H7157j3929m5017O0872o8842p9698M5167O1997K1216N395j6177m3339L2781
$$ 87157 73228 28211 89083 20241 -59457 -14290 47707 68923 74318 58141 14802 47583
787D7583j6899L8852q1727j8029M4598L1072L8240l4884l1767R2220o9396j5422
$$ 47583 30684 69536 -12191 -30220 14378 45450 83690 48806 17039 109259 39863 24441
775B4441o3121k6410P862O7384N5478k1442j3069R9765l1616p616n1756k3420
$$ 24441 -38680 -65090 -57228 10156 65634 44192 31123 130888 99272 91656 39900 16480
763A6480Q876K9293j2150L4659m2770K4003R7820m5062k7971p5261Q786R200L7209
$$ 16480 25356 54649 42499 77158 34388 58391 156211 111149 83178 7917 16703 25903 63112
750F3112p458k3249M9171P625l6090l2116n0943O575o946J4650L3993J7361N737
$$ 63112 55654 32405 81576 89201 53111 20995 -29948 -23373 -30319 -15669 18324 35685 41422
737D1422M1032o0726J30808p0281q3091l5024M6060j2420K8408J1052j6911k2636
$$ 41422 82454 21728 152536 82255 -836 -35860 10200 -2220 26188 37240 20329 -2307
725b307k5161l1357P6173p6245O5398J2096m4353l5751Q565P3699K0504N2447
$$ -2307 -27468 -58825 17348 -58897 6501 18597 -25756 -61507 -52942 20757 41261 93708
713I3708r8337o2320R6239l1887n2055q700M3371J6303k5006L9028j5149O4869
$$ 93708 -4629 -66949 29290 -2597 -54652 -63352 -19981 -3678 -28684 10344 -4805 60064
701F0064M5312j24364q1889R3010q1244J6209N4951L22P7509m6740n7433l9278
$$ 60064 105376 -18988 -100877 -7867 -89111 -72902 -17951 -17629 59880 13140 -44293 -83571
689h3571M4292l7487O169L2823L1820M4134L2228K5174J2770k8345n1654O9828
$$ -83571 -39279 -76766 -70597 -37774 -5954 38180 70408 95582 108352 80007 28353 98181
677I8181L297p231l3214M3470J02928K7805l8715p4831r719L2854p1614L7236
$$ 98181 101478 94247 61033 104503 207431 235236 196521 121690 111971 144825 73211 110447
665A10447j8717N9091j28293j06749R32L6111M9711q8645q4210Q6324l7988N6497
$$ 110447 91730 150821 22528 -84221 -83289 -47178 2533 -86112 -170322 -83998 -121986 -65489
653f5489J17868L1932j31431J2192N5189Q6349j3087q5926L6520J878n3337o2183
$$ -65489 52379 84311 -47120 -34928 20261 106610 93523 7597 44117 45995 -7342 -69525
641f9525k8111N0242N2118P9712m6207l3970K1454l878m432p5399L3393Q4020
$$ -69525 -97636 -47394 4724 84436 38229 4259 25713 21835 17403 -57996 -24603 59417
629E9417n6344j11837n1351Q5037j4709O518M0971K7638k9664p0829n1416N7125
$$ 59417 3073 -108764 -160115 -75078 -89787 -83269 -42298 -14660 -44324 -115153 -166569 -109444
617a09444N3731J40269P5266m2642j19614L011L1647P6508j3874k0539j12142
$$ -109444 -55713 84556 159822 117180 -2434 577 32224 108732 94858 74319 -37823
606c7823j9289O7324r2875N95J19467K9484r9238m6133P8879k1037m0954P6700
$$ -37823 -57112 10212 -82663 -82068 37399 66883 -32355 -78488 391 -20646 -61600 15100
594A5100l273n466m4376L4022m8507o5247l6983N6502L4341k383q191Q076j54997
$$ 15100 11827 6361 -38015 -3993 -52500 -117747 -154730 -98228 -63887 -66270 -74461 -66385 -221382
581b21382N5758J78112R7284j61364m0600J3215O314R3300j3434m6189J3635p8582
$$ -221382 -165624 12488 109772 -51592 -92192 -78977 -72663 20637 7203 -38986 -25351 -103933
569a03933L4973R122L903l9244N0522J10979Q422o0097j1646k0743p0884j6425
$$ -103933 -68960 -59838 -55935 -95179 -44657 66322 74744 14647 3001 -17742 -88626 -105051
557a05051K4729o0747o5507O7109J27686O283N0187J3786n1604j3038M1835o3896
$$ -105051 -80322 -141069 -206576 -139467 -11781 -5498 44689 58475 6871 -6167 35668 -28228
545b8228m4406J6028L9650L1220k2006M9130j02771K3034J32826n2116p0455q4656
$$ -28228 -72634 -56606 -16956 14264 -7742 41388 -61383 -38349 94477 42361 -28094 -112750
533a12750J586L9086R1282l3561l2846j8648o1402M1469M4168k590J15831l3819
$$ -112750 -111164 -72078 19204 -14357 -47203 -65851 -127253 -85784 -41616 -44206 71625 37806
521C7806j41467r669J60320L5519p1125p5279k1180k5801p5587J13331O2787p5703
$$ 37806 -103661 -113330 46990 82509 11384 -63895 -85075 -110876 -186463 -73132 -10345 -86048
509h6048j2883O1164k9185K7941N7750k4077p227L7368j5772K690j0675J9941
$$ -86048 -98931 -37767 -66952 -39011 18739 -5338 -12565 24803 9031 11721 1046 20987
497B0987j2529o2404p9344J61220q0905p6619L9135J9341P8615J3582m9127l8517
$$ 20987 8458 -53946 -133290 27930 -52975 -129594 -90459 -71118 7497 21079 -28048 -66565
485f6565k1895j7996N8120K8606R852k2846k9318M8045q559J9924k4013o3429
$$ -66565 -88460 -106456 -48336 -19730 -9878 -32724 -62042 -13997 -22556 -2632 -26645 -90074
473i0074R230N9855j9730L9183l4815j7436K1317o2679k0234M6526Q8787r5219
$$ -90074 -80844 -20989 -40719 -1536 -36351 -53787 -32470 -95149 -115383 -68857 19930 -75289
461g5289q8831J9969j1046R346O7551O0999m1964n2581k1766O0472R6003j7679
$$ -75289 -164120 -144151 -155197 -145851 -78300 -17301 -59265 -111846 -133612 -73140 22863 5184
449E184m630o519M5439j216r612j7636J0908m0022k9682r0611L3735k2510p3448
$$ 5184 554 -5965 39474 38258 28646 11010 21918 -18104 -47786 -138397 -104662 -127172 -200620
436b00620P8309J6345P1632j37643j6731M6067O8206N6150j0934j647N0582L5703
$$ -200620 -122311 -105966 -34334 -171977 -188708 -142641 -74435 -18285 -29219 -30866 19716 55419
424E5419l3058O3924q3450j7939m1558o2701Q1838n4450P246J1205J4413j21882
$$ 55419 22361 86285 2835 -15104 -56662 -119363 -37525 -91975 -84729 -73524 -59111 -180993
412a80993L6745N1311n4371L3308j4016J32860M22j21157m961j704Q2000l2859
$$ -180993 -144248 -92937 -147308 -114000 -128016 4844 5266 -115891 -120852 -122556 -40556 -73415
400g3415p6495m6293O6869P4194L1687m9858K0375K3214m2111M9850M2732J9176
$$ -73415 -149910 -196203 -129334 -55140 -23453 -73311 -52936 -29722 -71833 -21983 20749 39925
388C9925r1703j0830k3270J5537M8842k3743p8679l4058K2982Q0954P6249n3289
$$ 39925 -51778 -62608 -85878 -70341 -21499 -45242 -123921 -157979 -134997 -54043 22206 -31083
376c1083j4443p5961l360M6532M9962L3746n8304n8675J15055p334J3073q2136
$$ -31083 -45526 -121487 -124847 -78315 -28353 5393 -52911 -111586 3469 -3865 9208 -72928
364g2928N7431n4035O536L0672k9973K2340m4265L4962K8883o6037p8405M5485
$$ -72928 -15497 -69532 -62996 -32324 -62297 -39957 -84222 -49260 -20377 -86414 -164819 -119334
352a19334m6066k3961M137J08218N167L6058k0999P775L8443m1791r8913K2295
$$ -119334 -165400 -189361 -185224 -77006 -71839 -35781 -56780 -49005 -10562 -52353 -151266 -128971
340a28971N1304J36240J1667R13l9815n5881l2860N1317o4813P72j8865O5560
$$ -128971 -77667 58573 70240 71153 31338 -24543 -57403 -6086 -70899 -70127 -88992 -23432
328b3432q6202n5977P5900k6519j6942j0049n6046K0566P2200o0877L260N2923
$$ -23432 -109634 -165611 -89711 -116230 -133172 -143221 -199267 -178701 -106501 -167378 -164118 -111195
316a11195m8834P5384L5028n1089j4780l029k3405k9530o4167j8009J35279L8965
$$ -111195 -160029 -84645 -49617 -100706 -115486 -118515 -141920 -171450 -235617 -253626 -118347 -79382
304g9382o2454m137K389k8385L6713M6376K6509K1145r5264k008N3670K638j960
$$ -79382 -141836 -145973 -143584 -171969 -135256 -88880 -62371 -41226 -136490 -138498 -84828 -82190 -84150
291h4150K4199O945j5012j6416j3639J400m1571J03035M817l8931K7365l8487
$$ -84150 -59951 -53006 -68018 -84434 -98073 -96673 -138244 -35209 -30392 -69323 -41958 -80445
279h0445M9180k7175k856J9840o9386m7639o4490j8661R9628m63k965J5750o2647
$$ -80445 -31265 -58440 -61296 -41456 -110842 -158481 -222971 -241632 -142004 -142467 -145432 -129682 -192329
266a92329R4108j3413M4514L8208l928m1020l8557J0056K7211J0420K5197J5224
$$ -192329 -98221 -111634 -67120 -28912 -32840 -73860 -112417 -102361 -75150 -64730 -39533 -24309
254b4309n8223p6308R6845K2359K1039O105k4256k2249m8907N947J9209M742M9674
$$ -24309 -82532 -158840 -61995 -39636 -18597 -12492 -36748 -58997 -107904 -101957 -82748 -78006 -28332
241b8332k8841k1470L839Q4523p7951J6660m120K2142m0852o6563r3509L5922
$$ -28332 -57173 -78643 -74804 9719 -68232 -51572 -55692 -33550 -74402 -140965 -234474 -198552
229a98552Q5299k2235k5764l4556J1904J0671L4062o2317P8020J8415m6447l4958
$$ -198552 -113253 -135488 -161252 -195808 -183904 -173233 -139171 -201488 -123468 -105053 -151500 -186458
217a86458N4197l8667O5773R464J7239J9670j5546M2741k0015k6710q6550J7201
$$ -186458 -132261 -170928 -105155 -95691 -78452 -58782 -74328 -31587 -51602 -78312 -164862 -147661
205a47661K3738M288k9245k2319K8502o7356j8052K7954M5250J1662J2471j7776
$$ -147661 -123923 -119635 -148880 -171199 -142697 -210053 -228105 -200151 -154901 -143239 -130768 -148544
193a48544m406K3187j10491M2764N8792o304m030P4535m7711J224K6544j6204
$$ -148544 -152950 -129763 -240254 -197490 -138698 -145002 -149032 -74497 -122208 -120984 -94440 -110644
181a10644M0328n3302p2980O5395J8764l9610J4074M0425L1034m5942k1484j0186
$$ -110644 -70316 -123618 -196598 -131203 -112439 -152049 -137975 -97550 -66516 -112458 -133942 -144128
169a44128K2304q2891o767J81681L82j01765Q4575k9382j12772l1230P6107L1114
$$ -144128 -121824 -204715 -211482 -29801 -29419 -131184 -46609 -75991 -188763 -219993 -143886 -112772
157a12772K8712r8511K2648M5760p925j4026j7009K8797J25653j4910k1481j02453
$$ -112772 -84060 -182571 -159923 -114163 -122088 -136114 -153123 -124326 1327 -13583 -35064 -137517
145a37517O2K6711j0666k774J2315m2280n2601N4475L7728M0852R964n1566m1691
$$ -137517 -137455 -110744 -121410 -124184 -111869 -154149 -206750 -152275 -114547 -73695 -63731 -115297 -156988
132a56988Q4725j2450j9764p9302l1536P1396R6012m1083m7689j8755m251m952
$$ -156988 -72263 -84713 -104477 -183779 -215315 -143919 -47907 -88990 -136679 -155434 -159685 -164637
120a64637N1791j0714j1590m0264l8958J7022P1070O3681p4739l6005q406L1166
$$ -164637 -112846 -123560 -135150 -175414 -214372 -197350 -126280 -62599 -137338 -173343 -181749 -150583
108a50583L2547l790k9993k215N081k7650o0249m0504Q0687J4395l3698L650M8487
$$ -150583 -118036 -121826 -151819 -154034 -148953 -176603 -236852 -277356 -196669 -182274 -215972 -212322 -163835
95a63835K1812L567j2231M0560k9278k5173J8904n3043r2177O4038Q6744j5466
$$ -163835 -142023 -138456 -150687 -110127 -139405 -164578 -145674 -198717 -290894 -226856 -140112 -155578
83a55578L7650J5798n5981m2802J05588J6928r8273K0077r239J4077j0424L6083
$$ -155578 -117928 -102130 -158111 -200913 -95325 -78397 -176670 -156593 -165832 -151755 -162179 -126096
71a26096N0003o492n6689j4590N8924l2416M311L005k9224o0914l267L1372m9459
$$ -126096 -76093 -82585 -139274 -153864 -94940 -127356 -123045 -120040 -149264 -210178 -213445 -182073 -231532
58b31532M3227P9276p0408o25j1383R389j8015N2965j5203j1825L6541m4554J2333
$$ -231532 -188305 -109029 -179437 -180062 -191445 -182056 -200071 -147106 -162309 -174134 -137593 -182147 -169814
45a69814L6565l3750K1072J9759m1984K7418R024L745M063j7860l3369k2981O4793
$$ -169814 -133249 -166999 -145927 -126168 -168152 -140734 -131710 -127965 -123902 -141762 -175131 -198112 -133319
32a33319J3880p6545J7759M7998p6767j7489j618j996J7026M6799M1289k6100
$$ -133319 -119439 -195984 -178225 -130227 -206994 -224483 -226101 -228097 -211071 -164272 -122983 -149083
20a49083p1433l2444r344P8493N7250J0432K6472o6915K8609K745m3663p9085
$$ -149083 -220516 -252960 -262304 -183811 -126561 -116129 -89657 -156572 -127963 -125218 -168881 -247966
8b47966M3053J3862J2934O722k3143L0889O501K9965
$$ -247966 -204913 -191051 -178117 -171395 -194538 -163649 -157148 -127183
0a27183
$$ -127183
$$ Imaginary data points
##PAGE= N=2
##DATA TABLE= (X++(I..I)), XYDATA
16383e279646N3677N4600J9803J17910J14516J12865J9604k0122l223O5800J28648
$$ -5279646 -5225969 -5171369 -5151566 -5033656 -4919140 -4806275 -4786671 -4806793 -4810016 -4744216 -4615568
16372d615568l3932M7168R5869N1841Q9359O1716Q2806O892k81O4152K6049N1678
$$ -4615568 -4649500 -4602332 -4506463 -4454622 -4365263 -4303547 -4220741 -4213849 -4214130 -4149978 -4123929 -4072251
16360d072251M7441N1526R2015J7250R5745N9954N0772O0785O4214J10348Q4825
$$ -4072251 -4024810 -3973284 -3881269 -3864019 -3768274 -3708320 -3657548 -3596763 -3532549 -3422201 -3337376
16349c337376N9741J9167K1152O0707J8248P4163J29309O0030R938K2277O0160
$$ -3337376 -3277635 -3258468 -3237316 -3176609 -3158361 -3084198 -2954889 -2894859 -2884921 -2862644 -2802484
16338b802484l7891R1906P3388J7622R0586Q4720K7793k9227L6303Q1794Q7259
$$ -2802484 -2840375 -2748469 -2675081 -2657459 -2566873 -2482153 -2454360 -2483587 -2447284 -2365490 -2278231
16327b278231L2325M3905N1293J3285J3852J02759Q5869J8410n1994J45726J50924
$$ -2278231 -2245906 -2202001 -2150708 -2137423 -2123571 -2020812 -1934943 -1916533 -1968527 -1822801 -1671877
16316a671877O443J897N7786R0871N0282K7722N3575K4060O821J00208l336N0603
$$ -1671877 -1665434 -1663537 -1605751 -1514880 -1464598 -1436876 -1383301 -1359241 -1352420 -1252212 -1255548 -1204945
16304a204945K4798M301M4858P0971P8322N3214j593K7216L1088P3040L1562O3051
$$ -1204945 -1180147 -1175846 -1130988 -1060017 -981695 -928481 -930074 -902858 -871770 -798730 -767168 -704117
16292g04117m847J10905P0693l4359N6082O0220L8933P0424N0535J7104K4835
$$ -704117 -708964 -598059 -527366 -561725 -505643 -445423 -406490 -336066 -285531 -268427 -243592
16281b43592K4780J1242N3973K5103N5093K3880J4896P2871L6871K6511m190J7561
$$ -243592 -218812 -207570 -153597 -128494 -73401 -49521 -34625 38246 75117 101628 97438 114999
16269A14999M5435L9046L1936P5765O9674R8297N3865k1550O3337M1706j4599
$$ 114999 160434 199480 231416 307181 376855 475152 529017 507467 570804 612510 597911
16258E97911M7835K5829J805Q1117l4957m932L6503l5270N3899L5486Q0905M6414
$$ 597911 645746 671575 673380 754497 719540 714608 751111 715841 769740 805226 886131 932545
16246I32545J28047q409j0013n6541J24769J0576j5877k347J564Q2339J10635
$$ 932545 1060592 1052183 1042170 985629 1110398 1120974 1105097 1102750 1104314 1186653 1297288
16235A297288P1657j8416n3969Q0631J19104l9700p198L6073K2200J17973R358
$$ 1297288 1368945 1350529 1296560 1377191 1496295 1456595 1449397 1485470 1507670 1625643 1635001
16224A635001J3343O4777k9274R1592j1029m4359L3650n4577P6675L8261m7680
$$ 1635001 1648344 1713121 1683847 1775439 1764410 1720051 1753701 1699124 1775799 1814060 1766380
16213A766380O4841Q735j5442j4846R894P2119R1925K6886r4451J940J45686L4477
$$ 1766380 1831221 1839956 1824514 1809668 1819562 1891681 1983606 2010492 1916041 1917981 2063667 2098144
16201B098144N7403L2721l2559j0570o279k8815K7393J7560L4878L1752N8243
$$ 2098144 2155547 2188268 2155709 2145139 2138860 2110045 2137438 2154998 2189876 2221628 2279871
16190B279871o2657J4669P3462l5418K4938L6693K6579l1452K1157l3313R3566
$$ 2279871 2217214 2231883 2305345 2269927 2294865 2331558 2358137 2326685 2347842 2314529 2408095
16179B408095j757o3996J41364m8269K8577M6409j1877J4732J23888l1465k76
$$ 2408095 2406338 2342342 2483706 2435437 2464014 2510423 2498546 2513278 2637166 2605701 2605425
16168B605425K7693j7344J10782j8830n2867l2324K5978J33595M6501r3122K2947
$$ 2605425 2633118 2615774 2726556 2707726 2654859 2622535 2648513 2782108 2828609 2735487 2758434
16157B758434j4256P0906L8447n5335K9671N6198j8619m0522r767O6054m6829
$$ 2758434 2744178 2815084 2853531 2798196 2827867 2884065 2865446 2824924 2815157 2881211 2834382
16146B834382j5896l4076O8921N2658l5591M4397l6209o0210J289o4432J0358
$$ 2834382 2818486 2784410 2853331 2905989 2870398 2914795 2878586 2818376 2819665 2755233 2765591
16135B765591Q5518o1525J17085M7551k5917m6558O0383L1318O2749j917n5064
$$ 2765591 2851109 2789584 2906669 2954220 2928303 2881745 2942128 2973446 3036195 3034278 2979214
16124B979214m8686L2143r231M7698M3827m8425M8616N3891M6580k0456o8243
$$ 2979214 2930528 2962671 2953440 3001138 3044965 2996540 3045156 3099047 3145627 3125171 3056928
16113C056928J04158m2100o1209l366K2967l9633R2432M9648j58133k2033J06461
$$ 3056928 3161086 3118986 3057777 3054411 3077378 3037745 3130177 3179825 3021692 2999659 3106120
16102C106120k1552L1325P816L5411m5744o699l0561o275J00374k7930M5706p5983
$$ 3106120 3084568 3115893 3123709 3159120 3113376 3106677 3076116 3069841 3170215 3142285 3187991 3112008
16090C112008P8480L2621o4310r880L1268N867P6742N7577J1099l5390p5426o7797
$$ 3112008 3190488 3223109 3158799 3148919 3180187 3186054 3262796 3320373 3331472 3296082 3220656 3152859
16078C152859l8315K3305J7014j2529K7210L2591k6916n3465L6048l1806j9086
$$ 3152859 3114544 3137849 3154863 3142334 3169544 3202135 3175219 3121754 3157802 3125996 3106910
16067C106910J13910r2881L0792J22683l0033m3637J3872J64949p2087l180P7184
$$ 3106910 3220820 3127939 3158731 3281414 3251381 3207744 3221616 3386565 3314478 3311298 3388482
16056C388482m7973j30910K0102p8937M9442K3608q9278L5256R4848L5066j24017
$$ 3388482 3340509 3209599 3229701 3150764 3200206 3223814 3134536 3169792 3264640 3299706 3175689
16045C175689M6894P9190N8912n2333n7109k8793k7143n3938P7390M4142o7507
$$ 3175689 3222583 3301773 3360685 3308352 3251243 3222450 3195307 3141369 3218759 3262901 3195394
16034C195394J48375L4208q6592j20109j2879M4182L7742m5856O865n0631R6122
$$ 3195394 3343769 3377977 3291385 3171276 3158397 3202579 3240321 3194465 3201330 3150699 3246821
16023C246821P2657q9260k4122l786N8559J19086p3792r0367J15117P7928q6941
$$ 3246821 3319478 3230218 3206096 3202310 3260869 3379955 3306163 3215796 3330913 3408841 3321900
16012C321900q0681J5463n8690O4513J2011l2987J10843K8698m5759j28068k7046
$$ 3321900 3241219 3256682 3197992 3262505 3274516 3241529 3352372 3381070 3335311 3207243 3180197
16001C180197L4654J16225j9084n257J13976j18138K1946k6676q0298l4784J02381
$$ 3180197 3214851 3331076 3311992 3306735 3420711 3302573 3324519 3297843 3217545 3182761 3285142
15990C285142r98l3739j0675N2555J0622n5839L4283J24227K0768k4928r7378
$$ 3285142 3284144 3250405 3239730 3292285 3302907 3247068 3281351 3405578 3426346 3401418 3304040
15979C304040k2351j2839m2880J24053P4664j8306r7619j0915J0896N4657L1994
$$ 3304040 3281689 3268850 3225970 3350023 3424687 3406381 3308762 3297847 3308743 3363400 3395394
15968C395394N987P944m5675P1331K9284n4066k583r7131q0535l1276J9118j2804
$$ 3395394 3401381 3409325 3363650 3434981 3464265 3410199 3407616 3310485 3229950 3198674 3217792 3204988
15956C204988J17872m8876k5408o6976L650L8215j1494k5490O1134O9655j0964
$$ 3204988 3322860 3273984 3248576 3181600 3185250 3223465 3211971 3186481 3247615 3317270 3306306
15945C306306K4153K9743L7842q6027N7100p6402m7565M7693J9768O4082j09998
$$ 3306306 3330459 3360202 3398044 3312017 3369117 3292715 3245150 3292843 3312611 3376693 3266695
15934C266695n0537J33702k7744M9432p0058m042L8263O561j8727j9372M858Q0739
$$ 3266695 3216158 3349860 3322116 3371548 3301490 3297448 3335711 3342272 3323545 3304173 3309031 3389770
15922C389770j7808n2537Q7022N3790l9439q0747o8883R4240M0376l5035r9000
$$ 3389770 3371962 3319425 3406447 3460237 3420798 3340051 3271168 3365408 3405784 3370749 3271749
15911C271749N3680r566N714N0657J8588r0295K1878K656o8745L6593n909M4738
$$ 3271749 3325429 3315863 3321577 3372234 3390822 3300527 3322405 3325061 3256316 3292909 3287000 3331738
15899C331738p0706o2952q0423L8230N1191L409N5156L062N5929R1792o0957k5712
$$ 3331738 3261032 3198080 3117657 3155887 3207078 3210487 3265643 3268705 3324634 3416426 3355469 3329757
15887C329757M6658Q096l7016J5917J5571O9983q3990p1078K6814N304p885L1875
$$ 3329757 3376415 3384511 3347495 3363412 3378983 3448966 3364976 3293898 3320712 3326016 3318131 3350006
15875C350006l1791n0734j9817Q2142k2384r754L9586L1519o3268l2272P2886
$$ 3350006 3318215 3267481 3247664 3329806 3307422 3297668 3337254 3368773 3305505 3273233 3346119
15864C346119J8866N575K1355L0279o0140k8924o526j4183j7095o0890j5299O8400
$$ 3346119 3364985 3370560 3391915 3422194 3362054 3333130 3326604 3312421 3295326 3234436 3219137 3287537
15852C287537K6274oM1490J3035o3793J8989K7090O1435o3439k9382J7549n9164
$$ 3287537 3313811 3313805 3355295 3368330 3304537 3323526 3350616 3412051 3348612 3319230 3336779 3277615
15840C277615O613Q1535L2276L077p6137O2102p031j04506M4584N0349q3681N286
$$ 3277615 3284228 3365763 3398039 3401116 3324979 3387081 3380050 3275544 3320128 3370477 3286796 3292082
15828C292082L0348l4369n986O220O3003N1407J09884o8712n0725j8932k2186
$$ 3292082 3322430 3288061 3282075 3288295 3351298 3402705 3512589 3443877 3393152 3374220 3352034
15817C352034l6595Q207n6701n9870K3476R4068l9618n9486J17075J08593j17901
$$ 3352034 3315439 3323646 3266945 3207075 3230551 3324619 3285001 3225515 3342590 3451183 3333282
15806C333282l8331k4285j0970L4385o9071P5590Q449m1523P157N9579r563J3575
$$ 3333282 3294951 3270666 3259696 3294081 3225010 3300600 3309049 3267526 3274683 3334262 3324699 3338274
15794C338274N774L0801l1975R6996k3668r1506P0918n7175j4991J9106R9578
$$ 3338274 3344048 3374849 3342874 3439870 3416202 3324696 3395614 3338439 3323448 3342554 3442132
15783C442132k1682j5500K4887O1894k8496l6836K7055o5832l9095R7r8592l1916
$$ 3442132 3420450 3404950 3429837 3491731 3463235 3426399 3453454 3387622 3348527 3348624 3250032 3218116
15771C218116Q4430L4215r391m7130j6957J1666J6977R7479P449m7671o2581L4478
$$ 3218116 3302546 3336761 3327370 3280240 3263283 3274949 3291926 3389405 3396854 3349183 3286602 3321080
15759C321080j367J7393j8869k8054N5249P234j3280J4398J7484n1367J7823m0653
$$ 3321080 3319713 3337106 3318237 3290183 3345432 3352666 3339386 3353784 3371268 3319901 3337724 3297071
15747C297071j0474O4339L9112j19390l590L1342M8391J5253r6733k4479L2684
$$ 3297071 3286597 3350936 3390048 3270658 3267068 3298410 3346801 3362054 3265321 3240842 3273526
15736C273526k2932L5676R5328k4684O2091R059o7788l1382K734n2466N2676l6408
$$ 3273526 3250594 3286270 3381598 3356914 3419005 3428064 3360276 3328894 3331628 3279162 3331838 3295430
15724C295430m879M730N5193N813m3290k6579p5183Q1324J9526k6489R549M2094
$$ 3295430 3290551 3295281 3350474 3356287 3312997 3286418 3211235 3292559 3312085 3285596 3295145 3337239
15712C337239K0922l5209j1834O248J11444L6386o9090n9879k3344J11893L3384
$$ 3337239 3358161 3322952 3311118 3317366 3428810 3465196 3396106 3336227 3312883 3424776 3458160
15701C458160J4637n914p3331K6142O30k8297j9272l8484l340M6772M3364r4250
$$ 3458160 3472797 3466883 3393552 3419694 3420324 3392027 3372755 3334271 3330931 3377703 3421067 3326817
15689C326817R1124m8919m6853J3853J5516m2720N6289k8112m664k0157M5488
$$ 3326817 3417941 3369022 3322169 3336022 3351538 3308818 3365107 3336995 3332331 3312174 3357662
15678C357662L4045m3984M8852M1095m55m3373Q2898m0656J5055M3937q9265L0311
$$ 3357662 3391707 3347723 3396575 3437670 3437215 3393842 3476740 3436084 3451139 3495076 3405811 3436122
15666C436122N4631K3266q8286q5312q683O6038o3250J1247p676O0L6592O725
$$ 3436122 3490753 3514019 3425733 3340421 3331738 3397776 3334526 3345773 3338097 3338157 3374749 3381474
15654C381474N7761r6276l2702P881L8822K9695l4574k9916N0327J3422L5754
$$ 3381474 3439235 3342959 3310257 3318138 3356960 3386655 3352081 3322165 3372492 3385914 3421668
15643C421668p3490p1987R6780k3449J1476l7193J29J32395l2458l1234J12823
$$ 3421668 3348178 3276191 3372971 3349522 3360998 3323805 3323934 3456329 3423871 3392637 3505460
15632C505460l1606q7276j2726k5019L378j4911Q1727J9004p9894q089N4185R8184
$$ 3505460 3473854 3386578 3373852 3348833 3352211 3337300 3419027 3438031 3358137 3350048 3404233 3502417
15620C502417m2442l8776k6429j4246J4273Q797k7596M1709M8510o0535k6413
$$ 3502417 3459975 3421199 3394770 3380524 3394797 3403594 3375998 3417707 3466217 3405682 3379269
15609C379269j921J3438J3204P6048J291J1670m72k1970j09831M5376m0924r7707
$$ 3379269 3377348 3390786 3403990 3480038 3481329 3492999 3492527 3470557 3360726 3406102 3365178 3267471
15597C267471L2502L2784M2140J23041q4459j3545M8721n4182o7020m8731O9741
$$ 3267471 3299973 3332757 3374897 3497938 3413479 3399934 3448655 3394473 3327453 3278722 3348463
15586C348463l004l801K6992L3252k1496K000j5570m5545N8538r130m1790R6176
$$ 3348463 3345459 3341658 3368650 3401902 3380406 3382406 3366836 3321291 3379829 3370699 3328909 3425085
15574C425085M5582j19952n7161J9670P4225K5921n7804N5570l9161j41358R5087
$$ 3425085 3470667 3350715 3293554 3313224 3387449 3413370 3355566 3411136 3371975 3230617 3325704
15563C325704R8670m0957l1450K1771R497Q2983J8642q4295m8038R5371M0849
$$ 3325704 3424374 3383417 3351967 3373738 3383235 3466218 3484860 3400565 3352527 3447898 3488747
15552C488747J6675m776n0854m9183m2412p4543j4272M8206L4250q476O3417N662
$$ 3488747 3505422 3500646 3449792 3400609 3358197 3283654 3269382 3317588 3351838 3343362 3406779 3412441
15540C412441m9166K6491R0408q529k5028j10282n5536O9356Q7149J04848l4289
$$ 3412441 3363275 3389766 3480174 3471645 3446617 3336335 3280799 3350155 3437304 3542152 3507863
15529C507863r4080k6288J18376M3644l3598q9362l5386M5261N4761j5386p5340
$$ 3507863 3413783 3387495 3505871 3549515 3515917 3426555 3391169 3436430 3491191 3475805 3400465
15518C400465K0609Q3640r3464q5338k9932J8975m925L5415O3991K3612m5515
$$ 3400465 3421074 3504714 3411250 3325912 3295980 3314955 3310030 3345445 3409436 3433048 3387533
15507C387533k2109Q1417o0885R6062J5157r2232m2078L3411M9305o2111l1471
$$ 3387533 3365424 3446841 3385956 3482018 3497175 3404943 3362865 3396276 3445581 3383470 3351999
15496C351999K897R2774k491M3886Q6907r593o6532l8843N0172M8620n1680M3011
$$ 3351999 3354896 3447670 3445179 3489065 3575972 3566379 3499847 3461004 3511176 3559796 3508116 3551127
15484C551127O383J1829l0804l2764l061N6130L2644o7865r1682N187k2062M4895
$$ 3551127 3557510 3569339 3538535 3505771 3502710 3558840 3591484 3523619 3431937 3437124 3415062 3459957
15472C459957q6617J430K8039N7197K8301m6972l2096K1784l7990o5673o371j0323
$$ 3459957 3373340 3374770 3402809 3460006 3488307 3441335 3409239 3431023 3393033 3327360 3320989 3310666
15460C310666J73358o9848N657L0354M2029K7006l1440j6771o2021J00963j5777
$$ 3310666 3484024 3414176 3419833 3450187 3492216 3519222 3487782 3471011 3408990 3509953 3494176
15449C494176P0810j49551l7098P38O5155M5878n4433j5502K0430R0933M2833
$$ 3494176 3564986 3415435 3378337 3379075 3444230 3490108 3435675 3420173 3440603 3531536 3574369
15438C574369n5405j2071R5330j27699j76860N121K7360P1761N7007P674M0759
$$ 3574369 3518964 3506893 3602223 3474524 3297664 3302785 3330145 3401906 3458913 3466587 3507346
15427C507346q5908k6670J44843K2679j02515l0628J6500P3574N559K9340R896
$$ 3507346 3421438 3394768 3539611 3562290 3459775 3429147 3445647 3519221 3524780 3554120 3564016
15416C564016N374q0288L1336k4695M509l8448L7507k1145p6726p4156k1827N2445
$$ 3564016 3569390 3489102 3520438 3495743 3500252 3461804 3499311 3478166 3401440 3327284 3305457 3357902
15404C357902P3792J6009o550N6205Q2794J8175m8629p8341o1924N57O1351P2208
$$ 3357902 3431694 3447703 3441153 3497358 3580152 3598327 3549698 3471357 3409433 3409990 3471341 3543549
15392C543549L8983N053q4516k3991O029J9131n8789j4211k812q2947M1427J18904
$$ 3543549 3582532 3587585 3503069 3479078 3485107 3504238 3445449 3431238 3428426 3345479 3386906 3505810
15380C505810J2439r8394K9191R5512J5670j16391o7534O8264k34m725p047L3099
$$ 3505810 3518249 3419855 3449046 3544558 3560228 3443837 3376303 3444567 3444333 3439608 3432561 3465660
15368C465660M5865r220m9707q2012M9556P4363L879O5985j01047j6672R8064
$$ 3465660 3511525 3502305 3452598 3370586 3420142 3494505 3498384 3564369 3463322 3446650 3544714
15357C544714N862o2541O7395P4950q5456r9150j09708L1279K1183L3603m3762
$$ 3544714 3550576 3488035 3555430 3630380 3544924 3445774 3336066 3367345 3388528 3422131 3378369
15346C378369Q8983K2206p527N3m061m5846K0387K6064M5471M8657j0988q6214
$$ 3378369 3467352 3489558 3482031 3482084 3478023 3432177 3452564 3478628 3524099 3572756 3561768 3475554
15334C475554n0847N737J4988j9742L3530K1828k7964m937R923P8582k4049j01036
$$ 3475554 3424707 3430444 3445432 3425690 3459220 3481048 3453084 3448147 3458070 3536652 3512603 3411567
15322C411567j3918J4281j800J4914l8328J02935J8744m8637k8339L3933P0951
$$ 3411567 3397649 3411930 3410130 3425044 3386716 3489651 3508395 3459758 3431419 3465352 3536303
15311C536303o5684l5387Q1902l3177Q9460J8513n6990L2843p9160P893n5581
$$ 3536303 3470619 3435232 3517134 3483957 3573417 3591930 3534940 3567783 3488623 3496516 3440935
15300C440935j02079Q3200Q6541P2547K628j23056l9508O877J8882q2145p0627
$$ 3440935 3338856 3422056 3508597 3581144 3583772 3460716 3421208 3428085 3446967 3364822 3294195
15289C294195J11095Q3631L7663M0449p8935p4562L3619J4344J1287M0930P279
$$ 3294195 3405290 3488921 3526584 3567033 3488098 3413536 3447155 3461499 3472786 3513716 3520995
15278C520995m9618J7109n5841J28859l6917J1015N5988j03492M0045m793J5950
$$ 3520995 3471377 3488486 3432645 3561504 3524587 3535602 3591590 3488098 3528143 3523350 3539300
15267C539300q924k267L4387r1461L8128l2194L8688Q2509p9737M5788N8376j13499
$$ 3539300 3530376 3528109 3562496 3471035 3509163 3476969 3515657 3598166 3518429 3564217 3622593 3509094
15255C509094o3458N8555L9544n8089r869K997K0607M1721l902m5242M7454r825
$$ 3509094 3445636 3504191 3543735 3485646 3475777 3478774 3499381 3541102 3537200 3491958 3539412 3529587
15243C529587P4001n8250j41784P725Q9311J0794m8979P5997r07Q7474k3670q6062
$$ 3529587 3603588 3545338 3403554 3411279 3500590 3511384 3462405 3538402 3537495 3624969 3601299 3515237
15231C515237N1008J09078l9011o0150J5412L4580k5324o9035r1526k0993L8516
$$ 3515237 3566245 3675323 3636312 3576162 3591574 3626154 3600830 3531795 3440269 3419276 3457792
15220C457792J837o4870K6184J7156p432J08982o0922K2503O1319m369o8735j9370
$$ 3457792 3459629 3394759 3420943 3438099 3430667 3539649 3478727 3501230 3562549 3558180 3489445 3470075
15208C470075J01278q6121M0180p9345M8873k0159m7875O537N7124J30126r4673
$$ 3470075 3571353 3485232 3525412 3446067 3494940 3474781 3426906 3433443 3490567 3620693 3526020
15197C526020l0487L3715k799J6530O7352l6172j7216l3293p105R145j00638j2805
$$ 3526020 3495533 3529248 3526449 3542979 3610331 3574159 3556943 3523650 3516545 3525690 3425052 3412247
15185C412247J5989L765M0343J2305J09779l9647p1199j5690M8638q899n731N361
$$ 3412247 3428236 3432001 3472344 3484649 3594428 3554781 3483582 3467892 3516530 3507631 3501900 3507261
15173C507261J9138m3040M850r228L3545J09568l7838o2106j4437o3243K7261
$$ 3507261 3526399 3483359 3488209 3478981 3512526 3622094 3584256 3522150 3507713 3444470 3471731
15162C471731Q7821J3895M222j356k6297O7915o73p5576n5422R615O7684p8771
$$ 3471731 3559552 3573447 3577669 3576313 3550016 3617931 3617258 3541682 3486260 3495875 3563559 3484788
15150C484788j905m7360M9357j01196O8414Q8944Q9425L9219j04629m6180M8202
$$ 3484788 3482883 3435523 3484880 3383684 3452098 3541042 3630467 3669686 3565057 3518877 3567079
15139C567079L4961q8062m7527J2316R7538m3353p7866n235M3523L3935M7683
$$ 3567079 3602040 3513978 3466451 3478767 3576305 3532952 3455086 3449851 3493374 3527309 3574992
15128C574992J3828p5890k3917K9038J2593K4072j4114M700L3821r7015P041L6264
$$ 3574992 3588820 3512930 3489013 3518051 3530644 3554716 3540602 3545302 3579123 3482108 3489149 3525413
15116C525413P8391J7218n4567K0373O3568l6050l7404M4504M0992n8689M0506
$$ 3525413 3603804 3621022 3566455 3586828 3650396 3614346 3576942 3621446 3662438 3603749 3644255
15105C644255j04177m0460O9244K5802N5691j35631n8266N2188m8388J21704N5396
$$ 3644255 3540078 3499618 3568862 3594664 3650355 3514724 3456458 3508646 3460258 3581962 3637358
15094C637358o0282q6806N195M9922M4769L1230O633Q342m7682k7033L8436o0246
$$ 3637358 3577076 3490270 3495465 3545387 3590156 3621386 3628019 3636361 3588679 3561646 3600082 3539836
15082C539836M207O6904j18469r0904O5941K034Q0422L9755j39123M6429L2247
$$ 3539836 3544043 3610947 3492478 3401574 3467515 3469549 3549971 3589726 3450603 3497032 3529279
15071C529279M003M5527P5636l8901k4765j72k9225K469O2484J1898J7789o0749
$$ 3529279 3533282 3578809 3654445 3615544 3590779 3590607 3561382 3563851 3626335 3638233 3656022 3595273
15059C595273k1895r5378M3490O3800n1944j2294m5175K9193Q6636r6148R412
$$ 3595273 3573378 3478000 3521490 3585290 3533346 3521052 3475877 3505070 3591706 3495558 3504970
15048C504970j13351J17048J05495r8500K6906K2704K6873m0760K1646K2306R0600
$$ 3504970 3391619 3508667 3614162 3515662 3542568 3565272 3592145 3551385 3573031 3595337 3685937
15037C685937l4080j31197O7464m8561N0486K9483N68l0478K6464j37277p7215
$$ 3685937 3651857 3520660 3588124 3539563 3590049 3619532 3620100 3589622 3616086 3478809 3401594
15026C401594N9023P0560O0047k2071k242o1884j07001J4114K169p64Q5684M0216
$$ 3401594 3460617 3531177 3591224 3569153 3566911 3505027 3398026 3412140 3414309 3413545 3499229 3539445
15014C539445j8723n2802J14610L5569l5491o3381J2692N559J01516l927m0105
$$ 3539445 3520722 3467920 3582530 3618099 3582608 3519227 3531919 3537478 3638994 3635067 3594962
15003C594962J14766j637j00342r7636j7860J9287J51022m0792m3754Q7254j15837
$$ 3594962 3709728 3708091 3607749 3510113 3492253 3511540 3662562 3621770 3578016 3665270 3549433
14992C549433n2842j1465J0410p4158L0961N2010L8352k9172k3828j6321J0310
$$ 3549433 3496591 3485126 3495536 3421378 3452339 3504349 3542701 3513529 3489701 3473380 3483690
14981C483690J65843O7294m2131l3732j40877J271N3725l8419K4078M2643k7897
$$ 3483690 3649533 3716827 3674696 3640964 3500087 3501358 3555083 3516664 3540742 3583385 3555488
14970C555488k7802N464N2796j7230M8889r195M9446m5222n128M1538K7370m2758
$$ 3555488 3527686 3533150 3585946 3568716 3617605 3608410 3657856 3612634 3607506 3649044 3676414 3633656
14958C633656l5691P00j3159N8564K3769K7833n9187p5208j9748Q5875j2143Q2722
$$ 3633656 3597965 3598665 3585506 3644070 3667839 3695672 3636485 3561277 3541529 3627404 3615261 3697983
14946C697983l681j28046j2564j4838k6216J09969l3219n0600n1560l4042J13680
$$ 3697983 3694302 3566256 3553692 3538854 3512638 3622607 3589388 3538788 3487228 3453186 3566866
14935C566866P0838j8434L207l3821J3479O5539n3175k6771L9292n5836k8231
$$ 3566866 3637704 3619270 3622477 3588656 3602135 3667674 3614499 3587728 3627020 3571184 3542953
14924C542953M292k8851N3904J19712n1309m1139Q895J3097J388k6610O8665J2679
$$ 3542953 3547245 3518394 3572298 3692010 3640701 3599562 3608457 3621554 3622942 3596332 3664997 3677676
$$ [...]
##END NTUPLES=NMR SPECTRUM
##END=
