##TITLE=1H_CG-1142-A
 CDCl3, 8 sc, 
 27.04.2021
##JCAMPDX= 6.0         $$ Bruker NMR JCAMP-DX V2.0
##DATA TYPE= NMR SPECTRUM
##DATA CLASS= NTUPLES
##ORIGIN= UXNMR, Bruker Analytische Messtechnik GmbH
##OWNER= root
$$ XWIN-NMR		Version 3.5
$$ Tue Apr 27 14:38:08 2021 Russian Standard Time (UT+4h)  she@DPX200
##.OBSERVE FREQUENCY= 200.131506
##.OBSERVE NUCLEUS= ^1H
##.ACQUISITION MODE= SIMULTANEOUS
##.ACQUISITION SCHEME= undefined
##.AVERAGES= 8
##.DIGITISER RES= 18
##SPECTROMETER/DATA SYSTEM= spect
##.PULSE SEQUENCE= zg30
##.SOLVENT NAME= CD3CN
##.SHIFT REFERENCE= (INTERNAL, CD3CN, 0, 15.9968)
##AUDIT TRAIL= $$ (NUMBER, WHEN, WHO, WHERE, WHAT)
$$ ##TITLE= Audit trail, XWIN-NMR		Version 3.5
$$ ##JCAMPDX= 5.01
$$ ##ORIGIN= Bruker BioSpin GmbH
$$ ##OWNER= she
$$ F:/spectra/data/she/nmr/H-F/1/pdata/1/auditp.txt
$$ ##AUDIT TRAIL=  $$ (NUMBER, WHEN, WHO, WHERE, WHAT)
(   1,<2021-04-27 14:36:17.45 +0400>,<she>,<DPX200>,
      <created by zg, POWCHK disabled, PULCHK disabled
       configuration hash MD5:
       00 E9 B6 7A A2 85 ED C7 34 08 36 98 17 FE 4E 26
       data hash MD5: 16K
       0F F2 6A 45 47 BD A7 B5 7B 88 B7 D5 66 A6 16 23>)
(   2,<2021-04-27 14:36:19.79 +0400>,<she>,<DPX200>,
      <Start of raw data processing
       efp BC_mod = 2 LB = 0.24 FT_mod = 6 PKNL = 1 PHC0 = -11130.72 PHC1 = 25.80096 SI = 16K 
       data hash MD5: 16K
       C8 55 1B 58 98 5A AB 94 E7 5D 39 1E 05 72 83 A3>)
(   3,<2021-04-27 14:36:43.32 +0400>,<she>,<DPX200>,
      <pk PHC0 = 5.483779 PHC1 = -6.999999 
       data hash MD5: 16K
       61 77 52 9D FD 53 EF F0 3D 3C DB A9 88 09 8A AB>)
(   4,<2021-04-27 14:36:46.54 +0400>,<she>,<DPX200>,
      <abs ABSG = 5 
       data hash MD5: 16K
       14 2A 76 5D 7C F9 2E 80 98 AA F3 8F 0E 30 9C B5>)
(   5,<2021-04-27 14:37:06.95 +0400>,<she>,<DPX200>,
      <pk PHC0 = 19.18546 PHC1 = -22.4 
       data hash MD5: 16K
       DF 47 73 4D F2 BA FF 1A A4 77 AC 41 43 88 93 90>)
(   6,<2021-04-27 14:37:09.95 +0400>,<she>,<DPX200>,
      <abs ABSG = 5 
       data hash MD5: 16K
       52 38 C7 F9 94 9D 78 F5 AD E9 FD 3A 91 C8 67 FE>)
$$ ##END=
$$ 
$$ hash MD5
$$ BC AD 3F CD 91 68 FD FF D3 B7 56 6D 5F 31 C3 FA
##$RELAX= 
##$RELAX= 
##$RELAX= 
##$RELAX= 
##$RELAX= 
##$RELAX= 
$$ Bruker specific parameters
$$ --------------------------
##$DU= <F:/spectra>
##$EXPNO= 1
##$NAME= <H-F>
##$PROCNO= 1
##$TYPE= <nmr>
##$USER= <she>
##$AMP= (0..31)
100 100 100 100 100 100 100 100 100 100 100 100 100 100 100 100 100 100 
100 100 100 100 100 100 100 100 100 100 100 100 100 100 
##$AQSEQ= 0
##$AQ_mod= 1
##$AUNM= <au_zg>
##$AUTOPOS= <>
##$BF1= 200.13
##$BF2= 200.13
##$BF3= 200.13
##$BF4= 200.13
##$BF5= 200.13
##$BF6= 200.13
##$BF7= 200.13
##$BF8= 200.13
##$BYTORDA= 1
##$CFDGTYP= 0
##$CFRGTYP= 5
##$CHEMSTR= <none>
##$CNST= (0..31)
1 1 145 1 1 1 1 1 1 1 1 1 1 1 1 1 1 1 1 1 1 1 1 1 1 1 1 1 1 1 1 1 
##$CPDPRG= <>
##$CPDPRG1= <>
##$CPDPRG2= <>
##$CPDPRG3= <>
##$CPDPRG4= <mlev>
##$CPDPRG5= <mlev>
##$CPDPRG6= <mlev>
##$CPDPRG7= <mlev>
$$ [...]
##$SUBNAM3= <"">
##$SUBNAM4= <"">
##$SUBNAM5= <"">
##$SUBNAM6= <"">
##$SUBNAM7= <"">
##$SUBNAM8= <"">
##$SUBNAM9= <"">
##$SW= 16.9725357007746
##$SWIBOX= (0..15)
0 0 2 0 0 0 0 0 0 0 0 0 0 0 0 0 
##$SW_h= 3396.73913043478
##$TD= 16384
##$TD0= 1
##$TE= 0
##$TE2= 300
##$TE3= 300
##$TEG= 300
##$TL= (0..7)
0 120 120 120 120 120 120 120 
##$TP= (0..7)
150 150 150 150 150 150 150 150 
##$TP07= 0
##$TPNAME0= <>
##$TPNAME1= <>
##$TPNAME2= <>
##$TPNAME3= <>
##$TPNAME4= <>
##$TPNAME5= <>
##$TPNAME6= <>
##$TPNAME7= <>
##$TPOAL= (0..7)
0.5 0.5 0.5 0.5 0.5 0.5 0.5 0.5 
##$TPOFFS= (0..7)
0 0 0 0 0 0 0 0 
##$TUNHIN= 0
##$TUNHOUT= 0
##$TUNXOUT= 0
##$USERA1= <user>
##$USERA2= <user>
##$USERA3= <user>
##$USERA4= <user>
##$USERA5= <user>
##$V9= 5
##$VALIST= <valist>
##$VCLIST= <CCCCCCCCCCCCCCC>
##$VD= 0
##$VDLIST= <DDDDDDDDDDDDDDD>
##$VPLIST= <PPPPPPPPPPPPPPP>
##$VTLIST= <TTTTTTTTTTTTTTT>
##$WBST= 1024
##$WBSW= 4
##$XGAIN= (0..3)
0 0 0 0 
##$XL= 0
##$YL= 0
##$YMAX_a= 900574
##$YMIN_a= -1009426
##$ZGOPTNS= <>
##$ZL1= 120
##$ZL2= 120
##$ZL3= 120
##$ZL4= 120
##$ABSF1= 16.00303
##$ABSF2= -0.9696331
##$ABSG= 5
##$ABSL= 3
##$ALPHA= 0
##$AQORDER= 0
##$ASSFAC= 0
##$ASSFACI= 0
##$ASSFACX= 0
##$ASSWID= 0
##$AUNMP= <proc_1d>
##$AZFE= 0.1
##$AZFW= 0.1
##$BCFW= 0
##$BC_mod= 2
##$BYTORDP= 0
##$COROFFS= 0
##$CY= -3
##$DATMOD= 1
##$DC= 0
##$DFILT= <>
##$DTYPP= 0
##$F1P= 0
##$F2P= 0
##$FCOR= 1
##$FTSIZE= 16384
##$FT_mod= 6
##$GAMMA= 0
##$GB= 0
##$INTBC= 1
##$INTSCL= 1.334414e-10
##$ISEN= 128
##$LB= 0.24
##$LEV0= 0
##$LPBIN= 0
##$MAXI= 10000
##$MC2= 0
##$MEAN= 0
##$ME_mod= 0
##$MI= 1.114404
##$NCOEF= 0
##$NC_proc= -5
##$NLEV= 6
##$NOISF1= 3.799351
##$NOISF2= 2.8
##$NSP= 0
##$NTH_PI= 0
##$NZP= 0
##$OFFSET= 15.99682
##$PC= 1
##$PHC0= -11106.05
##$PHC1= -3.599039
##$PH_mod= 1
##$PKNL= yes
##$PPARMOD= 0
##$PSCAL= 0
##$PSIGN= 0
##$REVERSE= no
##$SF= 200.130002926144
##$SI= 16384
##$SIGF1= 3
##$SIGF2= 2
##$SINO= 5.538805
##$SIOLD= 16384
##$SREGLST= <1H.CDCl3>
##$SSB= 0
##$STSI= 16384
##$STSR= 0
##$SW_p= 3396.73913043479
##$SYMM= 0
##$S_DEV= 0
##$TDeff= 16384
##$TDoff= 0
##$TI= <>
##$TILT= no
##$TM1= 0
##$TM2= 0
##$TOPLEV= 0
##$USERP1= <user>
##$USERP2= <user>
##$USERP3= <user>
##$USERP4= <user>
##$USERP5= <user>
##$WDW= 1
##$XDIM= 16384
##$YMAX_p= 318358403
##$YMIN_p= -1262632
$$ End of Bruker specific parameters
$$ ---------------------------------
##NTUPLES= NMR SPECTRUM
##VAR_NAME=  FREQUENCY,     SPECTRUM/REAL,   SPECTRUM/IMAG
##SYMBOL=    X,             R,               I
##VAR_TYPE=  INDEPENDENT,   DEPENDENT,       DEPENDENT
##VAR_FORM=  AFFN,          ASDF,            ASDF
##VAR_DIM=   16384,         16384,           16384
##UNITS=     HZ,            ARBITRARY UNITS, ARBITRARY UNITS
##FACTOR=    0.207333158178282, 1,           1
##FIRST=     3201.4437234333, 0,             0
##LAST=      -195.295407001492, 0,           0
##MIN=       -195.295407001492, -1262632,    0
##MAX=       3201.4437234333, 318358403,     0
$$ Real data points
##PAGE= N=1
##DATA TABLE= (X++(R..R)), XYDATA
$$ [...]
6677 702484 660438 611351 555773 554575 544193 578498 528343 529152 501770 532517 603666 617531
6665 617531 655732 674140 633082 572035 562755 589407 589066 621766 703164 748251 825094 852757
6653 852757 850328 951996 1142058 1289233 1363802 1472153 1651643 1866068 2063777 2192630
6643 2192630 2278129 2348414 2339977 2226627 2105684 1917460 1740496 1632598 1561008 1540490 1529595
6632 1529595 1615606 1583739 1555550 1610598 1655964 1679469 1697972 1712771 1623451 1625986 1547095 1549224
6620 1549224 1514441 1420411 1365714 1279220 1204976 1162746 1112085 971123 988358 944956 870204
6609 870204 874445 790551 703788 688900 681686 665655 607337 602241 527540 567655 621204 601352
6597 601352 592946 572528 641933 658995 624536 635376 651909 695721 744107 705967 715711 775744
6585 775744 829249 864847 858487 930105 981576 1013309 1068072 1074330 1049150 1131513 1277121 1434329
6573 1434329 1633355 1722363 1855976 1987018 2105451 2223329 2095088 2046400 1889304 1744694
6563 1744694 1615982 1481845 1346756 1319612 1254319 1226426 1157905 1080141 1098559 1063794 1049121
6552 1049121 1054016 1118058 1143331 1202078 1256592 1355452 1388653 1485357 1502731 1545284 1585215 1559222
6540 1559222 1570569 1560591 1505555 1493536 1375920 1303726 1245569 1209148 1166870 1057789 976479
6529 976479 906594 873048 806016 746265 685117 690573 605350 605737 625542 569752 506992 477722
6517 477722 487966 423587 375127 396100 414473 321066 334917 373826 361825 329106 320514 357607
6505 357607 320086 278342 275148 335176 317571 323149 295441 214302 276719 289025 309574 306639
6493 306639 283765 259120 232091 275652 270818 321551 312552 365591 337733 392684 431044 410156
6481 410156 462319 473152 501569 545443 527876 495365 510540 535929 596679 631111 728454 709495
6469 709495 744222 782528 812024 834010 891156 940519 964207 959837 1006718 1064094 1122646 1187710
6457 1187710 1247337 1290274 1347613 1321991 1330784 1352047 1456884 1548929 1507485 1542065 1699423
6446 1699423 1803816 1883191 1880509 1923260 1932549 1941801 2037570 2082955 2077747 2005240 1982542 2015100
6434 2015100 1972072 1917784 1869102 1767145 1730318 1776304 1733538 1716759 1739404 1685562 1741342
6423 1741342 1702589 1753171 1800823 1826031 1771641 1832065 1874234 1883393 1843160 1839570 1846303 1848196
6411 1848196 1824500 1814792 1816448 1824678 1928427 1903722 1896101 1921173 1985950 2045973 2136093 2248147
6399 2248147 2305087 2283035 2343592 2410592 2414454 2374405 2442361 2531036 2575195 2698132 2776348
6388 2776348 2836721 2926322 3035880 3059220 3148495 3208504 3218746 3197696 3274819 3208214 3128850
6377 3128850 3073479 2927495 2865602 2738463 2648814 2521499 2417979 2320739 2217749 2160997
6367 2160997 2093050 2051683 1943545 1938527 1972234 1882472 1803830 1808215 1787583 1739458 1805337 1846133
6355 1846133 1837300 1812763 1806754 1886684 1960426 1977800 2024388 2102880 2167527 2253923 2226954 2294925
6343 2294925 2398703 2410264 2499583 2578814 2706110 2791996 2863542 3032342 3203872 3440144
6333 3440144 3669246 3738949 3888788 4083965 4362602 4629201 4976343 5351739 5624556 5845227
6323 5845227 5983258 6223948 6435114 6582966 6757297 6867074 6900840 6834321 6663184 6465663
6313 6465663 6125361 5782057 5463392 5222572 5092651 4923250 4800662 4609046 4522276 4417520
6303 4417520 4233333 4050180 3976683 3894183 3735814 3694235 3711959 3668838 3618037 3612315 3582681
6292 3582681 3551548 3454412 3456124 3469989 3476547 3454810 3439086 3371476 3337000 3340503 3396366 3415208
6280 3415208 3433332 3483222 3532657 3485147 3341035 3141209 3100786 3169728 3110907 3245625 3266323
6269 3266323 3277049 3236764 3129638 2983252 2911616 2841407 2779897 2742822 2722699 2729628 2697917
6258 2697917 2727680 2783570 2764179 2767340 2732116 2781888 2678869 2666990 2664785 2662263 2693696 2673401
6246 2673401 2668805 2615846 2670426 2635124 2627916 2578570 2643997 2559543 2565561 2590117 2568174 2565794
6234 2565794 2623304 2702989 2704915 2625874 2597664 2567764 2506057 2439222 2423501 2422469 2418439 2343765
6222 2343765 2371465 2349656 2326630 2381071 2333137 2298056 2281345 2220285 2242836 2361075 2261751
6211 2261751 2241801 2303330 2319752 2360880 2396847 2354780 2395210 2465999 2538298 2498893 2520165
6200 2520165 2520407 2496996 2471310 2401750 2369307 2303060 2294154 2335896 2331999 2323872 2279402 2253811
6188 2253811 2314055 2295716 2294338 2294682 2251793 2312010 2478182 2515939 2506626 2580764 2645622 2704283
6176 2704283 2805237 2810473 2841769 2931083 2939069 2949414 3009248 3089261 3052415 3025723 3052589 3121342
6164 3121342 3174745 3286664 3298851 3243363 3297180 3298884 3198894 3179361 3065996 3003045 2953154
6153 2953154 2781702 2669966 2551017 2454792 2345701 2176368 2077371 1967844 1854979 1833685
6143 1833685 1708372 1597356 1582061 1507046 1393021 1402202 1319482 1246673 1218726 1108823 1098034
6132 1098034 1060186 1040944 1025459 1009869 928174 914856 928603 891813 894324 858441 820169 833815
6120 833815 871886 832048 881423 790129 798836 960793 958840 863110 860010 805381 777320 866157
6108 866157 1005765 964815 959352 1037570 1106461 1172826 1169082 1222842 1255093 1358929 1464642
6097 1464642 1459546 1457721 1548473 1627471 1838366 2038666 2094102 2188912 2406978 2485817 2582424
6086 2582424 2789261 2888574 2876990 2819039 2811325 2832664 2716494 2508767 2409819 2324613 2271860
6075 2271860 2171839 2006152 1863849 1813153 1712522 1633822 1515502 1470258 1386736 1351489
6065 1351489 1297365 1227274 1270714 1206945 1147754 1144666 1106589 1047689 1094429 1074352 1047484 1009166
6053 1009166 949122 888144 817262 731349 701128 772496 763255 682215 628289 631406 764452 807185
6041 807185 745369 745571 764914 712030 715426 731706 852071 941105 940560 994071 972962 988303
6029 988303 1060994 1114645 1091463 1105647 1199518 1250076 1224070 1303630 1404081 1513218 1561419
6018 1561419 1653681 1831918 1883243 1956331 2049064 2271276 2442558 2470176 2581240 2622423 2589816
6007 2589816 2589572 2562149 2428323 2383733 2354950 2227407 2166045 2113493 2074517 2017513 2022195 2045304
5995 2045304 2132097 2094949 2020373 1967611 1967444 1918306 1849798 1767265 1727104 1626512 1578287 1544134
5983 1544134 1415830 1382218 1242698 1185637 1067432 996109 926196 800052 754088 673010 602213
5972 602213 581625 527549 487245 449286 381038 344974 301239 223745 211871 164156 126629 173013
5960 173013 225118 166372 48370 62371 47028 31134 -25383 17251 -33363 -60333 -26440
5949 -26440 -99990 -116000 -50561 -95655 -145354 -75521 -120250 -218603 -240193 -210856 -198284 -174113
5937 -174113 -197152 -176852 -231188 -249266 -199734 -287426 -331936 -309521 -289302 -227412 -233420 -257814
5925 -257814 -279120 -286571 -250795 -231835 -271062 -327655 -282317 -273778 -309807 -241387 -316045 -374023
5913 -374023 -352524 -272816 -276630 -372528 -397872 -337976 -362802 -336180 -320154 -418687 -471203 -363611
5901 -363611 -301625 -317440 -322571 -327522 -346764 -332374 -361488 -387519 -347588 -366519 -390169 -363075
5889 -363075 -335045 -359280 -349308 -326429 -230063 -244608 -115781 -19490 -41920 -68914 -65592 -23523
5877 -23523 48737 87373 36821 16374 23233 99744 55808 -26970 -25110 -53225 -135857 -210751
5865 -210751 -279440 -308866 -296813 -309460 -381796 -373599 -368391 -410571 -337683 -390176 -481963 -457277
5853 -457277 -417581 -450993 -531846 -510700 -501269 -528777 -612955 -599239 -510082 -527196 -499883 -526216
5841 -526216 -592732 -658330 -695162 -605394 -602146 -643502 -716225 -713556 -686229 -639179 -612966 -693799
5829 -693799 -665611 -610973 -562483 -602005 -620298 -651440 -527448 -470345 -503617 -538962 -642924
5818 -642924 -673786 -702618 -640192 -610729 -620304 -615304 -709490 -791992 -781072 -821939 -820334 -673569
5806 -673569 -668074 -733422 -750687 -684850 -776456 -754673 -687452 -711350 -643663 -602562 -631330 -669724
5794 -669724 -687040 -698760 -638411 -655457 -669784 -596010 -616751 -599828 -590703 -675377 -676774 -657250
5782 -657250 -602210 -597831 -586382 -638897 -630712 -612720 -581620 -631682 -598203 -614275 -626607 -621746
5770 -621746 -582219 -579386 -556715 -600910 -679426 -644257 -631489 -657478 -718878 -708418 -761164 -674645
5758 -674645 -747139 -752945 -790033 -764644 -836616 -893080 -795474 -742203 -711974 -763217 -784367 -817417
5746 -817417 -817366 -805241 -818763 -854255 -770306 -736043 -772215 -838175 -864661 -841418 -819569 -792597
5734 -792597 -870465 -898389 -919908 -912064 -837918 -870495 -882181 -886334 -933136 -910340 -833575 -794870
5722 -794870 -833580 -869086 -882791 -830327 -800665 -832447 -863251 -914201 -783041 -829490 -890960
5711 -890960 -891454 -896288 -903702 -933995 -939070 -946326 -937463 -864590 -831171 -880046 -895738 -901746 -933410
5698 -933410 -940572 -941357 -972008 -950395 -974543 -918546 -880086 -853809 -802803 -861600 -918624 -925629
5686 -925629 -964192 -999764 -1009026 -989028 -933427 -930508 -951742 -924270 -923852 -898303 -872768 -817940
5674 -817940 -865767 -903438 -928227 -993716 -1021166 -994037 -1030502 -1003843 -957466 -992769 -922668 -873616
5662 -873616 -868808 -938372 -938662 -966708 -959975 -877392 -943464 -981617 -1001198 -970343 -931663 -928784 -965938
5649 -965938 -1016512 -1047867 -1043026 -1048035 -1050569 -1048992 -987214 -954783 -888795 -915147 -864501 -866794 -923274
5636 -923274 -918378 -918303 -834773 -878438 -921957 -915942 -923381 -947256 -861070 -877222 -956226 -960193 -888212
5623 -888212 -919450 -933231 -944626 -968787 -971534 -962590 -921494 -876191 -849917 -729006 -810535 -889529
5611 -889529 -929368 -925102 -917718 -926171 -938457 -922826 -894340 -898522 -864671 -792032 -826771 -812132
5599 -812132 -763796 -832190 -904596 -892422 -880906 -910214 -885692 -916603 -934532 -909805 -837029 -798793
5587 -798793 -862774 -908038 -959308 -934880 -894208 -939868 -962164 -1016577 -979157 -1013103 -983083 -952330
5575 -952330 -965955 -1045844 -1107090 -1130689 -1013562 -921090 -964525 -981872 -951299 -978651 -1026812
5564 -1026812 -1020470 -1015761 -1008520 -992894 -1066958 -1018485 -945957 -1006082 -1006229 -1029362 -1059556 -1067886 -1070545
5551 -1070545 -1093685 -991471 -937985 -1030800 -1047411 -1036792 -1070648 -1015000 -983494 -1011353 -1044157
5540 -1044157 -1062821 -1030846 -976068 -973081 -957916 -910236 -908222 -884390 -888223 -954288 -916276 -891327
5528 -891327 -951959 -951813 -1047753 -1038493 -1087633 -1020628 -945327 -937681 -935914 -987589 -956189 -898251 -979274
5515 -979274 -978917 -986284 -1026531 -1062272 -1028650 -1026728 -970436 -897593 -873556 -948330 -988049 -986276 -1011690
5502 -1011690 -987773 -982292 -993524 -977382 -922143 -952330 -938415 -980007 -974866 -935092 -950317 -1002409
5490 -1002409 -979671 -955258 -944297 -1010702 -953173 -951149 -947577 -979535 -1046900 -1076189 -1053853 -1008220
5478 -1008220 -966815 -925329 -891243 -930725 -905560 -883371 -813794 -805864 -840641 -852575 -817360 -829568
5466 -829568 -882397 -913327 -864339 -825331 -821563 -756318 -808754 -861200 -812231 -826893 -807242 -796299
5454 -796299 -815232 -775205 -877984 -866440 -814942 -845581 -811602 -784085 -786502 -825345 -835092 -809299
5442 -809299 -755998 -712663 -702708 -627074 -581217 -447882 -444999 -334428 -205412 -158251 311
5431 311 -20638 -50730 -64715 -79046 -105950 -163850 -257825 -317436 -423456 -509864 -564023 -620873
5419 -620873 -735628 -703133 -677345 -751675 -762669 -780150 -753076 -839652 -865121 -849059 -795409
5408 -795409 -855423 -903675 -876612 -933949 -982126 -970550 -977298 -914388 -983928 -973105 -875065 -889501
5396 -889501 -922341 -904918 -951438 -971268 -957274 -1050868 -1136054 -1098678 -1029192 -1002796 -1036466 -1045287
5384 -1045287 -1002563 -997236 -965855 -977795 -977183 -992524 -965962 -1028725 -1003190 -1024279 -1065259 -1037233
5372 -1037233 -1062566 -1122231 -1053183 -1011765 -1088616 -1117714 -1164967 -1137169 -1039573 -1055223 -1075700
5361 -1075700 -1067671 -1023865 -1108853 -1120646 -1151845 -1119407 -1113586 -1105976 -1070510 -1117588 -983066 -1052483
5349 -1052483 -1153569 -1191668 -1084014 -1116439 -1147090 -1103948 -1078518 -1096020 -1089191 -1101169 -1161726
5338 -1161726 -1137920 -1117563 -1139928 -1094444 -1080814 -1130152 -1097145 -1140333 -1128442 -1109265 -1103242 -1084731
5326 -1084731 -1145552 -1136312 -1190479 -1198459 -1181402 -1108032 -1077127 -1030616 -1049641 -1114593 -1217079 -1236864
5314 -1236864 -1186119 -1136722 -1148015 -1161495 -1165810 -1127340 -1136576 -1145476 -1189533 -1151856 -1094601 -1099652
5302 -1099652 -1129567 -1199801 -1174233 -1110756 -1109854 -1159093 -1178321 -1209993 -1187931 -1121787 -1105421 -1174851
5290 -1174851 -1172380 -1184056 -1177924 -1172673 -1115871 -1144917 -1097869 -1097964 -1039042 -1079116 -1131169 -1140906 -1136253
5277 -1136253 -1217940 -1262632 -1229751 -1213781 -1245743 -1204647 -1158906 -1142141 -1117968 -1114449 -1162495 -1183913
5265 -1183913 -1139734 -1076564 -1075609 -1134620 -1095949 -1152835 -1162011 -1137487 -1199049 -1152206 -1102807 -1150613
5253 -1150613 -1153546 -1125792 -1127555 -1105775 -1175254 -1128383 -1071816 -1152658 -1119528 -1032828 -1138162 -1126441
5241 -1126441 -1111147 -1127142 -1118981 -1123190 -1165907 -1144014 -1126244 -1149582 -1102198 -1104597 -1090196 -1086271
5229 -1086271 -1137024 -1161405 -1095032 -1107424 -1078800 -1052947 -1069007 -1050233 -1038025 -1082662 -1144812
5218 -1144812 -1170193 -1125035 -1110414 -1116556 -1107214 -1115845 -1120607 -1118130 -1096054 -1025559 -1088167 -1037822
5206 -1037822 -1037748 -1098570 -1161093 -1153045 -1092538 -1090798 -1023297 -1052472 -1093051 -1055315 -986843 -908723
5194 -908723 -974615 -1154048 -1254009 -1140254 -1181895 -1189366 -1108732 -1082078 -1032614 -1036312 -1124941 -1092302
5182 -1092302 -1076128 -1080649 -1046017 -1029882 -1079880 -1065811 -1076278 -991109 -982676 -1058753 -1148918 -1134966
5170 -1134966 -1149237 -1111460 -1083471 -1095505 -1041509 -1043969 -1029754 -1067146 -1015554 -1069224 -1063748 -1074545
5158 -1074545 -1077204 -1104431 -1005209 -1018859 -1058069 -1100748 -1062519 -1058932 -1044832 -1029147 -1052766 -1069530
5146 -1069530 -1069644 -1018586 -1004965 -989272 -992587 -1051344 -1060562 -1021115 -1082837 -976726 -982342 -990020
5134 -990020 -1011338 -985815 -950089 -1005779 -1059863 -1046086 -1028985 -988813 -873695 -909801 -969073
5123 -969073 -1020907 -991854 -1034706 -981206 -916028 -886407 -888295 -835078 -812590 -920139 -972154 -1022897
5111 -1022897 -992286 -918340 -852402 -804131 -796170 -790573 -816887 -841292 -831891 -777520 -756878 -816313
5099 -816313 -816486 -781369 -709881 -715608 -720414 -670678 -718661 -693005 -659515 -607767 -588751 -565619
5087 -565619 -603650 -557418 -437793 -412271 -392181 -393011 -368440 -397990 -417140 -441261 -437329 -456831
5075 -456831 -521941 -571956 -575553 -522532 -613227 -627830 -599729 -642819 -665233 -670311 -688981 -653399
5063 -653399 -615111 -636286 -640962 -642398 -609673 -643846 -689235 -685240 -667123 -620885 -589610 -571396
5051 -571396 -555156 -615927 -564284 -535400 -533473 -464144 -410128 -336007 -243485 -288270 -248574 -259939
5039 -259939 -283011 -292909 -277045 -299247 -394258 -428020 -416910 -457959 -492999 -486931 -416619 -362970
5027 -362970 -448708 -446395 -492767 -424424 -358568 -304237 -330018 -327015 -269841 -228480 -193372 -133697
5015 -133697 -37299 -23467 -21067 17884 107878 54478 58775 -17679 -100806 -185774 -265519 -300836
5003 -300836 -334157 -363805 -418050 -435973 -496578 -489546 -432862 -435879 -528750 -606986 -643116 -596579
4991 -596579 -520459 -481047 -514664 -484275 -441199 -421101 -417697 -390669 -386671 -389950 -381627 -345316
4979 -345316 -275231 -177473 -98068 -80377 -8129 35517 128513 188166 172590 114767 112855 179126
4967 179126 156894 62812 -61483 -121291 -157789 -145561 -153986 -261055 -290585 -302680 -339487
4956 -339487 -345800 -382937 -451984 -479226 -525782 -588344 -566764 -653990 -699533 -669053 -676440 -679050
4944 -679050 -781390 -825628 -782124 -798798 -760256 -749093 -782807 -772940 -770394 -875116 -883207 -848940
4932 -848940 -854992 -897631 -937095 -953185 -923043 -923992 -879545 -884296 -938385 -965567 -911497 -882985
4920 -882985 -953667 -1002085 -951223 -860377 -876922 -860362 -928697 -930248 -957240 -941979 -934071 -890290
4908 -890290 -886539 -879529 -955039 -876095 -941458 -1027967 -1045902 -1006721 -943833 -967394 -977899 -937193
4896 -937193 -908766 -977071 -899254 -901583 -890021 -874625 -835101 -919395 -963854 -953101 -913672 -936883
4884 -936883 -968436 -946208 -951843 -845648 -868482 -865996 -864246 -858662 -907106 -880624 -880532 -843462 -836856
4871 -836856 -771878 -748166 -776503 -801104 -749356 -701544 -781894 -720770 -709054 -667254 -690002 -681284
4859 -681284 -689081 -657143 -683120 -642352 -610601 -615469 -572561 -445516 -447336 -435345 -384873 -318864
4847 -318864 -231603 -205668 -194468 -183083 -76980 -2911 458 47675 54431 -3098 -791 -8821
4835 -8821 -92167 -113674 -113126 -163729 -185436 -215654 -295144 -327725 -307807 -216469 -306036 -394625
4823 -394625 -391280 -367250 -372958 -361550 -200624 -167442 -217770 -169074 -92400 -34069 -2940 64786
4811 64786 147368 108796 79669 66931 63673 77208 59470 -63052 -84370 -88381 -204434 -277763
4799 -277763 -241072 -253022 -348211 -448342 -517032 -554994 -587776 -579997 -561801 -518862 -601985 -631454
4787 -631454 -531883 -503389 -545225 -484519 -409062 -462873 -463876 -447943 -466682 -452788 -451284 -384311
4775 -384311 -277072 -281522 -297116 -213337 -182129 -165692 -257505 -290277 -276522 -314867 -237040 -252763
4763 -252763 -358209 -404266 -331753 -305004 -373102 -397385 -401212 -498421 -498072 -476112 -452222 -480991
4751 -480991 -470715 -448578 -456281 -437611 -343766 -335089 -373725 -412457 -386930 -404588 -278939 -102699
4739 -102699 -167027 -223222 -231615 -309907 -293168 -314292 -322193 -374669 -436890 -408304 -453804 -413720
4727 -413720 -370280 -436202 -520734 -453225 -477371 -484268 -525408 -512071 -457767 -549376 -527165 -501563
4715 -501563 -553052 -616025 -570074 -460342 -454963 -545777 -573001 -517085 -416838 -381955 -404831
4704 -404831 -398847 -342353 -332345 -269670 -182361 -148799 -159380 -101261 -90412 -53542 -58155 20710
4692 20710 112845 85591 125504 118940 143645 117822 189050 160741 104348 20738 55057 32031
4680 32031 -69130 -61987 -72776 -134852 -168556 -229052 -263652 -312667 -343336 -335338 -398690 -383727
4668 -383727 -343258 -369411 -344517 -362908 -334178 -347413 -349492 -354191 -324131 -293390 -271960 -246713
4656 -246713 -288310 -321706 -305144 -306132 -325675 -322942 -337800 -358939 -410144 -332469 -298225 -361237
4644 -361237 -355317 -257979 -162836 -112002 -104022 -64345 62 35852 100784 136943 194861 229386
4632 229386 257814 324709 397876 409565 424227 473381 485935 514550 545543 521184 502780 536266
4620 536266 551868 519985 473226 420489 400610 331164 265472 211229 159948 84019 93640 61026
4608 61026 7415 -69067 -126831 -137835 -135421 -174597 -196319 -285972 -363155 -330300 -409206 -477578
4596 -477578 -479510 -444380 -478732 -522237 -542025 -533801 -544266 -563791 -578653 -542653 -654282 -629678
4584 -629678 -563414 -550156 -610080 -671718 -647249 -632640 -639364 -677049 -660544 -578134 -551215 -570713
4572 -570713 -594628 -545125 -596952 -589941 -566467 -528567 -618284 -681570 -652120 -623185 -727277 -750183
4560 -750183 -740535 -739446 -735495 -711808 -725108 -695269 -699012 -754414 -740170 -725333 -720665 -744072 -796601
4547 -796601 -788234 -759273 -725025 -675188 -754619 -727264 -742370 -681114 -729791 -671979 -603148 -629204
4535 -629204 -670483 -723611 -728777 -653661 -595579 -619710 -561900 -565572 -680242 -781646 -773751 -755766
4523 -755766 -752591 -690836 -666577 -694623 -749012 -737322 -745509 -717924 -715352 -748013 -741672 -722434
4511 -722434 -748999 -705059 -689641 -707281 -688490 -708786 -699794 -621841 -588594 -574183 -609710 -569909
4499 -569909 -533248 -482152 -481212 -560735 -644279 -672211 -718839 -678150 -603734 -563437 -636356 -653708
4487 -653708 -604437 -644288 -620311 -724443 -719018 -723390 -702119 -619065 -658389 -591143 -584420 -654311
4475 -654311 -677368 -713204 -590414 -556129 -613765 -630234 -645498 -659973 -598019 -589320 -653857 -596590
4463 -596590 -533130 -656856 -682866 -704311 -672265 -666976 -696834 -674223 -717509 -717839 -694234 -685988
4451 -685988 -684639 -668806 -747162 -689825 -678151 -700687 -702247 -761028 -734166 -746515 -734248 -783807
4439 -783807 -724455 -745266 -714230 -613897 -652161 -648616 -702893 -698023 -699436 -628059 -628308 -627881 -587003
4426 -587003 -548763 -472760 -484119 -383767 -346994 -396815 -415539 -338995 -321735 -425235 -439859
4415 -439859 -372880 -337750 -380905 -405109 -397741 -323292 -271809 -233507 -178706 -77555 -138511 -221496
4403 -221496 -128018 -63036 -38223 -75651 -99413 10973 62798 92286 157380 301319 298161
4392 298161 327880 490228 491196 464102 563051 632251 690416 779673 804264 825686 955349 953316
4380 953316 960705 1017056 1037888 999110 957315 1012071 1014264 899062 811787 835366 728289 701264
4368 701264 608867 483773 411959 392790 448463 382254 314550 328662 299834 352774 313607
4357 313607 215019 215310 141770 99409 151255 75861 4306 10171 23635 -16798 -31638 6287
4345 6287 61812 69479 75255 -13120 -32324 19081 32961 102249 42055 -6580 38583 52453
4333 52453 -10602 47624 165748 115178 206088 252386 280060 276275 326598 412262 470483 559280
4321 559280 633818 591381 562213 625331 673535 643866 622995 612077 559832 536296 508726 440241
4309 440241 418169 467673 462718 448025 397773 359683 309173 363313 339422 346907 349555 351658
4297 351658 332868 267328 194663 163673 104747 15628 -34052 -162836 -187734 -147860 -132076
4286 -132076 -170610 -161959 -200169 -103555 -82498 -146988 -95216 -79293 13350 28903 23253 -8250
4274 -8250 -54556 -83606 -92625 -206661 -311478 -323452 -294780 -305525 -280564 -257772 -259518 -340057
4262 -340057 -405069 -387188 -330725 -289247 -324728 -323529 -264467 -213370 -139520 -120491 -56909 -15643
4250 -15643 -4725 13137 13905 -10915 -35374 -9291 -27771 -28102 -80226 -155895 -181229 -157328 -192135
4237 -192135 -194716 -187924 -195353 -244630 -253932 -206573 -214937 -212024 -185185 -207508 -283198 -261549 -247158
4224 -247158 -162424 -198331 -242876 -170771 -128248 -175117 -232724 -189275 -167217 -148051 -74079 -142342
4212 -142342 -207579 -142630 -49481 27376 72433 136478 134764 126362 148133 175976 241168 237374
4200 237374 242335 233667 212691 148392 14113 -11742 -35191 -5389 -18021 -49171 -87475 -75555
4188 -75555 -57481 -18592 -38658 -67244 -92916 -96347 -48935 -119573 -138788 -70220 -94140 -182157
4176 -182157 -225526 -164727 -157170 -216849 -182153 -231387 -234618 -278538 -274258 -267491 -267321 -261997 -243499
4163 -243499 -151899 -165741 -164819 -222962 -286604 -319699 -275219 -285464 -279528 -270879 -270406 -281746 -241349
4150 -241349 -172120 -185337 -119705 -42451 -71601 -86835 -77657 -70445 -72717 -52734 -63775 -57027
4138 -57027 -83438 -154664 -104372 -84178 -145346 -71355 -49428 30877 -65346 -88396 41883 55142
4126 55142 67937 128742 278900 221913 176027 58236 -63244 -134623 -96802 -105117 -156093
4115 -156093 -207009 -237889 -230952 -269711 -354076 -397529 -348648 -354951 -393051 -362196 -326774 -354530
4103 -354530 -303588 -312956 -361574 -319545 -358473 -427125 -397266 -395202 -432130 -480171 -450909 -500780
4091 -500780 -443178 -426617 -449433 -481325 -420269 -331466 -413272 -456091 -444724 -472376 -471137 -466534
4079 -466534 -471663 -475495 -502417 -513778 -472393 -369940 -372345 -402875 -298119 -326380 -391510 -225590
4067 -225590 -152566 -80235 -52742 -61962 7740 -51742 -23445 73927 134360 162011 181333 238319
4055 238319 257659 411450 461427 476934 359447 319563 276503 147731 4883 -32639 -12775
4044 -12775 -10779 -26886 -12644 -36355 793 41077 31633 59282 55958 105307 116689 119107 152683
4031 152683 234122 251273 322799 407062 420675 537269 536320 492833 477902 438047 482125 513257
4019 513257 461148 496475 477323 484834 483215 408992 399034 412772 408406 367236 290552 246057
4007 246057 223870 265853 339317 308575 308519 351986 443328 428033 494436 523694 533997 495603
3995 495603 520232 564296 603657 664935 692949 680303 682757 707198 688306 719745 699533 706173
3983 706173 749127 737601 737898 875340 883508 929471 921345 931954 889614 775249 793120 805522
3971 805522 757095 788559 781958 676882 715783 710669 702664 715287 732839 741092 671365 618730
3959 618730 706180 741186 753449 795108 859398 879802 899984 891311 915979 956283 1030301 1065868
3947 1065868 1021091 957848 985688 1095391 1100874 1071634 1091568 1081218 1087898 1132289 1103770 1051915
3935 1051915 1090664 1178820 1260115 1332592 1365001 1396522 1423874 1427615 1409748 1358364 1401829 1396983
3923 1396983 1386826 1404886 1473395 1492814 1575003 1670113 1634520 1709296 1744852 1697105 1696670 1661555
3911 1661555 1637329 1685226 1696525 1709283 1780188 1912957 2009093 2015214 2107152 2189253 2271481
3900 2271481 2367577 2465605 2551237 2618328 2701986 2783897 2849525 2920929 3116872 3117221 3097350 3143327
3888 3143327 3298587 3369725 3445643 3494221 3517623 3555752 3611122 3730911 3789015 3862646 3957841
3877 3957841 4050789 4138037 4320112 4327764 4432585 4523725 4612675 4818322 4876592 4943478 4955452
3866 4955452 5039499 5186591 5239950 5260567 5297735 5414600 5465683 5481189 5560329 5542544 5593729
3855 5593729 5724308 5813165 5840745 5908229 6032700 6258208 6499994 6712749 6878050 6968051
3845 6968051 7089674 7198803 7394793 7578303 7888836 8121270 8266042 8493893 8793780 9168977
3835 9168977 9533913 9903632 10301383 10751359 11209033 11659279 12209306 12719914 13389447 14194858
3825 14194858 15016654 15891938 16692701 17537946 18436464 19402654 20330685 21290748 22294441
3816 22294441 23323738 24313206 25310769 26487979 27746444 29229970 30856851 32603225
3808 32603225 34629911 36979220 39781661 43252045 47705336 53329699 60392526 69640550
3800 69640550 81079810 94187762 109115738 125183428 140522849 154034921 159429864
3793 159429864 151359023 136116530 114445027 91459421 75149322 64627084 57603493
3786 57603493 51977233 47230348 43117437 39236916 35642638 32486672 29668655 27321313
3778 27321313 25444307 24043648 22824086 21966674 21225130 20703449 20261374 19790723 19344495
3769 19344495 18982632 18609148 18372240 18164464 18105237 18109636 18122890 18236671 18333111 18300739
3759 18300739 18308096 18381299 18425758 18483573 18671880 19021866 19539753 20004306 20475943 20999843
3749 20999843 21495862 22013837 22626656 23323223 23955968 24655534 25573965 26484098 27450908
3740 27450908 28533182 29735204 31201181 32807701 34557117 36629761 39055902 41844183
3732 41844183 45357170 49986663 55816237 63261633 72826412 83945269 96607044 111477648
3724 111477648 126758545 140584981 151235935 150578374 140522807 130219325 114432939
3717 114432939 93190380 76147836 65167696 57780710 51941032 47109311 43084697 39250122
3709 39250122 35746433 32770246 30225339 28016982 26288950 24867651 23808235 23026681
3701 23026681 22343035 21749063 21380040 21046387 20745046 20543524 20500469 20496109 20357535 20124083
3691 20124083 19232115 17780821 16557352 15701828 14947997 14276927 13730271 13075430 12507724
3682 12507724 12044410 11627904 11190932 10787855 10399037 10155115 9960959 9599740 9410605
3673 9410605 9244200 9065055 8783116 8534749 8334587 8122356 8000287 7856087 7791108 7692622
3663 7692622 7575324 7566529 7474488 7356707 7259663 7201965 7010630 6900292 6828246 6651028 6499747
3652 6499747 6385264 6342914 6282254 6225232 6130553 6107202 6106910 6037717 5845825 5843555 5786996 5654589
3640 5654589 5641649 5539936 5442866 5454002 5485068 5440833 5433261 5364720 5326294 5218531 5203074
3629 5203074 5206972 5151224 5003054 4919339 4928535 4883171 4867294 4913091 4943184 4971810 4890758 4812655
3617 4812655 4764996 4753680 4898437 4942557 4929471 5031735 5066003 5107282 5045649 5000982 4983982
3606 4983982 5009812 4935628 4967639 4968123 4869115 4868837 4837960 4794128 4783800 4788516 4665955 4618891
3594 4618891 4574139 4573513 4555754 4486811 4511385 4559505 4539157 4561711 4511234 4578643 4625710 4565647
3582 4565647 4541408 4552193 4603264 4626238 4547283 4601614 4663494 4619658 4682961 4693945 4636950
3571 4636950 4623068 4627546 4550214 4567501 4562286 4540262 4574818 4593731 4552837 4505803 4497385 4392447
3559 4392447 4386959 4417218 4430428 4398203 4385919 4356174 4322180 4359210 4315752 4308273 4394995 4410176
3547 4410176 4357636 4260109 4279162 4327399 4337656 4407657 4455340 4517228 4587734 4558429 4564008 4656904
3535 4656904 4647298 4681333 4700597 4688762 4647049 4671082 4708537 4592130 4571485 4646582 4593624
3524 4593624 4513563 4489923 4493110 4508457 4465704 4503531 4559046 4535359 4497445 4515989 4556470 4527883
3512 4527883 4503887 4534007 4534912 4571564 4569167 4525071 4492719 4444796 4409147 4442172 4457032 4443109
3500 4443109 4450520 4492615 4508679 4517187 4582211 4639889 4669167 4692648 4669417 4745988 4854173 4914149
3488 4914149 4867684 4839071 4938361 5060274 5075569 5111213 5181588 5172874 5152787 5178238 5134373
3477 5134373 5144840 5124472 5064892 5077556 5034151 5084754 5244612 5230381 5169057 5313732 5383054
3466 5383054 5470204 5573426 5699452 5936506 6120698 6142670 6221521 6203987 6174561 6207992 6141832
3455 6141832 6141360 6201803 6277958 6432279 6462506 6554103 6617128 6649645 6784332 6876130 6953484
3444 6953484 7066391 7170887 7351738 7546871 7724488 7962994 8223314 8441619 8667593 8936713
3434 8936713 9267166 9596017 9904674 10403718 10870195 11349644 11910871 12438551 12972925 13609920
3424 13609920 14134884 14468490 14722735 14814734 14696527 14537527 14114705 13574150 13037562 12518763
3414 12518763 12105362 11778092 11417337 11141108 10923203 10737143 10661269 10538099 10432311 10543788
3404 10543788 10654830 10624785 10650059 10707853 10596574 10383047 10166029 9862982 9725186 9561807
3394 9561807 9437019 9430837 9401620 9257471 9052083 9006251 8972348 8897877 8846443 8665457 8508313
3383 8508313 8343574 8170927 7917836 7777772 7677461 7615023 7432796 7456626 7480572 7372341
3373 7372341 7347017 7313320 7308941 7342155 7330153 7360703 7459951 7467680 7474103 7485429 7511458 7543555
3361 7543555 7583676 7561376 7568495 7667294 7676518 7702347 7713380 7654935 7639958 7686380 7842876 7831781
3349 7831781 7837576 7875394 7796746 7727851 7662065 7638679 7594288 7571093 7555352 7491481 7492401 7475198
3337 7475198 7492968 7521576 7412909 7492001 7695750 7796504 7886005 7934599 8062151 8118473 8291313
3326 8291313 8449287 8552979 8679525 8790859 8902493 8971333 9100714 9263015 9370262 9595835
3316 9595835 9870889 10022949 10229590 10349233 10525436 10795411 11069830 11286240 11504603 11787153
3306 11787153 12028627 12282775 12408819 12494141 12534989 12547524 12553939 12675308 12755895 12864502
3296 12864502 12936797 13122718 13388111 13646577 13886676 14273719 14784570 15236436 15737848 16349276
3286 16349276 17021532 17773540 18661347 19650616 20636520 21606631 22602802 23549413 24273057
3277 24273057 24557172 24501462 24242113 23595910 22752910 21729186 20591200 19549446 18621716
3268 18621716 17802053 17159225 16421000 15768134 15324859 14930133 14520916 14200625 14007907
3259 14007907 13801206 13590850 13367895 13129218 12886345 12652488 12441163 12252719 12068928
3250 12068928 11977774 11848972 11812469 11776522 11717913 11598281 11482068 11341917 11226510 11074755
3240 11074755 10934442 10759153 10618390 10484580 10388456 10172751 9942828 9829750 9811447 9731373
3230 9731373 9605081 9489957 9370778 9295376 9245802 9136656 9067108 8974087 8937135 8942363 8878530
3219 8878530 8890189 8932496 8891449 8820930 8824771 8841893 8977327 9065642 9185817 9289552 9301330
3208 9301330 9467608 9637941 9797442 9858052 10041906 10199448 10271855 10340318 10483918 10547908
3198 10547908 10613946 10713777 10763206 10690067 10781653 10905591 10926482 11003415 11035070 11067333 11092024
3187 11092024 11199335 11233881 11298262 11348031 11439607 11488234 11507752 11493986 11458865 11463581 11468951
3176 11468951 11486367 11419388 11491867 11537771 11532472 11611466 11694374 11846426 11900484 11895833 11915054
3165 11915054 11839903 11858951 11854275 11915141 11957074 11903299 11954991 11885537 11826103 11839392 11879711
3154 11879711 11835831 11815207 11814631 11851010 11907513 12026209 12172571 12391448 12508413 12622606 12560707
3143 12560707 12658999 12701715 12742662 12673566 12592959 12542149 12353499 12131728 11891019 11704189
3133 11704189 11611640 11490749 11343162 11259380 11216886 11191417 11153111 11075849 11054667 11072038 11124099
3122 11124099 11134966 10974799 10926027 10895907 10829434 10744122 10521374 10382312 10307129 10193266
3112 10193266 10121071 9974616 9874509 9800996 9732048 9721100 9749802 9702880 9683942 9772326 9827015
3101 9827015 9785833 9815216 9828242 9831996 9714363 9646227 9574679 9513571 9515038 9467269 9386541 9435095
3089 9435095 9448185 9408640 9484714 9518206 9496025 9517485 9436992 9476736 9544913 9638448 9684898
3078 9684898 9692091 9806585 10018480 10218502 10274668 10302295 10395164 10531706 10534524 10556681 10577844
3067 10577844 10576521 10726955 10835644 10991529 11094373 11149357 11314445 11473936 11619600 11806999
3057 11806999 12137550 12343743 12607150 12894714 13144208 13459799 13781232 14119977 14460889
3048 14460889 14785895 15157447 15523846 15953011 16341670 16816504 17298312 17646035 18196493
3039 18196493 18715702 19245572 19784279 20291567 20733733 21191312 21669538 22129982 22609877
3030 22609877 23111427 23679107 24221549 24789138 25369792 25876704 26448090 26978853 27410430
3021 27410430 27939675 28421664 28891582 29301801 29680811 30060691 30386801 30807174 31204191
3012 31204191 31590548 31991262 32366716 32690454 33037891 33358244 33593490 33767516 33965407
3003 33965407 34131316 34164677 34290610 34350842 34336065 34290898 34215799 34210323 34035657 33802946 33550913
2992 33550913 33281610 33027412 32638822 32287463 31920019 31551504 31197096 30850345 30490726
2983 30490726 30189570 29856153 29544774 29236797 28873458 28494965 28124520 27699059 27238154
2974 27238154 26762177 26279109 25818261 25400663 24993379 24605501 24231115 23819803 23484353
2965 23484353 23191635 22979063 22657755 22408766 22160775 21910500 21691849 21417248 21229211
2956 21229211 20933941 20635685 20404147 20156747 19984843 19801956 19614138 19533493 19335420 19217350
2946 19217350 19102136 18940309 18776378 18618236 18575706 18413321 18295125 18213516 18178810 18247322
2936 18247322 18286376 18323327 18355098 18618327 18840115 18986658 19121267 19188411 19340004 19464359
2926 19464359 19547202 19650984 19618333 19647202 19783990 19801517 19824391 19842120 19901763 19942417 19916677
2915 19916677 19856765 19767532 19644789 19543463 19340128 19134718 18960668 18713980 18499383 18203614
2905 18203614 18010768 17797729 17579782 17394455 17178376 17051187 16876710 16726695 16586882
2896 16586882 16452254 16292716 16194534 16051056 15908712 15776938 15695540 15598383 15498456 15350505
2886 15350505 15213184 15129068 14903133 14698894 14544923 14344996 14223310 14097676 14044965 13950363
2876 13950363 13738749 13641397 13573192 13502003 13409780 13293576 13309050 13321075 13262129 13282177 13355252
2865 13355252 13392112 13332435 13413543 13503956 13526869 13628355 13685928 13796678 14005651 14119411
2855 14119411 14233281 14341848 14449918 14593464 14794118 14953399 15063330 15079325 15213963 15339534
2845 15339534 15371785 15417965 15340546 15365795 15368496 15343140 15207561 15110741 15137508 15104596 15149670
2834 15149670 15096787 15049938 15062515 15118757 15210448 15172096 15128181 15241326 15307940 15272781 15312120
2823 15312120 15349887 15361783 15385988 15434562 15495841 15632076 15695632 15750439 15760208 15855162 15945116
2812 15945116 16088133 16150852 16235044 16358799 16502717 16705429 16824510 16949030 17100914 17270506
2802 17270506 17387561 17586184 17716067 17788519 17936362 18035542 18119353 18327808 18417776 18528642
2792 18528642 18732209 18888542 18978652 19073258 19241582 19452628 19689993 19885467 20089128 20230877
2782 20230877 20454810 20675684 20889087 21116202 21285686 21607585 21887360 22225472 22502699
2773 22502699 22865633 23282262 23593016 23895466 24212832 24492485 24967808 25481572 26066450
2764 26066450 26697355 27315747 28048844 28698609 29234451 29757812 30351336 30803949 31209365
2755 31209365 31600606 31947319 32187194 32390189 32605551 32712535 32832411 32980882 33115851
2746 33115851 33212234 33397302 33611441 33739824 33910076 34017719 34102845 34156884 34174360 34283305
2736 34283305 34197471 34045194 34080037 34103972 34088540 34128054 34232766 34398394 34586016 34789319
2726 34789319 35052101 35377971 35739702 36213572 36678948 37193303 37879677 38650296 39337524
2717 39337524 40142141 41107391 42156938 43293141 44484791 45753762 47091706 48376920
2709 48376920 49724675 51073386 52312823 53555959 54676036 55719567 56688250 57594764
2701 57594764 58254846 58724748 59125404 59457123 59738240 59896104 59833087 59645866 59226755 58645487
2691 58645487 58062465 57370087 56606066 55904406 55174922 54341222 53441989 52623445 51770075
2682 51770075 50984326 50061580 49193568 48359591 47463069 46592894 45668642 44795019 43772758
2673 43772758 42647134 41587487 40485832 39450401 38436421 37392671 36397285 35566883
2665 35566883 34774665 33975872 33334317 32767129 32240663 31769656 31312564 30925518 30536424
2656 30536424 30153792 29815958 29513587 29134739 28853867 28569680 28257696 28036215 27817275
2647 27817275 27592842 27319597 27170930 27002247 26846158 26746485 26540611 26380380 26247130 26152712
2637 26152712 26010061 25871738 25803122 25758878 25672707 25612512 25664265 25573043 25524118 25492856 25498337
2626 25498337 25544762 25600358 25660919 25748428 25922659 26004234 26038863 26136832 26169473 26380833 26591221
2615 26591221 26738217 26884819 27118539 27328047 27597539 27930089 28174053 28389375 28704850
2606 28704850 29036692 29478868 29920818 30395964 30878026 31402601 32033635 32624645 33283367
2597 33283367 34056762 34830465 35654045 36572142 37496354 38446009 39496340 40553904 41698809
2588 41698809 43019696 44490109 45941206 47435580 49129270 50908348 52702173 54622462
2580 54622462 56481320 58140141 59741079 61159318 62321927 63103469 63595360 63788792 63642548
2571 63642548 63257893 62700602 62077483 61376569 60592263 59758567 59025353 58380610 57693963
2562 57693963 57068484 56569680 56114198 55608394 55190056 54840403 54527277 54366102 54153615
2553 54153615 54134195 54320455 54427897 54712725 55087975 55625211 56233898 56973044 57799257 58640480
2543 58640480 59591433 60673834 61876955 63207039 64522522 65881410 67308506 68784362
2535 68784362 70293859 71640473 72979780 74431925 75758893 76971055 78189445 79420798
2527 79420798 80536148 81565429 82419151 83203169 83824864 84379020 84869661 85360124 85742637
2518 85742637 85969972 86187254 86476607 86788522 87232753 87537274 87813901 88077314 88160833 88130499
2508 88130499 87733921 86944054 85796059 84418969 82732569 80690266 78558208 76409553
2500 76409553 74036616 71740061 69482313 67373264 65413916 63484130 61675449 60147048
2492 60147048 58558518 57170688 55926264 54761758 53607732 52572477 51659373 50767888
2484 50767888 49811920 48869866 47888112 46954378 46161653 45263927 44416446 43539311 42747659
2475 42747659 41942083 41169376 40356142 39633351 38974853 38278198 37627153 36986261 36343906
2466 36343906 35753071 35230337 34622992 34064790 33617120 33146833 32574315 32059576 31596498
2457 31596498 31090118 30643528 30218229 29820816 29467318 29045007 28687122 28286428 27950750
2448 27950750 27591085 27244331 26992002 26651897 26398107 26097482 25861908 25579096 25328548
2439 25328548 25011821 24765696 24513533 24298678 24087839 23901299 23745415 23609306 23533596 23439994
2429 23439994 23365004 23329209 23179528 23222436 23264077 23317408 23443499 23470941 23627410 23760767
2419 23760767 23884034 23858143 23875198 23898772 23895030 23894137 23954955 23961735 23979624 23930944 23939807 23888622
2407 23888622 23978110 23970526 23988034 24016974 24054647 24170720 24187631 24238324 24234930 24260773 24349980
2396 24349980 24420948 24524733 24600944 24747683 24812417 24686780 24610324 24541706 24375304 24082470
2386 24082470 23884743 23560010 23225264 22913393 22539724 22169577 21788440 21503847 21241939
2377 21241939 21012159 20783320 20553877 20342864 20223069 20108997 19996573 20023203 20079275 20119999
2367 20119999 20176809 20217123 20335458 20483833 20612066 20752329 20831661 21074632 21278887 21401637
2357 21401637 21431782 21563901 21655877 21687768 21774766 21915577 21997892 22077912 22134437 22234353 22335654
2346 22335654 22514282 22674317 22811981 23012490 23264850 23592932 23804037 24112812 24477005
2337 24477005 24902169 25305220 25612410 25901103 26260153 26683419 27167848 27663279 28171026
2328 28171026 28640151 29212004 29778774 30344392 30936842 31539515 32253530 32846989 33388123
2319 33388123 33997771 34586500 35166036 35772505 36297022 36752183 37094185 37403352 37737623
2310 37737623 38000986 38147404 38268613 38403909 38549882 38636025 38677865 38784829 38882832 38909416
2300 38909416 38957885 39047459 39148835 39366386 39518933 39769650 39950041 40133678 40226830 40441967
2290 40441967 40712284 41017079 41327225 41547002 41819222 42185035 42599818 43045061 43592802
2281 43592802 44092568 44733155 45406563 46201763 46930702 47802049 48669696 49509309 50342228
2272 50342228 51186339 52042198 52924354 53946620 55014846 56021321 57116317 58283435 59393544
2263 59393544 60582158 61885588 63185741 64565782 66012796 67409987 68833962 70264912
2255 70264912 71705974 73100918 74552854 75901495 77161347 78437175 79669039 80702640
2247 80702640 81598785 82509136 83467888 84253262 84946510 85585516 86228917 86855131 87446221
2238 87446221 87962611 88533257 89112591 89546663 90022022 90451197 90830624 91032806 91197930
2229 91197930 91358124 91445210 91488968 91456068 91431890 91424509 91396649 91437334 91559714 91714128 91901318
2218 91901318 92275954 92662339 93137335 93685531 94299845 94876628 95367087 96030698 96569852
2209 96569852 97001803 97429429 97776374 97950328 98050611 98037812 97928028 97792687 97591109 97372088
2199 97372088 97049904 96653881 96206558 95713054 95181023 94535479 93999438 93480935 92882018
2190 92882018 92209016 91417889 90687238 89971377 89134824 88288258 87493347 86783920 86164498
2181 86164498 85592915 85091849 84776268 84525331 84355002 84390092 84572568 84798558 85156577 85562641
2171 85562641 86013552 86665268 87388136 88225149 89235908 90512858 91907119 93263131 94671605
2162 94671605 96206272 97660540 99065010 100300053 101176956 101579313 101590145 101191140 100303955
2153 100303955 99050073 97413781 95505919 93458897 91424326 89561215 87785438 86168308
2145 86168308 84691595 83288358 82025306 80875171 79838421 78855162 77972881 77179943 76456491
2136 76456491 75848994 75399134 75002645 74572457 74108641 73499682 72742793 71787204 70673295
2127 70673295 69274835 67721466 66196881 64653992 63130933 61643471 60307371 59046263
2119 59046263 57857837 56729554 55668525 54631368 53615796 52619874 51624589 50668640 49928624
2110 49928624 49187221 48482799 47828793 47202017 46625266 46085947 45771263 45450973 45127775
2101 45127775 44899753 44725096 44584328 44583798 44604205 44584773 44655689 44795702 44954091 45144191
2091 45144191 45362194 45628272 45965427 46258638 46748790 47253620 47865647 48592413 49340989
2082 49340989 50181930 50977166 51837998 52789596 53700029 54735855 55900638 57130319 58365329
2073 58365329 59607826 60949186 62281065 63692447 65120370 66599779 68107962 69711503
2065 69711503 71298456 72886037 74402782 75773256 77073484 78177225 79223313 80246470
2057 80246470 81100624 81910763 82596191 83167503 83648058 84090405 84370897 84569809 84650618 84507671
2047 84507671 84269817 83823263 83239391 82528652 81630969 80559159 79421268 78175263 76711151
2038 76711151 74991663 73195908 71416526 69405312 67394392 65385038 63340127 61368292
2030 61368292 59394563 57409239 55461022 53707709 52030217 50334325 48782687 47362335
2022 47362335 46067780 44806693 43649238 42615127 41539038 40507159 39526655 38440205
2014 38440205 37445602 36474539 35636664 34881093 34235246 33596838 32993671 32524303 32047938
2005 32047938 31582001 31189465 30807934 30377078 29933063 29559323 29233205 28817505 28579656
1996 28579656 28267783 28047720 27802904 27549896 27316723 27178660 27074465 26935397 26732529
1987 26732529 26555509 26561322 26529511 26426453 26364576 26342223 26271534 26173810 26100917 26094844 26085866
1976 26085866 26105076 26125197 26104869 26076265 26102139 26081136 26025192 26053365 25999270 25823103 25635898
1965 25635898 25526289 25303304 25078187 24755835 24369375 23920365 23418844 22928497 22484326
1956 22484326 22005232 21540541 21230792 20885549 20507730 20175231 19888443 19680117 19390685
1947 19390685 19165652 18922936 18713314 18559886 18450283 18335698 18234097 18145943 18031585 17974386
1937 17974386 17861517 17839576 17732465 17666399 17586409 17556020 17516686 17460530 17482278 17414497 17404775
1926 17404775 17367719 17301998 17320355 17275575 17212537 17217743 17240785 17216382 17192021 17203373 17316243
1915 17316243 17391326 17436344 17478770 17460087 17485133 17506998 17595273 17718077 17793977 17817707 17986425
1904 17986425 18111097 18267315 18434391 18641294 18826370 18970986 19049867 19097800 19295583 19418096
1894 19418096 19642502 19701540 19828677 19914359 20031099 20121426 20194593 20233834 20364596 20454329
1884 20454329 20514482 20634480 20822593 21069755 21163510 21454365 21707286 21947434 22261982 22553513
1874 22553513 22799593 23087199 23323695 23519461 23715691 23951774 24184276 24445450 24847088
1865 24847088 25169857 25606099 25995820 26455308 26908429 27276155 27577473 27909417 28185236
1856 28185236 28476613 28653283 28769297 28924780 29101019 29409661 29711633 30018360 30298937
1847 30298937 30505109 30747993 31022244 31238091 31574656 32009684 32435861 32863858 33325366
1838 33325366 33791421 34267424 34755488 35292099 35900878 36584823 37381313 37975060 38692592
1829 38692592 39476382 40275552 41119689 41970598 42944521 43803320 44599497 45385731 46117512
1820 46117512 46764211 47453617 48052589 48652670 49319221 50134706 50897501 51724727 52595663
1811 52595663 53545898 54703561 55843173 57076777 58450667 59869187 61529885 63325205
1803 63325205 65315391 67399262 69734964 72346143 75024895 77789833 80752920 83798596
1795 83798596 86869376 89893519 92594483 95021524 97215749 99224095 101357680 103642127
1787 103642127 106263032 109211922 112707421 116695148 121144175 126123425 131429655 137070382
1779 137070382 143145142 149567305 156378168 163635568 171488396 179870722 188786564 198166402
1771 198166402 207893353 217483388 226527578 234734404 242304514 249832313 257505697 264974404
1763 264974404 271898700 278376074 284965270 291913212 299105679 306086231 311983616 316255257
1755 316255257 318358403 317794648 313641106 305368664 293372552 278986612 263700699 248462850
1747 248462850 233605401 219368497 205786290 192921330 180605647 168748371 157491505
1740 157491505 147047514 137705053 129243378 121688491 114930286 108890850 103496240 98635915
1732 98635915 94242386 90206863 86504289 83119511 80095789 77459089 75071944 72910361
1724 72910361 70993681 69134226 67540349 66061909 64783218 63647845 62611690 61777306
1716 61777306 61076920 60368124 59885467 59544640 59241655 58914149 58551112 58131929 57975158
1707 57975158 57966243 58016209 58096687 58147722 58118598 57867757 57290736 56372452 55170980 53858989
1697 53858989 52340088 50537951 48549652 46456972 44372848 42452086 40696427 39156611
1689 39156611 37665384 36317579 35082845 33957853 32828936 31885795 30954003 30068314 29371217
1680 29371217 28593117 27887706 27244506 26595851 25979399 25377579 24791638 24197099 23691832
1671 23691832 23182898 22724713 22256662 21821200 21400015 20922965 20515509 20217068 19882956
1662 19882956 19475025 19086059 18701679 18369258 17958451 17623477 17291232 16923573 16570497
1653 16570497 16222131 15862686 15573915 15234733 14924606 14763222 14552622 14239767 14013808
1644 14013808 13734287 13495131 13261855 13121519 12895844 12653594 12454172 12270781 12062195
1635 12062195 11844514 11568364 11387272 11168689 10916724 10683520 10450232 10259683 10190752 9929979
1625 9929979 9707910 9481091 9404329 9188968 9029263 8805032 8678290 8537825 8356609 8223815
1615 8223815 8072726 7975126 7881742 7742665 7540518 7375161 7205250 7143425 7070162 7003399
1605 7003399 6891998 6762240 6614108 6596746 6479430 6305168 6139347 6047540 5980771 5922793
1595 5922793 5745708 5613605 5527239 5395551 5209226 5175311 5167499 5174422 5030830 4937949 4894559
1584 4894559 4807912 4764144 4754788 4693304 4611942 4584427 4521861 4496321 4518883 4491727 4521290 4468224
1572 4468224 4386799 4362077 4369024 4392641 4317917 4330595 4231746 4132154 4092847 4088742 4110435 4049096
1560 4049096 3997431 3948762 3924664 3866073 3798399 3716841 3664287 3679987 3647289 3514450 3472977
1549 3472977 3471976 3426435 3372710 3364067 3338307 3300288 3270264 3196814 3170332 3251359 3225468 3140933
1537 3140933 3182351 3227367 3204777 3121331 3131671 3129470 3206859 3126885 3122535 3115448 3087868 3094360
1525 3094360 3056336 3087849 3043373 3070266 3102422 3063448 2995862 3034838 3006026 3047414 3022223
1514 3022223 2985503 3017861 2970736 2911907 2924218 2868597 2877228 2913719 2857798 2866997 2917554 2903148
1502 2903148 2906102 2883492 2835061 2875687 2925759 2934749 3014137 3126336 3111074 3068308 3081616 3163548
1490 3163548 3107921 3095175 3086963 3151829 3238523 3256629 3264408 3264587 3302676 3347888 3319614 3294990
1478 3294990 3265889 3266781 3352410 3417147 3410998 3431308 3476601 3578949 3597110 3595611 3677044 3693317
1466 3693317 3744384 3769726 3864833 3905944 3908155 4023135 4138595 4205197 4242506 4200668 4273440
1455 4273440 4278156 4210415 4139037 4057134 4038905 3912863 3735919 3696543 3566572 3457214 3395959
1444 3395959 3292758 3204518 3091036 2985647 2998087 2940933 2804251 2773985 2765974 2706877 2680973
1433 2680973 2562643 2523002 2500310 2388105 2363396 2305769 2427386 2435203 2401038 2411650 2460133
1422 2460133 2469619 2418270 2444499 2461469 2457733 2333109 2249139 2223089 2106603 1957129 1906422
1411 1906422 1847136 1858473 1817839 1711980 1725337 1670174 1592509 1572183 1623729 1636529 1593860
1400 1593860 1479094 1448796 1501080 1500937 1455938 1374815 1300042 1384096 1395651 1341897 1296847 1268303
1388 1268303 1282503 1229773 1174482 1186526 1139144 1108576 1115478 1109974 1155082 1093850 1021466 1076747
1376 1076747 1028660 1012707 987407 944059 911668 784131 760963 730888 755392 784035 816715
1365 816715 865800 811319 794360 737557 759862 732420 720578 666297 597451 537143 584533 546788
1353 546788 514812 545575 600273 609370 528886 493906 432018 408617 443453 443650 377801 390216
1341 390216 384134 428328 418357 385247 320686 346005 367763 350930 330196 298177 303093 327959
1329 327959 264887 176396 213740 259767 264689 262024 251225 235861 213611 202389 229356 216152
1317 216152 208196 197442 168870 139645 150819 189052 212050 222327 209648 141655 112151 122568
1305 122568 142891 209053 182365 204055 22900 43025 96517 115992 129754 158293 115029
1294 115029 46665 66505 42873 35683 35747 -3491 35722 39983 -1419 12508 237 85092 109287
1281 109287 56948 53811 68494 20864 -39421 -9401 3794 47520 52593 51239 89359 24104
1269 24104 -25399 69259 93026 32853 69130 15058 10860 27629 31944 13957 35566 8222
1257 8222 3253 -44418 -70688 -65563 -5270 18708 -39413 -65152 -121271 -84534 -32562 -34688 -26580
1244 -26580 -65334 -28716 -74341 -138079 -67297 -52548 -18844 27907 -25973 -9970 -15871 -20185
1232 -20185 -51673 -38536 34107 31445 10501 -20253 4577 -33120 -42140 -36553 -43433 -67229 -48899
1219 -48899 -83778 -82308 -66115 -40449 -101018 -117925 -116469 -84586 -60330 -111956 -170415 -179333
1207 -179333 -198005 -147925 -149652 -176501 -166046 -165249 -156524 -205240 -124778 -106825 -101787 -184582 -193871
1194 -193871 -120430 -70886 -133684 -102139 -76010 -96026 -64770 -36965 -47247 -72789 -139034 -194647
1182 -194647 -158692 -161586 -88363 -97154 -162184 -76739 -113142 -76437 -128805 -162547 -152226 -122577
1170 -122577 -91701 -78625 -95848 -169066 -172274 -90815 -166441 -251214 -158581 -138739 -164867 -199313
1158 -199313 -209037 -223211 -204647 -209901 -206094 -189343 -190146 -224156 -172070 -213246 -244117 -246898 -259918
1145 -259918 -355419 -280674 -243837 -205676 -205227 -289322 -389090 -330317 -241682 -269074 -188009 -239452
1133 -239452 -305391 -214185 -160971 -171855 -155408 -209176 -277312 -271136 -217343 -180587 -185290 -197719
1121 -197719 -102785 -118335 -185941 -150752 -124860 -118487 -108237 -112946 -158595 -173348 -113049 -150922
1109 -150922 -136469 -97754 -79420 -143959 -139409 -104215 -143041 -176669 -229503 -213434 -220922 -221691
1097 -221691 -182785 -214803 -232147 -188010 -184493 -195183 -142232 -133381 -132521 -87754 -163287 -122169
1085 -122169 -72308 -19045 7829 -5170 13458 -23149 -16548 71191 90198 34437 -2474 -64674
1073 -64674 -80064 -98282 -54989 -57472 -38356 -34680 -47591 -62157 -24186 -100224 -141918 -168399
1061 -168399 -111011 -102212 -133579 -78361 -136617 -151868 -99031 -76447 -111615 -148261 -174273 -159436
1049 -159436 -85091 -73979 -57344 -40935 -60758 -44340 4334 19648 -55792 -48764 -17151 -61889
1037 -61889 -41403 -43643 -6217 -8545 -55910 19668 19618 -30086 -42203 -22045 -35590 102827 49472
1024 49472 65863 98812 139850 145903 147572 132306 159982 120272 152474 173033 112148 142324
1012 142324 168601 211822 144009 167323 228143 338555 385133 326235 343163 289640 407439
1001 407439 439772 396698 422078 376101 406764 499645 506042 549727 495250 492052 535992 512537
989 512537 599602 680204 699338 737699 761006 831612 892503 897063 974553 1045395 1017126 1047603
977 1047603 1117462 1226194 1338046 1464777 1580173 1687835 1748498 1941055 2069438 2154359
967 2154359 2344637 2553198 2710724 2878749 3086774 3333216 3581591 3889895 4199098 4456508
957 4456508 4680498 4847902 5012619 5363774 5923500 6481727 7204823 8304994 9714774
948 9714774 11476919 13826348 16087571 18466736 21131850 23518715 25398477 25810237 20568987
939 20568987 14738425 11459215 9524556 8360736 7300692 6511044 5802021 5242696 4763683
930 4763683 4336760 3779850 3461731 3160974 2906840 2646811 2376732 2147236 1965133 1789753
920 1789753 1678139 1621968 1493490 1354400 1367044 1328326 1289078 1209044 1203483 1162231 1167246
909 1167246 1020573 1039774 991189 866857 793216 750497 697200 659838 675695 681397 635403
898 635403 594237 513627 532382 533909 546083 496437 534073 522184 503670 471018 373647 310600
886 310600 331591 401199 439277 403531 386402 326166 270753 303123 345518 284596 270288 258255
874 258255 227656 194749 220427 216740 197800 214096 213242 232913 197487 142784 146009 103073 79681
861 79681 118129 124287 101184 82978 55884 -816 60900 105700 99135 65339 40683 -20033
849 -20033 -53115 -24857 -7503 8094 22065 1358 23809 25388 -62491 -52292 -35775 -46575
837 -46575 -15085 597 -7455 -3868 -92577 -122657 -102152 -86807 -109323 -121470 -128677 -65020 -57541
824 -57541 -100555 -107074 -177899 -130961 -210201 -240342 -260716 -211787 -180182 -206781 -233326 -235164
812 -235164 -151150 -85854 -121182 -76565 -133111 -156424 -156551 -170256 -165788 -192794 -235801 -208667
800 -208667 -163618 -217440 -214631 -154115 -120538 -135221 -130980 -179249 -107850 -105528 -258553 -252457
788 -252457 -221871 -253284 -195174 -216609 -213510 -245727 -222145 -208349 -218799 -233477 -247088 -231381
776 -231381 -183075 -210354 -153795 -167372 -239777 -253223 -213233 -229552 -277409 -195660 -222646 -267496
764 -267496 -221105 -190970 -261522 -231328 -260947 -254532 -205622 -205822 -265551 -257999 -302063 -242350 -109047
751 -109047 -163004 -167129 -183930 -297854 -241706 -222909 -219795 -213745 -205686 -235556 -232118 -248870 -260430
738 -260430 -226667 -159852 -127715 -214956 -244164 -222102 -248709 -301249 -291329 -180871 -171020 -197301
726 -197301 -152838 -124712 -178497 -258492 -215307 -182790 -240751 -238799 -191955 -129006 -98043 -184815
714 -184815 -150233 -158961 -119090 -114040 -156964 -157953 -181666 -195339 -176562 -140033 -125126 -168627 -167783
701 -167783 -151920 -135550 -115800 -133900 -126392 -103111 -130808 -178989 -146348 -133905 -182531 -207711
689 -207711 -193725 -182666 -154186 -143092 -145074 -191408 -229423 -195376 -180896 -166525 -223754 -143718
677 -143718 -168358 -252498 -227915 -237941 -198485 -133040 -99716 -155943 -200083 -181757 -131356 -155965
665 -155965 -115496 -78785 -12535 -51101 -53140 -10740 -13788 -35286 -19637 -66372 -56949 -52467 -94624
652 -94624 -96388 -141330 -156082 -156213 -183288 -118785 -35257 -77155 -121670 -135692 -166382 -173296 -98169
639 -98169 -104317 -162327 -101857 -46317 -135902 -162773 -271858 -189006 -192282 -230068 -157477 -153812
627 -153812 -183245 -241868 -202580 -270989 -277125 -196733 -186871 -172838 -156548 -160837 -142466 -166386
615 -166386 -229059 -178825 -134376 -158192 -122966 -95939 -101521 -134769 -178183 -118320 -121089 -91860
603 -91860 -135584 -109217 -79220 -84013 -83953 -111814 -79434 -69126 -36322 -11148 -92858 -58539 -98684
590 -98684 -138856 -150788 -150706 -206316 -190166 -177561 -163986 -104815 -73857 -113558 -96351 -112891 -127845
577 -127845 -105599 -73054 -49661 -63980 -109523 -114926 -87209 -104493 -103146 -83192 -109149 -93903
565 -93903 -49743 -102580 -122643 -166905 -101019 -78348 -103098 -183481 -88083 -103354 -75888 -114245
553 -114245 -145369 -98408 -92979 -182956 -166630 -116931 -103030 -51399 6411 22343 -31801 -70730
541 -70730 -98696 -99917 -55682 -71022 -82209 -100099 -71460 -52183 -165657 -82071 -11639 -48729
529 -48729 -25108 -11524 66379 21911 -74649 -68993 -22391 -75381 -56235 -42845 -140629 -122523
517 -122523 -178786 -126081 2813 -46036 -63356 -28470 -12448 -93514 -33861 17931 1509 -60119
505 -60119 -71199 -114838 -77853 -90232 -76259 -30614 -63109 -38569 -66751 -120251 -95647 -30028
493 -30028 -48294 -111326 -43763 -5227 -33238 -75997 -171846 -72226 258 43403 21872 -81740
481 -81740 -98173 -44566 -31067 -13121 -44916 18510 61666 76135 -42093 -116303 -71936 -76468
469 -76468 -57464 -61801 -80560 2582 60395 52558 49940 61708 3480 29249 2829 -39627 -35778
456 -35778 18097 -19170 8341 17357 25044 -28855 -29306 -36353 -1016 8291 17346 110877 12506
443 12506 -36755 -48518 -87727 -118178 -73230 -55072 -47630 52909 25710 20896 33134 18494
431 18494 35393 16675 32476 1943 45217 47911 -26979 -37547 -28253 -12626 -16959 -18249 -20578
418 -20578 36012 106031 108967 76771 38950 102093 94362 8279 51071 125312 109234 122872
406 122872 49184 29231 113835 163695 105947 90639 87121 89597 70477 159419 99500 87804
394 87804 163094 90152 66460 92588 24960 15260 42968 99876 95311 76275 16451 62819
382 62819 79302 43579 7175 74807 156020 54120 70143 89264 59294 57659 67828 61848
370 61848 97149 110591 86334 91473 149417 157876 186564 115725 139006 89484 71976 80844 114456
357 114456 106096 151498 162696 148247 136701 118376 135329 88909 44302 93938 90401 97528
345 97528 144814 113410 104009 95104 123907 101097 117524 150763 51559 78711 123654 108952
333 108952 150228 121302 138453 153905 126426 154626 109518 147208 190178 121451 98388 136477
321 136477 160915 183881 166430 108650 135143 141677 111746 59712 19346 106981 199269 184760
309 184760 204797 186904 123708 132373 125741 129282 166172 209741 194594 200475 220845 62193
297 62193 69733 97430 81171 117058 110816 126123 146834 126296 94897 138894 144866 109241 154411
284 154411 146527 128253 105264 118739 118684 169131 132704 200958 214226 249490 232719 219299 214273
271 214273 134300 109907 166497 190563 198604 236475 182780 193211 212323 168463 149176 146425
259 146425 167444 209535 150301 155128 205509 234639 211954 204817 180887 95771 159556 119978
247 119978 134906 132410 98070 171479 158778 182729 193108 231621 193853 119717 169012 229733
235 229733 177800 181567 216492 207771 235098 213545 143421 88913 71607 118278 164539 191453
223 191453 157607 200619 186883 210457 160139 216087 232769 154082 168577 143690 171321 237478
211 237478 247868 209368 162934 214591 209867 142452 175896 184394 190968 163544 151423 103079
199 103079 103966 279430 244778 233667 234718 168146 248530 236436 150486 196109 190000 232975
187 232975 212018 207156 212155 193743 257656 221259 268928 275056 209828 246079 251945 237932 181377
174 181377 179119 244926 294838 203576 177355 198632 225211 232014 229156 212857 171943 177666 155904
161 155904 160462 219236 261984 199440 211428 233063 229268 162967 197683 221937 224267 264638
149 264638 224591 198312 263400 234981 194059 245614 266241 237441 210273 224195 304925 249091
137 249091 241278 307757 249511 253195 271700 309898 337785 321916 305398 230554 212307 227320
125 227320 183395 231075 207528 207118 210612 175582 208456 215500 248334 267739 228390 278701 320000
112 320000 218838 245294 271417 264441 270352 308080 251543 277941 231251 260802 294253 294909
100 294909 250795 238506 245308 241501 260675 251631 235979 255782 238761 235688 230092 241720 267700
87 267700 237684 283523 272055 269776 276996 240434 229741 256781 284722 195365 233431 248464
75 248464 246476 256536 281418 239522 265495 315986 248825 292411 312422 360992 365068 336773
63 336773 269443 301157 246553 267024 294128 308045 297108 275100 245527 235154 249999 287300
51 287300 302364 315537 332033 344515 342748 313967 320690 407718 351542 258572 276399 301584
39 301584 278134 285769 249096 273981 261382 248754 249000 258923 335331 396809 339010 308656 301473
26 301473 281302 272949 286257 330004 395833 367180 306517 318873 304774 344793 313461 318974
14 318974 314496 326081 260709 258648 313369 282710 315507 320471 289155 261936 306627 308460 307340
1 307340 320554
0 320554
$$ Imaginary data points
##PAGE= N=2
##DATA TABLE= (X++(I..I)), XYDATA
16383 -4156063 -4110107 -4062350 -4035519 -4024832 -3993145 -3945853 -3921603 -3874081 -3823050 -3763446 -3777731
16372 -3777731 -3815100 -3732693 -3705600 -3680603 -3616465 -3546135 -3488400 -3486777 -3491417 -3437343 -3366291 -3356575
16360 -3356575 -3367169 -3326739 -3259774 -3249718 -3177898 -3106717 -3111581 -3071231 -3003239 -3023214 -2984486
16349 -2984486 -2948586 -2935661 -2894014 -2856291 -2824438 -2804054 -2789907 -2714821 -2698115 -2641623 -2581079
16338 -2581079 -2562218 -2549240 -2523815 -2469659 -2481261 -2434191 -2354763 -2343973 -2279291 -2284116 -2286883 -2234202
16326 -2234202 -2190260 -2168848 -2136713 -2045850 -2002556 -2038053 -2014184 -1931520 -1872504 -1795793 -1818443
16315 -1818443 -1813217 -1810735 -1790556 -1725784 -1710381 -1678715 -1633197 -1634474 -1587367 -1560623 -1549914 -1542658
16303 -1542658 -1487371 -1448297 -1393209 -1395356 -1396839 -1387755 -1365739 -1303908 -1264329 -1198165 -1177491 -1180169
16291 -1180169 -1096993 -1103314 -1062694 -1066794 -1010027 -997180 -982855 -989851 -961223 -895200 -836035 -807751
16279 -807751 -865091 -860288 -781472 -804499 -781720 -739036 -701125 -681639 -651201 -639077 -600494 -572845
16267 -572845 -571965 -552610 -539000 -505257 -485675 -434010 -383749 -400281 -373662 -319862 -279919 -292601
16255 -292601 -304965 -304391 -245884 -173601 -202501 -239503 -256421 -279627 -164908 -112459 -164003 -87811
16243 -87811 -136416 -79327 -32011 25261 43409 50653 48904 72743 68880 91553 70525 105891
16231 105891 115961 169315 135607 146207 201626 214121 151737 248280 261061 270482 348114 356937
16219 356937 313574 351925 380416 343563 319015 418807 509763 444958 409381 428074 455461
16208 455461 445526 572996 625379 647735 637968 622046 651264 631847 605957 584857 605939 632423
16196 632423 674589 638899 673110 689378 662313 739053 704529 731445 766006 814783 773091
16185 773091 766722 754888 767642 833399 860239 855236 881337 852032 753120 757018 813277 837788
16173 837788 893833 907800 874438 956504 1038954 1029632 1045479 1012809 959756 922580 960975 933946
16161 933946 908142 965795 1003124 921726 946959 1035957 1063828 1117221 1171667 1159982 1133038
16150 1133038 1149127 1084254 1023371 1068517 1037400 1083174 1131523 1111852 1114779 1081637 1139108
16139 1139108 1128744 1155298 1152288 1083327 1025257 1084538 1148874 1191474 1179849 1112689 1056505
16128 1056505 1031292 1042636 1096845 1193270 1236267 1143073 1181504 1179313 1160622 1218977 1180634
16117 1180634 1200943 1202334 1212262 1196575 1240899 1248107 1235910 1249742 1315185 1286965 1234054 1225675
16105 1225675 1215397 1200860 1178825 1146172 1230192 1250699 1175072 1257288 1272506 1232115 1287077
16094 1287077 1272819 1228772 1252674 1246261 1265434 1274651 1298478 1310652 1334832 1375031 1333764 1304702
16082 1304702 1315847 1291764 1293356 1316411 1308018 1312703 1286587 1298712 1362839 1337109 1276468 1335490
16070 1335490 1352931 1243682 1264932 1258215 1255998 1313754 1305575 1347694 1315451 1253956 1269094 1329410
16058 1329410 1339488 1263541 1207704 1295875 1357310 1398395 1387748 1312368 1330501 1321686 1319341 1361612
16046 1361612 1315222 1299055 1293845 1236154 1259170 1273085 1287897 1332190 1368041 1358815 1282523 1247214
16034 1247214 1221797 1284724 1347381 1341087 1351164 1259292 1337101 1345501 1323886 1332576 1349149 1271128
16022 1271128 1235639 1311168 1311158 1336237 1367463 1338136 1370620 1364624 1357249 1406019 1340513 1343082
16010 1343082 1393721 1402547 1424329 1434609 1417059 1446269 1448972 1365774 1337038 1368018 1365324 1353860
15998 1353860 1354390 1396888 1311281 1291566 1340295 1348545 1349920 1351099 1362969 1354713 1391796 1421939
15986 1421939 1446498 1404378 1373807 1343482 1304221 1394024 1394892 1339336 1327159 1327876 1303258 1364864
15974 1364864 1423411 1404260 1408823 1355964 1377943 1394356 1398607 1418339 1392073 1352747 1340798 1303308
15962 1303308 1318202 1358563 1411065 1384624 1402144 1380979 1386781 1368928 1373844 1364144 1357659 1328920
15950 1328920 1295323 1313183 1334786 1393995 1373288 1294306 1319094 1401742 1414140 1423163 1364041
15939 1364041 1355562 1379499 1348000 1336683 1340016 1331286 1346603 1409507 1390987 1374691 1443523 1376293
15927 1376293 1438347 1446742 1359473 1396361 1412035 1349808 1279147 1294619 1398704 1386365 1352254
15916 1352254 1312609 1359506 1425123 1422988 1386675 1386282 1422706 1408655 1402336 1447413 1376201 1331630
15904 1331630 1361885 1414672 1407290 1437110 1401829 1428249 1386912 1388354 1373278 1303782 1312517 1339030
15892 1339030 1407796 1387899 1426470 1414331 1377388 1393910 1367756 1399956 1436063 1386078 1423183
15881 1423183 1420631 1443067 1435385 1420419 1380063 1320166 1297602 1307073 1341500 1341849 1358427 1338354
15869 1338354 1356480 1359305 1330932 1362257 1383478 1407168 1424885 1400121 1417486 1415571 1431849 1416543
15857 1416543 1366512 1367470 1351475 1367837 1471933 1461286 1362226 1328447 1330261 1316373 1359684 1436608
15845 1436608 1401102 1452137 1467964 1484641 1477305 1415885 1406043 1493067 1495097 1442580 1417990 1438072
15833 1438072 1425608 1386904 1341221 1414668 1481771 1438028 1396180 1388220 1375064 1361488 1403934
15822 1403934 1392094 1368433 1380489 1409430 1398942 1394610 1470795 1420946 1421204 1378764 1382380 1382712
15810 1382712 1394491 1376572 1344305 1359760 1291809 1372489 1378584 1385380 1417426 1447625 1474527 1491703
15798 1491703 1425156 1378615 1397290 1444364 1433760 1377554 1403208 1378779 1381242 1452597 1483027
15787 1483027 1541087 1531844 1529233 1415149 1414855 1537309 1515210 1519622 1423937 1430747 1431198 1419061
15775 1419061 1395525 1385478 1472443 1510840 1471291 1416629 1431980 1432564 1384670 1365310 1447381 1435814
15763 1435814 1467398 1454686 1430616 1381817 1411454 1427714 1482191 1504917 1484992 1442207 1377830
15752 1377830 1428681 1427053 1389959 1416415 1489733 1379769 1368534 1350852 1440833 1398492 1318230
15741 1318230 1339344 1387659 1450747 1485624 1424095 1368581 1404512 1385737 1387018 1385009 1349146 1360202
15729 1360202 1321900 1346711 1335535 1375309 1381159 1430434 1425021 1395168 1365764 1379527 1402717 1353094
15717 1353094 1437432 1435724 1442919 1394906 1401918 1438872 1446786 1464458 1517819 1445266 1388399 1368311
15705 1368311 1375399 1298748 1406097 1470260 1423505 1401609 1389507 1336007 1374910 1422632 1372443
15694 1372443 1450119 1457076 1353078 1361014 1371491 1392978 1437207 1465291 1469512 1480841 1500151 1450616
15682 1450616 1380936 1440064 1523766 1460049 1393532 1374093 1439293 1487693 1518348 1442638 1452059
15671 1452059 1443513 1482252 1474550 1465824 1461220 1424427 1444353 1447223 1446225 1437077 1425148 1364748 1346423
15658 1346423 1313370 1430216 1430359 1385995 1417610 1466740 1451397 1404176 1393251 1457446 1373849
15647 1373849 1397398 1391669 1471269 1440385 1494668 1478624 1426469 1484550 1529284 1533855 1438529 1453534
15635 1453534 1481148 1478655 1438961 1455153 1403000 1381182 1386161 1444659 1448904 1449143 1450602 1484034
15623 1484034 1450340 1414732 1412748 1484929 1515954 1543001 1461570 1454899 1451117 1523196 1526729 1464135
15611 1464135 1392562 1463559 1518521 1473571 1459412 1469199 1480916 1502789 1457403 1476366 1455438
15600 1455438 1432259 1469077 1455350 1484662 1519876 1460025 1433832 1456351 1482640 1451411 1468571
15589 1468571 1547988 1504342 1448098 1488757 1422045 1439927 1492962 1537944 1473139 1468608 1493390
15578 1493390 1460409 1449581 1384250 1393689 1325488 1395201 1449748 1452736 1471317 1471417 1431387 1461549
15566 1461549 1466416 1473845 1457203 1471645 1455326 1400661 1373242 1375619 1386424 1471517 1544642 1532356
15554 1532356 1505534 1514899 1442667 1364438 1410016 1440507 1431656 1455310 1460728 1504276 1503246 1490720
15542 1490720 1509232 1562254 1472137 1417339 1432349 1447145 1453482 1396100 1335982 1298323 1385034
15531 1385034 1428641 1457852 1489273 1477804 1488378 1509083 1496319 1508652 1487580 1506019 1547920
15520 1547920 1450956 1418965 1444280 1486769 1513218 1541339 1538264 1547795 1512096 1419094 1443324 1538745
15508 1538745 1445395 1444685 1450773 1426578 1389060 1381763 1471222 1473938 1438493 1409540 1451961 1489931
15496 1489931 1470963 1482553 1505943 1530854 1480732 1448333 1453195 1443798 1482637 1441752 1493560 1490743
15484 1490743 1461413 1464617 1411747 1398921 1401771 1393208 1398356 1377980 1408880 1423637 1496814 1494305
15472 1494305 1512961 1501965 1492408 1434557 1432449 1458004 1433603 1403299 1403818 1395479 1453782 1421841
15460 1421841 1436008 1476265 1487383 1521037 1490373 1459582 1451353 1479672 1464904 1467563 1504754 1507212
15448 1507212 1504680 1484023 1508106 1543113 1490213 1466809 1520259 1563730 1487899 1478972 1462455 1502314
15436 1502314 1490163 1509459 1540972 1553600 1563021 1534891 1533544 1516932 1478453 1524749 1433880 1454914
15424 1454914 1455705 1430855 1471624 1465287 1506770 1561237 1578239 1596583 1513162 1405866 1456154 1507473
15412 1507473 1498757 1499411 1492582 1485046 1530122 1540708 1538705 1487361 1425589 1441504 1499670 1595197
15400 1595197 1564137 1512974 1529117 1536322 1481351 1431138 1481716 1516670 1551650 1580400 1540755
15389 1540755 1511461 1550823 1591278 1532648 1463595 1527086 1583378 1566549 1573039 1547315 1479462
15378 1479462 1516201 1496810 1518670 1535203 1564737 1511282 1522133 1559515 1515092 1519835 1531372
15367 1531372 1572900 1517959 1505455 1536201 1467367 1473096 1485284 1501116 1565267 1554392 1514753
15356 1514753 1484010 1508229 1496999 1511356 1573720 1568019 1516757 1438472 1458601 1424949 1477742
15345 1477742 1532413 1494359 1494282 1468819 1480063 1495209 1518914 1500618 1425778 1472162 1554004 1528058
15333 1528058 1472781 1502418 1570739 1583266 1500945 1509712 1548006 1532498 1473916 1509752 1574487
15322 1574487 1529738 1535728 1507209 1496228 1469887 1567257 1532216 1540563 1538256 1480395 1403003 1454221
15310 1454221 1559509 1535025 1506432 1534869 1535193 1426200 1464838 1487472 1505777 1481276 1430840
15299 1430840 1373023 1470781 1431969 1420479 1459843 1512150 1619460 1620620 1489461 1514726 1524382
15288 1524382 1458112 1422855 1431712 1429548 1506176 1559977 1561209 1511598 1465081 1524179 1436814 1469250
15276 1469250 1468135 1445868 1458376 1584176 1571746 1536673 1525769 1473244 1503426 1557045 1595807
15265 1595807 1583582 1519639 1496221 1489614 1532314 1479710 1512702 1476125 1437035 1429761 1488456 1533466
15253 1533466 1550392 1550732 1595210 1594315 1584154 1584525 1483893 1447965 1521457 1555314 1626875 1613733
15241 1613733 1566857 1652859 1668738 1594349 1530788 1570829 1555232 1550334 1564490 1572519 1572981 1576845
15229 1576845 1565582 1590605 1562811 1514955 1500672 1605583 1558895 1542317 1584870 1585521 1557058
15218 1557058 1505775 1510458 1576351 1552563 1527003 1531730 1496068 1435835 1522520 1606528 1616039 1554883
15206 1554883 1558842 1573783 1567587 1552116 1510404 1487015 1482406 1537993 1503086 1512267 1496358 1520398
15194 1520398 1519862 1495011 1476093 1498828 1492004 1454728 1523597 1577756 1529047 1505065 1519636 1580750
15182 1580750 1649989 1584023 1627165 1605745 1538810 1592054 1678070 1585558 1528779 1543309 1577778
15171 1577778 1632055 1506442 1554888 1606486 1621283 1631598 1594931 1601042 1584413 1591444 1561069
15160 1561069 1534884 1572365 1596730 1614065 1528531 1512759 1491538 1518659 1511580 1507601 1541232 1546298
15148 1546298 1538111 1557869 1585322 1554456 1556124 1612070 1611926 1523132 1521216 1565464 1558706 1545758
15136 1545758 1594275 1559399 1500330 1575165 1567230 1546667 1559889 1563245 1610655 1582387 1614687 1594667
15124 1594667 1545107 1564803 1616488 1604639 1587361 1601347 1608434 1600590 1555081 1518953 1504300 1575175
15112 1575175 1606902 1628963 1559501 1607758 1593733 1561140 1577857 1571570 1576220 1599586 1564373 1564538
15100 1564538 1523013 1481355 1547623 1529264 1564993 1529742 1515300 1522395 1504648 1497504 1561568 1627936
15088 1627936 1655207 1536910 1543182 1592876 1490619 1443345 1554606 1545091 1573637 1556309 1574414
15077 1574414 1576259 1582165 1573365 1607916 1613523 1566121 1550140 1582210 1612500 1502961 1533790 1563955
15065 1563955 1586719 1575737 1564340 1605693 1622776 1601674 1653737 1592886 1560333 1524632 1556347
15054 1556347 1664974 1644487 1617260 1628695 1629127 1626274 1573586 1588573 1606515 1610216 1621152 1584981
15042 1584981 1569800 1557477 1573123 1536617 1530307 1520998 1574598 1600039 1541881 1470432 1535813 1572394
15030 1572394 1627843 1657467 1645377 1584653 1552084 1615721 1618844 1564823 1567316 1640116 1544028 1534269
15018 1534269 1576188 1615738 1615477 1606277 1572444 1523468 1565042 1659200 1661325 1597222 1526540 1505971
15006 1505971 1576868 1580974 1612986 1580435 1623438 1631782 1520908 1553935 1608183 1629368 1611290
14995 1611290 1513114 1519765 1594459 1607917 1590684 1521718 1569841 1552862 1561516 1573906 1533757 1616213
14983 1616213 1667533 1646616 1623613 1552829 1583857 1601980 1655656 1596971 1583945 1640686 1628044
14972 1628044 1651481 1595647 1631634 1618401 1609051 1611740 1556392 1594702 1644691 1622114 1645591 1624195
14960 1624195 1628189 1641649 1616768 1691007 1667615 1637614 1619309 1640632 1556215 1555941 1575101 1584527
14948 1584527 1631989 1654327 1654072 1665213 1650110 1649593 1671719 1664949 1609762 1571770 1530913 1585278
14936 1585278 1606405 1559734 1554657 1609300 1655339 1642762 1650876 1651625 1622265 1622711 1623786 1639663 1634922
14923 1634922 1628514 1665824 1646943 1651966 1638062 1686654 1629916 1601575 1614920 1652999 1628121 1653168
14911 1653168 1672058 1670807 1660834 1649619 1675838 1635599 1554442 1583568 1600215 1619951 1643470 1638213
14899 1638213 1605148 1630879 1648406 1606646 1601363 1633711 1682517 1673086 1622639 1662671 1674027 1694546
14887 1694546 1634706 1598754 1591383 1589893 1595395 1656115 1644207 1626853 1733972 1747498 1665315 1659091
14875 1659091 1612319 1636658 1689080 1644642 1614903 1666538 1686637 1639803 1632662 1647219 1575520
14864 1575520 1616014 1603259 1495000 1522286 1615898 1588844 1550680 1632800 1607756 1668510 1723674
14853 1723674 1692585 1631655 1648031 1660550 1645115 1569708 1575598 1631623 1589928 1605881 1653868
14842 1653868 1656450 1597776 1626078 1652685 1648994 1670145 1669396 1659226 1679173 1710864 1640013 1604404
14830 1604404 1673596 1655458 1559250 1527238 1524797 1583665 1641907 1687122 1670722 1637029 1651664
14819 1651664 1640203 1609575 1628987 1671665 1666304 1557384 1599464 1611223 1641590 1657963 1626636
14808 1626636 1527012 1550285 1539956 1563028 1609603 1643487 1613824 1669524 1682790 1645496 1724582
14797 1724582 1700410 1646934 1609536 1623491 1664742 1639942 1600788 1643811 1706739 1710602 1657141
14786 1657141 1606265 1560225 1649521 1697901 1712172 1627131 1581487 1621381 1663489 1683377 1739716
14775 1739716 1668298 1575705 1649633 1648782 1654692 1687004 1651528 1639156 1663215 1663529 1709045 1671964
14763 1671964 1626135 1597413 1714105 1690853 1591172 1600557 1605246 1548643 1530285 1570441 1623743
14752 1623743 1670364 1649817 1643231 1643949 1639993 1615105 1630352 1597715 1634778 1676152 1646899 1623256
14740 1623256 1642830 1656773 1595209 1611405 1692303 1698975 1721877 1708765 1627964 1678593 1685657 1690265
14728 1690265 1666336 1590854 1622706 1638759 1708619 1708638 1698518 1699219 1734043 1765765 1713163 1684133
14716 1684133 1751086 1774810 1663651 1610143 1634377 1564104 1629030 1656674 1648301 1653697 1683156
14705 1683156 1680923 1636703 1607719 1651530 1685142 1678681 1622750 1648533 1686538 1673866 1720711 1716611
14693 1716611 1690639 1727422 1757262 1710279 1639096 1627221 1652688 1605840 1625492 1647926 1666526
14682 1666526 1713168 1747695 1665291 1650614 1715683 1647623 1615182 1646363 1672892 1665936 1677021
14671 1677021 1632033 1659110 1710409 1645459 1609750 1637038 1616516 1673141 1695139 1719452 1680973
14660 1680973 1618834 1611381 1648630 1647238 1666988 1619375 1579222 1674147 1684518 1639087 1600271 1654501
14648 1654501 1672497 1661329 1640463 1673488 1720676 1703796 1712440 1724792 1684585 1687336 1650996 1655978
14636 1655978 1689845 1642745 1640821 1664991 1693175 1694048 1639197 1653053 1684403 1709592 1623880 1635421
14624 1635421 1730701 1711165 1656190 1621035 1641881 1714666 1736443 1762723 1749277 1763842 1749382
14613 1749382 1725578 1680927 1702635 1713407 1691060 1696316 1689347 1695716 1660860 1662791 1596267 1641683
14601 1641683 1716731 1692067 1675301 1651752 1626669 1625547 1682796 1688499 1676948 1656346 1680478 1648912
14589 1648912 1677202 1708737 1711784 1658520 1731329 1786440 1751258 1709988 1698452 1740380 1787032
14578 1787032 1748314 1720348 1702024 1731740 1654699 1615896 1714484 1698650 1655720 1693876 1654561
14567 1654561 1660324 1723845 1731696 1725116 1785439 1790266 1789828 1770086 1740622 1687140 1625287 1699471
14555 1699471 1701492 1708996 1694892 1729004 1700664 1676024 1740096 1745878 1704757 1758033 1745720 1764830
14543 1764830 1740904 1739827 1698755 1722499 1685136 1713304 1755626 1782635 1736070 1774485 1699372
14532 1699372 1673796 1731938 1692556 1700568 1737463 1692400 1698176 1767926 1764208 1757046 1740152 1724053
14520 1724053 1694606 1659729 1691205 1788688 1761233 1754863 1745352 1620210 1626163 1689019 1701733 1690567
14508 1690567 1633834 1646828 1671763 1642506 1681000 1736533 1673312 1693012 1757115 1769747 1689387
14497 1689387 1673220 1711946 1650355 1700164 1753517 1738843 1673238 1700767 1710711 1693455 1658664
14486 1658664 1655757 1789004 1778309 1700692 1744307 1777491 1752422 1817982 1787301 1837292 1750959
14475 1750959 1711611 1681688 1706582 1797106 1735368 1661015 1772510 1736922 1647912 1653057 1703215
14464 1703215 1804633 1712507 1715055 1723123 1679716 1667697 1727257 1712771 1701327 1673528 1659559
14453 1659559 1679339 1681354 1719890 1696503 1648527 1665415 1699381 1811322 1807567 1679064 1713587
14442 1713587 1633582 1646057 1670754 1635563 1681500 1729640 1742926 1775466 1773387 1729069 1735849 1708461
14430 1708461 1732102 1745316 1702743 1811652 1877447 1804771 1691264 1694602 1737469 1688792 1702835
14419 1702835 1716690 1771177 1765058 1721049 1715134 1686096 1758716 1803791 1784733 1746376 1734915 1736162
14407 1736162 1727765 1709206 1594871 1678379 1767110 1787650 1778060 1804199 1772239 1764471 1770106 1831243
14395 1831243 1786151 1725249 1655013 1639048 1716065 1773456 1769905 1739459 1813640 1705139 1727476
14384 1727476 1747748 1749160 1781428 1726825 1669072 1698879 1674244 1696856 1706315 1719179 1752394 1798628
14372 1798628 1832777 1789707 1804449 1753249 1754949 1749303 1702688 1697885 1776977 1765439 1707838 1716516
14360 1716516 1759292 1736478 1702045 1747547 1746208 1785219 1730081 1819270 1886375 1767111 1733707
14349 1733707 1765055 1754927 1760051 1827780 1906926 1842928 1753676 1728030 1734837 1755798 1781690 1742950
14337 1742950 1783684 1754720 1722411 1772589 1784615 1831035 1779646 1761355 1760652 1762346 1781217 1839316
14325 1839316 1812324 1752974 1739617 1805325 1774573 1792398 1772172 1688834 1713981 1661486 1742297
14314 1742297 1754850 1803333 1818281 1780209 1801600 1745809 1696018 1759636 1719479 1647752 1706524
14303 1706524 1757016 1761686 1735369 1705999 1689052 1701693 1757686 1790874 1772410 1787247 1824938
14292 1824938 1838476 1774238 1811658 1782355 1754163 1737142 1751926 1749895 1732738 1686673 1711504
14281 1711504 1767963 1795795 1763885 1732517 1711695 1725156 1710646 1749352 1730804 1767932 1798471
14270 1798471 1729511 1719117 1750423 1688932 1755626 1756214 1744148 1799579 1784065 1787562 1776145 1786697
14258 1786697 1841241 1836015 1779785 1732445 1712711 1715163 1750000 1834788 1848999 1841103 1770680 1747339
14246 1747339 1820504 1876207 1798165 1795178 1791932 1787978 1729831 1776766 1744162 1785992 1810639 1809604
14234 1809604 1752738 1783577 1756693 1714857 1806245 1779739 1777154 1831040 1808371 1795063 1808217
14223 1808217 1804948 1753065 1770435 1726413 1706814 1710881 1706994 1750315 1748109 1779800 1822692 1831384
14211 1831384 1772486 1772291 1767623 1787173 1782091 1736900 1812518 1803262 1737396 1751100 1813057 1749270
14199 1749270 1689027 1757298 1713147 1805820 1855519 1803715 1746564 1750907 1850139 1844301 1858292 1850392
14187 1850392 1841539 1789013 1737768 1784507 1784241 1822705 1852174 1846550 1880646 1897318 1891169 1809126
14175 1809126 1724846 1720992 1820099 1921904 1847522 1889433 1905930 1832706 1815098 1901902 1887448
14164 1887448 1842860 1831434 1866780 1840087 1847439 1817186 1722500 1693554 1722629 1798109 1778661
14153 1778661 1732875 1812220 1812975 1789614 1804634 1793839 1806863 1789959 1777800 1853153 1845538 1868535
14141 1868535 1896025 1871529 1825743 1885014 1831682 1763520 1802185 1838976 1868732 1740854 1730090
14130 1730090 1685432 1759783 1801157 1822243 1839864 1897875 1859542 1857017 1878953 1814034 1746026
14119 1746026 1798396 1886912 1871853 1813767 1792799 1838396 1824752 1792617 1801018 1794282 1766150 1833685
14107 1833685 1853654 1929251 1878645 1828763 1943638 1868729 1861426 1874875 1794273 1839423 1840677
14096 1840677 1803876 1795422 1813743 1811281 1785990 1813828 1813832 1811914 1901829 1886630 1818617 1911859 1845434
14083 1845434 1819069 1817395 1837604 1850086 1786233 1800002 1778527 1764192 1847495 1796782 1800592 1854000
14071 1854000 1839767 1848619 1805288 1837995 1769592 1772677 1832117 1860368 1853773 1918659 1838283 1810903
14059 1810903 1862239 1804899 1782706 1789061 1791427 1786933 1821135 1827560 1861007 1848651 1797786 1800212
14047 1800212 1805138 1751627 1796306 1796095 1732546 1799607 1814418 1761890 1771878 1772527 1728665 1754958
14035 1754958 1770699 1810760 1868401 1888890 1876995 1839927 1822970 1816008 1835397 1872021 1808045
14024 1808045 1769359 1847063 1947441 1880744 1838204 1922804 1883254 1833810 1856898 1825914 1810015
14013 1810015 1817574 1677439 1739181 1845675 1912441 1903285 1884077 1892044 1900048 1919031 1897338 1879676
14001 1879676 1851512 1804660 1707897 1742644 1777135 1820665 1824142 1885100 1839737 1799023 1888450
13990 1888450 1843571 1808953 1804742 1845857 1882215 1798479 1779601 1885398 1904597 1857485 1803817
13979 1803817 1864331 1880393 1930521 1896858 1862225 1832081 1822745 1788899 1800185 1842441 1780106
13968 1780106 1796291 1842627 1837661 1882219 1916066 1890568 1939392 1902972 1865327 1885180 1860226
13957 1860226 1819761 1855015 1818907 1766067 1783249 1779575 1813202 1803476 1835652 1878466 1920475 1842057
13945 1842057 1751523 1842639 1857435 1817667 1819888 1902687 1839018 1836432 1873894 1921722 1935076 1874041
13933 1874041 1872312 1831658 1794745 1859201 1863099 1860724 1847030 1888862 1906540 1896422 1894135 1876201
13921 1876201 1860528 1867822 1923697 1904835 1854063 1834455 1932654 1948921 1874319 1890427 1856990
13910 1856990 1826506 1906201 1931338 1893269 1891250 1875480 1859014 1838053 1791204 1876080 1865706
13899 1865706 1888248 1880085 1845954 1904567 1968502 1939269 1878753 1854953 1815835 1854320 1810916
13888 1810916 1881393 1839994 1848587 1908142 1879949 1878784 1841063 1901847 1899111 1895330 1936455 1972595
13876 1972595 1960910 1919993 1877595 1898021 1941941 1894448 1805239 1834386 1862106 1872651 1860392
13865 1860392 1903034 1958876 1968276 2003871 1898522 1873425 1873343 1840715 1880650 1903058 1871921 1818199
13853 1818199 1847697 1837847 1822272 1825881 1824800 1899865 1941253 1942226 1881378 1856706 1862665 1847105
13841 1847105 1825998 1864536 1847860 1854735 1866554 1820685 1869940 1915428 1857401 1833845 1803308
13830 1803308 1907744 1934679 1905430 1928913 1937323 1995272 1996008 1933558 1883057 1950064 1925247 1919896
13818 1919896 1923276 1967809 1921343 1876276 1936760 1936079 1936462 1902395 1854345 1865116 1870734 1959941
13806 1959941 1939311 1894950 1881670 1971142 1960128 1872007 1854845 1842473 1836835 1794618 1852848
13795 1852848 1897679 1875764 1893717 1930768 1855039 1878276 1903513 1926110 1958282 1933188 1958400
13784 1958400 1980768 1956105 1883604 1894108 1930943 1970679 1913010 1872245 1936542 1995460 1964850
13773 1964850 1942613 1978605 1968976 2013600 1971716 1941085 1891694 1896449 1915684 1893723 1933145 1969376
13761 1969376 1998883 1889238 1929505 1956958 1844165 1914297 1997503 1926718 1872034 1915005 1912997
13750 1912997 1870419 1821444 1867886 1859370 1879998 1939978 1925819 1949985 1922877 1935029 1878604
13739 1878604 1922612 1910746 1866797 1836550 1889867 1859976 1849785 1887187 1869342 1885401 1895811
13728 1895811 1931942 2012833 1930478 1883056 1922181 1863925 1967544 1948704 1901962 1900367 1885341
13717 1885341 1807903 1833791 1908447 1944695 1910536 1944523 1922475 1977125 1980811 1923243 1910915
13706 1910915 1954250 1934469 1857423 1858500 1902547 1991886 1977346 2046746 2055474 1955914 1906219 1905568
13694 1905568 1996286 1949007 1976913 1970324 1899564 1895596 1941114 1908737 1952320 1924293 1929414 2031496
13682 2031496 2002727 2026721 1988633 1913401 1932454 1931392 1942077 1885938 1864464 1885217 1873789
13671 1873789 1903805 1993022 2061781 1995035 2036746 1991377 1907832 1910179 1929919 2004596 1939402
13660 1939402 1945915 1926060 1902798 1941731 1951177 1956916 1923766 1907072 1929236 1942335 1931289 1904361
13648 1904361 1902012 1863393 1797179 1882723 1925284 1912982 1908247 1946858 1907002 1921549 1964441 1908535
13636 1908535 1881462 1878254 1863025 1952141 1925707 1972824 2045415 2034936 1999301 2056084 1951523
13625 1951523 1946427 1944797 1920929 1948022 2031725 2024997 1995314 1989442 2014539 2039951 2024264 2005710
13613 2005710 2007888 1989225 1970923 1941430 1941789 1903494 1826989 1882526 1970977 2010935 1978439 1997421
13601 1997421 1969469 1957894 1917867 1917698 1905692 1835658 1906855 1960305 1967038 1929224 1947432 2005632
13589 2005632 2023861 1995177 1969860 2011606 2003678 2011299 2022228 2019713 1995025 2019740 1984565 1958895
13577 1958895 1963971 1980531 1938882 1913484 1867037 1935989 1979037 1966831 1954258 1976042 1967272 2028294
13565 2028294 2031268 1956145 2053934 2034355 2016039 1982193 1946659 1986185 1897701 1897956 1880583 1921879
13553 1921879 2029783 2039919 1993817 1995490 2005180 2020780 2041844 2073731 1990267 2002839 1993632 2011243
13541 2011243 2019609 1982105 1975681 1939939 1981977 1974257 1926740 1962055 1995565 2029652 2091947 2077112
13529 2077112 2074365 1952972 1845600 1911073 2036011 2052263 2004019 1956048 1885013 1949711 1910620
13518 1910620 1922733 1954785 1895283 1948400 1956729 1918865 1914337 1936319 1925395 1964901 1945493 1979675
13506 1979675 1944703 1897282 1960976 2006775 1939142 1913705 1916990 1931435 1951244 1960350 1925262 1984862
13494 1984862 1964359 1999017 2028834 1988971 1978741 1934158 1903395 1853390 1897299 1941746 1991177
13483 1991177 2000754 1993706 1951636 1898211 1962602 1984210 1983097 1942815 1901538 1969492 1971994 1998939
13471 1998939 2015770 1985386 2011972 2039894 2025319 1967538 1971776 2062523 2007029 1920932 1930614 1910851
13459 1910851 1923084 1971112 1956103 1939946 1957491 2023076 2041591 1921282 1939993 1983449 1958224
13448 1958224 1925587 1960433 2041188 2033089 1979059 1971185 1989880 1976864 1953267 1942685 1995487 2012538
13436 2012538 1953506 1978425 2040913 1976516 1968688 2037587 2024045 1963714 1995577 2000694 1991797 1946556
13424 1946556 1954779 2043673 2026867 1976694 1968872 1937723 1994101 1958517 1997318 2035751 2008488 2084824
13412 2084824 2062499 2029717 2038294 1996335 2000233 1948810 1998287 2014221 1974812 2047586 2051079 2003624
13400 2003624 1961650 1970005 2036630 2037166 1978571 1997619 1984706 1963662 1993987 1977511 1967256 2038870
13388 2038870 2052304 2007459 1980004 2047974 2049313 2004419 2029076 2041037 1935399 1915751 2010221
13377 2010221 2130941 2043050 1983098 1951917 1968801 1960437 1923258 2003073 2064359 2043899 1955460
13366 1955460 1987595 2033401 2037755 1990752 2044726 2076877 2066332 2005814 2005187 1998794 2011545 2047416
13354 2047416 2032921 2110094 2128791 2073877 2015754 2019859 2097441 2058340 2022098 2096442 2018643
13343 2018643 2104062 2135137 2133997 2054011 1987302 1967161 1905867 1966304 1992318 2005243 2061956
13332 2061956 2116364 2093984 2026669 2063051 2020103 2024494 2067569 2033339 2041182 2059215 2029088 2006672
13320 2006672 2011298 2022384 1996081 1948862 1935607 1931101 1997304 2060830 2083265 2082593 2090634 2048115
13308 2048115 2010985 2067698 2074616 2075110 2103102 2070938 2054021 2126576 2140449 1999856 1950887 2041159
13296 2041159 2035183 1981196 2028493 2059781 2081386 2064160 2075478 2078782 2089634 2062947 2034331 2012313
13284 2012313 2055131 2064488 2049699 2109200 2168672 2118869 2064707 1999384 2072395 2035446 2015501
13273 2015501 2047715 2022053 2041714 2078945 2054463 2051990 2095067 2017150 2032348 2056273 2013352
13262 2013352 2022571 1987580 2041383 2076583 2047450 2045065 2038351 1995562 2079089 2088857 2020465 1948411
13250 1948411 1971122 1999980 2061618 2083252 2068450 2073641 2099769 2114878 2156463 2104490 2061383
13239 2061383 2008440 2038526 2060404 2014153 2033877 1969821 1980097 2006856 2071499 2047577 2027188
13228 2027188 1972302 2080962 2073110 2090049 2092296 2078751 2053918 2028674 1979384 2014870 2065848
13217 2065848 2091229 2108120 2081434 2120123 2152894 2105815 2060826 2003374 2077313 2119186 2089169
13206 2089169 2075811 2059819 1986511 2025803 2003519 2012403 2086730 2141895 2116081 2056178 2097628
13195 2097628 2075099 2128532 2116419 2072181 2067673 2004832 2065021 2067651 2023588 2001537 2010927 2062277
13183 2062277 2109515 2088221 2031119 2039609 2003971 2065424 2152151 2161385 2079601 2051557 2083236 2138996
13171 2138996 2105630 2044803 2064047 2055617 2079792 2031320 1981198 2016197 2067084 2035911 2002412
13160 2002412 2049754 2041167 2100296 2113757 2091423 2080807 2070800 1976115 1971092 1967656 1997051 2014969
13148 2014969 2041568 2111356 2124473 2088910 2026589 2084442 2100171 2141107 2144281 2094034 2089754 2066881
13136 2066881 2029435 2085737 2075089 2060352 2117517 2148740 2112855 2139862 2114304 2093426 2111928
13125 2111928 2101520 2137610 2188273 2108230 2110096 2188893 2152472 2132279 2068605 2020293 2050091
13114 2050091 2104855 2090005 1995604 1997816 2053536 2052981 2100386 2032513 2116038 2067109 2077698 2090680
13102 2090680 2105915 2158363 2173953 2135660 2117547 2020716 2000073 2085835 2122759 2004747 2057159
13091 2057159 2131380 2105004 2137031 2129837 2141069 2064331 2069098 2043469 2036527 2047587 2133570 2055205
13079 2055205 2041469 2027938 2061584 2109168 2125976 2132595 2130415 2138326 2089144 2096023 2076100 1984538
13067 1984538 1987648 2038589 2021652 2063734 2072356 2103126 2113661 2130882 2080085 2094130 2142897 2070438
13055 2070438 2089939 2109869 2101573 2086924 2099320 2076176 2146850 2135837 2107530 2079082 2066581
13044 2066581 2093271 2043069 2093776 2136528 2161788 2160736 2136312 2118952 2058495 2011466 2013798 2147587
13032 2147587 2146566 2082822 2106585 2086375 2051089 2040342 2067473 2084193 2099525 2129752 2103104
13021 2103104 2043725 2098945 2083308 2102387 2137588 2140218 2148993 2161426 2214049 2222116 2139465 2109346
13009 2109346 2094401 2057110 2031496 2096586 2134079 2073375 2068667 2134343 2077129 2050227 2073470
12998 2073470 2066005 2057406 2065717 2136066 2198124 2201737 2175311 2155003 2117503 2111950 2147575 2126323
12986 2126323 2066386 2156735 2211590 2117870 2150095 2161520 2132579 2168005 2157717 2172905 2138072
12975 2138072 2140217 2159965 2141733 2108627 2142963 2173809 2184199 2129335 2161010 2110795 2120840
12964 2120840 2098193 2019187 2045332 2099648 2162090 2210800 2157378 2153854 2151614 2120696 2111840 2140400
12952 2140400 2154471 2125236 2151871 2115177 2193631 2197741 2162136 2157697 2188613 2196173 2122719 2107390
12940 2107390 2124516 2136023 2079492 2055380 2055434 2060625 2045220 2068265 2125909 2102851 2037732 2104637
12928 2104637 2110965 2105342 2139828 2107667 2118852 2146098 2104466 2145503 2178080 2162128 2152825 2148948
12916 2148948 2138833 2066050 2080791 2124270 2118168 2108691 2075585 2114895 2164559 2176244 2198631 2159923
12904 2159923 2127095 2090441 2187703 2147107 2167355 2142353 2094485 2117037 2145880 2164393 2180233
12893 2180233 2142295 2119274 2157569 2151739 2161710 2161402 2157145 2255778 2232945 2173568 2140343 2172152
$$ [...]
##END NTUPLES=NMR SPECTRUM
##END=
