##TITLE=1H_CG-1142-1
 CDCl3,8 sc, 
 10.03.2021
##JCAMPDX= 6.0         $$ Bruker NMR JCAMP-DX V2.0
##DATA TYPE= NMR SPECTRUM
##DATA CLASS= NTUPLES
##ORIGIN= UXNMR, Bruker Analytische Messtechnik GmbH
##OWNER= root
$$ XWIN-NMR		Version 3.5
$$ Wed Mar 10 10:30:37 2021 Russian Standard Time (UT+4h)  she@DPX200
##.OBSERVE FREQUENCY= 200.131506
##.OBSERVE NUCLEUS= ^1H
##.ACQUISITION MODE= SIMULTANEOUS
##.ACQUISITION SCHEME= undefined
##.AVERAGES= 8
##.DIGITISER RES= 18
##SPECTROMETER/DATA SYSTEM= spect
##.PULSE SEQUENCE= zg30
##.SOLVENT NAME= CDCl3
##.SHIFT REFERENCE= (INTERNAL, CDCl3, 0, 15.9792)
##AUDIT TRAIL= $$ (NUMBER, WHEN, WHO, WHERE, WHAT)
$$ ##TITLE= Audit trail, XWIN-NMR		Version 3.5
$$ ##JCAMPDX= 5.01
$$ ##ORIGIN= Bruker BioSpin GmbH
$$ ##OWNER= she
$$ F:/spectra/data/she/nmr/H-F/1/pdata/1/auditp.txt
$$ ##AUDIT TRAIL=  $$ (NUMBER, WHEN, WHO, WHERE, WHAT)
(   1,<2021-03-10 10:29:32.14 +0400>,<she>,<DPX200>,
      <created by zg, POWCHK disabled, PULCHK disabled
       configuration hash MD5:
       00 E9 B6 7A A2 85 ED C7 34 08 36 98 17 FE 4E 26
       data hash MD5: 16K
       92 DC 7F A3 3E B9 D1 BE 44 62 81 C2 87 70 49 CD>)
(   2,<2021-03-10 10:29:34.42 +0400>,<she>,<DPX200>,
      <Start of raw data processing
       efp BC_mod = 2 LB = 0.24 FT_mod = 6 PKNL = 1 PHC0 = -11117.36 PHC1 = 9.40094 SI = 16K 
       data hash MD5: 16K
       F7 31 8B F8 E4 0B DA 7E 17 93 E1 28 77 88 21 C0>)
(   3,<2021-03-10 10:29:53.68 +0400>,<she>,<DPX200>,
      <pk PHC0 = -3.729722 PHC1 = 5.6 
       data hash MD5: 16K
       00 CD 95 62 32 51 CA 9D 61 8E EC 70 84 18 A3 1D>)
(   4,<2021-03-10 10:29:56.70 +0400>,<she>,<DPX200>,
      <abs ABSG = 5 
       data hash MD5: 16K
       E4 C4 B8 F4 77 98 63 CF 99 87 A4 39 1D 31 6F 52>)
$$ ##END=
$$ 
$$ hash MD5
$$ 8C CF 16 1B E9 68 01 2D E3 74 25 7B 41 19 0C 32
##$RELAX= 
##$RELAX= 
##$RELAX= 
##$RELAX= 
##$RELAX= 
##$RELAX= 
$$ Bruker specific parameters
$$ --------------------------
##$DU= <F:/spectra>
##$EXPNO= 1
##$NAME= <H-F>
##$PROCNO= 1
##$TYPE= <nmr>
##$USER= <she>
##$AMP= (0..31)
100 100 100 100 100 100 100 100 100 100 100 100 100 100 100 100 100 100 
100 100 100 100 100 100 100 100 100 100 100 100 100 100 
##$AQSEQ= 0
##$AQ_mod= 1
##$AUNM= <au_zg>
##$AUTOPOS= <>
##$BF1= 200.13
##$BF2= 200.13
##$BF3= 200.13
##$BF4= 200.13
##$BF5= 200.13
##$BF6= 200.13
##$BF7= 200.13
##$BF8= 200.13
##$BYTORDA= 1
##$CFDGTYP= 0
##$CFRGTYP= 5
##$CHEMSTR= <none>
##$CNST= (0..31)
1 1 145 1 1 1 1 1 1 1 1 1 1 1 1 1 1 1 1 1 1 1 1 1 1 1 1 1 1 1 1 1 
##$CPDPRG= <>
##$CPDPRG1= <>
##$CPDPRG2= <>
##$CPDPRG3= <>
##$CPDPRG4= <mlev>
##$CPDPRG5= <mlev>
##$CPDPRG6= <mlev>
##$CPDPRG7= <mlev>
##$CPDPRG8= <mlev>
##$CPDPRGB= <>
##$CPDPRGT= <>
##$D= (0..31)
0 1.2 0 0 0 0 0 0 0 0.06 0 0.03 0 0 0 0 0.0002 0 0 0 0 0 0 0 0 0 0 0 0 
0 0 0 
##$DATE= 1615357771
##$DBL= (0..7)
120 120 120 120 120 120 120 120 
##$DBP= (0..7)
150 150 150 150 150 150 150 150 
##$DBP07= 0
##$DBPNAM0= <>
##$DBPNAM1= <>
##$DBPNAM2= <>
##$DBPNAM3= <>
##$DBPNAM4= <>
$$ [...]
##$SUBNAM3= <"">
##$SUBNAM4= <"">
##$SUBNAM5= <"">
##$SUBNAM6= <"">
##$SUBNAM7= <"">
##$SUBNAM8= <"">
##$SUBNAM9= <"">
##$SW= 16.9725357007746
##$SWIBOX= (0..15)
0 0 2 0 0 0 0 0 0 0 0 0 0 0 0 0 
##$SW_h= 3396.73913043478
##$TD= 16384
##$TD0= 1
##$TE= 0
##$TE2= 300
##$TE3= 300
##$TEG= 300
##$TL= (0..7)
0 120 120 120 120 120 120 120 
##$TP= (0..7)
150 150 150 150 150 150 150 150 
##$TP07= 0
##$TPNAME0= <>
##$TPNAME1= <>
##$TPNAME2= <>
##$TPNAME3= <>
##$TPNAME4= <>
##$TPNAME5= <>
##$TPNAME6= <>
##$TPNAME7= <>
##$TPOAL= (0..7)
0.5 0.5 0.5 0.5 0.5 0.5 0.5 0.5 
##$TPOFFS= (0..7)
0 0 0 0 0 0 0 0 
##$TUNHIN= 0
##$TUNHOUT= 0
##$TUNXOUT= 0
##$USERA1= <user>
##$USERA2= <user>
##$USERA3= <user>
##$USERA4= <user>
##$USERA5= <user>
##$V9= 5
##$VALIST= <valist>
##$VCLIST= <CCCCCCCCCCCCCCC>
##$VD= 0
##$VDLIST= <DDDDDDDDDDDDDDD>
##$VPLIST= <PPPPPPPPPPPPPPP>
##$VTLIST= <TTTTTTTTTTTTTTT>
##$WBST= 1024
##$WBSW= 4
##$XGAIN= (0..3)
0 0 0 0 
##$XL= 0
##$YL= 0
##$YMAX_a= 224944
##$YMIN_a= -259826
##$ZGOPTNS= <>
##$ZL1= 120
##$ZL2= 120
##$ZL3= 120
##$ZL4= 120
##$ABSF1= 16.01857
##$ABSF2= -0.9540939
##$ABSG= 5
##$ABSL= 3
##$ALPHA= 0
##$AQORDER= 0
##$ASSFAC= 0
##$ASSFACI= 0
##$ASSFACX= 0
##$ASSWID= 0
##$AUNMP= <proc_1d>
##$AZFE= 0.1
##$AZFW= 0.1
##$BCFW= 0
##$BC_mod= 2
##$BYTORDP= 0
##$COROFFS= 0
##$CY= -3
##$DATMOD= 1
##$DC= 0
##$DFILT= <>
##$DTYPP= 0
##$F1P= 0
##$F2P= 0
##$FCOR= 1
##$FTSIZE= 16384
##$FT_mod= 6
##$GAMMA= 0
##$GB= 0
##$INTBC= 1
##$INTSCL= 2.992141e-10
##$ISEN= 128
##$LB= 0.24
##$LEV0= 0
##$LPBIN= 0
##$MAXI= 10000
##$MC2= 0
##$MEAN= 0
##$ME_mod= 0
##$MI= 1.114404
##$NCOEF= 0
##$NC_proc= -7
##$NLEV= 6
##$NOISF1= 3.799351
##$NOISF2= 2.8
##$NSP= 0
##$NTH_PI= 0
##$NZP= 0
##$OFFSET= 15.97921
##$PC= 1
##$PHC0= -11121.09
##$PHC1= 15.00094
##$PH_mod= 1
##$PKNL= yes
##$PPARMOD= 0
##$PSCAL= 0
##$PSIGN= 0
##$REVERSE= no
##$SF= 200.130006451014
##$SI= 16384
##$SIGF1= 3
##$SIGF2= 2
##$SINO= 5.538805
##$SIOLD= 16384
##$SREGLST= <1H.CDCl3>
##$SSB= 0
##$STSI= 16384
##$STSR= 0
##$SW_p= 3396.73913043479
##$SYMM= 0
##$S_DEV= 0
##$TDeff= 16384
##$TDoff= 0
##$TI= <>
##$TILT= no
##$TM1= 0
##$TM2= 0
##$TOPLEV= 0
##$USERP1= <user>
##$USERP2= <user>
##$USERP3= <user>
##$USERP4= <user>
##$USERP5= <user>
##$WDW= 1
##$XDIM= 16384
##$YMAX_p= 431824767
##$YMIN_p= -428207
$$ End of Bruker specific parameters
$$ ---------------------------------
##NTUPLES= NMR SPECTRUM
##VAR_NAME=  FREQUENCY,     SPECTRUM/REAL,   SPECTRUM/IMAG
##SYMBOL=    X,             R,               I
##VAR_TYPE=  INDEPENDENT,   DEPENDENT,       DEPENDENT
##VAR_FORM=  AFFN,          ASDF,            ASDF
##VAR_DIM=   16384,         16384,           16384
##UNITS=     HZ,            ARBITRARY UNITS, ARBITRARY UNITS
##FACTOR=    0.207333158178282, 1,           1
##FIRST=     3197.91938034956, 0,            0
##LAST=      -198.819750085227, 0,           0
##MIN=       -198.819750085227, -428207,     0
##MAX=       3197.91938034956, 431824767,    0
$$ Real data points
##PAGE= N=1
##DATA TABLE= (X++(R..R)), XYDATA
$$ [...]
$$ plain form
4429 10220450 9869655 9474520 9057618 8692227 8330000 8084766 7855245 7632796 7441106
4420 7441106 7289396 7033122 6946297 6913678 6759538 6543758 6450134 6239568 5893906 5827099
4410 5827099 5983591 5965078 5927041 5833233 5629500 5541811 5389493 5238433 5393698 5504766
4400 5504766 5407698 5420776 5449361 5200288 5137766 5030174 5051328 4902471 4813318 4770432 4490909
4389 4490909 4312325 4175552 4166513 4102335 4105003 4057498 4022517 4046469 4044213 4011687 3888233
4378 3888233 3852149 3721449 3801866 3626818 3493805 3703557 3717541 3561804 3487869 3647878
4368 3647878 3660898 3549353 3356357 3274461 3505477 3566754 3453904 3457281 3311074 3223419 3194841
4357 3194841 3273862 3288153 3145691 3165723 3328286 3311701 3441764 3259096 3260875 3264479 3236140
$$ packed form
4429A0220450l50795l95135m16902l65391l62227k45234k29521k22449j91690
4420G441106j51710k56274q6825l2619j54140k15780r3624k10566l45662o6807
4410E827099J56492j8513l8037r3808k03733q7689j52318j51060J55265J11068
4400E504766r7068J3078K8585k49073o2522j07592K1154j48857q9153m2886k79523
4389D490909j78584j36773r039o4178K668m7505l4981K3952k256l2526j23454
4378C888233l6084j30700Q0417j75048j33013K09752J3984j55737p3935J60009
4368C647878J3020j11545j92996q1896K31016O1277j12850L377j46207q7655k8578
4357C194841P9021J4291j42462K0032J62563j6585J30063j82668J779L604k8339
$$ plain form
4346 3236140 3199649 3310654 3332709 3376170 3265563 3073407 2950925 2866396 3022251 3055781
4336 3055781 2926679 2812195 2823299 2734245 2659262 2777675 2702483 2748268 2712599 2496706 2476643
4325 2476643 2370651 2382767 2493626 2313239 2373757 2525600 2488459 2548003 2440923 2412962
4315 2412962 2537793 2468564 2455830 2455114 2428104 2316264 2342128 2387514 2199274 2298328 2470333
4304 2470333 2625853 2529791 2355555 2446726 2643386 2633909 2726375 2687823 2590646 2773474 2653034
4293 2653034 2538238 2623020 2788446 2875970 2732653 2678045 2554451 2708583 2689805 2633777
4283 2633777 2677753 2701663 2916698 3047616 3004368 3093275 3029967 2885190 2888885 3297155 3553940
4272 3553940 3496661 3500633 3581181 3877373 3989236 4166407 4617859 4942132 5264017 5305556
$$ packed form
4346C236140l6491J11005K2055M3461j10607j92156j22482q4529J55855L3530
4336C055781j29102j14484J1104q9054p4983J18413p5192M5785l5669k15893k0063
4325B476643j05992J2116J10859j80387O0518J51843l7141N9544j07080k7961
4315B412962J24831o9229j2734p16k7010j11840K5864M5386j88240R9054J72005
4304B470333J55520r6062j74236R1171J96660r477R2466l8552r7177J82828j20440
4293B653034j14796Q4782J65426Q7524j43317n4608j23594J54132j8778n6028
4283B633777M3976K3910K15035J30918m3248Q8907o3308j44777L695M08270K56785
4272C553940n7279L972Q0548K96192J11863J77171M51452L24273L21885M1539
$$ plain form
4262 5305556 5145868 4970283 4722307 4581565 4485131 4207082 3986636 3492278 2949484 3049894
4252 3049894 2941768 2732841 2574107 2575717 2516835 2451788 2364744 2297390 2216727 2146640 2262261
4241 2262261 2517151 2361252 2297838 2211111 2130875 2159274 2115129 2132078 2168999 2246807 2112101
4230 2112101 1981773 1985256 2005554 1959668 1962755 2086739 2159407 2056083 2018378 2080736 1928004
4219 1928004 1822080 2054595 2188078 2036702 2022140 1928498 2107104 2069864 2107101 2104842 2068749
4208 2068749 2114348 2153528 2372521 2184534 2065058 2284152 2310541 2072664 2055846 1944540
4198 1944540 2020021 2046510 1902690 1925391 1956233 2087519 2262451 2289310 2295863 2242007 2279977
4187 2279977 2221297 2136562 2075789 1981761 1964928 2042970 2096280 2101057 2151873 2254799 2146238
$$ packed form
4262E305556j59688j75585k47976j40742r6434k78049k20446m94358n42794J00410
4252C049894j08126k08927j58734J610n8882o5047q7044o7354q0663p0087J15621
4241B262261K54890j55899o3414q6727q0236K8399m4145J6949L6921P7808j34706
4230B112101j30328L483K0298m5886L087J23984P2668j03324l7705O2358j52732
4219A928004j05924K32515J33483j51376j4562r3642J78606l7240L7237k259l6093
4208B068749M5599L9180K18993j87987j19476K19094K6389k37877j6818j11306
4198A944540P5481K6489j43820K2701L0842J31286J74932K6859O553n3856L7970
4187B279977n8680q4735o0773r4028j6833P8042N3310M777N0816J02926j08561
$$ plain form
4176 2146238 2168602 2063469 2158079 2125132 1933272 1917003 1924117 2071132 2074889 2204397 2189709
4165 2189709 2231054 2255851 2260026 2267135 2108654 2221660 2298934 2438165 2549207 2528134 2633879
4154 2633879 2534323 2614787 2618954 2540169 2539938 2601103 2617617 2718691 3058363 2813775 2819291 2842543
4142 2842543 2960864 2972447 2888063 2936608 3020383 3163054 3067712 3054299 3283187 3334013 3517818
4131 3517818 3514499 3452569 3454628 3392410 3319613 3042230 2904336 2880107 2860131 2910286 2721308
4120 2721308 2843261 2860278 2936595 3084915 2854545 2726734 2668165 2767064 2563174 2563960 2681310
4109 2681310 2796605 2641585 2491649 2682933 2689244 2781645 2768147 2625849 2610944 2656101 2802073
4098 2802073 2718911 2698525 2765659 2870866 2893795 2894305 2752406 2968374 2742949 2711537 2639604
$$ packed form
4176B146238K2364j05133R4610l2947j91860j6269P114J47015L757J29508j4688
4165B189709M1345K4797M175P109j58481J13006P7274J39231J11042k1073J05745
4154B633879r9556Q0464M167p8785k31O1165J6514J01074L39672k44588N516K3252
4142B842543J18321J1583q4384M8545Q3775J42671r5342j3413K28888N0826J83805
4131C517818l319o1930K059o2218p2797k77383j37894k4229j9976N0155j88978
4120B721308J21953J7017P6317J48320k30370j27811n8569R8899k03890P86J17350
4109B681310J15295j55020j49936J91284O311R2401j3498j42298j4905M5157J45972
4098B802073q3162k0386O7134J05207K2929N10j41899K15968k25425l1412p1933
$$ plain form
4087 2639604 2702709 2854253 2749231 2756610 2835280 2848523 2651466 2630003 2652298 2759664 2814937
4076 2814937 2730530 2678393 2731013 2676890 2790479 2893481 2894059 3072721 2895353 2818515 3140135
4065 3140135 3297491 3282514 3097160 3066231 2909292 3207769 3337819 3226384 3103405 2971120
4055 2971120 2737981 2899324 2859715 2896562 2867864 2625560 2644314 2727353 2935792 2845374 2870048
4044 2870048 2912987 3066425 3122735 3069185 3064756 3176937 3132636 3188128 3095930 3224136 3261337
4033 3261337 3449161 3393232 3399689 3472960 3399645 3384044 3240936 3389761 3320760 3216554 3301917
4022 3301917 3351327 3567275 3518838 3541948 3634779 3477421 3484526 3471463 3367922 3326073 3527305
4011 3527305 3594091 3534744 3518964 3590995 3438125 3452918 3547067 3428182 3554990 3560737 3456006
$$ packed form
4087B639604O3105J51544j05022P379P8670J3243j97057k1463K2295J07366N5273
4076B814937q4407n2137N2620n4123J13589J03002N78J78662j77368p6838L21620
4065C140135J57356j4977j85354l0929j56939K98477J30050j11435j22979j32285
4055B971120k33139J61343l9609L6847k8698k42304J8754Q3039K08439r0418K4674
4044B870048M2939J53438N6310n3550m429J12181m4301N5492r2198J28206L7201
4033C261337J87824n5929O457P3271p3315j5601j43108J48825o9001j04206Q5363
4022C301917M9410K15948m8437K3110R2831j57358P105j3063j03541m1849K01232
4011C527305O6786n9347j5780P2031j52870J4793R4149j18885J26808N747j04731
$$ plain form
4000 3456006 3506954 3293194 3183537 3153103 3261931 3406692 3409803 3420083 3484818 3527448 3401507
3989 3401507 3281650 3430115 3486283 3536868 3541292 3579491 3592025 3462992 3449150 3389496 3324840
3978 3324840 3364127 3515909 3231237 3220832 3161617 3086420 3213610 3234783 3135741 3137618 3180208
3967 3180208 3284047 3453204 3418934 3432031 3496059 3312548 3258623 3544245 3591625 3522395 3611155
3956 3611155 3673724 3572246 3606892 3471907 3577616 3534249 3509184 3532153 3510069 3707864 3692682
3945 3692682 3656690 3812608 3894082 3988092 3930099 3929286 3908711 3990234 3992291 4056876 3993759 4145473
3933 4145473 3951064 3874261 4102421 3929830 4014598 4057215 4287544 4404226 4309809 4362881
3923 4362881 4421884 4414532 4617396 4634359 4454832 4467251 4417710 4320084 4532914 4683007 4683948
$$ packed form
4000C456006N0948k13760j09657l0434J08828J44761L111J0280O4735M2630j25941
3989C401507j19857J48465N6168N0585M424L8199J2534j29033j3842n9654o4656
3978C324840L9287J51782k84672j0405n9215p5197J27190K1173r9042J877M2590
3967C180208J03839J69157l4270J3097O4028j83511n3925K85622M7380o9230Q8760
3956C611155O2569j01478L4646j34985J05709m3367k5065K2969k2084J97795j5182
3945C692682l5992J55918Q1474R4010n7993q13k0575Q1523K057O4585o3117J51714
3933D145473j94409p6803K28160j72591Q4768M2617K30329J16682r4417N3072
3923D362881N9003p352K02864J6963j79527J2419m9541r7626K12830J50093R41
$$ plain form
3912 4683948 4566483 4855076 4910484 4877127 4910643 5016416 5148824 5148383 5072548 5037823 5206707
3901 5206707 5287947 5349075 5493475 5682460 5716937 5763989 6019387 6192014 6342910 6331818
3891 6331818 6275790 6488845 6684864 6813518 6775158 6946208 6998466 7015755 7315338 7445838
3881 7445838 7372537 7637521 7800411 7795383 8014995 8117443 8224111 8219594 8428589 8609774
3871 8609774 8641579 8843589 9001199 9086749 9204457 9522981 9739490 9887077 10197160 10391798
3861 10391798 10594026 10726033 10758298 11036032 11185079 11422434 11598158 11854933 12034575 12110007
3851 12110007 12126357 12363472 12604925 13046706 13412468 13646362 13913427 14282497 14649049 14902215
3841 14902215 15285269 15857871 16465345 17111252 17942746 18496943 19156092 19959477 20563264
$$ packed form
3912D683948j17465K88593N5408l3357L3516J05773J32408m41p5835l4725J68884
3901E206707Q1240O1128J44400J88985L4477M7052K55398J72627J50896j1092
3891F331818n6028K13055J96019J28654l8360J71050N2258J7289K99583J30500
3881G445838p3301K64984J62890n028K19612J02448J06668m517K08995J81185
3871H609774L1805K02010J57610Q5550J17708L18524K16509J47587L10083J94638
3861A0391798K02228J32007L2265K77734J49047K37355J75724K56775J79642P5432
3851A2110007J6350K37115K41453M41781L65762K33894K67065L69070L66552K53166
3841A4902215L83054N72602O07474O45907Q31494N54197O59149Q03385O03787
$$ plain form
3832 20563264 21252998 21977289 22654695 23465287 24287746 25078822 25896050 26884685 28293386
3823 28293386 29619821 30959554 32332830 33891067 35517861 37295270 39584257 42059852
3815 42059852 44830736 47967679 51654302 55639770 60227352 65987011 73164867 81779206
3807 81779206 92520202 105399189 119749502 134799701 150187597 163836361 171803041
3800 171803041 173817093 169815091 156572917 138599319 119818263 101335731 85602384
3793 85602384 73923363 65681061 59780712 55080664 51541447 48416381 45614238 43680166
3785 43680166 42040696 40356311 39186520 38220485 37415885 36886003 36397054 36136051 35859305
3776 35859305 35529014 35482155 35677882 35826081 35984378 36078387 36459417 36932784 37471329 38044476
$$ packed form
3832B0563264O89734P24291O77406Q10592Q22459P91076Q17228R88635J408701
3823B8293386J326435J339733J373276J558237J626794J777409K288987K475595
3815D2059852K770884L136943L686623L985468M587582N759659P177856Q614339
3807H1779206J0740996J2878987J4350313J5050199J5387896J3648764P966680
3800A71803041K014052m002002j3242174j7973598j8781056j8482532j5733347
3793H5602384j1679021q242302n900349m700048l539217l125066k802143j934072
3785D3680166j639470j684385j169791r66035q04600n29882m88949k61003k76746
3776C5859305l30291m6859J95727J48199J58297R4009L81030M73367N38545N73147
$$ plain form
3766 38044476 38497506 39119684 39718370 40486476 41411521 42433211 43138462 43948591 44981650
3757 44981650 45900082 46874535 48146042 49423714 50626399 52174713 53653920 55493772
3749 55493772 57545390 60062997 62823106 65726247 69012060 72955989 77337048 82415093
3741 82415093 87925641 94804497 103268190 113508789 125905957 140243512 155707500 171919702
3733 171919702 189088847 204006678 211864241 215399650 215118075 205666340 191158653 176763093
3725 176763093 162472235 149286308 139130557 132604790 128631169 126064756 124417768 123742998
3717 123742998 123809705 124684377 125978023 128051252 130679447 133324026 135975308 138947147
3709 138947147 141574746 143966435 146103204 147649202 148599429 148946793 148466117 146962617
$$ packed form
3766C8044476M53030O22178N98686P68106R25045J021690P05251Q10129J033059
3757D4981650R18432R74453J271507J277672J202685J548314J479207J839852
3749E5493772K051618K517607K760109K903141L285813L943929M381059N078045
3741H2415093N510548O878856Q463693J0240599J2397168J4337555J5463988J6212202
3733A71919702J7169145J4917831P857563L535409k81575r451735j4507687j4395560
3725A76763093j4290858j3185927j0155751o525767l973621k566413j646988o74770
3717A23742998O6707Q74672J293646K073229K628195K644579K651282K971839
3709A38947147K627599K391689K136769J545998R50227L47364m80676j503500
$$ plain form
3701 146962617 144242344 140694408 136077432 130470637 124567375 118510333 112489051 106921714
3693 106921714 102091449 98064871 95133875 93059334 91450514 89952659 88403035 86425781
3685 86425781 83734876 80159040 75805405 71085339 66180868 61231768 56921328 53115449
3677 53115449 49909817 46955345 44361150 42130955 40062013 38286157 36960955 35844483
3669 35844483 34577102 33645825 32718036 32200560 31811502 31228103 30589014 29990180 29337101
3660 29337101 28767953 28241163 27492475 26357401 25629488 24961477 24110006 23261756 22391800
3651 22391800 21755573 21130135 20557618 20149981 19544955 19011150 18788555 18277019 17979968
3642 17979968 17412823 16890610 16610116 16101650 15528079 15137328 14724524 14507869 13881762
$$ packed form
3701A46962617k720273l547936m616976n606795n903262o057042o021282n567337
3693A06921714m830265m026578k930996k074541j608820j497855j549624j977254
3685H6425781k690905l575836m353635m720066m904471m949100m310440l805879
3677E3115449l205632k954472k594195k230195k068942j775856j325202j116472
3669C5844483j267381r31277r27789n17476l89058n83399o39089n98834o53079
3660B9337101n69148n26790p48688j135074p27913o68011q51471q48250q69956
3651B2391800o36227o25438n72517m07637o05026n33805k22595n11536k97051
3642A7979968n67145n22213k80494n08466n73571l90751m12804k16655o26107
$$ plain form
3633 13881762 13626953 13271238 12979148 12734625 12455662 12165624 11987220 11781741 11508514
3624 11508514 11368678 11210607 11069069 10734514 10629511 10365117 10112029 9935780 9972810 10056250
3614 10056250 9970095 9612318 9531252 9553299 9516131 9571916 9326187 9263656 9388516 9275171
3604 9275171 8883710 8793489 8578639 8622513 8304048 8280066 8089321 8012073 8142592 7736503
3594 7736503 7628977 7447317 7261352 7185018 7276150 7204268 7364194 7214987 7025045 6974228
3584 6974228 6722967 6811172 7025039 6793361 6496804 6478620 6401057 6528589 6546358 6449132
3574 6449132 6417404 6481395 6417687 6336952 6513259 6716536 6437322 6478492 6596644 6407131
3564 6407131 6436428 6475901 6500707 6371037 6473584 6364281 6289206 6422780 6565910 6420981
$$ packed form
3633A3881762k54809l55715k92090k44523k78963k90038j78404k05479k73227
3624A1508514j39836j58071j41538l34555j05003k64394k53088j76249L7030Q3440
3614A0056250q6155l57777q1066K2047l7168N5785k45729o2531J24860j13345
3604I275171l91461r0221k14850M3874l18465k3982j90745p7248J30519m06089
3594G736503j07526j81660j85965p6334R1132p1882J59926j49207j89942n0817
3584F974228k51261Q8205K13867k31678k96557j8184p7563J27532J7769r7226
3574F449132l1728O3991o3708q0735J76307K03277k79214M1170J18152j89513
3564F407131K9297L9473K4806j29670J02547j09303p5075J33574J43130j44929
$$ plain form
3554 6420981 6304096 6372434 6377194 6437971 6638320 6505943 6275562 6528240 6536274 6459402 6525605
3543 6525605 6429236 6377936 6514058 6592481 6647693 6736056 6846684 6688672 6731244 6880049 6848942
3532 6848942 6829475 6862785 6897158 6847123 6741135 6727568 6936878 7019698 7119213 6987045 7014850
3521 7014850 7083015 7195531 7137618 7279445 7535728 7464812 7541411 7737499 7958591 8198760
3511 8198760 8112853 8280418 8490315 8712443 8855680 8879332 8896853 8992856 9039374 9319658
3501 9319658 9501296 9560741 9569820 9649511 9837717 9902787 9977003 10153625 10362655 10486649 10732383
3490 10732383 10807506 10905909 11033653 11319005 11392106 11593834 11785347 12249292 12472621 12584004
3480 12584004 12753892 12913823 13220153 13673830 14038165 14090965 14357622 14600163 14790511 15143539
$$ packed form
3554F420981j16885O8338M760O0777K00349j32377k30381K52678Q034p6872O6203
3543F525605r6369n1300J36122P8423N5212Q8363J10628j58012M2572J48805l1107
3532F848942j9467L3310L4373n0035j05988j3567K09310Q2820R9515j32168K7805
3521G014850O8165J12516n7913J41827K56283p0916P6599J96088K21092K40169
3511H198760q5907J67565K09897K22128J43237K3652J7521R6003M6518K80284
3501I319658J81638N9445R079P9691J88206O5070P4216J76622K09030J23994K45734
3490A0732383P5123R8403J27744K85352P3101K01728J91513M63945K23329J11383
3480A2584004J69888J59931L06330M53677L64335N2800K66657K42541J90348L53028
$$ plain form
3470 15143539 15722570 16195508 16523255 16972950 17334260 17418248 17781306 18049511 18352822 18513666
3460 18513666 18714286 19176782 19675833 20127454 20634090 21356542 22085270 22530343 23420516
3451 23420516 24300226 25170906 26201189 27049648 27854520 28869074 29733465 30940879 32106940
3442 32106940 33183910 34510029 35610073 37071494 38776523 40578410 42229506 44244736
3434 44244736 46852444 49561721 52665010 56262900 60048165 64407123 69163212 74258402
3426 74258402 80084410 86673999 94148895 102958878 113467665 125795552 140148104 155940951
3418 155940951 172076530 187499704 200867099 210588088 214473158 210622304 199272657
3411 199272657 182251902 162420482 142889588 125584098 111323260 99513040 90012594
$$ packed form
3470A5143539N79031M72938L27747M49695L61310Q3988L63058K68205L03311J60844
3460A8513666K00620M62496M99051M51621N06636P22452P28728M45073Q90173
3451B3420516Q79710Q70680J030283Q48459Q04872J014554Q64391J207414J166061
3442C2106940J076970J326119J100044J461421J705029J801887J651096K015230
3434D4244736K607708K709277L103289L597890L785265M358958M756089N095190
3426G4258402N826008O589589P474896Q809983J0508787J2327887J4352552J5792847
3418A55940951J6135579J5423174J3367395R720989L885070l850854j1349647
3411A99272657j7020755j9831420j9530894j7305490j4260838j1810220r500446
$$ plain form
3404 90012594 82256421 75933132 70421727 65789273 61805104 58441852 55619386 52995905
3396 52995905 50758349 48848949 47170541 45592986 44172374 43060608 42079416 41332817
3388 41332817 40399323 39668330 38934836 38353027 37548631 37059342 36493273 35835854 35336516
3379 35336516 34960909 34494150 34029932 33694247 33565488 33591525 33407102 33467341 33501579 33881066
3369 33881066 34309668 34724265 35284669 35864823 36509253 37627497 38679327 39706713 41079355
3360 41079355 42467326 44087845 45826327 47663107 49380677 51521932 53613490 55750718
3352 55750718 58074501 60330921 62576257 64469014 65978541 66511739 66233100 65331703 63841223
3343 63841223 61960481 60368523 59088070 58145285 57707161 57749287 58015413 58575069 59292757
$$ packed form
3404I0012594p756173o323289n511405m632454l984169l363252k822466k623481
3396E2995905k237556j909400j678408j577555j420612j111766r81192p46599
3388D1332817r33494p30993p33494n81809q04396m89289n66069o57419m99338
3379C5336516l75607m66759m64218l35685j28759K6037j84423O0239L4238L79487
3369C3881066M28602M14597N60404N80154O44430J118244J051830J027386J372642
3360D1079355J387971J620519J738482J836780J717570K141255K091558K137228
3352E5750718K323783K256420K245336J892757J509527N33198k78639r01397j490480
3343F3841223j880742j591958j280453r42785m38124M2126K66126N59656P17688
$$ plain form
3334 59292757 60355712 61629992 63323814 65151324 67414935 70013908 72887466 76248248
3326 76248248 79815437 83737016 88359473 93392997 99207254 105947764 113686786 122056935
3318 122056935 130813957 139553172 147559026 154830823 161174479 166527198 171652634 177656857
3310 177656857 185444223 195507164 207535124 220756555 233390226 243329820 248965751
3303 248965751 248777551 242414900 230236234 213516405 194017178 173735500 154494127
3296 154494127 137450265 123550696 112597150 104100362 97291763 91948265 87887267 84768524
3288 84768524 82448135 80430848 78937332 77862801 76467043 74866742 72763098 69892020
3280 69892020 66539802 62490124 58095956 54005726 50152503 46753273 43605014 40842290
$$ packed form
3334E9292757J062955J274280J693822J827510K263611K598973K873558L360782
3326G6248248L567189L921579M622457N033524N814257O740510P739022Q370149
3318A22056935Q757022Q739215Q005854P271797O343656N352719N125436O004223
3310A77656857P787366J0062941J2027960J3221431J2633671R939594N635931
3303B48965751j88200o362651j2178666j6719829j9499227k0281678j9241373
3296A54494127j7043862j3899569j0953546q496788o808599n343498m060998l118743
3288H4768524k320389k017287j493516j074531j395758j600301k103644k871078
3280F9892020l352218m049678m394168m090230l853223l399230l148259k762724
$$ plain form
3272 40842290 38460083 36353100 34440085 32834123 31322594 29881430 28832299 27951656
3264 27951656 27071767 26027926 25166604 24631026 23935744 23076383 22510247 21932465 21501496
3255 21501496 20844426 20182407 19698281 18962427 18166808 17537946 17071503 16549735 16237458
3246 16237458 16076747 15542931 15226613 14996987 14438750 14047728 13927068 13603869 13338303
3237 13338303 13072555 12905455 12659836 12444278 12142524 11937529 11770962 11487439 11374437
3228 11374437 11280650 11205060 11044948 10764669 10437124 10297854 10151472 10095616 10127843 10082267
3218 10082267 9879510 9860791 9824066 9749574 9724545 9847965 9823940 9724759 9637297 9498065 9531666
3207 9531666 9348281 8997535 8799067 8700483 8724488 8731610 8796821 8709627 8492303 8359100 8328373
$$ packed form
3272D0842290k382207k106983j913015j605962j511529j441164j049131q80643
3264B7951656q79889j043841q61322n35578o95282q59361n66136n77782m30969
3255B1501496o57070o62019m84126p35854p95619o28862m66443n21768l12277
3246A6237458j60711n33816l16318k29626n58237l91022j20660l23199k65566
3237A3338303k65748j67100k45619k15558l01754k04995j66567k83523j13002
3228A1374437r3787p5590j60112k80279l27545j39270j46382n5856L2227m5576
3218A0082267k02757j8719l6725p4492k5029J23420k4025r9181q7462j39232L3601
3207I531666j83385l50746j98468r8584K4005P122O5211q7194k17324j33203l0727
$$ plain form
3196 8328373 8456514 8562795 8372628 8182474 8240233 8406771 8399345 8369886 8298882 8206868 8200470
3185 8200470 8311323 8398121 8445108 8201146 8422774 8607953 8693678 8852202 8957930 9014282
3175 9014282 9037526 9130477 8997879 9142622 9237459 9237259 9390078 9499133 9565466 9772976 9937078
3164 9937078 9975901 10030361 10427370 10613676 10769147 10925499 11326083 11523320 11681222 11988239
3154 11988239 12081681 12088732 12259751 12604839 12900529 13241914 13593081 14213508 14804250 15536769
3144 15536769 16209416 17191869 18087390 18829181 19536543 20177087 20914589 21482895 21851231
3135 21851231 22408804 22664131 23047452 23548082 24254216 25124911 26164722 27939667 30215841
3126 30215841 32849915 36606630 40825822 45335017 49942168 54197464 58028231 60282697
$$ packed form
3196H328373J28141J06281j90167j90154N7759J66538p426k9459p1004r2014o398
3185H200470J10853Q6798M6987k43962K21628J85179Q5725J58524J05728N6352
3175I014282K3244R2951j32598J44743R4837k00J52819J09055O6333K07510J64102
3164I937078L8823N4460L97009J86306J55471J56352M00584J97237J57902L07017
3154A1988239R3442P051J71019L45088K95690L41385L51167O20427N90742P32519
3144A5536769O72647R82453Q95521P41791P07362O40544P37502N68306L68336
3135B1851231N57573K55327L83321N00630P06134Q70695J039811J774945K276174
3126C0215841K634074L756715M219192M509195M607151M255296L830767K254466
$$ plain form
3118 60282697 59870673 57010604 52319372 46338463 40646754 35712608 32309443 29718883
3110 29718883 27634539 25950444 24535014 22937412 21529402 20272357 18822639 17545664
3102 17545664 16587482 15657067 14752451 14255238 13756451 13180904 12881571 12571712 12404281
3093 12404281 12207323 11791231 11711832 11744986 11807384 11472640 11233139 11128241 11007434 10931431
3083 10931431 10706803 10636265 10473920 10205587 10091987 9774176 9525717 9300049 8802496 8426759
3073 8426759 8304958 8175493 7869221 7701810 7342335 7315712 7241282 7015895 6816802 6946877
3063 6946877 6934529 7122234 7050788 6878092 6874891 6979786 7013682 6964612 7109782 7185160 7148601
3052 7148601 7009773 7223033 7362063 7253364 7134831 7305540 7353922 7417880 7527788 7577712
$$ packed form
3118F0282697m12024k860069m691232n980909n691709m934146l403165k590560
3110B9718883k084344j684095j415430j597602j408010j257045j449718j276975
3102A7545664r58182r30415r04616m97213m98787n75547k99333l09859j67431
3093A2404281j96958m16092p9399L3154O2398l34744k39501j04898j20807p6003
3083A0931431k24628p0538j62345k68333j13600l17811k48459k25668m97553l75737
3073H426759j21801j29465l06272j67411l59475k6623p4430k25387j99093J30075
3063F946877j2348J87705p1446j72696l201J04895L3896m9070J45170P5378l6559
3052G148601j38828K13260J39030j08699j18533J70709M8382O3958J09908M9924
$$ plain form
3042 7577712 7609635 7656895 7681960 7767972 7971487 8104310 8136749 8410862 8520848 8494691 8533676
3031 8533676 8532316 8664692 8701855 8906289 8994057 9131976 9381421 9365024 9699748 9897098
3021 9897098 10068340 10442776 10710859 10791152 10985422 11217403 11191695 11231648 10930409 10967071
3011 10967071 11264963 11381658 11710502 11977834 12335243 12642114 12937546 13206134 13472835
3002 13472835 13699990 13751091 13818490 13830188 13955998 14061789 14089533 14244436 14223779 14167238
2992 14167238 14493544 14861249 14887102 15164318 15551178 15872761 16387306 16893553 17260453 17425100
2982 17425100 17691209 18255769 18865849 19295065 19538171 19804822 20126324 20535879 20797471
2973 20797471 21077783 21530401 22392963 23057448 23766136 24735761 25797180 26855737 27659132
$$ packed form
3042G577712L1923M7260K5065Q6012K03515J32823L2439K74113J09986k6157L8985
3031H533676j360J32376L7163K04434Q7768J37919K49445j6397L34724J97350
3021I897098J71242L74436K68083Q0293J94270K31981k5708L9953l01239L6662
3011A0967071K97892J16695L28844K67332L57409L06871K95432K68588K66701
3002A3472835K27155N1101O7399J1698J25810J05791K7744J54903k0657n6541
2992A4167238L26306L67705K5853K77216L86860L21583N14545N06247L66900J64647
2982A7425100K66109N64560O10080M29216K43106K66651L21502M09555K61592
2973B0797471K80312M52618Q62562O64485P08688R69625J061419J058557Q03395
$$ plain form
2964 27659132 28269900 28749751 28892220 28780688 28645400 28476419 28439330 28315613 28404910 28592183
2954 28592183 29356712 30347274 31075091 31985580 32824828 33281721 33533180 33303314 32805436
2945 32805436 31713456 30689534 29686298 28705543 28062851 27677681 27556346 27657524 27921508
2936 27921508 28061459 28212503 28294353 28105986 27285229 26628674 25937177 24696345 23404379
2927 23404379 22174320 21089191 20319386 19715404 19062262 18562719 18419468 17933369 17469583
2918 17469583 17129488 16570482 15710829 15027310 14355896 13647426 13005614 12231477 11483177
2909 11483177 10938929 10545814 10146038 9887716 9612481 9276888 8905360 8449942 8141588
2900 8141588 7928510 7763796 7590106 7282311 6959575 6969649 6713034 6416239 6244557 5900189
$$ packed form
2964B7659132O10768M79851J42469j11532j35288j68981l7089j23717Q9297J87273
2954B8592183P64529R90562P27817R10489Q39248M56893K51459k29866m97878
2945C2805436j091980j023922j003236r80755o42692l85170j21335J01178K63984
2936B7921508J39951J51044Q1850j88367q20757o56555o91497j240832j291966
2927B3404379j230059j085129p69805o03982o53142m99543j43251m86099m63786
2918A7469583l40095n59006q59653o83519o71414p08470o41812p74137p48300
2909A1483177n44248l93115l99776k58322k75235l35593l71528m55418l08354
2900H141588k13078j64714j73690l07795l22736J0074k56615k96795j71682l44368
$$ plain form
2890 5900189 5891793 5805037 5736132 5562491 5535535 5445369 5167172 5034178 4996185 4900836 4619560
2879 4619560 4720887 4603940 4571463 4460354 4323021 4357659 4085696 3892492 3877305 3745480
2869 3745480 3900318 3837612 3760037 3748746 3665132 3681158 3781199 3761107 3673666 3554210 3493366
2858 3493366 3654283 3602961 3491480 3690031 3729203 3412818 3466678 3546867 3474678 3540222 3538358
2847 3538358 3301746 3410261 3329269 3265470 3300732 3115849 3268377 3547933 3591433 3657621
2837 3657621 3539601 3388369 3463413 3528610 3480379 3367281 3499020 3484938 3320980 3344595
2827 3344595 3324265 3328221 3168777 3128893 3005048 3100556 3128790 3218629 3170214 3203814 3331532
2816 3331532 3395207 3194170 3110217 3159656 3110519 3264079 3337703 3145004 3109943 3236062 3143697
$$ packed form
2890E900189q396q6756o8905j73641k6956r0166k78197j32994l7993r5349k81276
2879D619560J01327j16947l2477j11109j37333L4638k71963j93204j5187j31825
2869C745480J54838o2706p7575j1291q3614J6026J00041k0092q7441j19456o0844
2858C493366J60917n1322j11481J98551L9172l16385N3860Q0189p2189O5544j864
2847C538358k36612J08515q0992o3799L5262j84883J52528K79556M3500O6188
2837C657621j18020j51232P5044O5197m8231j13098J31739j4082j63958K3615
2827C344595k0330L956j59444l9884j23845R5508K8234Q9839m8415L3600J27718
2816C331532O3675k01037q3953M9439m9137J53560P3624j92699l5061J26119r2365
$$ plain form
2805 3143697 3162637 3175403 3033707 3003037 3049036 3222219 3239579 3213381 3328057 3237883 3058740
2794 3058740 3044924 3029566 3108613 3126562 3090182 3005233 3046614 3041949 3294693 3134198 2972098
2783 2972098 2989038 2955662 3030262 3071594 3224982 3014902 2941942 3034187 3088747 2961437 3069578
2772 3069578 3060056 3151448 3334531 3230878 3306525 3369284 3305155 3407768 3568391 3597548 3608890
2761 3608890 3766613 3844768 3949424 3892456 3897397 3910831 3973053 4103897 4056816 4138988 4320205
2750 4320205 4172124 4022445 4102815 4269625 4223752 4484218 4650083 4604434 4715775 4848611
2740 4848611 4867674 5028792 5205314 5364849 5557840 5611283 5628054 5812199 6159926 6259370
2730 6259370 6496796 6763636 7124790 7355488 7491408 8139975 8483902 9012127 9571429 10129166
$$ packed form
2805C143697J8940J2766j41696l0670M5999J73183J7360k6198J14676r0174j79143
2794C058740j3816j5358P9047J7949l6380q4949M1381m665K52744j60495j62100
2783B972098J6940l3376P4600M1332J53388k10080p2960R2245N4560j27310J08141
2772C069578r522R1392J83083j03653P5647O2759o4129J02613J60623K9157J1342
2761C608890J57723P8155J04656n6968M941J3434O2222J30844m7081Q2172J81217
2750D320205j48081j49679Q0370J66810m5873K60466J65865m5649J11341J32836
2740D848611J9063J61118J76522J59535J92991N3443J6771J84145L47727R9444
2730F259370K37426K66840L61154K30698J35920O48567L43927N28225N59302N57737
$$ plain form
2720 10129166 10771031 11220845 11935013 12669651 13117017 13618753 14136162 14610194 14817186
2711 14817186 14889895 14957562 15143511 15108724 15002192 14834262 14811738 14883627 14602356 14444652
2701 14444652 14488037 14438444 14539434 14570127 14298102 13954589 13646150 13221333 12828390 12339215
2691 12339215 11791531 11182927 10672163 10070966 9546157 9188656 8759152 8297052 7922116
2682 7922116 7625240 7278663 6995852 6787242 6632004 6438373 6308263 6243147 6231550 6222979
2672 6222979 6087623 6016575 5873135 5765620 5656313 5701952 5808954 5562520 5514347 5440766
2662 5440766 5541949 5678274 5845496 5654699 5614405 5460825 5656253 5668130 5515300 5652878
2652 5652878 5764718 5653178 5770784 5781254 5811097 5770053 5728037 6087770 6121391 6108485 6224826
$$ packed form
2720A0129166O41865M49814P14168P34638M47366N01736N17409M74032K06992
2711A4817186P2709O7667J85949l4787j06532j67930k2524P1889k81271j57704
2701A4444652M3385m9593J00990L0693k72025l43513l08439m24817l92943m89175
2691A2339215n47684o08604n10764o01197n24809l57501m29504m62100l74936
2682G922116k96876l46577k82811k08610j55238j93631j30110o5116j1597q571
2672F222979j35356p1048j43440j07515j09307M5639J07002k46434m8173p3581
2662E440766J01183J36325J67222j90797m0294j53580J95428J1877j52830J37578
2652E652878J11840j11540J17606J0470K9843m1044m2016L59733L3621j2906J16341
$$ plain form
2641 6224826 6477695 6542203 6588707 6530512 6429111 6539061 6509640 6439730 6341976 6488265 6636552
2630 6636552 6381145 6255566 6375840 6440876 6475748 6647721 6643271 6569561 6676760 6604380 6595400
2619 6595400 6664046 6598386 6705575 6887914 7003815 7002693 7227638 7389828 7429101 7649681
2609 7649681 7801186 7983766 8016650 8161987 8222980 8409534 8610292 8876351 9015948 9113001
2599 9113001 9146015 9179164 9357008 9583629 9760757 10072449 10217471 10317138 10448687 10724242
2589 10724242 10942565 11163174 11388288 11653081 12003849 12195674 12528182 12764702 12984410
2580 12984410 13192823 13555991 13738236 13828318 13906187 14102213 14126312 14108916 14331607 14662942
2570 14662942 15028821 15010298 15157575 15493962 15904874 16324426 16602564 17005964 17345764 17838620
$$ packed form
2641F224826K52869O4508M6504n8195j01401J09950k9421o9910r7754J46289J48287
2630F636552k55407j25579J20274O5036L4872J71973m450p3710J07199p2380q980
2619F595400O8646o5660J07189J82339J15901j122K24945J62190L9273K20580
2609G649681J51505J82580L2884J45337O0993J86554K00758K66059J39597R7053
2599I113001L3014L3149J77844K26621J77128L11692J45022R9667J31549K75555
2589A0724242K18323K20609K25114K64793L50768J91825L32508K36520K19708
2580A2984410K08413L63168J82245R0082P7869J96026K4099j7396K22691L31335
2570A4662942L65879j8523J47277L36387M10912M19552K78138M03400L39800M92856
$$ plain form
2560 17838620 18278375 18760666 19210306 19755251 20359335 20977751 21677590 22336017 22995074
2551 22995074 23739644 24565360 25648928 26620843 27775298 29020827 30299678 31777353 33516722
2542 33516722 35281395 37325622 39280643 42038968 44878798 47787611 50987804 54851427
2534 54851427 58977309 63432704 68383144 73543712 78873469 84132239 89258978 94043610
2526 94043610 98195275 101452508 104330707 106211249 107432981 107642670 107320362 106602369 105586244
2517 105586244 104373743 103285520 102156990 101074568 100081537 99130409 97676063 95914604
2509 95914604 93670368 90845953 87581730 83718539 79160986 74268186 69062247 63903254
2501 63903254 59224290 54502400 50187736 46314347 42924129 39947978 37243218 34767293
$$ packed form
2560A7838620M39755M82291M49640N44945O04084O18416O99839O58427O59057
2551B2995074P44570Q25716J083568R71915J154455J245529J278851J477675J739369
2542C3516722J764673K044227J955021K758325K839830K908813L200193L863623
2534E4851427M125882M455395M950440N160568N329757N258770N126739M784632
2526I4043610M151665L257233K878199J880542J221732K09689l22308p17993j016125
2517A05586244j212501j088223j128530j082422r93031r51128j454346j761459
2509I5914604k244236k824415l264223l863191m557553m892800n205939n158993
2501F3903254m678964m721890m314664l873389l390218k976151k704760k475925
$$ plain form
2493 34767293 32688860 31023798 29763064 28127533 26612131 25491148 24582944 23570544
2485 23570544 22776331 21973119 21065267 20539289 19879720 19328416 18810074 18283490 17999411
2476 17999411 17650605 17311454 16945349 16802220 16781920 16417165 16189936 15856417 15748105 15535011
2466 15535011 15383767 15161086 15067654 15047652 14875109 14747821 14713717 14750855 14438510 14388287
2456 14388287 14356559 14211173 14193059 14140367 14031425 13909262 13740486 13559363 13517189 13482582
2446 13482582 13384418 13455405 13323028 13123666 12952494 12903609 13091147 13160914 13021979 12743741
2436 12743741 12768227 12960226 12767930 12640040 12660406 12780291 12785542 12851478 12996891 13055642
2426 13055642 13233068 13277625 13287055 13198617 13276335 13455124 13852209 13987147 14297150 14634671
$$ packed form
2493C4767293k078433j665062j260734j635531j515402j120983r08204j012400
2485B3570544p94213q03212r07852n25978o59569n51304n18342n26584k84079
2476A7999411l48806l39151l66105j43129k0300l64755k27229l33519j08312k13094
2466A5535011j51244k22681r3432k0002j72543j27288l4104L7138l12345n0223
2456A4388287l1728j45386j8114n2692j08942j22163j68776j81123m2174l4607
2446A3482582r8164P0987j32377j99362j71172m8885J87538O9767j38935k78238
2436A2743741K4486J91999j92296j27890K0366J19885N251O5936J45413N8751
2426A3055642J77426M4557R430q8438P7718J78789L97085J34938L10003L37521
$$ plain form
2416 14634671 14549402 14518460 14739225 15014323 15083721 15294126 15609420 15673826 16026234 16068794
2406 16068794 16058727 16270979 16576448 16754544 16725218 16721529 16939422 17194924 17430318 17684448
2396 17684448 17506827 17782216 17861795 18335755 18665136 18744442 18904512 19032821 19159431 19287283
2386 19287283 19664158 19899937 20082151 20116289 20148663 20312759 20618082 21015092 21255110 21497618
2376 21497618 21822932 22298622 22903942 23364566 23879161 24571839 25363294 26031915 26957597
2367 26957597 28047215 29020307 30049742 31136118 32265764 33352557 34582634 36012334
2359 36012334 37435962 38899959 40314285 41923644 43738691 45776416 48006373 50489957
2351 50489957 53156381 56029885 59702247 63617670 67924469 72781867 78233945 84493472
$$ packed form
2416A4634671q5269l0942K20765K75098O9398K10405L15294O4406L52408M2560
2406A6068794j0067K12252L05469J78096k9326l689K17893K55502K35394K54130
2396A7684448j77621K75389P9579M73960L29381P9306J60070J28309J26610J27852
2386A9287283L76875K35779J82214L4138L2374J64096L05323L97010K40018K42508
2376B1497618L25314M75690O05320M60624N14595O92678P91455O68621R25682
2367B6957597J089618R73092J029435J086376J129646J086793J230077J429700
2359C6012334J423628J463997J414326J609359J815047K037725K229957K483584
2351E0489957K666424K873504L672362L915423M306799M857398N452078O259527
$$ plain form
2343 84493472 91397267 99304826 108048109 117905701 128769888 140507399 153122342 166493935
2335 166493935 180331891 193888288 206392511 217404776 225874766 231015104 232558921
2328 232558921 230225163 223629543 213518536 200917921 186646097 171605542 156252235
2321 156252235 141661436 128437482 116343731 105769350 96609314 88436448 81356200
2314 81356200 75426786 70070579 65383526 61437078 57929859 54680855 51869040 49350038
2306 49350038 47121954 44969353 43198443 41721359 40094672 38784283 37557643 36350423
2298 36350423 35220650 34212561 33295861 32579789 31935686 31128541 30602068 30334708 29931234
2289 29931234 29604461 29261795 29096472 28823041 28816546 28945946 29042972 29031681 29278041 29443393
$$ packed form
2343H4493472O903795P907559Q743283R857592J0864187J1737511J2614943J3371593
2335A66493935J3837956J3556397J2504223J1012265Q469990N140338J543817
2328B32558921k333758o595620j0111007j2600615j4271824j5040555j5353307
2321A56252235j4590799j3223954j2093751j0574381r160036q172866p080248
2314H1356200n929414n356207m687053l946448l507219l249004k811815k519002
2306D9350038k228084k152601j770910j477084j626687j310389j226640j207220
2298C6350423j129773j008089r16700p16072o44103q07145n26473k67360m03474
2289B9931234l26773l42666j65323k73431o495J29400R7026j1291K46360J65352
$$ plain form
2279 29443393 29792742 30140630 30385038 30820861 31204560 31298964 31621969 31872572 32245204 32540983
2269 32540983 32832155 33119629 33443754 33841356 34178936 34645810 35062170 35468055 35909647
2260 35909647 36352751 36940278 37380801 37998258 38603564 39172345 39654819 39747760 39920112 39752618
2250 39752618 39522497 39332981 39024672 38856673 38584440 38222647 37981330 38003516 38101385 37985179
2240 37985179 38098799 37980992 37962211 37998292 37749944 37786769 37822188 37629156 37458634 37317586
2230 37317586 37311553 37388554 37860612 38032158 38340847 38964513 39434696 39857001 40369009 40796062
2220 40796062 41394655 42131917 42859528 43793169 44434644 45560852 46666570 47459814 48513532
2211 48513532 49611386 51096027 52453901 54075489 55825001 57682432 59734292 62278263
$$ packed form
2279B9443393L49349L47888K44408M35823L83699R4404L23005K50603L72632K95779
2269C2540983K91172K87474L24125L97602L37580M66874M16360M05885M41592
2260C5909647M43104N87527M40523O17457O05306N68781M82474R2941J72352j67494
2250C9752618k30121j89516l08309j67999k72233l61793k41317K2186R7869j16206
2240C7985179J13620j17807j8781L6081k48348L6825L5419j93032j70522j41048
2230C7317586o033P7001M72058J71546L08689O23666M70183M22305N12008M27053
2220D0796062N98593P37262P27611R33641O41475J126208J105718P93244J053718
2211D8513532J097854J484641J357874J621588J749512J857431K051860K543971
$$ plain form
2203 62278263 65065284 68090810 71192917 74390343 77713363 81060298 84469721 87492846
2195 87492846 90078907 92522584 94695999 96460919 97854069 98949700 99805008 100557564
2187 100557564 101327292 102111159 103145969 104462765 105997860 107558888 109442604 111511853
2179 111511853 113360692 115200020 116740690 117956326 119108839 119770822 120156296 120305263
2171 120305263 120114234 119680390 118761155 117709611 116562952 114903035 113259622 111277280
2163 111277280 109168476 107099318 105431564 103754533 101895995 100383177 98943837 97464012
2155 97464012 95578244 93513078 91040252 88066204 85051195 81599551 77671084 73734885
2147 73734885 69763640 65895798 62048844 58533457 55012073 51875060 49252074 47064500
$$ packed form
2203F2278263K787021L025526L102107L197426L323020L346935L409423L023125
2195H7492846K586061K443677K173415J764920J393150J095631Q55308P52556
2187A00557564P69728P83867J034810J316796J535095J561028J883716K069249
2179A11511853J848839J839328J540670J215636J152513O61983L85474J48967
2171A20305263j91029m33844r19235j051544j146659j659917j643413j982342
2163A11277280k108804k069158j667754j677031j858538j512818j439340j479825
2155I7464012j885768k065166k472826k974048l015009l451644l928467l936199
2147G3734885l971245l867842l846954l515387l521384l137013k622986k187574
$$ plain form
2139 47064500 45211438 43386664 42010644 40799676 39864576 39187048 38465687 37661552 36900902
2130 36900902 35780806 34448508 33468256 32290111 30991075 29733885 28789663 27946269 27406170
2121 27406170 27114044 26838258 26702375 26810914 26763480 26625628 26890260 26957510 27247866 27635006
2111 27635006 27768481 27862789 27939980 27995920 27983464 28023478 28160585 27987585 28040909 28202441
2101 28202441 28468261 28659647 28769818 28903752 28781299 28625028 28636662 28339363 27795375 27163162
2091 27163162 26469918 25965588 25392862 25050367 24798221 24556195 24329000 24282744 24187461 23886519
2081 23886519 23917868 23875315 23947820 24062056 24098294 24361492 24630972 24725309 25050706 25300546
2071 25300546 25580593 25916211 25945574 26096571 26305660 26395271 26703152 26828008 26682260 26737416
$$ packed form
2139D7064500j853062j824774j376020j210968r35100o77528p21361q04135p60650
2130C6900902j120096j332298r80252j178145j299036j257190r44222q43394n40099
2121B7406170k92126k75786j35883J08539m7434j37852K64632O7250K90356L87140
2111B7635006J33475R4308P7191N5940j2456M0014J37107j73000N3324J61532
2101B8202441K65820J91386J10171J33934j22453j56271J1634k97299n43988o32213
2091B7163162o93244n04330n72726l42495k52146k42026k27195m6256r5283l00942
2081B3886519L1349m2553P2505J14236L6238K63198K69480R4337L25397K49840
2071B5300546K80047L35618K9363J50997K09089Q9611L07881J24856j45748N5156
$$ plain form
2061 26737416 26818508 26877205 26928059 26660785 26471417 26268266 26024824 26130813 25878159 25481131
2051 25481131 25146580 24830502 24635857 24440769 24145157 23830115 23430597 23252303 23160788 22947214
2041 22947214 22894315 22997445 23039618 23191032 23318580 23811944 24081512 24260116 24840818 25021770
2031 25021770 25527459 26067348 26948792 27882192 28667568 29630385 30482512 31287266 32144374
2022 32144374 33099931 34231573 35533844 37137417 38961607 41119020 43563260 46267392
2014 46267392 49194156 52480983 56234913 60466285 65267923 70273091 75158297 80382087
2006 80382087 85805334 90956615 95819494 100125911 103684934 106416052 107937483 108299460
1998 108299460 107487372 105139808 101592434 96895479 91460017 85725291 79763186 73551723
$$ packed form
2061B6737416Q1092N8697N0854k67274j89368k03151k43442J05989k52654l97028
2051B5481131l34551l16078j94645j95088k95612l15042l99518j78294r1515k13574
2041B2947214n2899J03130M2173J51414J27548M93364K69568J78604N80702J80952
2031B5021770N05689N39889Q81444R33400P85376R62817Q52127Q04754Q57108
2022C2144374R55557J131642J302271J603573J824190K157413K444240K704132
2014D6267392K926764L286827L753930M231372M801638N005168M885206N223790
2006H0382087N423247N151281M862879M306417L559023K731118J521431L61977
1998A08299460q12088k347564l547374m696955n435462n734726n962105o211463
$$ plain form
1990 73551723 67589927 61939093 56631438 51808771 47502543 43709176 40396905 37456542
1982 37456542 34983880 32792010 30795970 29001562 27458155 25876899 24658944 23490929
1974 23490929 22196647 21246247 20304084 19384486 18457200 17739059 16878912 16098373 15313172
1965 15313172 14926848 14524247 14102814 13647103 13114401 12974269 12579054 12165743 11927927
1956 11927927 11570794 11271264 11124943 10578680 10380274 10178165 10042130 9833095 9698043
1947 9698043 9671020 9644363 9590989 9300386 9147942 9357157 9160839 8926500 8798907 8846523
1937 8846523 8726941 8557819 8497880 8418500 8368823 8127929 8020120 7820977 7652911 7492451
1927 7492451 7202438 7148795 7273068 7066678 6880770 6754484 6787579 6732090 6654405 6722279
$$ packed form
1990G3551723n961796n650834n307655m822667m306228l793367l312271k940363
1982C7456542k472662k191870j996040j794408j543407j581256j217955j168015
1974B3490929j294282r50400r42163r19598r27286p18141q60147p80539p85201
1965A5313172l86324m02601m21433m55711n32702j40132l95215m13311k37816
1956A1927927l57133k99530j46321n46263j98406k02109j36035k09035j35052
1947I698043k7023k6657n3374k90603j52444K09215j96318k34339j27593M7616
1937H846523j19582j69122n9939p9380m9677k40894j07809j99143j68066j60460
1927G492451k90013n3643J24273k06390j85908j26286L3095n5489p7685O7874
$$ plain form
1917 6722279 6575896 6564093 6429782 6423727 6358773 6383640 6434989 6349765 6310454 6091582 6128354
1906 6128354 6088948 6029002 6126848 6047632 5967685 6078589 6067443 5997738 5984771 6194637 6371354
1895 6371354 6440111 6429895 6418214 6241331 6390951 6539948 6473057 6540305 6758508 6669757 6619022
1884 6619022 6677422 6742471 6854018 6855750 6637211 6635582 6753498 6776408 6912510 7035997 7080136
1873 7080136 7085598 7214060 7412633 7538916 7578163 7759799 7851620 7842456 7620960 7620851 7760285
1862 7760285 7897418 7761321 7802458 8155400 8378038 8416294 8285524 8316268 8448262 8622946
1852 8622946 8505021 8565768 8845038 9000947 9100738 9459414 9406762 9674461 9866731 9931772
1842 9931772 10134483 10077077 10398169 10555114 10735424 10933101 10910845 11121384 11331983 11516821
$$ packed form
1917F722279j46383j1803j34311o055o4954K4867N1349q5224l9311k18872L6772
1906F128354l9406n9946R7846p9216p9947J10904j1146o9705j2967K09866J76717
1895F371354O8757j0216j1681j76883J49620J48997o6891O7248K18203q8751n0735
1884F619022N8400O5049J11547J732k18539j629J17916K2910J36102J23487M4139
1873G080136N462J28462J98573J26283L9247J81636R1821r164k21496j09J39434
1862G760285J37133j36097M1137L52942K22638L8256j30770L0744J31994J74684
1852H622946j17925O0747K79270J55909R9791L58676n2652K67699J92270O5041
1842I931772K02711n7406L21092J56945J80310J97677k2256K10539K10599J84838
$$ plain form
1832 11516821 11661469 11951670 12129445 12408807 12764873 12981645 13491533 13917194 14246544
1823 14246544 14475172 14611546 15023908 15339618 15434081 15866792 16348179 16769727 17318386 17767884
1813 17767884 18130888 18470208 19059865 19705731 20064919 20592342 21380538 21874035 22560750
1804 22560750 23074234 23547141 24164267 24807687 25460087 26145664 26733391 27603402 28458255
1795 28458255 29495227 30691031 31432216 32499104 33624407 35024902 36357152 38003591
1787 38003591 39754378 41624985 43522917 45537625 47705923 50227859 52875415 55784888
1779 55784888 59015269 62571985 66546836 71190894 76407557 82413469 88531556 94422100
1771 94422100 99770869 104489429 107520591 108231633 106452340 102476450 97646889 92757355
$$ packed form
1832A1516821J44648K90201J77775K79362L56066K16772N09888M25661L29350
1823A4246544K28628J36374M12362L15710R4463M32711M81387M21548N48659M49498
1813A7767884L63004L39320N89657O45866L59188N27423P88196M93497O86715
1804B2560750N13484M72907O17126O43420O52400O85577N87727Q70011Q54853
1795B8458255J036972J195804P41185J066888J125303J400495J332250J646439
1787C8003591J750787J870607J897932K014708K168298K521936K647556K909473
1779E5784888L230381L556716L974851M644058N216663O005912O118087N890544
1771I4422100N348769M718560L031162P11042j779293l975890m829561m889534
$$ plain form
1763 92757355 88564285 85352829 82850958 80802464 79501943 78630149 78175420 78095841 78485390
1754 78485390 78983947 79800603 81221233 83246131 85701436 88467495 91994943 95835613
1746 95835613 100482663 105959468 112253699 119588158 127617980 136427352 146355212 157480724
1738 157480724 170024695 184874108 202013652 222309489 247177641 276229227 309011539
1731 309011539 343437348 376148011 404752711 424994033 431824767 420746616 392656052
1724 392656052 353248083 309978315 269602646 235245566 207287021 184904078 166460471
1717 166460471 151228807 138352291 127194927 116939375 107867589 99772873 92384790
1710 92384790 85882773 80285181 75306839 70809449 66997725 63448206 60258293 57297145
$$ packed form
1763I2757355m193070l211456k501871k048494j300521q71794m54729p9579L89549
1754G8485390M98557Q16656J420630K024898K455305K766059L527448L840670
1746I5835613M647050N476805O294231P334459Q029822Q809372R927860J1125512
1738A57480724J2543971J4849413J7139544K0295837K4868152K9051586L2782312
1731C09011539L4425809L2710663K8604700K0241322O830734j1078151k8090564
1724C92656052l9407969m3269768m0375669l4357080k7958545k2382943j8443607
1717A66460471j5231664j2876516j1157364j0255552r071786q094716p388083
1710I2384790o502017n597592m978342m497390l811724l549519l189913k961148
$$ plain form
1702 57297145 54739558 51945912 49544502 47413912 45192810 43178246 41209415 39587979
1694 39587979 37816537 36245031 35077824 33764002 32470500 31300542 30156142 28889319
1686 28889319 27909799 27031062 26398072 25710912 24881960 23954361 23068907 22326376 21279235
1677 21279235 20522646 19854144 19197834 18581540 17950209 17528805 17117400 16734532 16283577
1668 16283577 15782975 15357445 14935895 14615568 14329353 14140199 13899002 13830805 13542860 13178272
1658 13178272 13085446 12899488 12700123 12514799 12051381 11736925 11606056 11087735 10819561 10528867
1648 10528867 10344788 10124236 10002029 9689970 9371437 9304371 9264533 9007876 8767046 8599338
1638 8599338 8385602 8236600 7958667 7782967 7622707 7497370 7334564 7149591 7155758 7292068
$$ packed form
1702E7297145k557587k793646k401410k130590k221102k014564j968831j621436
1694C9587979j771442j571506j167207j313822j293502j169958j144400j266823
1686B8889319r79520q78737o32990o87160q28952r27599q85454p42531j047141
1677B1279235p56589o68502o56310o16294o31331m21404m11405l82868m50955
1668A6283577n00602m25530m21550l20327k86215j89154k41197o8197k87945l64588
1658A3178272r2826j85958j99365j85324m63418l14456j30869n18321k68174k90694
1648A0528867j84079k20552j22207l12059l18533o7066l9838k56657k40830j67708
1638H599338k13736j49002k77933j75700j60260j25337j62806j84973O167J36310
$$ plain form
1628 7292068 7035079 6943154 6621137 6557330 6661352 6443151 6443197 6397863 6114520 5969008 5996784
1617 5996784 5905375 5787304 5560668 5483574 5594959 5467032 5428675 5132403 5209853 5050124
1607 5050124 4853761 4839220 4543650 4452070 4388914 4336789 4455479 4434360 4333225 4356502 4325714
1596 4325714 4320314 4358905 4197141 3995318 3907664 3879971 3755497 3637548 3733338 3804881 3577162
1585 3577162 3373537 3529551 3580381 3583300 3500845 3427116 3199936 3178542 3211536 3131546 3238392
1574 3238392 3245144 3042848 2923903 2809030 2921284 2824957 2806920 2835213 2911654 3084170 3348759
1563 3348759 3300430 3029138 2780749 2612958 2674640 2810294 2828298 2900699 2950839 3051689
1553 3051689 3146200 2946040 2833037 2837732 2885745 2896963 2949694 2728332 2742774 2817743 2917696
$$ packed form
1628G292068k56989r1925l22017o3807J04022k18201M6m5334k83343j45512K7776
1617E996784r1409j18071k26636p7094J11385j27927l8357k96272P7450j59729
1607E050124j96363j4541k95570r1580o3156n2125J18690k1119j01135K3277l0788
1596D325714n400L8591j61764k01823q7654k7693j24474j17949R5790P1543k27719
1585C577162k03625J56014N0830K919q2455p3729k27180k1394L2994p9990J06846
1574C238392O752k02296j18945j14873J12254r6327j8037K8293P6441J72516K64589
1563C348759m8329k71292k48389j67791O1682J35654J8004P2401N0140J00850
1553C051689R4511k00160j13003M695M8013J1218N2731k21362J4442P4969R9953
$$ plain form
1542 2917696 2800508 2600679 2627132 2521270 2495012 2487343 2539255 2636125 2636060 2417730 2314506
1531 2314506 2204946 1997969 2041280 2020742 1900028 2003764 2051929 2010941 2013330 2018813 1819268
1520 1819268 1926648 1970717 1973846 2017133 2000702 1896729 1854951 2001462 1957827 1806964 1626464
1509 1626464 1684322 1660162 1779272 1670077 1741552 1838698 1846509 1866471 1860336 1634276 1450880
1498 1450880 1541139 1593227 1631695 1791295 1799865 1613495 1765711 1716419 1753868 1718681 1723451
1487 1723451 1585690 1624578 1610558 1557710 1549285 1320638 1288260 1389592 1359930 1391290 1279962
1476 1279962 1143299 1369671 1424546 1469983 1614600 1656320 1531881 1399907 1300940 1461629
1466 1461629 1628394 1625180 1447625 1390733 1447718 1317001 1461523 1589958 1540866 1333386
$$ packed form
1542B917696j17188j99829K6453j05862k6258p669N1912R6870o5k18330j03224
1531B314506j09560k06977M3311k0538j20714J03736M8165m0988K389N483j99545
1520A819268J07380M4069L129M3287j6431j03973m1778J46511m3635j50863j80500
1509A626464N7858k4160J19110j09195P1475R7146P811J9962o135k26060j83396
1498A450880R0259N2088L8468J59600Q570j86370J52216m9292L7449l5187M770
1487A723451j37761L8888j4020n2848q425k28647l2378J01332k9662L1360j11328
1476A279962j36663K26372N4875M5437J44617M1720j24439j31974r8967J60689
1466A461629J66765l214j77555n6892N6985j30717J44522J28435m9092k07480
$$ plain form
1456 1333386 1325670 1328729 1491691 1411129 1247422 1330772 1263899 1383028 1303063 1560570 1560250
1445 1560250 1547026 1563616 1474464 1558763 1465756 1496681 1687682 1603501 1394457 1388387 1844084
1434 1844084 2013011 2235902 2312670 2412198 2427536 2506982 2496462 2551912 2859360 2948100 2916711
1423 2916711 2799693 2615995 2284262 2033025 1787310 1617569 1607028 1688884 1559607 1557710
1413 1557710 1452722 1408014 1267255 1266528 1266550 1217385 1207452 1057010 1168359 1159959 1282905 1262228
1401 1262228 1009170 1147036 1243318 1055123 1046270 969278 924774 852817 792982 990602 754923
1390 754923 797401 919063 843557 773297 673308 792220 845572 680753 748099 628775 753757
1379 753757 664222 690165 595039 521092 542543 566745 719724 695417 570028 547764 576473
$$ packed form
1456A333386p716L059J62962q0562j63707Q3350o6873J19129p9965K57507l20
1445A560250j3224J6590q9152Q4299r3007L0925J91001q4181k09044o070M55697
1434A844084J68927K22891P6768R9528J5338P9446j0520N5450L07448Q8740l1389
1423B916711j17018j83698l31733k51237k45715j69741j0541Q1856j29277j897
1413A557710j04988m4708j40759p27K2m9165r933j50442J11349q400J22946k0677
1401A262228k53058J37866R6282j88195q853p6992m4504p1957n9835J97620k35679
1390G54923M2478J21662p5506p0260r9989J18912N3352j64819O7346j19324J24982
1379G53757q9535K5943r5126p3947K1451K4202J52979k4307j25389k2264K8709
$$ plain form
1368 576473 568795 608582 714613 770053 733293 715963 667847 691648 472767 479148 456379 528984
1356 528984 415394 365159 436867 346388 395740 519893 403007 592743 792524 599691
1346 599691 479786 471524 270487 391728 422801 399111 284299 404805 456360 321925 489112
1335 489112 622722 604701 347768 133591 178350 207068 266406 377492 404950 337866 313922
1324 313922 407621 559751 508532 390331 438329 430302 345096 376639 340327 190145 196674
1313 196674 362662 518650 335598 447455 382357 438699 364398 284583 318802 338154 367529
1302 367529 266563 194562 345959 383523 395735 354412 385543 418300 600002 471167 165706
1291 165706 267846 221129 131541 160776 259808 207212 279250 146920 226351 345266 341915
$$ packed form
1368E76473p678L9787J06031N5440l6760j7330m8116K3801k18881O381k2769P2605
1356E28984j13590n0235P1708r0479M9352J24153j16886J89736J99781j92833
1346E99691j19905q262k01037J21241L1073k3690j14812J20506N1555j34435J67187
1335D89112J33610j8021k56933k14177M4759K8718N9338J11086K7458o7084k3944
1324C13922R3699J52130n1219j18201M7998q027q5206L1543l6312j50182O529
1313A96674J65988J55988j83052J11857o5098N6342p4301p9815L4219J9352K9375
1302C67529j00966p2001J51397L7564J2212m1323L1131L2757J81702j28835l05461
1291A65706J02140m6717q9588K9235R9032n2596P2038j32330P9431J18915l351
$$ plain form
1280 341915 305603 159669 201526 368472 569067 398123 372449 250223 237863 226830 220912
1269 220912 268196 213258 185544 189726 144144 288546 311125 277180 292972 128162 146151
1258 146151 249144 460462 392452 363685 471894 335123 307528 347891 344891 454603 337478
1247 337478 371861 351480 389400 406515 484964 553254 581660 472264 341384 399406 554521
1236 554521 498818 347777 383232 320922 256026 414926 342106 245983 180958 267648 152016
1225 152016 47203 173963 195618 206707 330436 232927 68394 148094 112217 169557 244517
1214 244517 220497 331903 483926 423951 329081 179454 139628 113243 113221 138949 236405 186476
1202 186476 471064 489233 483457 281325 214193 226979 166884 159516 315273 176137 207301
$$ packed form
1280C41915l6312j45934M1857J66946K00595j70944k5674j22226j2360j1033n918
1269B20912M7284n4938k7714M182m5582J44402K2579l3945J5792j64810J7989
1258A46151J02993K11318o8010k8767J08209j36771k7595M0363l000J09712j17125
1247C37478L4383k0381L7920J7115P8449O8290K8406j09396j30880N8022J55115
1236E54521n5703j51041L5455o2310o4896J58900p2820r6123o5025Q6690j15632
1225A52016j04813J26760K1655J1089J23729r7509j64533P9700l5877N7340P4960
1214B44517k4020J11406J52023n9975r4870j49627l9826k6385k2K5728R7456m9929
1202A86476K84588J8169n776k02132o7132J2786o0095p368J55757j39136L1164
$$ plain form
1191 207301 223979 36813 129713 177714 359726 395516 179615 48024 217356 233529 359136
1180 359136 328423 207621 10082 21168 239324 262144 293274 479700 441799 497933 440421
1169 440421 364318 241226 371797 262785 359680 469964 260192 45753 250387 284138
1159 284138 158930 222765 371400 418356 398937 255189 165185 222193 67792 -22926 75707
1148 75707 213545 316076 385811 304829 146389 150255 126322 275066 325148 323754 281091
1137 281091 56677 105484 314895 282745 205939 423936 482277 572521 559283 560408 513086
1126 513086 447326 355206 486881 569527 473664 228993 201624 276661 362816 526533 395206
1115 395206 175439 352638 406137 577292 502590 495106 378632 372315 480168 387774 431688
$$ packed form
1191B07301J6678j87166R2900M8001J82012L5790k15901j31591J69332J6173J25607
1180C59136l0713j20802j97539J1086K18156K2820L1130J86426l7901N6134n7512
1169D40421p6103j23092J30571j09012R6895J10284k09772k14439K04634L3751
1159B84138j25208O3835J48635M6956j9419j43748r0004N7008j54401r0718R8633
1148G5707J37838J02531O9735q0982j58440L866k3933J48744N0082j394m2663
1137B81091k24414M8807K09411l2150p6806K17997N8341R0244j3238J125m7322
1126E13086o5760r2120J31675Q2646r5863k44671k7369P5037Q6155J63717j31327
1115C95206k19767J77199N3499J71155p4702p484j16474o317J07853r2394M3914
$$ plain form
1104 431688 511530 419835 395916 333199 606796 537902 458371 540867 598467 593242 534179 568965
1092 568965 458414 606692 564260 389224 514078 604447 461693 452111 490219 600974 721854
1081 721854 755361 676700 799807 701175 811093 696899 872032 1017243 805536 586133
1071 586133 801726 884404 920176 930949 742939 811152 969673 903877 725877 776544 906206
1060 906206 976527 1021973 1256952 1200574 1128781 955561 1186942 1362190 1408852 1308165 1290736
1049 1290736 1295382 1265627 1299480 1289567 1339483 1436351 1409436 1386645 1387435 1518170 1489238 1449623
1037 1449623 1513897 1469430 1521519 1467176 1428158 1537724 1868880 1665173 1593309 1715959 1767613
1026 1767613 1941869 2181138 2262362 2172202 2106155 2095027 2094961 2164477 2341028 2290270 2328497
$$ packed form
1104D31688P9842r1695k3919o2717K73597o8894p9531Q2496N7600n225n9063L4786
1092E68965j10551J48278m2432j75036J24854R0369j42754r582L8108J10755J20880
1081G21854L3507p8661J23107r8632J09918j14194J75133J45211k11707k19403
1071E86133K15593Q2678L5772J0773j88010O8213J58521o5796j78000N0667J29662
1060I06206P0321M5446K34979n6378p1793j73220K31381J75248M6662j00687j7429
1049A290736M646k9755L3853r913M9916R6868k6915k2791P90J30735k8932l9615
1037A449623O4274m4467N2089n4343l9018J09566L31156k03707p1864J22650N1654
1026A767613J74256K39269Q1224r0160o6047j1128o6O9516J76551n0758L8227
$$ plain form
1015 2328497 2369396 2290897 2596147 2698032 2615038 2686410 2713754 2780304 2808380 3027225 3228222
1004 3228222 3305824 3295146 3491839 3674770 3665156 3893933 4154637 4380880 4792552 5070254
994 5070254 5429181 5637964 5773780 6114700 6178104 6558697 6914186 6993004 7277607 7674124
984 7674124 8126329 8427705 8998361 9725585 10261059 10944186 11594478 12531275 13564875 14995342
974 14995342 16100582 16977686 17941699 19274838 20856626 22787339 24884586 27911994 31965886
965 31965886 37533138 44666358 52886996 60108270 67272213 74299227 79533708 79384332
957 79384332 70387191 57813618 45865326 36923927 30675303 26365654 23114580 20480520
949 20480520 18444294 16796004 15624900 14638400 13744529 12998594 12382642 11783875 10994132
$$ packed form
1015B328497M0899p8499L05250J01885q2994P1372K7344O6550K8076K18845K00997
1004C228222P7602j0678J96693J82931r614K28777K60704K26243M11672K77702
994E070254L58927K08783J35816L40920O3404L80593L55489P8818K84603L96517
984G674124M52205L01376N70656P27224N35474O83127O50292R36797J033600J430467
974A4995342J105240Q77104R64013J333139J581788J930713K097247L027408M053892
965C1965886N567252P133220Q220638P221274P163943P027014N234481j49376
957G9384332q997141j2573573j1948292q941399o248624m309649l251074k634060
949B0480520k036226j648290j171104r86500q93871p45935o15952n98767p89743
$$ plain form
940 10994132 10071318 9297703 8708658 8016877 7577346 7233970 6973149 6587038 6321127 6059053
930 6059053 5637287 5448816 5134289 4768897 4576191 4499376 4284149 3987869 3760462 3587314
920 3587314 3396583 3314458 3362504 3125267 3080307 2898023 2853106 2857094 2723826 2622010 2538205
909 2538205 2374781 2084046 1845784 1825314 1796935 1737646 1903322 1963691 1811383 1770095 1785290
898 1785290 1629969 1577271 1541802 1539345 1521729 1496758 1577702 1624194 1863970 1680939 1610999
887 1610999 1490875 1444554 1538210 1459133 1380478 1279277 1355146 1291358 1218394 1281705 1173797
876 1173797 1097230 1013055 945072 883134 1096986 1111449 962003 1046653 980172 827981 804638
865 804638 955495 718695 650742 637912 573082 680900 785740 728379 698722 669002 612289
$$ packed form
940A0994132r22814p73615n89045o91781m39531l43376k60821l86111k65911k62074
930F059053m21766j88471l14527l65392j92706p6815k15227k96280k27407j73148
920C587314j90731q2125M8046k37237m4960j82284m4917L988j33268j01816q3805
909B538205j63424k90735k38262k0470k8379n9289J65676O0369j52308m1288J5195
898A785290j55321n2698l5469k457j7616k4971Q0944M6492K39776j83031o9940
887A610999j20124m6321R3656p9077p8655j01201P5869o3788p2964O3311j07908
876A173797p6567q4175o7983o1938K13852J4463j49446Q4650o6481j52191k3343
865H04638J50857k36800o7953j2830o4830J07818J04840n7361k9657k9720n6713
$$ plain form
854 612289 576231 687169 655323 649576 738646 904522 953689 850665 839637 762904 506865
843 506865 472812 550090 532692 489427 637665 552184 344992 414232 545907 623334 528061
832 528061 441084 567588 410964 307733 495333 493198 602843 522583 317888 287146 340429
821 340429 510746 608562 411633 318465 303469 443533 335077 181508 149105 220615 202630
810 202630 500 52452 45615 297441 346589 367750 393524 276723 86251 237373 388658
799 388658 202971 214263 372895 300847 241327 194948 36217 -16915 -50048 122170 145394
788 145394 73630 157311 110895 135483 263644 248679 176824 131061 126140 59940 47587 75455
776 75455 -45362 193502 186104 112142 141278 -21486 -98172 -11137 127723 -10786 52986
$$ packed form
854F12289l6058J10938l1846n747Q9070J65876M9167j03024j1028p6733k56039
843E06865l4053P7278j7398m3265J48238q5481k07192O9240J31675P7427r5273
832E28061q6977J26504j56624j03231J87600k135J09645q0260k04695l0742N3283
821C40429J70317R7816j96929r3168j4996J40064j08456j53569l2403P1510j7985
810B02630k02130N1952o837K51826M9148K1161K5774j16801j90472J51122J51285
799C88658j85687J1292J58632p2048n9520m6379j58731n3132l3133J72218K3224
788A45394p1764Q3681m6416K4588J28161j4965p1855m5763m921o6200j2353K7868
776G5455j20817K38864p398p3962K9136j62764p6686Q7035J38860j38509O3772
$$ plain form
765 52986 122612 132019 69164 -32550 52906 -46028 90712 17380 -64271 -15332 1683 13633
753 13633 -64563 10019 40943 127037 116545 161364 17443 -119864 -36531 70074 71143 26350
741 26350 185697 116489 -129167 -97735 126642 247579 222088 127115 88275 170890 125477
730 125477 171242 147068 53592 -236816 -199630 -125617 -212418 -142137 -154641 -1000 29643
719 29643 -98262 30322 28580 -20671 -121591 -110336 50775 8003 13741 245542 272687
708 272687 267590 234690 271528 136382 150775 274013 269498 19475 -130 162968 227415
697 227415 180756 94068 17437 68304 127509 32073 96876 -122967 -270604 -103361 -69800
686 -69800 46202 172409 -14398 258053 241912 125385 205374 260617 218991 209615 231421
$$ packed form
765E2986O9626R407o2855j01714Q5456r8934J36740p3332q1651M8939J7015J1950
753A3633p8196P4582L0924Q6094j0492M4819j43921j37307Q3333J06605J069m4793
741B6350J59347o9208k45656L1432K24377J20937k5491r4973l8840Q2615m5413
730A25477M5765k4174r3476k90408L7186P4013q6801P0281j2504J53641L0643
719B9643j27905J28584j742m9251j00920J1255J61111m2772N738K31801K7145
708B72687n097l2900L6838j35146J4393J23238m515k50023j9605J63098O4447
697B27415m6659q6688p6631N0867N9205r5436O4803k19843j47637J67243L3561
686f9800J16002J26207j86807K72451j6141j16527P9989N5243m1626r376K1806
$$ plain form
675 231421 301958 323695 300181 303553 267852 182800 129266 120317 184049 142437 -14231 -77036
663 -77036 78737 -17546 95640 136085 82659 204653 34853 16002 -51243 -86992 -23031
652 -23031 126678 -35764 -165770 -60693 -67778 -80321 -60952 18709 -101170 -157019 -84183
641 -84183 -115691 -194174 -192573 -260857 -182067 121251 152065 109786 57807 103046 53467 48071
629 48071 -26849 -10531 132582 111442 -37515 -179022 -172907 -49817 -16410 8918 -7984
618 -7984 -188972 -242429 -180133 -138949 -4321 225386 13578 -11709 74521 69223 -66539
607 -66539 91614 165863 133753 169533 -38786 -20269 43178 -69041 -19838 61138 -66551
596 -66551 -23634 -203052 -271652 -371995 -283330 -207234 -183081 -106612 -101346 83489 141989 3883
$$ packed form
675B31421P0537K1737k3514L372l5701q5052n3534q949O3732m1612j56668o2805
663g7036J55773r6283J13186M0445n3426J21994j69800j8851o7245l5749O3961
652b3031J49709j62442j30006J05077p085j2543J9369P9661j19879n5849P2836
641h4183l1508p8483J601o8284P8790L03318L0814m2279n1979M5239m9579n396
629D8071p4920J6318J43113k1140j48957j41507O115J23090L3407K5328j6902
618g984j80988n3457O2296M1184J34628K29707k11808k5287Q6230n298j35762
607f6539J58153P4249l2110L5780k08319J8517O3447j12219M9203Q0976j27689
596f6551M2917j79418o8600j00343Q8665P6096K4153P6469N266J84835N8500j38106
$$ plain form
584 3883 -157578 -193246 -74468 114329 33208 -45923 -55953 -143886 -186483 -91289 -48514 -122235
572 -122235 -32681 -59588 -132369 -109845 -123924 -180883 -164436 -238795 -206563 -39093 -31306 -57017
560 -57017 -62280 -203017 -427577 -292724 -167068 -37140 -110537 -152585 -108472 -68801 -89228
549 -89228 -75183 26034 53799 -82980 8543 -65180 -72441 -10925 -138024 -134708 -25014 -44437
537 -44437 -63630 77621 -83501 -137148 -218592 -208018 -172606 -248348 -255023 -331262 -211063 -238376
525 -238376 -176847 24777 -5841 98015 44895 -97052 -227009 -235329 3736 142234 -33227
514 -33227 78514 140758 45603 -59406 -109786 -227870 -233431 -287300 -111754 -32552 -78355
503 -78355 24173 -203525 -361790 -218897 -134847 -213357 -71119 93821 -4216 -255329 -91086
$$ packed form
584C883j61461l5668J18778J88797q1121p9131j0030q7933m2597R5194M2775p3721
572a22235Q9554k6907p2781K2524j4079n6959J6447p4359L2232J67470P787k5711
560e7017n263j40737k24560J34853J25656J29928p3397m2048M4113L9671k0427
549h9228J4045J01217K7765j36779R1523p3723p261O1516j27099L316J09694j9423
537d4437j9193J41251j61122n3647q1444J0574L5412p5742o675p6239J20199k7313
525b38376O1529K01624l0618J03856n3120j41947j29957q320K39065J38498j75461
514c3227J11741O2244r5155j05009n0380j18084n561n3869J75546P9202m5803
503g8355J02528k27698j58265J42893Q4050p8510J42238J64940r8037k51113J64243
$$ plain form
492 -91086 70870 35650 2122 146126 57099 -214026 -166166 -133914 -20790 -98592 -43816
481 -43816 -126976 -245145 -343917 -208181 -262448 -287093 -148797 -317768 -248195 -137769 -47384
470 -47384 -79849 -111292 -132807 -205601 -312243 -164121 -92862 -115856 -92687 -104919 -7920 190595
458 190595 96278 -101427 -178837 -342 -135538 -246617 -250145 -213814 -278718 -276147 -136286
447 -136286 -259230 -392306 -208255 -45369 109905 -62862 -223144 -93244 -190990 -266847
437 -266847 -226330 -255690 -260625 -47096 -94014 -177022 -299005 -373280 -417395 -323760 -298461 -234109
425 -234109 -200445 -152685 -190654 -220553 -166909 -292733 -189289 -227845 -336128 -196514 -192136
414 -192136 -215241 -133482 -92700 -112163 -234429 -369935 -238818 -178118 -211421 -490173 -429417
$$ packed form
492i1086J61956l5220l3528J44004q9027k71125M7860L2252J13124p7802N4776
481d3816q3160j18169r8772J35736n4267k4645J38296j68971O9573J10426R0385
470d7384l2465l1443k1515p2794j06642J48122P1259k2994K3169j2232R6999J98515
458A90595r4317j97705p7410J78495j35196j11079l528L6331o4904K571J39861
447a36286j22944j33076J84051J62886J55274j72767j60282J29900r7746p5857
437b66847M0517k9360m935K13529m6918q3008j21983p4275m4115R3635K5299O4352
425b34109L3664M7760l7969k9899N3644j25824J03444l8556j08283J39614M378
414a92136k3105Q1759M0782j9463j22266j35506J31117O0700l3303k78752O0756
$$ plain form
403 -429417 -158306 -191745 -190837 -179923 24912 50231 -151583 -207284 -233133 -203413 -181128 -136708
391 -136708 -154936 -204647 -360889 -283759 -175895 -156155 -134428 -133014 -80480 -85452 -14344 -45618
379 -45618 -28756 -93420 -184533 -185288 -343181 -271709 -20673 -9113 -114575 -27353 -70063 -20722
367 -20722 -137499 -167261 -208608 -352645 -320057 -278673 -427996 -282168 -141789 -267167 -289291
356 -289291 -227929 -199632 -125665 -227762 -467814 -248030 -219243 42177 -225227 -170616 -178745
345 -178745 -296081 -210823 -162769 -167784 -279249 -274587 -348775 -376757 -255989 -228751 -181102 -94679
333 -94679 -89824 -147124 -163587 -302113 -101005 -136189 -210161 -179651 -316412 -281503 -281434 -265883
321 -265883 -129487 -155834 -228919 -488271 -487888 -320827 -325924 -529049 -383220 -154948 20988
$$ packed form
403d29417K71111l3439R08J0914K04835K5319k01814n5701k5849K9720K2285M4420
391a36708j8228m9711j56242P7130J07864J9740K1727J414N2534m972P1108l1274
379d5618J6862o4664r1113p55j57893P1472K51036J1560j05462Q7222m2710M9341
367b0722j16777k9762m1347j44037L2588M1384j49323J45828J40379j25378k2124
356b89291O1362K8297P3967j02097k40052K19784K8787K61420k67404N4611q129
345a78745j17336Q5258M8054n015j11465M662p4188k7982J20768K7238M7649Q6423
333i4679M855n7300j6463j38526K01108l5184p3972L0510j36761L4909O9J5551
321b65883J36396k6347p3085k59352L83J67061n097k03125J45829K28272J75936
$$ plain form
310 20988 187866 60103 -18053 -254329 -235724 -203034 -223234 -328071 -380509 -370226 -274441
299 -274441 -242051 -293222 -342108 -353432 -374543 -449003 -574687 -317012 -326129 -310648 -223654 -250918
287 -250918 -254869 -242994 -272419 -388760 -382221 -420950 -426042 -377495 -332367 -293856 -297907 -234433
275 -234433 -354860 -330254 -122876 -195802 -323183 -355638 -513436 -373581 -245455 -344377 -289623
264 -289623 -288255 -330078 -419667 -473984 -284035 -177717 -231664 -299338 -159125 -80886 -33096
253 -33096 -228516 -209404 -144545 -237524 -363801 -188294 -210331 -199666 -256228 -132826 -200588
242 -200588 -359180 -461693 -386839 -207099 -338042 -124530 -329637 -398140 -345081 -254300 -188652
231 -188652 -158369 -86823 -230161 -193533 -271169 -267406 -159635 -246155 -445331 -473057 -380036
$$ packed form
310B0988J66878j27763p8156k36276J8605L2690k0200j04837n2438J0283R5785
299b74441L2390n1171m8886j1324k1111p4460j25684K57675r117J5481Q6994k7264
287b50918l951J1875k9425j16341O539l8729n092M8547M5128L8511m051O3474
275b34433j20427K4606K07378p2926j27381l2455j57798J39855J28126r8922N4754
264b89623J368m1823q9589n4317J89949J06318n3947o7674J40213P8239M7790
253c3096j95420J9112O4859r2979j26277J75507k2037J0665n6562J23402o7762
242b00588j58592j02513P4854J79740j30943K13512k05107o8503N3059R0781O5648
231a88652L0283P1546j43338L6628p7636L763J07771q6520j99176k7726R3021
$$ plain form
220 -380036 -523425 -434312 -473842 -328391 -231453 -170431 -281918 -218852 -311604 -483617 -317126
209 -317126 -364605 -314237 -205625 -314902 -289146 -305978 -263318 -325755 -274870 -343557 -326399
198 -326399 -155461 -259354 -404561 -361281 -245126 -453877 -400687 -216137 -335870 -250315
188 -250315 -228912 -324325 -331638 -420231 -341991 -279779 -167887 -193585 -213612 -150652 -362747 -470423
176 -470423 -502909 -386956 -328267 -299993 -325461 -387668 -385045 -409224 -401533 -484671 -410712 -196030
164 -196030 -177143 -215651 -247699 -402653 -438000 -273869 -293196 -270736 -336421 -448547 -408802
153 -408802 -513962 -601799 -515295 -496440 -441346 -340378 -450526 -544696 -409028 -265281 -440893
142 -440893 -393760 -206921 -179995 -294860 -479261 -562449 -481769 -350181 -262712 -456875 -622913
$$ packed form
220c80036j43389Q9113l9530J45451R6938O1022j11487O3066r2752j72013J66491
209c17126m7479N0368J08612j09277K5756j6832M2660o2437N0885o8687J7158
198c26399J70938j03893j45207M3280J16155k08751N3190J84550j19733Q5555
188b50315K1403r5413p313q8593P8240O2212J11892k5698k0027O2960k12095j07676
176d70423l2486J15953N8689K8274k5468o2207K623k4179P691q3138P3959K14682
164a96030J8887l8508l2048j54954l5347J64131j9327K2460o5685j12126L9745
153d08802j05160q7837Q6504J8855N5094J00968j10148r4170J35668J43747j75612
142d40893M7133J86839K6926j14865j84401q3188Q0680J31588Q7469j94163j66038
$$ plain form
131 -622913 -532781 -558323 -448149 -477810 -366607 -256910 -253265 -306080 -273177 -220744 -376869
120 -376869 -491886 -504415 -366462 -413912 -431143 -524152 -534589 -482426 -454316 -511068 -445616
109 -445616 -496097 -532603 -500515 -498089 -516782 -478100 -399724 -326385 -329926 -249921 -171576 -249232
97 -249232 -284752 -450168 -480829 -444180 -551026 -546225 -426310 -490514 -460040 -432502 -369438 -295564
85 -295564 -356793 -495697 -461304 -459187 -386806 -395772 -308821 -264508 -342568 -270079 -402214 -538567
73 -538567 -540464 -410225 -391181 -435082 -558108 -468637 -449491 -492627 -499183 -355666 -292807 -327475
61 -327475 -284692 -327395 -422724 -478203 -562693 -422435 -293515 -380286 -486532 -382521 -424163
50 -424163 -410020 -369868 -459349 -489598 -503937 -428159 -582819 -561695 -415896 -519307 -593689
$$ packed form
131f22913R0132k5542J10174k9661J11203J09697L645n2815L2903N2433j56125
120c76869j15017j2529J37953m7450j7231r3009j0437N2163K8110n6752O5452
109d45616n0481l6506L2088K426j8693L8682P8376P3339l541Q0005P8345p7656
97b49232l5520j65416l0661L6649j06846M801J19915o4204L0474K7538O3064P3874
85b95564o1229j38904L4393K117P2381q966Q6951M4313p8060P2489j32135j36353
73e38567j897J30239J9044m3901j23026Q9471J9146m3136o556J43517O2859l4668
61c27475M2783m2703r5329n5479q4490J40258J28920q6771j06246J04011m1642
50d24163J4143M0152q9481l0249j4339P5778j54660K1124J45799j03411p4382
$$ plain form
39 -593689 -627690 -587450 -428053 -242336 -237762 -307142 -375771 -423936 -382884 -471831 -467563 -529941
27 -529941 -471884 -530629 -516085 -489067 -522262 -442447 -374468 -403342 -468016 -388879 -372712 -440609
15 -440609 -521077 -510842 -440051 -495241 -458957 -481601 -431020 -428787 -524262 -510366 -558943 -551203
3 -551203 -577961 -608816 -434822
0 -434822
$$ packed form
39e93689l4001M0240J59397J85717M574o9380o8629m8165M1052q8947M268o2378
27e29941N8057n8745J4544K7018l3195P9815O7979k8874o4674P9137J6167o7897
15d40609q0468J0235P0791n5190L6284k2644N0581K233r5475J3896m8577P740
3e51203k6758l0855J73994
0d34822
$$ Imaginary data points
##PAGE= N=2
##DATA TABLE= (X++(I..I)), XYDATA
$$ plain form
16383 -4561106 -4645480 -4677054 -4563744 -4498781 -4480873 -4313018 -4169619 -4159356 -4245306 -4197911 -4074325
16372 -4074325 -4029289 -4022213 -3922237 -3820654 -3790893 -3714729 -3810032 -3760824 -3637733 -3664530 -3684852
16361 -3684852 -3616120 -3498980 -3432044 -3428468 -3307027 -3196665 -3088677 -3117440 -3202217 -3044334
16351 -3044334 -3012552 -2991773 -2877340 -2755141 -2819998 -2858615 -2886732 -2987785 -2984891 -2818798 -2593825
16340 -2593825 -2531888 -2489192 -2545389 -2317420 -2281706 -2443002 -2294897 -2298602 -2333800 -2243035 -2078350
16329 -2078350 -2040610 -1919430 -1909893 -1899415 -1894927 -1930003 -1876169 -1825437 -1670473 -1588649 -1499778
16318 -1499778 -1488766 -1375619 -1330969 -1292164 -1212270 -1293750 -1262499 -1272466 -1243267 -1183771 -1000481
16307 -1000481 -1062357 -1033938 -983356 -904188 -670519 -736003 -782232 -853462 -1008641 -787026 -739483
$$ packed form
16383d561106q4374l1574J13310O4963J7908J67855J43399J0263q5950M7395J23586
16372d074325M5036P076R9976J01583K9761P6164r5303M9208J23091k6797k0322
16361c684852O8732J17140O6936L576J21441J10362J07988k8763q4777J57883
16351c044334L1782K0779J14433J22199o4857l8617k8117j01053K894J66093K24973
16340b593825O1937M2696n6197K27969L5714j61296J48105l705l5198R0765J64685
16329b078350L7740J21180R537J0478M488l5076N3834N0732J54964Q1824Q8871
16318a499778J1012J13147M4650L8805P9894q1480L1251r967K9199N9496J83290
16307a000481o1876K8419N0582P9168K33669o5484m6229p1230j55179K21615M7543
$$ plain form
16296 -739483 -763967 -717455 -753921 -655814 -552677 -513725 -411898 -463487 -515967 -387030 -375425
16285 -375425 -328390 -241993 -263003 -123765 -70383 -210801 -5179 -36113 -174650 -29099
16275 -29099 41501 -7129 91758 75091 259775 226733 222503 293327 352554 328056 351135 468374
16263 468374 382142 431351 495643 584614 712529 672950 570502 445870 486265 559076 638282
16252 638282 655094 788779 831335 699604 833443 783325 1000763 1253297 1144161 991316
16242 991316 935304 938825 1111433 1157928 1095413 1211104 1284503 1381740 1272966 1487095 1421890
16231 1421890 1398687 1371666 1344886 1250368 1336480 1593287 1586023 1658673 1599380 1730056 1596262
16220 1596262 1467364 1656120 1575902 1638039 1653696 1590670 1502702 1604698 1852891 1753105
$$ packed form
16296g39483k4484M6512l6466R8107J03137L8952J01827n1589n2480J28937J1605
16285c75425M7035Q6397k1010J39238N3382j40418K05622l0934j38537J45551
16275b9099P0600m8630R8887j6667J84684l3042m230P0824N9227k4498K3079J17239
16263D68374q6232M9209O4292Q8971J27915l9579j02448j24632M0395P2811P9206
16252F38282J6812J33685M2556j31731J33839n0118K17438K52534j09136j52845
16242I91316n6012L521J72608M6495o2515J15691P3399R7237j08774K14129o5205
16231A421890k3203k7021k6780r4518Q6112K56807p264P2650n9293J30676j33794
16220A596262j28898J88756q0218O2137J5657o3026q7968J01996K48193r9786
$$ plain form
16210 1753105 1876254 1826001 1956395 1955938 1958515 1935358 1810517 1928035 1971228 1995706 2076628
16199 2076628 1969660 1910955 2044271 2094204 2233712 2134880 2105516 1959004 1904041 2046451
16189 2046451 1975627 1999779 1942003 1921560 2015292 2140370 1988015 1910112 2193937 2250538 2167184
16178 2167184 2155982 2111752 2275813 2181768 2187597 2203986 2180835 2362002 2482515 2524318 2566283
16167 2566283 2448001 2365280 2333279 2337790 2365107 2430230 2484568 2405109 2515487 2648326 2702463
16156 2702463 2672234 2593516 2515108 2627312 2604852 2538601 2553097 2551918 2559480 2491268 2762829
16145 2762829 2609141 2538362 2481956 2504188 2503880 2538788 2574386 2519086 2725760 2760855 2553811
16134 2553811 2512938 2559227 2621700 2758375 2626663 2648692 2584753 2565298 2644327 2627860 2683174
$$ packed form
16210A753105J23149n0253J30394m57K577k3157j24841J17518M3193K4478Q0922
16199B076628j06968n8705J33316M9933J39508r8832k9364j46512n4963J42410
16189B046451p0824K4152n7776k0443R3732J25078j52355p7903K83825N6601q3354
16178B167184j1202m4230J64061r4045N829J6389k3151J81167J20513M1803M1965
16167B566283j18282q2721l2001M511K7317O5123N4338p9459J10378J32839N4137
16156B702463l0229p8718p8408J12204k2460o6251J4496j179P562o8212K71561
16145B762829j53688p0779n6406K2232l08L4908L5598n5300K06674L5095k07044
16134B553811m0873M6289O2473J36675j31712K2029o3939j9455P9029j6467N5314
$$ plain form
16123 2683174 2610878 2819478 2877862 2766528 2686319 2742739 2862280 2725007 2620670 2759197
16113 2759197 2782932 2867510 2861022 2874776 2785153 2800621 2842862 2919748 2916589 2727847 2832949
16102 2832949 2710224 2896171 2977040 2896594 2729327 2764723 2736993 2773551 2808558 2707523
16092 2707523 2739662 2707052 2665052 2823706 2908654 2965214 2928253 2799728 2722394 2889442 2881093
16081 2881093 3014651 2967939 2804156 2872970 2845359 2810528 3025105 2941231 2971418 3074605
16071 3074605 3143169 3161077 3070562 3000556 2908796 2870536 3114625 2993247 2812891 2957373
16061 2957373 2963448 3069496 3068945 2973297 2981830 2914309 2807201 2855027 3018285 3030004 3008513
16050 3008513 3105366 3100214 2903544 2797195 2756249 2840828 2973324 2914311 2886646 2911202 2837215
$$ packed form
16123B683174p2296K08600N8384j11334q0209N6420J19541j37273j04337J38527
16113B759197K3735Q4578o488J3754q9623J5468M2241P6886l159j88742J05102
16102B832949j22725J85947Q0869q0446j67267L5396k7730L6558L5007j01035
16092B707523L2139l2610m2000J58654Q4948N6560l6961j28525p7334J67048q349
16081B881093J33558m6712j63783O8814k7611l4831K14577q3874L0187J03187
16071C074605O8564J7908r0515p0006r1760l8260K44089j21378j80356J44482
16061B957373O075J06048n51r5648Q533o7521j07108M7826J63258J1719k1491
16050C008513R6853n152j96670j06349m0946Q4579J32496n9013k7665K4556p3987
$$ plain form
16039 2837215 2878132 2937387 2829095 2832534 2737887 2751653 2942827 2960474 2896622 2911555 2956703
16028 2956703 3002850 2840302 2753251 2876920 3095692 3107502 3051032 3081264 3114264 2943477
16018 2943477 3057685 3101742 3010904 2950589 2979510 3117999 3209298 3277731 3220964 3174684 3023626
16007 3023626 2976515 2912368 2848596 2882735 2800557 2872690 2951530 2897376 2888480 2868544 2828469
15996 2828469 3003461 3024873 2775068 2866347 2997508 2967821 2813626 2782146 2967910 2828866
15986 2828866 2923554 2811120 3021452 3186348 3172433 3101147 3093308 2985779 2959202 2869448 2929132
15975 2929132 2858462 3033578 3024926 2936419 3019763 2905969 3105258 3116134 3085068 3007573 3071264
15964 3071264 3103178 2983233 2934277 3032053 3005111 2949168 2844544 2941354 3247604 3209706 3054312
$$ packed form
16039B837215M0917N9255j08292L439r4647J3766J91174J7647o3852J4933M5148
16028B956703M6147j62548q7051J23669K18772J1810n6470L0232L3000j70787
16018B943477J14208M4057r0838o0315K8921J38489R1299O8433n6767m6280j51058
16007C023626m7111o4147o3772L4139q2178P2133P8840n4154q896j9936m0075
15996B828469J74992K1412k49805R1279J31161k9687j54195l1480J85764j39044
15986B828866R4688j12434K10332J64896j3915p1286p839j07529k6577q9754N9684
15975B929132p0670J75116q652q8507Q3344j13794J99289J0876l1066p7495O3691
15964C071264L1914j19945m8956R7776k6942n5943j04624R6810L06250l7898j55394
$$ plain form
15953 3054312 3046680 3058584 2937882 2977342 2998559 2876956 2903735 2865386 2951308 2951843 2915992
15942 2915992 2889904 2941726 2945908 2906341 2798866 2860282 2967789 3015063 2945237 2940552 2950828
15931 2950828 3014458 3219269 3122521 3023901 2874386 2969931 2958929 2871313 2915129 2961576 3034913
15920 3034913 2953426 3085921 2889056 2934226 3120991 3184478 3202530 3060917 3039517 2955659
15910 2955659 2875706 2935575 2949618 3079667 2977829 3049120 2993557 3050599 2955065 2866834 2762376
15899 2762376 2810279 2934656 3009193 3046618 3010084 3154203 3083106 3049071 3211133 3105043
15889 3105043 2966411 3030623 3072838 3285906 2955071 2944137 3042003 2939809 2999414 3172948
15879 3172948 3345624 3248923 3131389 2996334 2943941 3043809 3064607 3019037 3017241 2968317 3024681
$$ packed form
15953C054312p632J1904j20702L9460K1217j21603K6779l8349Q5922N35l5851
15942B915992k6088N1822M182l9567j07475O1416J07507M7274o9826m685J0276
15931B950828O3630K04811r6748r8620j49515R5545j1002q7616M3816M6447P3337
15920C034913q1487J32495j96865M5170J86765O3487J8052j41613k1400q3858
15910B955659p9953N9869J4043J30049j01838P1291n5563N7042r5534q8231j04458
15899B762376M7903J24377P4537L7425l6534J44119p1097l4035J62062j06090
15889C105043j38632O4212M2215K13068l30835j0934R7866j02194N9605J73534
15879C172948J72676r6701j17534j35055n2393R9868K0798m5570j796m8924N6364
$$ plain form
15868 3024681 2968258 2920965 3112778 2970748 2865891 2879179 2958847 2963317 2966371 2924826 2797226
15857 2797226 2764971 2755189 2952711 3066677 3128672 2981872 2967520 2974836 2955059 2926808 2785253
15846 2785253 2880077 2967910 3086943 3047873 3071590 2992423 2938775 2946479 2759819 3047344 3121585
15835 3121585 3061680 3069467 2825407 2723874 2864734 2824856 3019505 3142154 3137657 3100591 3067548
15824 3067548 2997400 2901492 2961729 2881518 2936739 3041609 3127789 3107821 3115031 3009522 3085396
15813 3085396 2884833 2710058 2845451 2975352 2965186 2826433 2759489 2982386 3144987 2816835
15803 2816835 2636486 2749434 2961674 2873533 2808190 3157071 3129956 3030875 3103178 2869285
15793 2869285 2851799 2935142 2876029 2822944 2747530 2828064 2776627 2725570 2768921 2906744 3010632
$$ packed form
15868C024681n6423m7293J91813j42030j04857J3288P9668M470L054m1545j27600
15857B797226l2255r782J97522J13966O1995j46800j4352P316j9777k8251j41555
15846B785253R4824Q7833J19033l9070K3717p9167n3648P704j86660K87525P4241
15835C121585n9905P787k44060j01533J40860l9878J94649J22649m497l7066l3043
15824C067548p0148r5908O0237q0211N5221J04870Q6180j9968P210j05509P5874
15813C085396k00563j74775J35393J29901j0166j38753o6944K22897J62601l28152
15803B816835j80349J12948K12240q8141o5343L48881k7115r9081P2303k33893
15793B869285j7486Q3343n9113n3085p5414Q0534n1437n1057M3351J37823J03888
$$ plain form
15782 3010632 3117682 3029823 2982118 2751593 2891530 2795329 2986686 3010521 2912954 2977366
15772 2977366 3257096 3198621 3334379 3129466 2857668 3171361 3030181 3064942 3051560 3076012
15762 3076012 2875268 2895594 2871133 2834801 2812013 2830466 2865192 2983163 3071391 3076173 3173641
15751 3173641 2996135 2869846 2913818 2904634 3112727 3124964 3058573 2876990 2816988 2945876
15741 2945876 3069449 2969110 2991831 3024476 2942627 2762364 2887242 3005376 3055944 3101246
15731 3101246 3014707 3052076 3001217 2828108 2900432 2802408 2749388 2938861 3192990 3109422 3104513
15720 3104513 2996992 2955371 2972728 3070175 3064358 3201490 3018608 2842798 2932844 2972160 3032193
15709 3032193 3055576 2923529 2866571 2955763 2982136 2975683 3089152 2952789 2905186 3114101 3043222
$$ packed form
15782C010632J07050q7859m7705k30525J39937r6201J91357K3835r7567O4412
15772B977366K79730n8475J35758k04913k71798L13693j41180L4761j3382K4452
15762C076012k00744K0326k4461l6332k2788J8453L4726J17971Q8228M782R7468
15751C173641j77506j26289M3972r184K08093J2237o6391j81583o0002J28888
15741B945876J23573j00339K2721L2645q1849j80263J24878J18134N0568M5302
15731C101246q6539L7369n0859j73109P2324r8024n3020J89473K54129q3568m909
15720C104513j07521m1621J7357R7447n817J37132j82882j75810R0046L9316O0033
15709C032193K3383j32047n6958Q9192K6373o453J13469j36363m7603K08915p0879
$$ plain form
15698 3043222 2981184 3076462 3104423 3040035 3097301 2982623 2931613 2981388 3047412 2902567 3058673
15687 3058673 3079955 3201040 3108011 3071240 3074766 3042783 2916245 2960440 2998139 3113207 3131951
15676 3131951 3033306 3019637 3015460 3124259 3125475 3075892 2916762 2750344 2797748 2847178 3115245
15665 3115245 3159567 3067000 3052774 3182383 3084829 2954971 3021896 3207066 3185038 3036689
15655 3036689 2931722 3075584 3074560 3179058 3339342 3176585 3129813 3186373 3079689 3095741
15645 3095741 3122057 3064539 2986130 2828354 2864929 2955483 3042496 2906989 2956061 3138538 3055316
15634 3055316 2803224 2695898 2645008 2700549 2847701 3034625 3019125 2991430 3044403 3208043
15624 3208043 2952824 3010787 3029747 3178627 3178710 3010964 2901354 2870307 2926507 2885931 2842031
$$ packed form
15698C043222o2038R5278K7961o4388N7266j14678n1010M9775O6024j44845J56106
15687C058673K1282J21085r3029l6771L526l1983j26538M4195L7699J15068J8744
15676C131951r8645j3669m177J08799J216m9583j59130j66418M7404M9430K68067
15665C115245M4322r2567j4226J29609r7554j29858O6925J85170k2028j48349
15655C036689j04967J43862j024J04498J60284j62757m6772N6560j06684J6052
15645C095741K6316n7518p8409j57776L6575R0554Q7013j35507M9072J82477q3222
15634C055316k52092j07326n0890N5541J47152J86924j5500k7695N2973J63640
15624C208043k55219N7963J8960J48880Q3j67746j09610l1047N6200m0576m3900
$$ plain form
15613 2842031 3081237 3138766 3139235 3027473 2920969 2983685 2964294 2978252 2849907 2944067 2996087
15602 2996087 2963915 3030561 3071376 3132904 3121342 3043327 3065778 3033284 3064169 3084022 3102845
15591 3102845 3225088 3263709 3224608 3249474 3199811 3126706 2988283 3070535 3184748 3202710 3208720
15580 3208720 3247722 3413525 3467927 3301205 3313411 3246762 3166010 3151945 3064912 3095451 2989787
15569 2989787 3048942 2903702 3007704 3139885 3162023 3371984 3222936 3085252 2974843 2857119
15559 2857119 2919978 3088267 2845606 2713141 2873444 3131652 3265785 3104669 3147219 3109228
15549 3109228 3070935 3084673 3038404 3048384 2913810 2793914 2901058 3002871 3030194 2955536 2834181
15538 2834181 2920210 2930052 2879626 2895169 3068386 2896082 2816939 2946895 3165888 3047418
$$ packed form
15613B842031K39206N7529M69j11762j06504O2716j9391J3958j28345R4160N2020
15602B996087l2172O6646M0815O1528j1562p8015K2451l2494L0885J9853J8823
15591C102845J22243L8621l9101K4866m9663p3105j38423Q2252J14213J7962O010
15580C208720L9002J65803N4402j66722J2206o6649q0752j4065q7033L0539j05664
15569B989787N9155j45240J04002J32181K2138K09961j49048j37684j10409j17724
15559B857119O2859J68289k42661j32465J60303K58208J34133j61116M2550l7991
15549C109228l8293J3738m6269R980j34574j19896J07144J01813K7323p4658j21355
15538B834181Q6029R842n0426J5543J73217j72304p9143J29956K18993j18470
$$ plain form
15528 3047418 3114553 3215005 3194864 3215410 3198855 3072134 3053080 3097363 3171479 3239533 3180705
15517 3180705 3015944 2822972 2931232 3048444 3051272 2928938 2932639 2869785 2864286 2986224 3161141
15506 3161141 3043031 2990187 3176071 3058740 2995021 3045799 2890463 2922411 2981100 3067874
15496 3067874 3000353 3006870 3136371 3310039 3226837 3167259 2983837 2917880 2850680 2910701 2900179
15485 2900179 2761521 2941258 2959394 2980882 3019892 2885939 3025187 3210179 3068524 3061194
15475 3061194 2945955 2904731 2944940 3033003 3096630 2955653 2917393 3048376 3064468 3002634 2996985
15464 2996985 3065697 3105886 3069561 3068519 3097957 3045835 3159670 3011490 3130523 3098310 3050147
15453 3050147 3007281 2993111 3095284 3100438 3069817 3075660 2979248 2901946 3071048 3006892 2999201
$$ packed form
15528C047418O7135J00452k0141K0546j6555j26721j9054M4283P4116O8054n8828
15517C180705j64761j92972J08260J17212K828j22334L701o2854n499J21938J74917
15506C161141j18110n2844J85884j17331o3719N0778j55336L1948N8689Q6774
15496C067874o7521O517J29501J73668q3202n9578j83422o5957o7200O0021j0522
15485B900179j38658J79737J8136K1488L9010j33953J39248J84992j41655p330
15475C061194j15239m1224M0209Q8063O3627j40977l8260J30983J6092o1834n649
15464B996985O8712M0189l6325j042K9438n2122J13835j48180J19033l2213m8163
15453C050147m2866j4170J02173N154l0621N843r6412p7302J69102o4156p691
$$ plain form
15442 2999201 3018907 2967794 2844337 2884867 3069845 3172565 3060529 3175358 3244518 3140750
15432 3140750 3195773 3227510 3055982 2967244 2835311 2848076 3035544 3064577 2994446 3192399
15422 3192399 3093067 2947660 2894755 2963375 2951704 2785535 2915201 3124508 3021625 2969847
15412 2969847 3092041 3125777 3354248 3320134 3265436 3164611 3028974 2970994 2803913 2892854
15402 2892854 3004895 2963705 2881952 3136083 3244158 3132030 3027850 3066065 3023516 3010351
15392 3010351 3133317 3071765 2999772 3083565 3212283 3159258 3155828 3176046 3205000 3102845 2761954
15381 2761954 2866174 3154707 3048769 2991695 2950475 3071551 3199381 3162545 3115709 3167219
15371 3167219 3033840 3167769 3292279 3203472 3197370 3133281 2991041 3063619 3159365 3195723 3157772
$$ packed form
15442B999201J9706n1113j23457M0530J84978J02720j12036J14829O9160j03768
15432C140750N5023L1737j71528q8738j31933J2765J87468K9033p0131J97953
15422C192399r9332j45407n2905O8620j1671j66169J29666K09307j02883n1778
15412B969847J22194L3736K28471l4114n4698j00825j35637n7980j67081Q8941
15402B892854J12041m1190q1753K54131J08075j12128j04180L8215m2549j3165
15392C010351J22966o1552p1993Q3793J28718n3025l430K0218K8954j02155l40891
15381B761954J04220K88533j05938n7074m1220J21076J27830l6836m6836N1510
15371C167219j33379J33929J24510q8807o102o4089j42240P2578R5746L6358l7951
$$ plain form
15360 3157772 3046058 3045767 2954936 2933398 2979239 3119268 3211654 3159716 3151786 3083539 2969216
15349 2969216 2916867 3066155 3132361 3079729 3118395 3090343 3098340 3134717 3161808 3297348 3181053
15338 3181053 3068691 3092946 3028942 3104842 3291835 3197268 2975065 3070569 3084651 2971670
15328 2971670 2999432 3043963 3015035 3006286 3027711 3010164 3164432 3216051 3099555 3012319 3109338
15317 3109338 3288184 3359711 3285618 3260368 3175134 3103740 2925618 3130722 3323225 3516879
15307 3516879 3272471 3051686 3279291 3221730 3080618 3041791 3069553 2977309 3087878 3108221
15297 3108221 3114891 3165265 3072810 2982815 2953828 3039571 3118950 3110897 3177738 3124388 3281133
15286 3281133 3315555 3108780 3216131 3115669 2918483 2975702 3132372 3268089 3111237 3162391
$$ packed form
15360C157772j11714k91r0831k1538M5841J40029R2386n1938p930o8247j14323
15349B969216n2349J49288O6206n2632L8666k8052P997L6377K7091J35540j16295
15338C181053j12362K4255o4004P5900J86993r4567k22203R5504J4082j12981
15328B971670K7762M4531k8928q749K1425j7547J54268N1619j16496q7236R7019
15317C109338J78846P1527p4093k5250q5234p1394j78122K05104J92503J93654
15307C516879k44408k20785K27605n7561j41112l8827K7762r2244J10569K0343
15297C108221O670N0374r2455q9995k8987Q5743P9379q053O6841n3350J56745
15286C281133L4422k06775J07351j00462j97186N7219J56670J35717j56852N1154
$$ plain form
15276 3162391 3185753 3180202 3140794 3058413 3060745 3109143 3134318 3054233 2942216 2978600 3020657
15265 3020657 3163682 3104879 2871507 2897288 3142515 3098071 3059301 3077038 3011492 3119443
15255 3119443 3196345 3031069 2981361 2997575 3177041 3236991 3143300 3164127 3226868 3246255 3144949
15244 3144949 3173615 3199972 3260341 3386545 3142530 3002029 3139180 3245231 3155566 3120750
15234 3120750 3206404 3131845 3084051 3116652 3161399 3155608 3043131 3118942 3123602 3039938 3074263
15223 3074263 2996466 3054781 3043306 3046842 3025267 3079161 3111370 3203521 3283498 3158946 3243307
15212 3243307 3324345 3213901 3083692 3100596 2976968 2985267 3012683 3077331 3272183 3155398
15202 3155398 2945599 2902712 3081666 3118817 3108397 3037661 3124056 3185604 3180402 3193620 3198746
$$ packed form
15276C162391K3362n551l9408q2381K332M8398K5175q0085j12017L6384M2057
15265C020657J43025n8803k33372K5781K45227m4444l8770J7737o5546J07951
15255C119443P6902j65276m9708J6214J79466N9950r3691K0827O2741J9387j01306
15244C144949K8666K6357O0369J26204k44015j40501J37151J06051q9665l4816
15234C120750Q5654p4559m7794L2601M4747n791j12477P5811M660q3664L4325
15223C074263p7797N8315j1475L536k1575N3894L2209R2151P9977j24552Q4361
15212C243307Q1038j10444j30209J6904j23628Q299K7416O4648J94852j16785
15202C155398k09799m2887J78954L7151j0420p0736Q6395O1548n202J3218N126
$$ plain form
15191 3198746 3155131 3125237 3245515 3217863 3015499 3120930 3093432 3165192 3151399 3089752 3089885
15180 3089885 2993915 3121517 3013280 3026041 3045329 2893325 2989319 3037233 2995170 3011332 3247375
15169 3247375 3187405 3182861 3107181 3111191 3257438 3217461 3041950 3122996 3141529 3203080 3262540
15158 3262540 3163271 3164861 3193592 3205610 3135628 3225153 3320089 3384271 3377175 3227512 3241725
15147 3241725 3280338 3152490 3345131 3266935 3239679 3312386 3175132 3058069 3054947 3144334 3156297
15136 3156297 3100618 3217350 3119958 3081020 3020136 2977256 2951712 3127815 3187772 3236038 3220218
15125 3220218 3243930 3194646 3115152 2983762 3068257 3195843 3187592 3241428 3120157 3121454 3212609
15114 3212609 3265875 3286276 3324748 3158414 3198711 3193988 3166973 3324157 3251647 3245928 3316025
$$ packed form
15191C198746m3615k9894J20278k7652k02364J05431k7498P1760j3793o1647J33
15180C089885r5970J27602j08237J2761J9288j52004R5994M7914m2063J6162K36043
15169C247375n9970m544p5680M010J46247l9977j75511Q1046J8533O1551N9460
15158C262540r9269J590K8731J2018o9982Q9525R4936O4182p096j49663J4213
15147C241725L8613j27848J92641p8196k7256P2707j37254j17063l122Q9387J1963
15136C156297n5679J16732r7392l8938o0884m2880k5544J76103N9957M8266j5820
15125C220218K3712m9284p9494j31390Q4495J27586q251N3836j21271J297R1155
15114C212609N3266K0401L8472j66334M0297m723k7015J57184p2510n719P0097
$$ plain form
15103 3316025 3250868 3120026 3047162 3284898 3330318 3335516 3286877 3417942 3370612 3271114 3367993
15092 3367993 3416713 3436838 3445251 3420215 3308808 3374511 3424842 3295209 3221327 3310101 3463055
15081 3463055 3504494 3344167 3296319 3315237 3148251 3262323 3215163 3191844 3336652 3188572
15071 3188572 3234057 3382780 3269689 3140700 3200677 3096919 3169134 3318721 3157157 3190868
$$ packed form
15103C316025o5157j30842p2864K37736M5420N198m8639J31065m7330r9498R6879
15092C367993M8720K0125Q413k5036j11407O5703N0331j29633p3882Q8774J52954
15081C463055M1439j60327m7848J8918j66986J14072m7160k3319J44808j48080
15071C188572M5485J48723j13091j28989N9977j03758P2215J49587j61564L3711
$$ [...]
##END NTUPLES=NMR SPECTRUM
##END=
