##TITLE=1H_CG-1141-3
 CDCl3, 8 sc, 
 1.07.2021
##JCAMPDX= 6.0         $$ Bruker NMR JCAMP-DX V2.0
##DATA TYPE= NMR SPECTRUM
##DATA CLASS= NTUPLES
##ORIGIN= UXNMR, Bruker Analytische Messtechnik GmbH
##OWNER= root
$$ XWIN-NMR		Version 3.5
$$ Thu Jul  1 10:25:06 2021 Russian Standard Time (UT+4h)  she@DPX200
##.OBSERVE FREQUENCY= 200.131506
##.OBSERVE NUCLEUS= ^1H
##.ACQUISITION MODE= SIMULTANEOUS
##.ACQUISITION SCHEME= undefined
##.AVERAGES= 8
##.DIGITISER RES= 18
##SPECTROMETER/DATA SYSTEM= spect
##.PULSE SEQUENCE= zg30
##.SOLVENT NAME= CDCl3
##.SHIFT REFERENCE= (INTERNAL, CDCl3, 0, 17.5044)
##AUDIT TRAIL= $$ (NUMBER, WHEN, WHO, WHERE, WHAT)
$$ ##TITLE= Audit trail, XWIN-NMR		Version 3.5
$$ ##JCAMPDX= 5.01
$$ ##ORIGIN= Bruker BioSpin GmbH
$$ ##OWNER= she
$$ F:/spectra/data/she/nmr/H-F/1/pdata/1/auditp.txt
$$ ##AUDIT TRAIL=  $$ (NUMBER, WHEN, WHO, WHERE, WHAT)
(   1,<2021-07-01 10:23:39.51 +0400>,<she>,<DPX200>,
      <created by zg, POWCHK disabled, PULCHK disabled
       configuration hash MD5:
       00 E9 B6 7A A2 85 ED C7 34 08 36 98 17 FE 4E 26
       data hash MD5: 16K
       A9 44 D4 7E D8 55 7B ED 95 12 E5 CF A5 BC 87 A6>)
(   2,<2021-07-01 10:23:46.85 +0400>,<she>,<DPX200>,
      <Start of raw data processing
       efp BC_mod = 2 LB = 0.24 FT_mod = 6 PKNL = 1 PHC0 = -11915.25 PHC1 = 12.40099 SI = 16K 
       data hash MD5: 16K
       29 57 4B 50 81 A6 63 04 41 69 4D CF F0 AD E3 63>)
(   3,<2021-07-01 10:24:05.93 +0400>,<she>,<DPX200>,
      <pk PHC0 = -0.214726 PHC1 = 1.4 
       data hash MD5: 16K
       AA 72 52 7E 50 29 E0 11 CA EE 2A 21 4F B2 9D BD>)
(   4,<2021-07-01 10:24:09.48 +0400>,<she>,<DPX200>,
      <abs ABSG = 5 
       data hash MD5: 16K
       9E AE 3F 2C B5 FE C9 06 E9 8C 00 19 DB 8F 97 FE>)
(   5,<2021-07-01 10:24:40.31 +0400>,<she>,<DPX200>,
      <abs ABSG = 5 
       data hash MD5: 16K
       A7 F5 CA 16 FB 39 B8 BC DD 47 29 BF E4 58 40 54>)
$$ ##END=
$$ 
$$ hash MD5
$$ 4E 5C 46 2F 1F 94 46 F1 74 C2 7A 63 51 AC 95 6D
##$RELAX= 
##$RELAX= 
##$RELAX= 
##$RELAX= 
##$RELAX= 
##$RELAX= 
$$ Bruker specific parameters
$$ --------------------------
##$DU= <F:/spectra>
##$EXPNO= 1
##$NAME= <H-F>
##$PROCNO= 1
##$TYPE= <nmr>
##$USER= <she>
##$AMP= (0..31)
100 100 100 100 100 100 100 100 100 100 100 100 100 100 100 100 100 100 
100 100 100 100 100 100 100 100 100 100 100 100 100 100 
##$AQSEQ= 0
##$AQ_mod= 1
##$AUNM= <au_zg>
##$AUTOPOS= <>
##$BF1= 200.13
##$BF2= 200.13
##$BF3= 200.13
##$BF4= 200.13
##$BF5= 200.13
##$BF6= 200.13
##$BF7= 200.13
##$BF8= 200.13
##$BYTORDA= 1
##$CFDGTYP= 0
##$CFRGTYP= 5
##$CHEMSTR= <none>
##$CNST= (0..31)
1 1 145 1 1 1 1 1 1 1 1 1 1 1 1 1 1 1 1 1 1 1 1 1 1 1 1 1 1 1 1 1 
##$CPDPRG= <>
##$CPDPRG1= <>
##$CPDPRG2= <>
##$CPDPRG3= <>
##$CPDPRG4= <mlev>
##$CPDPRG5= <mlev>
##$CPDPRG6= <mlev>
##$CPDPRG7= <mlev>
##$CPDPRG8= <mlev>
##$CPDPRGB= <>
##$CPDPRGT= <>
##$D= (0..31)
0 1.2 0 0 0 0 0 0 0 0.06 0 0.03 0 0 0 0 0.0002 0 0 0 0 0 0 0 0 0 0 0 0 
0 0 0 
##$DATE= 1625120619
##$DBL= (0..7)
$$ [...]
##$SUBNAM3= <"">
##$SUBNAM4= <"">
##$SUBNAM5= <"">
##$SUBNAM6= <"">
##$SUBNAM7= <"">
##$SUBNAM8= <"">
##$SUBNAM9= <"">
##$SW= 20.0188882624521
##$SWIBOX= (0..15)
0 0 2 0 0 0 0 0 0 0 0 0 0 0 0 0 
##$SW_h= 4006.41025641026
##$TD= 16384
##$TD0= 1
##$TE= 0
##$TE2= 300
##$TE3= 300
##$TEG= 300
##$TL= (0..7)
0 120 120 120 120 120 120 120 
##$TP= (0..7)
150 150 150 150 150 150 150 150 
##$TP07= 0
##$TPNAME0= <>
##$TPNAME1= <>
##$TPNAME2= <>
##$TPNAME3= <>
##$TPNAME4= <>
##$TPNAME5= <>
##$TPNAME6= <>
##$TPNAME7= <>
##$TPOAL= (0..7)
0.5 0.5 0.5 0.5 0.5 0.5 0.5 0.5 
##$TPOFFS= (0..7)
0 0 0 0 0 0 0 0 
##$TUNHIN= 0
##$TUNHOUT= 0
##$TUNXOUT= 0
##$USERA1= <user>
##$USERA2= <user>
##$USERA3= <user>
##$USERA4= <user>
##$USERA5= <user>
##$V9= 5
##$VALIST= <valist>
##$VCLIST= <CCCCCCCCCCCCCCC>
##$VD= 0
##$VDLIST= <DDDDDDDDDDDDDDD>
##$VPLIST= <PPPPPPPPPPPPPPP>
##$VTLIST= <TTTTTTTTTTTTTTT>
##$WBST= 1024
##$WBSW= 4
##$XGAIN= (0..3)
0 0 0 0 
##$XL= 0
##$YL= 0
##$YMAX_a= 180417
##$YMIN_a= -189561
##$ZGOPTNS= <>
##$ZL1= 120
##$ZL2= 120
##$ZL3= 120
##$ZL4= 120
##$ABSF1= 17.50444
##$ABSF2= -2.514599
##$ABSG= 5
##$ABSL= 3
##$ALPHA= 0
##$AQORDER= 0
##$ASSFAC= 0
##$ASSFACI= 0
##$ASSFACX= 0
##$ASSWID= 0
##$AUNMP= <proc_1d>
##$AZFE= 0.1
##$AZFW= 0.1
##$BCFW= 0
##$BC_mod= 2
##$BYTORDP= 0
##$COROFFS= 0
##$CY= -3
##$DATMOD= 1
##$DC= 0
##$DFILT= <>
##$DTYPP= 0
##$F1P= 0
##$F2P= 0
##$FCOR= 1
##$FTSIZE= 16384
##$FT_mod= 6
##$GAMMA= 0
##$GB= 0
##$INTBC= 1
##$INTSCL= 1.334414e-10
##$ISEN= 128
##$LB= 0.24
##$LEV0= 0
##$LPBIN= 0
##$MAXI= 10000
##$MC2= 0
##$MEAN= 0
##$ME_mod= 0
##$MI= 1.114404
##$NCOEF= 0
##$NC_proc= -6
##$NLEV= 6
##$NOISF1= 3.799351
##$NOISF2= 2.8
##$NSP= 0
##$NTH_PI= 0
##$NZP= 0
##$OFFSET= 17.50444
##$PC= 1
##$PHC0= -11915.46
##$PHC1= 13.80099
##$PH_mod= 1
##$PKNL= yes
##$PPARMOD= 0
##$PSCAL= 0
##$PSIGN= 0
##$REVERSE= no
##$SF= 200.130006042157
##$SI= 16384
##$SIGF1= 3
##$SIGF2= 2
##$SINO= 5.538805
##$SIOLD= 16384
##$SREGLST= <1H.CDCl3>
##$SSB= 0
##$STSI= 16384
##$STSR= 0
##$SW_p= 4006.41025641026
##$SYMM= 0
##$S_DEV= 0
##$TDeff= 16384
##$TDoff= 0
##$TI= <>
##$TILT= no
##$TM1= 0
##$TM2= 0
##$TOPLEV= 0
##$USERP1= <user>
##$USERP2= <user>
##$USERP3= <user>
##$USERP4= <user>
##$USERP5= <user>
##$WDW= 1
##$XDIM= 16384
##$YMAX_p= 346925711
##$YMIN_p= -1876925
$$ End of Bruker specific parameters
$$ ---------------------------------
##NTUPLES= NMR SPECTRUM
##VAR_NAME=  FREQUENCY,     SPECTRUM/REAL,   SPECTRUM/IMAG
##SYMBOL=    X,             R,               I
##VAR_TYPE=  INDEPENDENT,   DEPENDENT,       DEPENDENT
##VAR_FORM=  AFFN,          ASDF,            ASDF
##VAR_DIM=   16384,         16384,           16384
##UNITS=     HZ,            ARBITRARY UNITS, ARBITRARY UNITS
##FACTOR=    0.24454680195387, 1,            1
##FIRST=     3503.163744528, 0,              0
##LAST=      -503.246511882256, 0,           0
##MIN=       -503.246511882256, -1876925,    0
##MAX=       3503.163744528, 346925711,      0
$$ Real data points
##PAGE= N=1
##DATA TABLE= (X++(R..R)), XYDATA
$$ [...]
$$ plain form
5948 -21682 1549 -41203 -118362 -128267 -170490 -86603 2350 -16513 -37962 -104273 22354 -37501
5936 -37501 -52431 -25104 82018 8223 -108897 -46406 -47420 -129284 -93146 -21415 14650 -25427
5924 -25427 -127502 -80515 -8140 -142263 -65353 -98668 -95539 -37491 -43503 -68400 -116909 -146467
5912 -146467 -154283 -144504 -49823 -57028 6379 -26077 -134800 -75330 -40530 48441 -68689 -13448
5900 -13448 -115299 -81270 -41030 2594 45792 -78199 -78292 -136589 -42022 -74505 -32195 -63450
5888 -63450 -140298 -123908 -146000 -78005 -54248 -83056 -83380 -7825 -78856 -87015 -102769 -124638
5876 -124638 -262922 -122545 -48294 -197576 -114225 -204642 -127173 -68481 -88614 -85486 -17850
5865 -17850 -49266 -54973 -107586 -113902 -81785 -160454 -185214 -186743 -85195 -4693 -18166 -179243
$$ packed form
5948b1682K3231m2752p7159r905m2223Q3887Q8953j8863k1449o6311J26627n9855
5936c7501j4930K7327J07122p3795j17120O2491j014q1864L6138P1731L6065m0077
5924b5427j02075M6987P2375j34123P6910l3315L129N8048o012k4897m8509k9558
5912a46467p816R779R4681p205O3407l2456j08723N9470L4800Q8971j17130N5241
5900a3448j01851L4029M0240M3624M3198j23991r3n8297R4567l2483M2310l1255
5888f3450p6848J6390k2092O7995K3757k8808l24P5555p1031q159j5754k1869
5876a24638j38284J40377P4251j49282Q3351r0417P7469N8692k0133L128O7636
5865a7850l1416n707n2613o316L2117p8669k4760j529J01548Q0502j3473j61077
$$ plain form
5853 -179243 -44281 -63195 -31754 38783 70804 29178 -39803 -210433 -65382 -61191 -14043
5842 -14043 -17878 -34970 -6870 -52652 -44291 -13369 25164 -203607 -176061 1426 -6640 -109668
5830 -109668 -138493 -112007 -75313 74394 -18650 -129514 -179437 -163368 -69774 -49565 1254
5819 1254 -55190 -12993 -101827 -35304 8160 -32678 -98933 10363 -39559 29659 -25830 -157642
5807 -157642 -119799 46370 71246 18842 -6155 -66858 -56603 -130461 -162568 -117382 -60871
5796 -60871 -147793 -163146 -32234 -41462 -167713 55331 77323 -77938 -184494 -194085 -134398
5785 -134398 -45214 -70005 -106446 -85338 -196115 -55835 -36680 -152775 -131463 -101968 -168535
5774 -168535 -100653 -72691 -135896 -176331 -228150 -134343 -116625 -47459 -127538 -210960 -136802 -74630
$$ packed form
5853a79243J34962j8914L1441P0537L2021m1626o8981j70630J45051M191M7148
5842a4043l835j7092K8100m5782Q361L0922L8533k28771K7546J77487q066j03028
5830a09668k8825K6486L6694J49707r3044j10864m9923J6069R3594K0209N0819
5819A254n6444M2197q8834O6523M3464m0838o6255J09296m9922O9218n5489j31812
5807a57642L7843J66169K4876n2404k4997o0703J0255p3858l2107M5186N6511
5796f0871q6922j5353J30912r228j26251K23044K1992j55261j06556r591N9687
5785a34398Q9184k4791l6441K1108j10777J40280J9155j16095K1312K9495o6567
5774a68535O7882K7962o3205m0435n1819R3807J7718O9166q0079q3422P4158O2172
$$ plain form
5762 -74630 -34928 -23055 -115165 -172233 -134153 -172444 -116976 594 5812 -22856 51141 47863
5750 47863 9760 -50177 -30100 -110566 -49739 8089 38474 -37071 -103576 -4954 -44978 -65441
5738 -65441 -17279 -56672 -22375 19935 29055 81872 69458 45001 -83300 -16564 52958 16942
5726 16942 -81414 -62217 -35782 -145303 -93898 -64090 -58956 -63325 -60999 9400 -3688 -91310
5714 -91310 -167003 -159414 -91349 -139388 -130072 -178517 -216875 -194330 -153768 -176059 -131203 -185421
5702 -185421 -294571 -105799 -59286 -18426 10386 -9967 -44782 -46569 -64547 -21919 -121092
5691 -121092 -63361 -65239 -189005 -162067 -208266 -151408 -27436 -117435 -152442 -78294 -66882
5680 -66882 -47543 -11842 24968 -56835 -30766 -72986 -7280 -36256 -79241 -110740 -210296 -127933
$$ packed form
5762g4630L9702J1873r2110n7068L8080l8291N5468J17570N218k8668P3997l278
5750D7863l8103n9937K0077q0466O0827N7828L0385p5545o6505R8622m0024k0463
5738f5441M8162l9393L4297M2310R120N2817j2414k4457j28301O6736O9522l6016
5726A6942r8356J9197K6435j09521N1405K9808N134m369K326P0399j3088q7622
5714i1310p5693P589O8065m8039R316m8445l8358K2545M0562k2291M4856n4218
5702a85421j09150J88772M6513M0860K8812k0353l4815j787j7978M2628r9173
5691a21092N7731j878j23766K6938m6199N6858J23972q9999l5007P4148J1412
5680f6882J9339L5701L6810q1803K6069m2220O5706k8976m2985l1499r9556Q2363
$$ plain form
5668 -127933 -152264 -87686 -36956 -55244 -92021 -34008 -50202 -55501 -41054 -75846 -18463 52250
5656 52250 -6155 -78856 -101576 -74518 14733 119718 39085 21245 -7744 -27529 20868 38228
5644 38228 -22280 -42855 -23255 -37692 6542 -23453 1276 3447 30121 -72289 -93371 -182512
5632 -182512 -206234 -158770 -77601 -69453 -39066 -36194 -176066 -22545 74428 -3084 -143085
5621 -143085 -70413 16371 -2804 13672 -115973 -118710 15766 -72344 -118274 -146437 -172977
5610 -172977 -103366 -128513 -88803 -19841 6041 -22536 -34468 -17486 -127858 -69104 -9422
5599 -9422 -11074 -34930 -69751 74332 25493 -78599 -36576 -10252 -28675 21843 -86980 -40426
5587 -40426 51136 130140 108606 33109 -53390 -60060 -105842 -11060 -52128 -116669 -29161 -82909
$$ packed form
5668a27933k4331O4578N0730j8288l6777N8013j6194n299J4447l4792N7383P0713
5656E2250n8405p2701k2720K7058Q9251J04985q0633j7840k8989j9785M8397J7360
5644C8228o0508k0575J9600j4437M4234k9995K4729K171K6674j02410k1082q9141
5632a82512k3722M7464Q1169Q148L0387K872j39872J53521R6973p7512j40001
5621a43085P2672Q6784j9175J6476j29645k737J34476q8110m5930k8163k6540
5610a72977O9611k5147L9710O8962K5882k8577j1932J6982j10372N8754N9682
5599i422j652k3856l4821J44083m8839j04092M2023K6324j8423N0518j08823M6554
5587d0426R1562P9004k1534p5497q6499o670m5782R4782m1068o4541Q7508n3748
$$ plain form
5575 -82909 5453 -38393 42166 93642 54498 68262 -82495 -139545 -129951 -216098 -255734 -249715
5563 -249715 -130084 -112901 -38799 -37401 -46837 -44430 -91178 -30520 82895 54384 55712 60035
5551 60035 18472 19954 -2957 -85985 -81598 -45452 -118573 -52897 19681 100704 77801 14426
5539 14426 -43104 38518 -22102 -47780 5381 22274 134288 -27643 -123856 4187 -64097
5528 -64097 -63576 71405 75894 7010 -66406 -112466 -95375 69382 44056 49345 143527 32556
5516 32556 -29024 9740 -78325 -86321 -67925 -113391 -71742 -67329 -157371 -134288 -53904 -154547
5504 -154547 -155658 -97618 -114325 -137970 -37720 -37141 -39010 49733 -18017 -37451 -8414 -8269 -29730
5491 -29730 -88616 -101446 26238 1685 -78614 -53101 57548 -128106 -155458 -51528 -121059
$$ packed form
5575h2909Q8362m3846Q0559N1476l9144J3764j50757n7050R594q6147l9636O019
5563b49715J19631J7183P4102J398r436K407m6748O0658J13415k8511J328M323
5551F0035m1563J482k2911q3028M387L6146p3121O5676P2578Q1023k2903o3375
5539A4426n7530Q1622o0620k5678N3161J6893J12014j61931r6213J28043o8284
5528f4097N21J34981M489o8884p3416m6060J7091J64757k5326N289R4182j10971
5516C2556o1580L8764q8065p996J8396m5466M1649M413r0042K3083Q0384j00643
5504a54547j111N8040j6707k3645J00250N79j869Q8743o7750j9434K9037J45k1461
5491b9730n8886j2830J27684k4553q0299K5513J10649j85654k7352J03930o9531
$$ plain form
5480 -121059 -42213 -45721 -169205 -243470 -212713 -182545 -18161 -83797 -138057 -83087 15023
5469 15023 68207 -3726 -36052 27327 46986 11022 -21344 -72530 23609 -90442 -86184 51519
5457 51519 -95319 -183543 -74315 46114 56060 -105647 -150289 -102596 30833 -83466 -123536
5446 -123536 4967 19661 10280 -49552 30122 40535 24928 -56778 -2135 61192 52422 -105144
5434 -105144 -133213 -27153 4283 -40467 -150491 -181932 -89226 -162840 -148633 30888 -59591
5423 -59591 -77256 -178121 -113306 -150237 -192750 -146300 -65016 38044 78565 75857 12686 21165
5411 21165 145042 -4504 80167 100072 -108833 -87786 -104200 -131616 19901 36654 28588
5400 28588 -17240 -87059 -49462 -20635 -35206 -119966 -102228 -119350 -61411 -23922 -7662 20439
$$ packed form
5480a21059P8846l508j23484p4265L0757L0168J64384o5636n4260N4970R8110
5469A5023N3184p1933l2326O3379J9659l5964l2366n1186R6139j14051M258J37703
5457E1519j46838q8224J09228J20429R946j61707m4642M7693J33429j14299m0070
5446a23536J28503J4694r381n9832P9674J0413j5607q1706N4643O3327q770j57566
5434a05144k8069J06060L1436m4750j10024l1441R2706p3614J4207J79521r0479
5423e9591j7665j00865O4815l6931m2513M6450Q1284J03060M0521k708o3171Q479
5411B1165J23877j49546Q4671J9905k08905K1047j6414k7416J51517J6753q066
5400B8588m5828o9819L7597K8827j4571q4760J7738j7122N7939L7489J6260K8101
$$ plain form
5388 20439 39014 3021 -53552 -80333 -80618 -36216 -11841 -52975 -8138 38573 9743 -103910
5376 -103910 -162405 -142631 -31503 20849 59557 -86160 -106169 -29353 -30129 -142434 9587
5365 9587 -11957 -52543 -437 -48873 -126464 -103025 -61134 -12213 -19528 -28981 6619 8011 6951
5352 6951 -81500 37473 115301 51587 26414 55199 -32285 -36499 -73406 -114869 -79731 -77710
5340 -77710 -50167 8181 -1426 -72707 -94855 -110032 -32422 -114344 -70801 -68429 -116366 -50786
5328 -50786 -20906 -30104 -51804 -47105 -95153 -91710 -188441 -31237 -15873 24538 -85381 -57323
5316 -57323 -1488 -18798 18414 -69160 -77538 9452 -126180 -107523 -134962 -53159 109136 49308
5304 49308 -4981 26983 41089 29754 45436 -57614 -74933 -156357 -209130 -209554 -142467 -156845
$$ packed form
5388B0439J8575l5993n6573k6781k85M4402K4375m1134M4837M6711k8830j13653
5376a03910n8495J9774J11128N2352L8708j45717k0009P6816p76j12305J52021
5365I587k1544m0586N2106m8436p7591K3439M1891M8921p315r453L5600J392j060
5352F951q8451J18973P7828o3714k5173K8785q7484m214l6907m1463L5138K021
5340g7710K7543N8348r607p1281k2148j5177P7610q1922M3543K372m7937O5580
5328e0786K9880r198k1700M699m8048L443r6731J57204J5364M0411j09919K8058
5316e7323N5835j7310L7212q7574q378Q6990j35632J8657k7439Q1803J62295n9828
5304D9308n4289L1964J4106j1335J5682j03050j7319q1424n2773m24O7087j4378
$$ plain form
5292 -156845 -123433 -65643 -2992 -125794 -158695 -19428 -33866 -73997 109889 -19860 -24416
5281 -24416 -35652 -94850 -68175 -74520 -127356 -116739 -101571 -45777 -56315 -89504 -113492 -185544
5269 -185544 -226357 -264306 -157242 -87680 21789 25192 -12901 4586 38818 -37445 -104999
5258 -104999 -34847 -43908 -188903 -114960 -184243 -160882 -58903 -131810 -107859 -128704 -199563
5247 -199563 -155871 -180202 -156772 -50024 -28737 -146974 -78538 4132 -29269 -63547 -27607
5236 -27607 -109357 -105053 -52647 -89066 -63513 -61402 -14794 50109 80174 132008 5007 -75623
5224 -75623 -125140 -25838 -6459 -62110 -41197 -91950 22456 -15408 -19248 115318 65639 -59971
5212 -59971 -40600 -86747 -106962 -24108 23318 81433 197146 107764 31662 -63806 10682 32865
$$ packed form
5292a56845L3412N7790O2651j22802l2901J39267j4438m0131J83886j29749m556
5281b4416j1236n9198K6675o345n2836J0617J5168N5794j0538l3189k3988p2052
5269a85544m0813l7949J07064O9562J09469L403l8093J7487L4232p6263o7554
5258a04999P0152r061j44995P3943o9283K3361J01979p2907K3951k0845p0859
5247a99563M3692k4331K3430J06748K1287j18237O8436Q2670l3401l4278L5940
5236b7607q1750M304N2406l6419K5553K111M6608O4903L0065N1834j27001q0630
5224g5623m9517R9302J9379n5651K0913n0753J14406l7864l840J34566m9679j25610
5212e9971J9371m6147k0215Q2854M7426N8115J15713q9382p6102r5468P4488K2183
$$ plain form
5200 32865 30671 -38325 -77603 -80881 -182135 -60661 -44308 35390 -17645 -90869 23789 66573
5188 66573 -127993 -199935 -102235 -125628 -74667 -42223 -95374 -66255 -25606 -32134 -128146 -88379
5176 -88379 5748 89804 75297 54539 29068 10763 25017 21684 -29390 72730 151821 78217
5164 78217 77377 51155 12951 -60571 -25086 96608 50274 42945 109636 86433 113563 49884
5152 49884 -19802 -40923 13909 -15090 -115535 -150318 40020 -35585 13344 65608 -44592
5141 -44592 -24241 39349 8824 82722 109540 67043 -5164 -10482 -6488 -21974 40016 17464
5129 17464 6141 -4265 -127513 -96137 8038 -19472 13892 3670 -23272 -49580 102830
5118 102830 107583 31143 -24948 -77833 -29603 64375 -82281 -48662 111320 39931 28528
$$ packed form
5200C2865k194o8996l9278l278j01254J21474J6353P9698n3035p3224J14658M2784
5188F6573j94566p1942R7700k3393N0961L2444n3151K9119M0649o528r6012L9767
5176h8379R4127Q4056j4507k0758k5471j8305J4254l333n1074J02120P9091p3604
5164G8217q40k6222l8204p3522L5485J21694m6334p329O6691k3203K7130o3679
5152D9884o9686k1121N4832k8999j00445l4783J90338p5605M8929N2264j10200
5141d4592K0351O3590l0525P3898K6818m2497p2207n318L994j5486O1990k2552
5129A7464j1323j0406j23248L1376J04175k7510L3364j0222k6942k6308J52410
5118A02830M753p6440n6091n2885M8230R3978j46656L3619J59982p1389j1403
$$ plain form
5107 28528 -55079 -22221 60225 48490 68028 80652 -123641 -91058 -37531 99029 124845
5096 124845 50692 26755 33912 -64207 -19447 26197 51676 112544 -21597 42979 176569
5085 176569 201166 28176 6838 -31854 60476 117255 86721 35894 76756 121549 142859
5074 142859 70521 67430 185292 -24038 -47361 37727 22643 93003 -31920 -99648 -88467
5063 -88467 -4068 -9993 -66691 -86766 -1898 81044 144913 163744 86885 152939 120561 -58605
5051 -58605 -45537 38987 98906 114667 -45746 64893 68658 -39024 9702 20171 44101
5040 44101 -9742 47752 -19999 114078 184915 203649 178750 135431 34060 19475 -62067
5029 -62067 -81032 -59293 68001 207444 190293 111683 39859 84044 94839 149568 99918
$$ packed form
5107B8528q3607L2858Q2446j1735J9538J2624k04293L2583N3527J36560K5816
5096A24845p4153k3937P157r8119M4760M5644K5479O0868j34141O4576J33590
5085A76569K4597j72990k1338l8692R2330N6779l0534n0827M0862M4793K1310
5074A42859p2338l091J17862k09330k3323Q5088j5084P0360j24923o7728J1181
5063h8467Q4399n925n6698k0075Q4868Q2942O3869J8831p6859O6054l2378j79166
5051e8605J3068Q4524N9919J5761j60413J10639L765j07682M8726J0469K3930
5040D4101n3843N7494o7751J34077P0837J8734k4899m3319j01371j4585q1542
5029f2067j8965K1739J27294J39443j7151p8610p1824M4185J0795N4729m9650
$$ plain form
5018 99918 76600 -11812 19281 158689 142653 -7601 59550 138507 150805 124348 79874
5007 79874 -30141 -81170 -106677 19835 225851 115558 44226 -12765 64708 42144 -14770
4996 -14770 -29817 -21319 10895 66415 89785 -38241 -400 64774 62200 1442 83826 128419
4984 128419 167601 124993 90240 83386 140584 77260 97551 176705 83620 8629 93478 102343
4972 102343 139155 190564 61793 11519 110394 126818 110752 126024 82677 162349 213556
4961 213556 84485 162703 225012 169257 115328 57937 18345 12224 44222 72517 97950 119022
4949 119022 85996 145934 246621 108656 183079 246143 223311 172936 44079 144128 235847
4938 235847 253181 173864 186995 234899 287425 236796 270166 297240 330706 326899 200926 142691
$$ packed form
5018I9918k3318q8412L1093J39408j6036j50254O7151P8957J2298k6457m4474
5007G9874j10015n1029k5507J26512K06016j10293p1332n6991P7473k2564n6914
4996a4770j5047Q498L2214N5520K3370j28026L7841O5174k574o0758Q2384M4593
4984A28419L9182m2608l4753o854N7198o3324K0291P9154r3085p4991Q4849Q865
4972A02343L6812N1409j28771n0274R8875J6424j6066J5272m3347P9672N1207
4961B13556j29071P8218O2309n5755n3929n7391l9592o121L1998K8295K5433K1072
4949A19022l3026N9938J00687j37965P4423O3064k2832n0375j28857J00049R1719
4938B35847J7334p9317J3131M7904N2526n0629L3370K7074L3466l807j25973n8235
$$ plain form
4926 142691 94020 218394 261526 262315 281095 247057 222011 230117 158614 144660 252295 301596
4914 301596 305712 161410 121033 140993 229325 170100 223157 156104 104111 245097 173940
4903 173940 164057 74452 87003 196499 147589 78978 191941 245744 195408 221644 337144
4892 337144 165639 199295 141779 72846 117156 135589 44011 52298 123603 156242 184526 96405
4880 96405 71374 104679 130480 136040 132687 126027 66954 158767 101299 103185 125139 11515
4868 11515 59529 154809 175531 127571 39129 17361 -56043 -61102 -52072 3261 46790 48721
4856 48721 46644 78331 44780 -32471 34546 166844 145230 99993 179728 106629 65878 71254
4844 71254 50989 19537 70970 12123 -13161 25150 34085 53255 -62501 -61585 -23209 145824
$$ packed form
4926A42691m8671J24374M3132P89J8780l4038k5046Q106p1503j3954J07635M9301
4914C01596M116j44302m0377J9960Q8332n9225N3057o7053n1993J40986p1157
4903A73940r883q9605J2551J09496m8910o8611J12963N3803n0336K6236J15500
4892C37144j71505L3656n7516o8933M4310J8433r1578Q287P1305L2639K8284q8121
4880I6405k5031L3305K5801N560l353o660n9073R1813n7468J886K1954j13624
4868A1515M8014R5280K0722m7960q8442k1768p3404n059R030N5333M3529J931
4856D8721k077L1687l3551p7251O7017J32298k1614m5237P9735p3099m0751N376
4844G1254k0265l1452N1433n8847k5284L8311Q935J9170j15756R16L8376J69033
$$ plain form
4832 145824 264671 95740 59176 -3458 -81074 -58603 -19284 -26397 105672 78253 29423
4821 29423 35447 125954 114674 139387 75148 133309 176314 146149 71872 2350 -6238 63199
4809 63199 78436 74512 79384 120637 102511 4803 -25408 56340 79132 21300 5381 127038
4797 127038 10953 55236 18937 -52936 87731 14057 17216 32255 7749 -102263 -89534
4786 -89534 -133016 -34420 131251 74657 -84072 -59089 4943 83914 92828 166504 169764 110023
4774 110023 -27273 58162 -108312 -98766 -8772 -61619 41147 112261 89787 -14488 10229
4763 10229 -23488 42026 2311 -49824 -16968 77798 19585 46780 143272 8473 820 70934
4751 70934 94076 14489 -84030 -56259 34869 -31943 45033 24371 -43020 -15343 19950 -14492
$$ packed form
4832A45824J18847j68931l6564o2634p7616K2471L9319p113J32069k7419m8830
4821B9423O024R0507j1280K4713o4239N8161M3005l0165p4277o9522q588O9437
4809F3199J5237l924M872M1253j8126r7708l0211Q1748K2792n7832j5919J21657
4797A27038j16085M4283l6299p1873J40667p3674L159J5039k4506j10012J2729
4786h9534m3482R8596J65671n6594j58729K4983O4032P8971Q914P3676L260n9741
4774A10023j37296Q5435j66474R546Q9994n2847J02766P1114k2474j04275K4717
4763A0229l3717O5514l9715n2135L2856R4766n8213K7195R6492j34799p653P0114
4751G0934K3142p9587r8519K7771R1128o6812P6976k0662o7391K7677L5293l4442
$$ plain form
4739 -14492 -132581 -29791 -61430 -113822 -70185 -62556 -57703 37803 125385 -24741 62836 74932
4727 74932 -105972 -28423 78562 66573 -10340 64525 97466 -600 16123 -23006 -2643
4716 -2643 83162 60466 15593 -8459 35332 80422 70927 41036 121408 110664 37220 75194
4704 75194 139577 102127 146367 164784 63000 131762 134908 127194 163654 165251 122589 15345
4692 15345 -40750 -127833 920 55385 -88131 -49648 -56264 -14144 66147 141536 131204 -37492
4680 -37492 -10994 7016 103412 60792 -39751 -32941 28460 -130020 -98866 40613 49110 89349
4668 89349 77470 113913 18811 153070 122169 100437 149478 95244 168864 250853 229448 144376
4656 144376 21708 103257 106729 74501 146579 152437 10712 -33017 48827 -10387 137800
$$ packed form
4739a4492j18089J02790l1639n2392M3637P629M853R5506Q7582j50126Q7577J2096
4727G4932j80904P7549J06985j1989p6913P4865L2941r8066J6723l9129K0363
4716b643Q5805k2696m4873k4052M3791M5090r495k9891Q0372j0744p3444L7974
4704G5194O4383l7450M4240J8417j01784O8762L146p714L6460J597m2662j07244
4692A5345n6095q7083J28753N4465j43516L8483o616M2120Q0291P5389j0332j68696
4680c7492K6498J8010R6396m2620j00543O810O1401j58480L1154J39479Q497M0239
4668H9349j1879L6443r5102J34259l0901k1732M9041n4234P3620Q1989k1405q5072
4656A44376j22668Q1549L472l2228P2078N858j41725m3729Q1844n9214J48187
$$ plain form
4645 137800 75114 61425 48260 67056 134559 141627 52626 41382 157075 -11426 88644
4634 88644 95846 119799 97656 83069 51971 125714 150307 117123 96477 24562 4019 28011
4622 28011 77736 24028 106809 149293 107994 85199 177545 125940 109573 120220 303549 229833
4610 229833 100800 -36166 54178 134749 218333 264672 181226 223773 303584 209600 126309
4599 126309 92567 129146 75975 147144 242043 237635 242076 87623 53543 3906 93408 107605
4587 107605 96977 -41408 -29769 65292 82341 43559 25909 32014 -4910 103580 179023
4576 179023 55611 28811 61428 -4749 31461 66597 51566 -23308 -32478 -6669 36864 60951
4564 60951 21915 -30401 -55683 -28696 71068 146776 -19890 17542 -40563 -7831 -7517 -92366
$$ packed form
4645A37800o2686j3689j3165J8796O7503P068q9001j1244J15693j68501J00070
4634H8644P202K3953k2143j4587l1098P3743K4593l3184k0646p1915k0543K3992
4622B8011M9725n3708Q2781M2484m1299k2795R2346n1605j6367J0647J83329p3716
4610B29833j29033j36966R0344Q0571Q3584M6339q3446M2547P9811r3984q3291
4599A26309l3742L6579n3171P1169R4899m408M441j54453l4080m9637Q9502J4197
4587A07605j0628j38385J1639R5061J7049l8782j7650O105l6924J08490P5443
4576A79023j23412k6800L2617o6177L6210L5136j5031p4874r170K5809M3533K4087
4564F0951l9036n2316k5282K6987R9764P5708j66666L7432n8105L2732L14q4849
$$ plain form
4552 -92366 -4632 -129962 -141940 59005 10315 38042 41885 13431 -36369 -20074 -24408 10222
4540 10222 -43747 -122760 -110643 -87383 -37815 -136402 -92555 7198 -45432 -22457 -178316 -212423
4528 -212423 -168980 -174065 -181642 -87724 -70363 -62158 -86603 -72349 -101406 -9585 -9947 -74015 -20891
4515 -20891 9559 12146 -39745 -49457 -93190 12152 46257 -31833 -159941 -112933 -87689 -16949
4503 -16949 -131355 -102451 -148811 -20918 -64841 -10261 -59926 -181147 -92242 -25213 11527
4492 11527 -13923 -39027 -57581 -135300 -71426 -58050 -46055 -95288 -156380 -84671 -54469 -47554
4480 -47554 -127450 -79077 43927 36988 5388 81085 -35987 1941 -15529 59741 13592 -55672
4468 -55672 -54543 -114852 -179621 -100147 -87792 -50563 -78842 -25872 4823 -39302 -92703 -92208
$$ packed form
4552i2366Q7734j25330j1978K00945m8690K7727L843k8454m9800J6295m334L4630
4540A0222n3969p9013J2117K3260M9568r8587M3847R9753n2630K2975j55859l4107
4528b12423M3443n085p577R3918J7361Q205k4445J4254k9057R1821l62o4068N3124
4515b0891L0450K587n1891r712m3733J05342L4105p8090j28108M7008K5244P0740
4503a6949j14406K8904m6360J27893m3923N4580m9665j21221Q8905O7029L6740
4492A1527k5450k5104j8554p7719O3874J3376J1995m9233o1092P1709L0202O915
4480d7554p9896M8373J23004o939l1600P5697j17072L7928j7470P5270m6149o9264
4468e5672J129o0309o4769P9474J2355L7229k8279N2970L0695m4125n3401M95
$$ plain form
4456 -92208 -26444 38359 63819 -18598 -64601 -9975 -33591 -27983 61436 -40642 39645 20231
4444 20231 -29789 -63201 14058 -82615 -50894 -50061 -19646 -20101 38313 40663 67478 88837 48873
4431 48873 -46202 342 130929 114608 40039 -35952 1516 -29497 24577 29221 -77436 -21889
4419 -21889 -40936 48397 93934 67323 57256 31582 -38840 -21538 53817 8372 15522 25151
4407 25151 97810 14625 -79605 -63652 -11598 -56666 -46560 -81561 90335 88824 39592 -97112
4395 -97112 -35048 -19901 -58225 -20841 -176125 -38008 72692 -65224 -77461 -65865 -140629
4384 -140629 -61090 -62258 -206169 -167750 -98089 -20881 -101802 -81033 -53665 -116770 -93688 -88137
4372 -88137 -82100 -13650 98737 422 -31995 60243 71032 5460 -49674 -48060 -50716 -37514
$$ packed form
4456i2208O5764O4803K5460q2417m6003N4626k3616N608Q9419j02078Q0287j9414
4444B0231n0020l3412P7259r6673L1721Q33L0415m55N8414K350K6815K1359l9964
4431D8873r5075M6544J30587j6321p4569p5991L7468l1013N4074M644j06657N5547
4419b1889j9047Q9333M5537k6611j0067k5674p0422J7302P5355m5445P150R629
4407B5151P2659q3185r4230J5953N2054m5068J0106l5001J71896j511m9232j36704
4395i7112O2064J5147l8324L7384j55284J38117J10700j37916j2237J1596p4764
4384a40629P9539j168j43911L8419O9661P7208q0921K0769K7368o3105K3082N551
4372h8137O037O8450J12387r8315l2417R2238J0789o5572n5134J614k656J3202
$$ plain form
4360 -37514 -53234 -79950 -75670 -70810 -91815 -81891 -38217 19925 18576 11614 30184 -59883 25842
4347 25842 66141 -70014 -60565 11121 21972 -34761 -66790 -52772 -6700 -218 -37296 -89774
4335 -89774 -166562 -173777 -41096 -32248 -22043 -4012 -91931 -172547 -97832 -87705 -131676 -22365
4323 -22365 19843 68741 -23680 16515 123399 46443 -46452 14409 52876 30617 -1079 -21948
4311 -21948 -25981 22377 53036 18476 36868 -61534 -109642 -56545 -16138 -225 10104 -43675
4299 -43675 -91761 14215 28726 24504 13448 98390 -16208 -106809 57495 94716 73047
4288 73047 200040 90688 -19868 80976 44914 -17166 29723 19411 -50552 11522 45841
4277 45841 -74524 -53365 -10648 29410 60684 46100 67549 25817 27349 -52687 -97690 -168786
$$ packed form
4360c7514j5720k6716M280M860k1005R924M3674N8142j349o962J8570r0067Q5725
4347B5842M0299j36155R449P1686J0851n6733l2029J4018M6072O482l7078n2478
4335h9774p6788p215J32681Q848J0205J8031q7919q0616P4715J0127m3971J09311
4323b2365M2208M8898r2421M0195J06884p6956r2895O0861L8467k2259l1696k0869
4311b1948m033M8358L0659l4560J8392r8402m8108N3097M0407J5913J0329n3779
4299d3675m8086J05976J4511m222j1056Q4942j14598r0601J64304L7221k1669
4288G3047J26993j09352j10556J00844l6062o2080M6889j0312o9963O2074L4319
4277D5841j20365K1159M2717M0058L1274j4584K1449m1732J532q0036m5003p1096
$$ plain form
4265 -168786 -14166 -12129 24615 -15231 -100035 -59932 32280 -73770 -66688 179729 90795
4254 90795 85129 7161 -81664 -55889 59851 41265 83034 -24270 -44136 5267 859 64526
4242 64526 -45046 -98352 -45848 -33220 -84934 -28431 -123226 -7233 59724 -31361 78200
4231 78200 6 -41398 -108375 -44513 -1212 -58478 15130 1562 84302 83333 -16142 33941
4219 33941 69763 66745 69099 33749 56641 77025 92322 29291 -13850 -105671 -73003 -132098
4207 -132098 -38528 121577 -14043 -2009 -68688 -4754 36148 70895 130063 21870 71858
4196 71858 -1924 97188 168870 121062 42232 68280 14117 -6003 135951 107065 123281 47639
4184 47639 79997 -12922 -38737 -68235 -13688 25659 -25447 35627 -14267 11705 99177 147680
$$ packed form
4265a68786J54620K037L6744l9846q4804M0103R2212j06050P082K46417q8934
4254I0795n666p7968q8825K5775J15740j8586M1769j07304j9866M9403m408O3667
4242F4526j09572n3306N2504J2628n1714N6503r4795J15993O6957r1085J09561
4231G8200p8194m1404o6977O3862M3301n7266P3608j3568Q2740r69r9475N0083
4219C3941L5822l018K354l5350K2892K0384J5297o3031m3141r1821L2668n9095
4207a32098R3570J60105j35620J2034o6679O3934M0902L4747N9168j08193M9988
4196G1858p3782R9112P1682m7808p8830K6048n4163k0120J41954k8886J6216p5642
4184D7639L2358r2919k5815k9498N4547L9347n1106O1074m9894K5972Q7472M8503
$$ plain form
4172 147680 151878 48998 25514 -28178 -61167 -40267 -47373 7704 86588 46371 28584 80994
4160 80994 148270 174559 211824 119343 166226 125458 72611 16889 13424 145731 131064 128969
4148 128969 101285 79570 50695 118176 52770 -46486 42414 26330 88161 89454 73727 -67672
4136 -67672 -54145 -47059 -37217 -26792 -12996 106881 83106 94470 62805 113805 138171 98408
4124 98408 27810 65862 110695 110642 53048 139027 45008 55998 97582 70034 76881 61495 60095
4111 60095 93307 128718 163726 159746 105381 162959 208399 125008 175410 147210 106026 161034
4099 161034 224211 116499 253010 248289 195141 250625 177041 171947 251463 216232 191624 234132
4087 234132 74858 62493 161272 229404 208440 53809 162287 204056 15167 55376 48687
$$ packed form
4172A47680M198j02880k3484n3692l2989K0900p106N5077P8884m0217j7787N2410
4160H0994O7276K6289L7265r2481M6883m0768n2847n5722l465J32307j4667k095
4148A28969k7684k1715k8875O7481o5406r9256Q8900j6084O1831J293j5727j41399
4136f7672J3527P086R842J0425J3796J19877k3775J1364l1665N1000K4366l9763
4124I8408p0598L8052M4833n3n7594Q5979r4019J0990M1584k7548O847j5386j400
4111F0095L3212L5411L5008l980n4365N7578M5440q3391N0402k8200m1184N5008
4099A61034O3177j07712J36511m721n3148N5484p3584n094P9516l5231k4608M2508
4087B34132j59274j2365R8779O8132k0964j54631J08478M1769j88889M0209o689
$$ plain form
4076 48687 95034 128797 138497 270631 134067 80055 211352 238567 160258 86850 151110
4065 151110 192787 138673 62432 142687 185057 150215 5424 56975 148977 130872 161655
4054 161655 97891 74259 101324 188240 158985 157480 187337 238664 181062 79703 66565 94424
4042 94424 36720 110705 181230 213376 115237 12932 90153 81857 30518 84331 -7329 -44817
4030 -44817 48872 100690 169175 -21814 -96672 -6755 115882 130436 154426 163722 270457
4019 270457 246594 181110 73622 59870 15688 122162 51561 41671 66353 132178 72745
4008 72745 59904 160787 169405 210115 251760 182933 147757 155434 136714 187307 208039 155791
3996 155791 176669 305858 351733 235947 223431 257473 343229 296297 356724 349152 383551
$$ packed form
4076D8687M6347L3763R700J32134j36564n4012J31297K7215p8309p3408O4260
4065A51110M1677n4114p6241Q0255M2370l4842j44791N1551R2002j8105L0783
4054A61655o3764k3632K7065Q6916k9255j505K9857N1327n7602j01359j3138K7859
4042I4424n7704P3985P0525L2146r8139j02305P7221q296n1339N3813r1660l7488
4030d4817R3689N1818O8485j90989p4858Q9917J22637J4554K3990R296J06735
4019B70457k3863o5484j07488j3752m4182J06474p0601r890K4682O5825n9433
4008G2745j2841J00883Q618M0710M1645o8827l5176P677j8720N0593K0732n2248
3996A55791K0878J29189M5875j15786j2516L4042Q5756m6932O0427p572L4399
$$ plain form
3985 383551 352479 369829 434721 392268 317816 273343 327628 329464 293961 196891 321572 304701
3973 304701 368391 363688 382076 362824 350080 397620 413943 435132 492732 390117 374143 371163
3961 371163 387557 459133 461101 416410 379998 324441 417962 473634 479459 329632 280502 302750
3949 302750 282964 314193 372525 339689 307150 362146 294926 428282 480678 412852 401030
3938 401030 426750 619330 623426 545576 514043 532887 542828 563999 516693 615522 631793 655722
3926 655722 745409 724450 658960 615723 632545 693141 685856 894301 989127 785230 783818 746018
3914 746018 859703 926239 883579 912417 962744 969270 935838 951819 975232 960254 921279 1046916
3902 1046916 997020 1072536 1186411 1209599 1169039 1212965 1263938 1305184 1409826 1536619 1522791
$$ packed form
3985C83551l1072J7350O4892m2453p4452m4473N4285J836l5503r7070J24681j6871
3973C04701O3690m703J8388j9252j2744M7540J6323K1189N7600j02615j5974k980
3961C71163J6394P1576J968m4691l6412n5557R3521N5672N825j49827m9130K2248
3949C02750j9786L1229N8332l2836l2539N4996o7220J33356N2396o7826j1822
3938D01030K5720J92580M096p7850l1533J8844R941K1171m7306R8829J6271K3929
3926F55722Q9687k0959o5490m3237J6822O0596p285K08445R4826k03897j412l7800
3914G46018J13685O6536m2660K8838N0327O526l3432J5981K3413j4978l8975J25637
3902A046916m9896P5516J13875K3188m0560M3926N0973M1246J04642J26793j3828
$$ plain form
3891 1522791 1429051 1456079 1571053 1751205 1698460 1736795 1783370 1817009 1786055 1992762 2121456
3880 2121456 2179952 2236239 2246785 2330306 2498802 2598910 2679520 2803000 2857241 2862518 3105150
3869 3105150 3329717 3469788 3668530 3871076 4026852 4359447 4681045 4774342 5053339 5242245
3859 5242245 5564061 5890202 6227374 6644770 7183661 7768355 8431529 8931938 9548760 10216695
3849 10216695 10502047 10770860 10925630 11049848 11395062 11850404 12492937 13225406 14189164
3840 14189164 15276883 16414471 17487048 18156788 18489531 18470133 18281803 17864549 17586555
3831 17586555 17478848 17922616 18685035 19627001 20649239 21817202 22827650 23306249 23186474
3822 23186474 22446466 21476291 20363893 19248465 18548519 18143021 18195839 18379209 18806403
$$ packed form
3891A522791r3740K7028J14974J80152n2745L8335M6575L3639l0954K06707J28694
3880B121456N8496N6287J0546Q3521J68496J00108Q0610J23480N4241N277K42632
3869C105150K24567J40071J98742K02546J55776L32595L21598R3297K78997J88906
3859E242245L21816L26141L37172M17396N38891N84694O63174N00409O16822O67935
3849A0216695K85352K68813J54770J24218L45214M55342O42533P32469R63758
3840A4189164J087719J137588J072577O69740L32743j9398j88330m17254k77994
3831A7586555j07707M43768P62419R41966J022238J167963J010448M78599j19775
3822B3186474p40008r70175j112398j115428o99946m05498N2818J83370M27194
$$ plain form
3813 18806403 19419881 19867535 19856520 19433934 18489658 17241784 15852352 14551167 13604736
3804 13604736 12914170 12404381 11985781 11802963 11719098 11612069 11268305 10937810 10267312 9472130
3794 9472130 8665799 7944342 7315796 6715528 6354809 5991190 5735037 5648587 5354293 5106375
3784 5106375 4969975 4805745 4447210 4088377 3836142 3660632 3521932 3298386 3201837 3016294
3774 3016294 2921636 2819665 2751593 2585411 2467814 2501482 2504270 2356737 2309206 2201412 2139278
3763 2139278 2074240 1994543 1976588 1871376 1910242 1886844 1991982 2037007 1938178 1849235 1778877
3752 1778877 1743219 1792544 1617761 1597887 1715515 1739442 1648374 1523573 1528797 1730751 1639646
3741 1639646 1422534 1362122 1557753 1647162 1660916 1581050 1519803 1507535 1644329 1531125 1538177
$$ packed form
3813A8806403O13478M47654j1015m22586r44276j247874j389432j301185r46431
3804A3604736o90566n09789m18600j82818q3865j07029l43764l30495o70498p95182
3794I472130q06331p21457o28546o00268l60719l63619k56153q6450k94294k47918
3784E106375j36400j64230l58535l58833k52235j75510j38700k23546r6549j85543
3774C016294r4658j01971o8072j66182j17597L3668K788j47533m7531j07794o2134
3763B139278o5038p9697j7955j05212L8866k3398J05138M5025r8829q8943p0358
3752A778877l5658M9325j74783j9874J17628K3927r1068j24801N224K01954r1105
3741A639646k17112o0412J95631Q9409J3754p9866o1247j2268J36794j13204P052
$$ plain form
3730 1538177 1514424 1442078 1448925 1433930 1382616 1502965 1432215 1356358 1444915 1509405 1706904
3719 1706904 1850408 1781590 1777852 1930909 1829539 1910957 2077345 2056946 2139402 2183483 2148852
3708 2148852 2201702 2303591 2326084 2407914 2532464 2496489 2562249 2585320 2624244 2483919 2520720
3697 2520720 2395490 2409088 2356466 2243557 2177206 2128415 2130068 2271704 2251290 2229562 2134829
3686 2134829 2200302 2194954 2210986 2177405 2213691 2323933 2231003 2307582 2411513 2455467 2464103
3675 2464103 2568780 2693833 2791381 2726181 2721923 2710303 2899452 3059866 3152380 3088750 3154750
3664 3154750 3255459 3402393 3574789 3470661 3593368 3697186 3715519 3807408 3996986 4111237
3654 4111237 4195058 4355363 4479122 4546869 4643149 4618172 4773430 4902380 5071144 5112627
$$ packed form
3730A538177k3753p2346O847j4995n1314J20349p0750p5857Q8557O4490J97499
3719A706904J43504o8818l738J53057j01370Q1418J66388k0399Q2456M4081l4631
3708B148852N2850J01889K2493Q1830J24550l5975O5760K3071L8924j40325L6801
3697B520720j25230J3598n2622j12909o6351m8791J653J41636k0414k1728r4733
3686B134829O5473n348J6032l3581L6286J10242r2930P6579J03931M3954Q636
3675B464103J04677J25053R7548o5200m258j1620J89149J60414R2514o3630O6000
3664C154750J00709J46934J72396j04128J22707J03818J8333R1889J89578J14251
3654D111237Q3821J60305J23759O7747R6280k4977J55258J28950J68764M1483
$$ plain form
3644 5112627 5132062 5316200 5442481 5433209 5586916 5862967 5907128 6136619 6285503 6554058
3634 6554058 6658684 6782626 7015515 7187797 7392919 7605672 7835110 8207915 8612113 8829061
3624 8829061 9246527 9670485 10086469 10738766 11359749 12091092 12765345 13580147 14596403
3615 14596403 15704723 17103055 18542931 20121681 22077385 24333064 26982008 29951165
3607 29951165 33198729 36770930 40716245 44761157 48686147 52439469 55656261 58237620
3599 58237620 60023261 61104725 61443532 61208238 60661512 59903938 59204253 58749916 58569612
3590 58569612 58492171 58458325 58372760 57903202 56828931 55246267 53104947 50340916 47108381
3581 47108381 43504068 39957937 36405056 32945194 29870488 27086922 24649580 22626790
$$ packed form
3644E112627J9435J84138J26281r272J53707K76051M4161K29491J48884K68555
3634F554058J04626J23942K32889J72282K05122K12753K29438L72805M04198K16948
3624H829061M17466M23958M15984O52297O20983P31343O74253Q14802J016256
3615A4596403J108320J398332J439876J578750J955704K255679K648944K969157
3607B9951165L247564L572201L945315M044912L924990L753322L216792K581359
3599E8237620J785641J081464L38807k35294n46726p57574o99685m54337j80304
3590E8569612p7441l3846q5565m69558j074271j582664k141320k764031l232535
3581D7108381l604313l546131l552881l459862l074706k783566k437342k022790
$$ plain form
3573 22626790 20925070 19527675 18198855 17045014 16079529 15182874 14491563 13762242 13215120
3564 13215120 12801342 12276639 11921429 11654765 11454160 11309905 10927520 10739068 10598041
3555 10598041 10489065 10322700 10238509 10156963 10071365 9966103 9897365 9783484 9713054 9744233
3545 9744233 9661055 9647219 9660944 9612842 9592390 9706271 9819345 9770465 9750679 9785356 9837779
3534 9837779 9993266 9926361 10010127 10133562 10153008 10154075 10303626 10538116 10598004 10730291 10862988
3523 10862988 10950653 11029649 11126828 11240579 11425051 11648584 11828827 11970227 12057783 12186082
3513 12186082 12262860 12305233 12345913 12402072 12609542 12725789 12674262 12720464 12876490 13147380
3503 13147380 13129800 13186891 13477525 13631139 13784745 13987591 14223120 14400608 14627793 14722410
$$ packed form
3573B2626790j701720j397395j328820j153841r65485q96655o91311p29321n47122
3564A3215120m13778n24703l55210k66664k00605j44255l82385j88452j41027
3555A0598041j08976j66365q4191q1546q5598j05262o8738j13881p0430L1179
3545I744233q3178j3836J3725m8102k0452J13881J13074m8880j9786L4677N2423
3534I837779J55487o6905Q3766J23435J9446J067J49551K34490N9888J32287J32697
3523A0862988Q7665P8996R7179J13751J84472K23533J80243J41400Q7556J28299
3513A2186082P6778M2373M0680N6159K07470J16247n1527M6202J56026K70890
3503A3147380j7580N7091K90634J53614J53606K02846K35529J77488K27185R4617
$$ plain form
3493 14722410 14912773 14958737 15092004 15207268 15172158 15276218 15211930 15236040 15221314 15226784 15341221
3482 15341221 15419026 15535751 15862824 16155864 16314596 16600485 17116174 17469447 17943089 18498855
3472 18498855 19134500 19854828 20670212 21685608 22704841 23788271 25048854 26536533 28183073
3463 28183073 30051336 32043966 34358307 37382701 40712698 44621266 49127061 54239704
3455 54239704 60096318 66827980 74746305 83954585 94243549 105698199 117812979 130348711
3447 130348711 142599777 153450937 162435270 168511270 171215905 170439240 165964194 158349548
3439 158349548 148246936 136469818 124018342 111566915 99925444 89343949 79806195
3432 79806195 71258337 63915142 57354721 51872687 46998447 42698200 39158486 36098901
$$ packed form
3493A4722410J90363M5964J33267J15264l5110J04060o4288K4110j4726N470J14437
3482A5341221P7805J16725L27073K93040J58732K85889N15689L53273M73642N55766
3472A8498855O35645P20328Q15384J015396J019233J083430J260583J487679J646540
3463B8183073J868263J992630K314341L024394L329997L908568M505795N112643
3455E4239704N856614O731662P918325R208280J0288964J1454650J2114780J2535732
3447A30348711J2251066J0851160Q984333O076000K704635p76665m475046p614646
3439A58349548j0102612j1777118j2451476j2451427j1641471j0581495r537754
3432G9806195q547858p343195o560421n482034m874240m300247l539714l059585
$$ plain form
3424 36098901 33447448 31194577 29131641 27342347 25613546 24249981 23091126 21951073
3416 21951073 20850360 19993073 19306604 18533050 17826272 17178281 16620156 16078596 15530730
3407 15530730 15082723 14592983 14055949 13695889 13306809 13069725 12795084 12438435 12144351
3398 12144351 11924584 11690628 11556104 11389017 11243903 11033562 10715942 10546621 10416893
3389 10416893 9988460 9601632 9324948 9128037 8717516 8355165 8145193 7877890 7557028
3380 7557028 7303339 7137203 6863084 6558621 6429448 6284017 6028691 5880156 5687325 5611720
3370 5611720 5396147 5238605 5265780 5190593 5033272 4916634 4819367 4605774 4468535 4349453
3360 4349453 4279513 4302383 4148519 3993103 4007515 4070835 3958847 3864488 3761890 3637900
$$ packed form
3424C6098901k651453k252871k062936j789294j728801j363565j158855j140053
3416B1951073j100713q57287o86469p73554p06778o47991n58125n41560n47866
3407A5530730m48007m89740n37034l60060l89080k37084k74641l56649k94084
3398A2144351k19767k33956j34524j67087j45114k10341l17620j69321j29728
3389A0416893m28433l86828k76684j96911m10521l62351k09972k67303l20862
3380G557028k53689j66136k74119l04463j29173j45431k55326j48535j92831p5605
3370E611720k15573j57542K7175p5187j57321j16638r7267k13593j37239j19082
3360D349453o9940K2870j53864j55416J4412O3320j11988r4359j02598j23990
$$ plain form
3350 3637900 3573500 3422791 3538499 3544679 3575241 3487459 3423033 3497553 3417424 3360248 3276815
3339 3276815 3210421 3199434 3243815 3234612 3249636 3251873 3207207 3068300 3151194 3137535 3090490 3066539
3327 3066539 3083369 3128652 3028627 2887756 2885215 3031799 3009903 3040099 3069138 2996121 2929609
3316 2929609 2841327 2859557 2837578 2857561 2899361 2911139 2924256 2968838 2967151 2937531 2978397 3008637
3304 3008637 2967687 2972982 3031420 3088400 2933390 2896711 2996057 2947865 2972984 2944779 2957773
3293 2957773 3007267 3063473 3153351 3263389 3265424 3332785 3256148 3208645 3233376 3381049 3391228
3282 3391228 3343088 3406435 3522448 3494872 3503208 3703852 3763151 3973864 3921475 3859971 3985152
3271 3985152 4129723 4299508 4325959 4410728 4549983 4544581 4663421 4816770 4940436 5041971
$$ packed form
3350C637900o4400j50709J15708O180L0562q7782o4426P4520q0129n7176q3433
3339C276815o6394j0987M4381r203J5024K237m4666j38907Q2894j3659m7045k3951
3327C066539J6830M5283j00025j40871k541J46584k1896L0196K9039p3017o6512
3316B929609q8282J8230k1979J9983M1800J1778J3117M4582j687k9620M0866L0240
3304C008637m0950N295N8438N6980j55010l6679R9346m8192K5119k8205J2994
3293B957773M9494N6206Q9878J10038K035O7361p6637m7503K4731J47673J0179
3282C391228m8140O3347J16013k7576Q336K00644N9299K10713n2389o1504J25181
3271C985152J44571J69785K6451Q4769J39255n402J18840J53349J23666J01535
$$ plain form
3261 5041971 5192225 5462425 5618729 5681364 5875637 6044305 6394535 7023261 7296386 7622568
3251 7622568 7966906 8577186 9279060 9895619 10605782 11391295 12208921 12949945 13735551 14527926
3241 14527926 15349811 15953049 16427938 16869447 17256948 17707158 18005637 18324103 18561118
3232 18561118 18670107 18676218 18582335 18381279 18338799 18378838 18213669 17979250 17730790 17536830
3222 17536830 17280695 16905443 16401163 15993803 15585503 15146260 14639984 14212528 13972888
3213 13972888 13896197 13833152 13888750 14160216 14401641 14746637 15144036 15756969 16483022 17196186
3203 17196186 18167997 19225308 20431873 21900436 23696764 25647114 27949236 30422192
3195 30422192 33130434 35792662 38456766 40956545 43229258 45224461 47064328 48770090
$$ packed form
3261E041971J50254K70200J56304O2635J94273J68668L50230O28726K73125L26182
3251G622568L44338O10280P01874O16559P10163P85513Q17626P41024P85606P92375
3241A4527926Q21885O03238M74889M41509L87501M50210K98479L18466K37015
3232A8561118J08989O111r3883k01056m2480M0039j65169k34419k48460j93960
3222A7536830k56135l75252n04280m07360m08300m39243n06276m27456k39640
3213A3972888p6691o3045N5598K71466K41425L44996L97399O12933P26053P13164
3203A7196186R71811J057311J206565J468563J796328J950350K302122K472956
3195C0422192K708242K662228K664104K499779K272713J995203J839867J705762
$$ plain form
3187 48770090 50406721 51981467 53270553 54259733 54875296 55253881 55333012 55100283 54738820
3178 54738820 54206770 53313886 52449341 51573214 50693415 49771162 48683566 47230168 45434455
3169 45434455 43194741 40954676 38934362 37023984 35442372 34200469 33369197 32960345
3161 32960345 32886255 33315358 33876490 34889580 36303867 37961215 39878077 41890095 43937782
3152 43937782 45994435 47829753 49563486 51146684 52358659 53346025 53850476 54150402 54283543
3143 54283543 54203438 53949798 53678372 53407684 53073936 52401631 51707254 50851601 49463291
3134 49463291 47813444 45923462 43690811 41167578 38633772 36006592 33490550 31018316
3126 31018316 28664914 26520510 24614713 22975885 21524226 20389784 19263033 18358422
$$ packed form
3187D8770090J636631J574746J289086R89180O15563L78585P9131k32729l61463
3178E4738820n32050q92884q64545q76127q79799r22253j087596j453398j795713
3169D5434455k239714k240065k020314j910378j581612j241903q31272m08852
3161C2960345p4090M29103N61132J013090J414287J657348J916862K012018K047687
3152D3937782K056653J835318J733733J583198J211975R87366N04451K99926J33141
3143E4283543q0105k53640k71426k70688l33748o72305o94377q55653j388310
3134D9463291j649847j889982k232651k523233k533806k627180k516042k472234
3126C1018316k353402k144404j905797j638828j451659j134442j126751r04611
$$ plain form
3118 18358422 17541395 16808894 16269096 15932880 15559715 15306639 15221176 15098691 15204633 15310983
3108 15310983 15460526 15818457 16238679 16601072 17061827 17614186 18189576 18820407 19374218
3099 19374218 19916207 20278736 20599459 20761590 20830700 20806556 20861146 20874740 20945102 20979536
3089 20979536 20850152 20747166 20693599 20576087 20486187 20373786 20086155 19733587 19303783 18908531
3079 18908531 18364443 17824840 17040799 16370167 15829327 15331240 14746289 14326496 13915442
3070 13915442 13505990 13026593 12556129 12094195 11680375 11339360 11149055 10862181 10683918
3061 10683918 10639395 10344474 10121637 10001114 9981102 9984025 10001840 10036044 10062066 10243868 10355821
3050 10355821 10438457 10554293 10706636 11055989 11375915 11626425 12093628 12499060 13050775 13657964
$$ packed form
3118A8358422q17027p32501n39798l36216l73165k53076q5463j22485J05942J06350
3108A5310983J49543L57931M20222L62393M60755N52359N75390O30831N53811
3099A9374218N41989L62529L20723J62131O9110k4144N4590J3594P0362L4434
3089B0979536j29384j02986n3567j17512q9900j12401k87631l52568m29804l95252
3079A8908531n44088n39603p84041o70632n40840m98087n84951m19793m11054
3070A3915442m09452m79397m70464m61934m13820l41015j90305k86874j78263
3061A0683918m4523k94921k22837j20523k0012K923J7815L4204K6022J81802J11953
3050A0355821Q2636J15836J52343L49353L19926K50510M67203M05432N51715O07189
$$ plain form
3040 13657964 14351628 15214314 16285394 17580569 18739545 20208365 21896276 24076510
3032 24076510 26477951 28966120 31731498 34353139 36746739 38858568 40669413 42598654
3024 42598654 44922305 47466636 50153077 52664175 54575085 55900515 56474255 57202946
3016 57202946 58054143 58925137 59976624 60649048 60998112 60615173 59410368 57591608 55216653
3007 55216653 52390986 49205209 45777463 41952020 38136493 34461410 31081999 28134511
2999 28134511 25424542 22998649 20984981 19374309 17878936 16531302 15501013 14554841
2991 14554841 13695992 12919996 12185917 11649532 11187346 10613315 10202518 9888734 9568076
2982 9568076 9179373 8897350 8629646 8494819 8329916 8058141 7975742 7775337 7705411 7506564
$$ packed form
3040A3657964O93664Q62686J071080J295175J158976J468820J687911K180234
3032B4076510K401441K488169K765378K621641K393600K111829J810845J929241
3024D2598654K323651K544331K686441K511098J910910J325430N73740P28691
3016E7202946Q51197Q70994J051487O72424L49064l82939j204805j818760k374955
3007E5216653k825667l185777l427746l825443l815527l675083l379411k947488
2999B8134511k709969k425893k013668j610672j495373j347634j030289r46172
2991A4554841q58849p75996p34079n36385m62186n74031m10797l13784l20658
2982I568076l88703k82023k67704j34827j64903k71775q2399k00405o9926j98847
$$ plain form
2972 7506564 7335385 7360550 7358220 7280116 7350615 7406167 7431401 7715516 7789309 7910192 8019185
2961 8019185 8198965 8371219 8394735 8364933 8210100 7935231 7612210 7328214 6962687 6620087
2951 6620087 6327745 5943605 5568363 5327598 5046776 4685526 4563478 4398007 4329882 4112645
2941 4112645 3952695 3856520 3777757 3749138 3753607 3712143 3536450 3453547 3421997 3404875 3343426
2930 3343426 3286910 3200567 3202263 3241215 3137468 3070184 3079165 3046312 3109623 3046017 3156899
2919 3156899 3071217 3115355 3089568 3137611 3057285 3032738 3147169 3133417 2971886 2851218 2863013
2908 2863013 2876398 2958665 2797375 2780208 2810433 2691802 2614934 2609308 2547332 2542060 2669317
2897 2669317 2715971 2691980 2636903 2643518 2677941 2784345 2797003 2824813 2829344 2799614 2865272 2874106
$$ packed form
2972G506564j71179K5165k330p8104P0499N5552K5234K84115P3793J20883J08993
2961H019185J79780J72254K3516k9802j54833k74869l23021k83996l65527l42600
2951F620087k92342l84140l75242k40765k80822l61250j22048j65471o8125k17237
2941D112645j59950r6175p8763k8619M469m1464j75693q2903l1550j7122o1449
2930C343426n6516q6343J696L8952j03747o7284Q981l2853O3311o3606J10882
2919C156899q5682M4138k5787M8043q0326k4547J14431j3752j61531j20668J1795
2908B863013J3385Q2267j61290j7167L0225j18631p6868n626o1976n272J27257
2897B669317M6654k3991n5077O615L4423J06404J2658K7810M531k9730O5658Q834
$$ plain form
2885 2874106 2906464 2929131 2958993 3016970 3051157 2934872 2963519 3020474 3129046 3136498 3191562
2874 3191562 3248045 3188704 3262313 3264964 3203678 3223478 3306551 3339517 3470837 3472868 3594088
2863 3594088 3644334 3624280 3676020 3677345 3715145 3812042 3858589 3889990 3957451 4060010 4154607
2852 4154607 4318189 4459958 4497853 4562737 4591474 4611299 4629994 4675208 4752666 4865817 5162344
2841 5162344 5268747 5354413 5578140 5744293 5810648 5983863 6229166 6591358 6756652 6874109
2831 6874109 7047438 7318308 7631778 7668340 7904836 8089833 8403642 8723162 9046276 9295974
2821 9295974 9660400 9909116 10056366 10441725 10728000 10928600 11240896 11538557 11761598 12142423
2811 12142423 12402519 12598835 12826285 13022122 13304108 13700923 14092315 14332300 14678268
$$ packed form
2885B874106L2358K2667K9862N7977L4187j16285K8647N6955J08572P452N5064
2874C191562N6483n9341P3609K651o1286J9800Q3073L2966J31320K031J21220
2863C594088N0246k0054N1740J325L7800R6897M6547L1401O7461J02559R4597
2852D154607J63582J41769L7895O4884K8737J9825J8695M5214P7458J13151K96527
2841E162344J06403Q5666K23727J66153O6355J73215K45303L62192J65294J17457
2831F874109J73329K70870L13470L6562K36496J84997L13809L19520L23114K49698
2821I295974L64426K48716J47250L85359K86275K00600L12296K97661K23041L80825
2811A2142423K60096J96316K27450J95837K81986L96815L91392K39985L45968
$$ plain form
2802 14678268 14939541 15320949 15804124 16279653 16668943 17439296 18161713 18829542 19503132
2793 19503132 20347295 21098977 22132992 23118424 24075873 25241253 26530778 27858792 29244650
2784 29244650 30773178 32480595 34497757 36528052 38734390 41305553 44326663 47604425
2776 47604425 51365412 55714540 60699858 66711759 73920462 82256323 91819305 102746175
2768 102746175 115301740 129878187 146847506 166760600 190693136 219268428 252552302
2761 252552302 287996478 320091720 342873475 346925711 326242188 286614482 240591752
2754 240591752 200020961 168707220 145450056 127881232 114162737 102804964 92823657
2747 92823657 83697135 75672625 68566510 62528083 57431343 53006736 49178921 45858884
$$ packed form
2802A4678268K61273L81408M83175M75529L89290P70353P22417O67829O73590
2793A9503132Q44163P51682J034015R85432R57449J165380J289525J328014J385858
2784B9244650J528528J707417K017162K030295K206338K571163L021110L277762
2776D7604425L760987M349128M985318O011901P208703Q335861R562982J0926870
2768A02746175J2555565J4576447J6969319J9913094K3932536K8575292L3283874
2761B52552302L5444176L2095242K2781755M052236k0683523l9627706m6022730
2754B40591752m0570791l1313741k3257164j7568824j3718495j1357773r981307
2747I2823657r126522q024510p106115o038427n096740m424607l827815l320037
$$ plain form
2739 45858884 42863281 40266193 37851713 35699871 33834838 32189753 30682239 29219528
2731 29219528 27935776 26773731 25622002 24491725 23389527 22398321 21442827 20667054 20023623
2722 20023623 19220153 18460426 17706288 17012836 16289099 15717710 15150244 14464113 13917745
2713 13917745 13539520 13087579 12479872 12052019 11726488 11262565 10813720 10434479 10076331
2704 10076331 9737080 9611815 9351985 9130654 8934100 8718666 8440462 8258809 8132976
2695 8132976 7897135 7784367 7633260 7446354 7419185 7262696 7085165 6884067 6685344 6458391
2685 6458391 6239145 6093674 6019432 5838273 5572891 5393776 5300217 5079256 4875241 4882950
2675 4882950 4805108 4559493 4440324 4527400 4356592 4161887 3827673 3802808 3924266 3763862
$$ packed form
2739D5858884k995603k597088k414480k151842j865033j645085j507514j462711
2731B9219528j283752j162045j151729j130277j102198r91206r55494p75773o43431
2722B0023623q03470p59727p54138o93452p23737n71389n67466o86131n46368
2713A3917745l78225m51941o07707m27853l25531m63923m48845l79241l58148
2704A0076331l39251j25265k59830k21331j96554k15434k78204j81653j25833
2695H132976k35841j12768j51107j86906k7169j56489j77531k01098j98723k26953
2685F458391k19246j45471p4242j81159k65382j79115r3559k20961k04015P709
2675D882950p7842k45615j19169Q7076j70808j94705l34214k4865J21458j60404
$$ plain form
2665 3763862 3622692 3592133 3622648 3508149 3399775 3306648 3268540 3179590 3100235 3056799 2910166
2654 2910166 2900770 2761213 2711558 2646872 2493119 2406459 2504711 2520589 2424119 2492862 2562631
2643 2562631 2373368 2252297 2275504 2269395 2267372 2176358 2143781 2136038 2120597 2111635 2164876 2108223
2631 2108223 2099516 2027851 2004931 2010589 2056036 2094717 1970753 1926245 1957654 1843869 1854874
2620 1854874 1807944 1818043 1845209 1687487 1578313 1615583 1486676 1481305 1558166 1625349 1589211
2609 1589211 1479237 1479442 1332317 1233159 1279299 1216570 1184108 1071931 1130320 1289877 1158106
2598 1158106 1099209 1171081 1281463 1280982 1267303 1248733 1324301 1324427 1284657 1271240 1316245 1366375
2586 1366375 1250466 1272185 1228536 1138029 1011361 1078892 989197 876441 957496 957233 967736
$$ packed form
2665C763862j41170l0559L0515j14499j08374r3127l8108q8950p9355m3436j46633
2654B910166r396j39557m9655o4686j53753q6660R8252J5878r6470O8743O9769
2643B562631j89263j21071K3207o109k023r1014l2577p743j5441q962N3241n6653
2631B108223q707p1665k2920N658M5447L8681j23964m4508L1409j13785J1005
2620A854874m6930J0099K7166j57722j09174L7270j28907n371P6861O7183l6138
2609A589211j09974K05j47125r9158M6140o2729l2462j12177N8389J59557j31771
2598A158106n8897P1872J10382m81j3679j8570P5568J26l9770j3417M5005N0130
2586A366375j15909K1719m3649r0507j26668O7531q9695j12756Q1055k63J0503
$$ plain form
2575 967736 911551 894716 887654 921697 854698 874147 793543 782649 728327 739573 724437 726737
2563 726737 750278 810537 809075 641719 633518 608929 551209 600959 584105 615347 565878 595816
2551 595816 599542 507010 576660 629219 669971 633618 547715 582165 605406 578492 597161 488990
2539 488990 471410 518934 554453 712397 600247 642464 666971 645454 586730 608421 705563
2528 705563 633397 699159 766783 785673 830812 747896 660845 753800 755936 828015 788202 753654
2516 753654 813739 804756 998346 994072 894502 1092241 1290869 1421629 1438120 1547412 1772475
2505 1772475 2047641 2149062 2221312 2207972 2016846 1750931 1572855 1377631 1250676 1146861
2495 1146861 1031806 940604 809168 772884 706635 603768 667824 680506 732824 707366 607880
$$ packed form
2575I67736n6185j6835p062L4043o6999J9449q0604j0894n4322J1246j5136K300
2563G26737K3541O0259j462j67356q201k4589n7720M9750j6854L1242m9469K9938
2551E95816L726r2532O9650N2559M0752l6353q5903L4450K3241k6914J8669j08171
2539D88990j7580M7524L5519J57944j12150M2217K4507k1517n8724K1691R7142
2528G05563p2166O5762O7624J8890M5139q2916q7051R2955K136P2079l9813l4548
2516G53654O0085q983J93590m274r9570J97739J98628J30760J6491J09292K25063
2505A772475K75166J01421P2250j3340j91126k65915j78076j95224j26955j03815
2495A146861j15055r1202j31436l6284o6249j02867O4056J2682N2318k5458r9486
$$ plain form
2484 607880 574581 470352 500484 456791 487894 542835 461671 393761 345093 329135 310947
2473 310947 300814 251622 378870 426354 462399 414195 324035 297065 314291 228616 339905
2462 339905 403386 408502 409970 301770 375735 291411 492768 443486 428053 387958 278602
2451 278602 344527 372809 205462 250601 402669 283245 238222 342558 293834 188304 192742
2440 192742 245588 221690 210504 227972 222730 408377 399230 374064 305855 238424 189940 230795
2428 230795 190980 183619 117647 134764 143771 156199 176123 179785 153847 121297 162633 143898
2416 143898 188267 191926 242755 99156 68478 176069 168705 196099 241913 177412 34884
2405 34884 70776 177446 106382 195889 158195 102676 167529 126553 78679 224693 308001
$$ packed form
2484F07880l3299j04229L0132m3693L1103N4941q1164o7910m8668j5958j8188
2473C10947j0133m9192J27248M7484L6045m8204r0160k6970J7226q5675J11289
2462C39905O3481N116J468j08200P3965q4324K01357m9282j5433m0095j09356
2451B78602O5925K8282j67347M5139J52068j19424m5023J04336m8724j05530M438
2440A92742N2846k3898j1186J7468n242J85647r147k5166o8209o7431m8484M0855
2428B30795l9815p361o5972J7117R007J2428J9924L662k5938l2550M1336j8735
2416A43898M4369L659N0829j43599l0678J07591p364K7394M5814o4501j42528
2405C4884L5892J06670p1064Q9507l7694n5519O4853m0976m7874J46014Q3308
$$ plain form
2394 308001 199123 123710 174530 156666 135105 212853 144780 124833 233730 201088 106780
2383 106780 102957 58802 -125171 23530 102870 79844 150207 147087 142375 184613 339957 250067
2371 250067 140035 176600 170159 180223 244888 74148 -13762 62509 87000 51579 157963
2360 157963 145867 102499 236337 277677 155943 -92 82250 182218 112118 97572 180388
2349 180388 31557 -5513 37199 85982 122668 128098 106658 172354 108907 -7106 73772
2338 73772 65725 53400 43791 49736 138067 92513 184038 220976 14865 36783 73702 48086
2326 48086 29173 27255 98822 86690 -62727 -38456 -54995 -24959 32464 73825 133920 219104
2314 219104 54469 79122 101767 162593 224854 106095 140660 232865 311967 191508 214701
$$ packed form
2394C08001j08878p5413N0820j7864k1561P7748o8073j9947J08897l2642r4308
2383A06780l823m4155j83973J48701P9340k3026P0363l120m712M2238J55344q9890
2371B50067j10032L6565o441J0064O4665j70740q7910P6271K4491l5421J06384
2360A57963j2096m3368J33838M1340j21734j56035Q2342R9968p0100j4546Q2816
2349A80388j48831l7070M2712M8783L6686N430k1440O5696o3447j16013Q0878
2338G3772q047j2325r609N945Q8331m5554R1525L6938k06111K1918L6919k5616
2326D8086j8913j918P1567j2132j49417K4271j6539L0036N7423M1361O0095Q5184
2314B19104j64635K4653K2645O0826O2261j18759L4565R2205P9102j20459K3193
$$ plain form
2303 214701 243876 231569 278397 225686 342357 281084 186317 281513 181700 207863 274280
2292 274280 109176 91525 216463 106932 155926 147193 115664 198670 182782 148405 177994
2281 177994 155565 73739 105724 176144 176181 158253 216535 100224 158491 67313 78874 188023
2269 188023 63503 62034 70588 84760 137324 204003 59632 -19885 173504 182319 205388 240203
2257 240203 212528 219640 100846 -65211 48938 36268 -40474 114923 106562 109233 67144
2246 67144 35202 17543 116835 52799 -93062 -25541 29495 40295 -35998 24890 11326 62347
2234 62347 167627 115735 142957 163711 214883 193215 141425 80161 70771 109021 206709 48053
2222 48053 58861 72927 92736 175841 161356 208561 178308 158345 190830 106537 21893 30921
$$ packed form
2303B14701K9175j2307M6828n2711J16671o1273r4767R5196r9813K6163O6417
2292B74280j65104j7651J24938j09531M8994q733l1529Q3006j5888l4377K9589
2281A77994k2429q1826L1985P0420L7j7928N8282j16311N8267r1178J1561J09149
2269A88023j24520j469Q554J4172N2564O6679j44371p9517J93389Q815K3069L4815
2257B40203k7675P112j18794j66057J14149j2670p6742J55397q361K671m2089
2246F7144l1942j7659R9292o4036j45861O7521N5036J0800p6293O0888j3564N1021
2234F2347J05280n1892K7222K0754N1172k1668n1790o1264r390L8250R7688j58656
2222D8053J0808J4066J9809Q3105j4485M7205l0253j9963L2485q4293q4644R028
$$ plain form
2210 30921 115362 106153 10417 32444 87031 112186 187225 267526 227195 230167 108426 108522 137228
2197 137228 92258 162070 140755 167457 170266 30264 153811 308651 442254 462129 324568
2186 324568 370889 346706 408160 427270 332137 243026 312626 212751 173462 265523 231914 296990
2174 296990 366214 396828 372891 313329 319088 241923 216986 230182 240320 274459 328696 300262
2162 300262 396022 403799 366195 292687 197805 244873 290076 331944 387389 401033 392657 410790
2150 410790 387818 323682 314082 344426 369646 343410 360204 460887 451458 473615 319598 385707
2138 385707 591148 591296 560377 476371 417847 521158 649890 711843 635829 706607 514331
2127 514331 601227 637401 731681 710175 924213 951659 929597 922950 901924 1000049 965930 929521
$$ packed form
2210C0921Q4441r209r5736K2027N4587K5155P5039Q0301m0331K972j21741R6K8706
2197A37228m4970O9812k1315K6702K809j40002J23547J54840J33603J9875j37561
2186C24568M6321k4183O1454J9110r5133q9111O9600r9875l9289R2061l3609O5076
2174B96990O9224L0614k3937n9562N759p7165k4937J3196J0138L4139N4237k8434
2162C00262R5760P777l7604p3508r4882M7068M5203M1868N5445J3644q376J8133
2150D10790k2972o4136r600L0344K5220k6236J6794J00683r429K2157j54017O6109
2138C85707K05441J48l0919q4006n8524J03311J28732O1953p6014P0778j92276
2127E14331Q6896L6174R4280k1506K14038K7446k2062o647k1026R8125l4119l6409
$$ plain form
2115 929521 947961 935808 1008816 1218146 1175705 1213367 1232219 1266821 1216153 1351942 1367321
2104 1367321 1309624 1358073 1351745 1463717 1413477 1445845 1371065 1457501 1684529 1837009 1866042
2093 1866042 1825170 2011847 2128759 2252263 2324374 2408646 2531073 2712500 2941533 3154106
2083 3154106 3398910 3523867 3677181 3843694 4061030 4488329 4902335 5303714 5748222 6229578
2073 6229578 6822569 7386428 8271671 9203156 10188482 11138088 12328101 14053111 16097313
2064 16097313 18589727 21627519 25504950 30281181 35572582 39556253 43527790 42669584
2056 42669584 37464772 30264911 23465002 19275425 16249761 14095933 12238366 11147776
2048 11147776 10092554 9233304 8525013 8008194 7452068 6853639 6248552 5672999 5220818
$$ packed form
2115I29521J8440j2153P3008K09330m2441L7662J8852L4602n0668J35789J5379
2104A367321n7697M8449o328J11972n0240L2368p4780Q6436K27028J52480K9033
2093A866042m0872J86677J16912J23504P2111Q4272J22427J81427K29033K12573
2083C154106K44804J24957J53314J66513K17336M27299M14006M01379M44508M81356
2073F229578N92991N63859Q85243R31485R85326R49606J190013J725010K044202
2064A6097313K492414L037792L877431M776231N291401L983671L971537q58206
2056D2669584n204812p199861o799909m189577l025664k153828j857567j090590
2048A1147776j055222q59250p08291n16819n56126n98429o05087n75553m52181
$$ plain form
2039 5220818 4819570 4420076 4170055 4038996 3885515 3637207 3492964 3246531 3009777 2923436
2029 2923436 2904697 2706199 2592348 2544163 2406436 2231838 2140271 2101072 2038057 2023715 1955411
2018 1955411 1823940 1721861 1731419 1698875 1598398 1606100 1547510 1389957 1265045 1363268 1166673
2007 1166673 1133948 1217818 1058709 1013675 1059570 1032321 998087 993926 939501 942297 815646
1996 815646 769457 866536 802673 808914 925337 801677 804195 982466 843955 704365 700913
1985 700913 732502 735437 684621 609479 619083 689211 714483 679905 630707 625843 704331 533387
1973 533387 441839 468515 387532 431038 367794 441944 379815 352328 376122 377270 360461 238285
1961 238285 323719 359008 401772 395406 377957 279785 383213 378624 351672 322531 278950 254591
$$ packed form
2039E220818m01248l99494k50021j31059j53481k48308j44243k46433k36754q6341
2029B923436j8739j98498j13851m8185j37727j74598r1567l9199o3015j4342o8304
2018A955411j31471j02079R558l2544j00477P702n8590j57553j24912R8223j96595
2007A166673l2725Q3870j59109m5034M5895k7249l4234m161n4425K796j26651
1996H15646m6189R7079o3863O241J16423j23660K518J78271j38511j39590l452
1985G00913L1589K935n0816p5142R604P0128K5272l4578m9198m864P8488j70944
1973E33387r1548K6676q0983M3506o3244P4150o2129k7487K3794J148j6809j22176
1961B38285Q5434L5289M2764o366j7449r8172J03428m589k6952k9141m3581k4359
$$ plain form
1949 254591 246913 253634 304910 281944 281400 295975 218193 269494 146439 232367 298805 400841
1937 400841 361635 237681 221365 190059 152790 194816 148633 261140 280767 292198 251183
1926 251183 280477 179163 209414 244177 132168 173760 133796 112481 165194 241064 121419
1915 121419 266493 316324 141308 73861 75884 92415 163805 152886 169173 213546 180061
1904 180061 51149 -61732 -79118 70216 125754 124344 103028 153381 42002 48917 88386
1893 88386 34797 59735 159913 192720 31947 56220 15811 149191 153906 121390 76605
1882 76605 6306 146181 168755 75976 21628 149489 41746 55740 68760 3286 44453
1871 44453 96514 138026 89219 191404 170562 132104 141203 249754 258426 147706 72398 58803
$$ packed form
1949B54591p678O721N1276k2966n44J4575p7782N1301j23055Q5928O6438J02036
1937D00841l9206j23954j6316l1306l7269M2026m6183J12507J9627J1431m1015
1926B51183K9294j01314L0251L4763j12009M1592l9964k1315N2713P5870j19645
1915A21419J45074M9831j75016o7447K023J6531P1390j0919J6287M4373l3485
1904A80061j28912j12881j7386J49334N5538j410k1316N0353j11379O915L9469
1893H8386n3589K4938J00178L2807j60773K4273m0409J33380M715l2516m4785
1882G6605p0299J39875K2574r2779n4348J27861j07743J3994J3020o5474M1167
1871D4453N2061M1512m8807J02185k0842l8458R099J08551Q672j10720p5308j3595
$$ plain form
1859 58803 -79404 -113159 -6631 40955 76768 -8228 -16640 56203 176112 183534 149569 98047
1847 98047 85873 73046 24832 10562 83634 -18984 54439 43382 -23716 70198 109020 -22444
1835 -22444 -42730 119787 105481 25047 34039 103442 77679 105736 143343 146036 46184 164343
1823 164343 86133 9736 87338 102229 186577 216012 189056 205111 190222 231970 255939 279087
1811 279087 157180 146137 25824 4796 58188 126372 86572 65930 -14747 -60183 114435
1800 114435 11143 40079 71291 61344 59040 116678 67809 111658 149708 49242 -40085 -38659
1788 -38659 4003 61768 -9146 -85421 -93265 -70705 65976 67017 42989 -32153 -32569 -105495
1776 -105495 -18269 14800 2633 60629 -10283 -63110 -45483 -10331 -14244 -2208 82776 161859
$$ packed form
1859E8803j38207l3755J06528M7586L5813q4996q412P2843J19909P422l3965n1522
1847I8047j2174j2827m8214j4270P3072j02618P3423j1057o7098R3914L8822j31464
1835b2444k0286J62517j4306q0434Q992O9403k5763K8057L7607K693r9852J18159
1823A64343p8210p6397P7602J4891Q4348K9435k6956J6055j4889M1748K3969K3148
1811B79087j21907j1043j20313k1028N3392O8184l9800k0642q0677m5436J74618
1800A14435j03292K8936L1212r947k304N7638m8869M3849L8050j00466q9327J426
1788c8659M2662N7765p0914p6275p844K2560J36681J041k4028p5142m16p2926
1776a05495Q7226L3069j2167N7996p0912n2827J7627L5152l913J2036Q4984P9083
$$ plain form
1764 161859 156160 12577 -19159 116937 -14828 -23228 -82711 -99721 -66030 -65561 -36111 -22305
1752 -22305 20621 -27453 -98269 -94420 8601 -51914 -4115 49120 -125556 -123101 -64738 85187
1740 85187 7795 35265 -6547 -64178 38368 27808 -26319 -66697 -14111 -32106 -32813 -145474
1728 -145474 -37296 162792 9911 -91957 -187923 -124887 -36420 -126110 7043 -21070 -93128
1717 -93128 -28111 -50019 -93074 -103490 -56947 -178356 -142867 -116126 -31654 16212 2520 -26333
1705 -26333 -98501 -57997 -43413 -34141 -70481 -11740 86451 96639 124709 23238 25324 46327
1693 46327 -48921 75043 64386 144529 75553 -71624 -64545 -59762 -80322 -74478 -9093 64599
1681 64599 1818 3952 4671 -24826 27636 88996 80170 -9807 44832 -31003 -46904 16989 -4602
$$ packed form
1764A61859n699j43583l1736J36096j31765q400n9483j7010L3691M69K9450J3806
1752b2305M2926m8074p0816L849J03021o0515M7799N3235j74676K455N8363J49925
1740H5187p7392K7470m1812n7631J02546j0560n4127m0378N2586j7995p07j12661
1728a45474J08178K00088j52881j01868r5966O3036Q8467q9690J33153k8113p2058
1717i3128O5017k1908m3055j0416M6543j21409L5489K6741Q4472M7866j3692k8853
1705b6333p2168M0504J4584R272l6340N8741R8191J0188K8070j01471K086K1003
1693D6327r5248J23964j0657Q0143o8976j47177P079M783k0560N844O5385P3692
1681F4599o2781K134P19k9497N2462O1360q826q9977N4639p5835j5901O3893k1591
$$ plain form
1668 -4602 -41780 -166081 -33500 38900 -81531 -23025 -7508 38660 -106233 -141139 -168279
1657 -168279 -213329 -199316 -89884 -85306 -75863 20296 -61612 -40638 -129077 -63461 -65856 -35190
1645 -35190 4762 3877 34877 -64682 -14719 9644 -32987 -21472 100545 118812 71316 -84149
1633 -84149 -200320 -18442 -29379 -77519 -30783 -24004 -78801 145679 184105 56949 147699
1622 147699 67554 -82232 -18713 -3944 20816 18501 -39519 84150 24760 4196 -44574
1611 -44574 -45443 46274 97676 65487 -47363 -52770 -65173 -72720 -38064 -4457 -75266 -99168
1599 -99168 -67731 -21249 -78087 -105548 -19577 11206 48774 564 -88286 -117269 -127362 -87496
1587 -87496 14716 -1344 -28027 -24464 -43777 -4763 8368 -31515 -77246 29463 114338 76327
$$ packed form
1668d602l7178j24301J32581P2400j20431N8506J5517M6168j44893l4906k7140
1657a68279m5050J4013J09432M578R443R6159q1908K0974q8439O5616k395L0666
1645c5190L9952q85L1000r9559M9963K4363m2631J1515J22017J8267m7496j55465
1633h4149j16171J81878j0937m8140M6736O779n4797K24480L8426j27156R0750
1622A47699q0145j49786O3519J4769K4760k315n8020J23669n9390k0564m8770
1611d4574q69R1717N1402l2189j12850n407j2403p547L4656L3607p0809k3902
1599i9168L1437M6482n6838k7461Q5971L0783L7568m8210q8850k8983j0093L9866
1587h7496J02212j6060k6683L563j9313L9014J3131l9883m5731J06709Q4875l8011
$$ plain form
1575 76327 6439 28167 12871 17309 -60430 -51151 358 -140266 -71869 86430 36266 -85460
1563 -85460 17663 -61719 -64402 -38349 -122022 -116535 -59412 -125291 -116035 52811 -30914 -60940
1551 -60940 -147234 -44536 -87307 -13362 -25171 1550 37450 -25311 -115520 -53446 -70730 -69686
1539 -69686 -7937 21269 111991 -104145 -148229 -126493 -64356 26304 -20117 -34897 -60962 -210592
1527 -210592 -117114 -43633 55468 56386 18431 48672 28462 19551 10691 -13748 -29255 -42745
1515 -42745 24111 11624 -21756 -51857 -140926 -115520 -25731 -25232 119744 66732 16568 -31481
1503 -31481 -36852 -76321 -60133 -77431 -65814 -82527 -64856 -88418 -9544 7547 100476 68264
1491 68264 -65757 1673 -70258 -119902 -30945 24968 29824 -10948 10287 3565 -42889 118824
$$ packed form
1575G6327o9888K1728j5296M438p7739R279N1509j40624O8397J58299n0164j21726
1563h5460J03123p9382k683K6053q3673N487N7123o5879R256J68846q3725l0026
1551f0940q6294J02698m2771P3945j1809K6721L5900o2761r0209O2074j7284J044
1539f9686O1749K9206R0722k16136m4084K1736O2137R0660m6421j4780k6065j49630
1527b10592R3478P3481R9101R18l7955L0241k0210q911q860k4439j5507j3490
1515d2745O6856j2487l3380l0101q9069K5406Q9789M99J44976n3012n0164m8049
1503c1481n371l9469J6188j7298J1617j6713J7671k3562P8874J7091R2929l2212
1491F8264j34021O7430p1931m9644Q8957N5913M856m0772K1235o722m6454J61713
$$ plain form
1479 118824 48882 -134157 -157831 -89781 -112274 -18549 -20594 10096 73397 76145 53204 -106528
1467 -106528 -30118 103084 18659 -37240 -123518 -106459 -58037 41472 36970 114561 87100 25266
1455 25266 -7214 24170 55033 32068 95374 56248 34062 116558 457 77286 64958 154651
1443 154651 57370 -92080 -69870 -122287 -83487 -163141 -41824 1185 -60120 -29849 19599
1432 19599 -21462 47457 -20380 -88964 -109139 -54148 -2651 -24755 31941 -24279 -116568 -106009
1420 -106009 -26710 72227 133986 100117 -16567 73640 -31106 -28079 84750 33317 73860
1409 73860 107400 76742 42659 -1182 -27877 -53026 -20189 -63627 -40247 -59482 9684 141
1397 141 59141 174912 65442 -46701 -47473 -46634 -85791 -94253 -105876 -20211 -116747 -116098 -126007
$$ packed form
1479A18824o9942j83039k3674O8050k2493R3725k045L0690O3301K748k2941j59732
1467a06528P6410J33202q4425n5899q6278J7059M8422R9509m502P7591k7461o1834
1455B5266l2480L1384L0863k2965O3306l9126k2186Q2496j16101P6829j2328Q9693
1443A54651r7281j49450K2210n2417L8800p9654J21317M3009o1305L0271M9448
1432A9599m1061O8919o7837o8584k0175N4991N1497k2104N6696n6220r2289J0559
1420a06009P9299R8937O1759l3869j16684R0207j04746L027J12829n1433M0543
1409G3860L3540l0658l4083m3841k6695k5149L2837m3438K3380j9235O9166r543
1397A41N9000J15771j09470j12143p72Q39l9157q462j1623Q5665r6536O49r909
$$ plain form
1384 -126007 7603 8580 -52908 11176 48256 -30658 59566 180956 21901 -56463 -23473
1373 -23473 -10935 -42763 -82575 11610 -105978 -67534 23879 41958 80495 72763 66418 91383
1361 91383 118702 100102 127663 88778 5528 60387 41619 129028 -43072 26268 -45453 -114335
1349 -114335 -76588 -34980 -50020 -49209 -50128 -17696 43528 -49678 -42114 -16143 45404 -64124
1337 -64124 -100460 -98623 -66596 -84673 -34193 84914 103520 -63967 -95343 -127199 10101
1326 10101 -96893 -150609 75295 -14239 3901 -88183 -112372 -91357 -145657 4874 -21238
1315 -21238 -23094 -145254 -72649 852 11728 -49284 -8445 -85211 -4044 -1246 57318 -36418
1303 -36418 -48935 68873 60816 125788 97420 137680 5325 -119571 -60988 -122272 -46973
$$ packed form
1384a26007J33610R77o1488O4084L7080p8914R0224J21390j59055p8364L2990
1373b3473J2538l1828l9812R4185j17588L8444R1413J8079L8537p732o345K4965
1361I1383K7319j8600K7561l8885q3250N4859j8768Q7409j72100O9340p1721o8882
1349a14335L7747M1608j5040Q11r19L2432O1224r3206P564K5971O1547j09528
1337f4124l6336J837L2027j8077N0480J19107J8606j67487l1376l1856J37300
1326A0101j06994n3716K25904q9534J8140r2084k4189K1015n4300J50531k6112
1315b1238j856j22160P2605P3501J0876o1012M0839p6766Q1167K798N8564r3736
1303c6418j2517J17808q057O4972k8368M0260j32355j24896N8583o1284P5299
$$ plain form
1292 -46973 40167 161002 123215 40597 -29527 -29794 50752 -68042 20074 108874 5235 12071
1280 12071 33081 52990 -36109 -63974 -5583 20382 -22812 -9345 -34848 -1416 131545 139350
1268 139350 -17315 7146 -69204 -76580 126829 -75914 119865 -23727 -69509 -13209 -48690
1257 -48690 -86435 -30733 -82361 -129882 -92702 -103090 -62459 -63615 -37218 64136 -6424 -82782
1245 -82782 -33183 -125590 -17371 9275 -82701 -122129 -103992 -72683 4386 5629 38393 -11603
1233 -11603 -601 51575 -22689 17017 3243 -107598 -42382 78763 14291 38431 53499
1222 53499 10606 -52008 -35475 -29862 -28140 -98706 -120280 -45564 -117096 -118504 -111570 -45721 -21754
1209 -21754 -77028 -63700 -72581 -98143 -51333 -17464 -100647 -129820 -68600 -16611 -119224 14118
$$ packed form
1292d6973Q7140J20835l7787q2618p0124k67Q0546j18794Q8116Q8800j03639O836
1280A2071K1010J9909q9099k7865N8391K5965m3194J3467k5503L3432J32961P805
1268A39350j56665K4461p6350p376K03409k02743J95779j43592m5782N6300l5481
1257d8690l7745N5702n1628m7521L7180j0388M0631j156K6397J01354p0560p6358
1245h2782M9599r2407J08219K6646r1976l9428J8137L1309P7069J243L2764m9996
1233a1603J1002N2176p4264L9706j3774j10841O5216J21145o4472K4140J5068
1222E3499m2893o2614J6533N613J722p0566k1574P4716p1532j408O934O5849K3967
1209b1754n5274J3328q881k5562M6810L3869q3183k9173O1220N1989j02613J33342
$$ plain form
1197 14118 -34885 21017 -3198 51008 -12827 -125693 40841 40661 58436 171024 50088
1186 50088 -84811 60250 23325 -72713 -43948 -95063 -74628 -70738 -6758 76948 53110 41867
1174 41867 -45775 27213 15068 22729 35601 -79777 -121716 -147067 8541 51662 33350 30618
1162 30618 30284 3121 -25222 14406 60174 38277 89149 60938 -77470 26459 3496 -1884
1150 -1884 -30368 -33710 39365 -100947 -50823 -46487 7442 43774 -42992 -24618 -24638 -18138 -59813
1137 -59813 89162 1007 82348 150259 73004 82845 51430 -120391 -89096 29789 32158 88079
1125 88079 -124350 -126673 129946 15076 -88412 -25202 8696 -41575 -22580 777 13897
1114 13897 -46406 -33526 -65641 -13467 -19574 -101843 -86929 30885 31729 -10028 -21724 4550
$$ packed form
1197A4118m9003N5902k4215N4206o3835j12866J66534j80J7775J12588j20936
1186E0088j34899J45061l6925r6038K8765n1115K0435L890O3980Q3706k3838j1243
1174D1867q7642P2988j2145P661J2872j15378m1939k5351J55608M3121j8312k732
1162C0618l34k7163k8343L9628M5768k1897N0872k8211j38408J03929k2963n380
1150a884k8484l342P3075j40312N0124M336N3929L6332q6766J8374k0O500m1675
1137e9813J48975q8155Q1341O7911p7255R841l1415j71821L1295J18885K369N5921
1125H8079k12429k323K56619j14870j03488O3210L3898n0271J8995K3357J3120
1114A3897o0303J2880l2115N2174o107q2269J4914J17814Q44m1757j1696K6274
$$ plain form
1102 4550 -3578 16465 -81116 35380 -62051 -206087 -235610 -123697 -89347 -62654 -52620 -59476
1090 -59476 -26286 -91801 -58642 -39748 -84745 -20784 81881 -12402 20157 75950 61458 -3544
1078 -3544 9397 -15584 -11647 64393 147796 -5421 -35452 -38169 -6101 21847 97111 37109
1066 37109 1867 31628 63537 64639 90988 8701 60393 -7468 -79218 -14815 31068 90836
1054 90836 56716 -82618 -156428 -101435 9005 29783 15315 21713 48419 -14026 -86472 -149639
1042 -149639 -75723 -99582 -132438 -138314 -89780 6044 40439 -35084 -70665 -50480 9778 -51179
1030 -51179 -16743 -22090 -43141 10905 -5552 5462 50641 163750 198114 201524 21201 -8316
1018 -8316 40206 22355 67124 29128 51848 104067 66923 43066 -44960 -29161 -79743 4853
$$ packed form
1102D550q128K0043r7581J16496r7431j44036k9523J11913L4350K6693J0034o856
1090e9476L3190o5515L3159J8894m4997O3961J02665r4283L2559N5793j4492o5002
1078c544J2941k4981L937P6040Q3403j53217l0031k717L2068K7948P5264o0002
1066C7109l5242K9761L1909J102K6349q2287N1692o7861p1750O4403M5883N9768
1054I0836l4120j39334p3810N4993J10440K0778j4468O398K6706o2445p2446o3167
1042a49639P3916k3859l2856n876M8534R5824L4395p5523l5581K0185O0258o0957
1030e1179L4436n347k1051N4046j6457J1014M5179J13109L4364L410j80323k9517
1018h316M8522j7851M4769l7996K2720N2219l7144k3857q8026J5799n0582Q4596
$$ plain form
1006 4853 -16136 -60066 25634 -58663 -99900 5047 -6810 -65527 -31135 -33312 158 -63221
994 -63221 -86236 -46838 -65823 -105634 -14544 34870 64449 82520 -30601 -12535 -96317 18185
982 18185 -15668 -16886 34007 129 -40314 28375 12662 23908 -15003 12408 36633 6178
970 6178 95167 115901 86897 70515 -81250 -96847 -157495 -97289 2668 -47120 -19143 39677
958 39677 91764 2134 59164 64075 -63814 10479 30234 -50369 -4653 93665 104658 7385
946 7385 -45047 64463 44438 -4650 -249 -12674 101891 57446 4755 9209 21350 51500
934 51500 37112 91504 174068 112360 168848 70623 -66176 -152252 -95529 -99132 -158610 -154007
922 -154007 -3205 -46697 -103189 -68039 51298 7912 -107786 -18129 57593 86591 37169
$$ packed form
1006D853k0989m3930Q5700q4297m1237J04947j1857n8717L4392k177L3470o3379
994f3221k3015L9398j8985l9811R1090M9414K9579J8071j13121J8066q3782J14502
982A8185l3853j218N0893l3878m0443O8689j5713J1246l8911K7411K4225l0455
970F178Q8989K0734k9004j6382j51765j5597o0648O0206R9957m9788K7977N8820
958C9677N2087q9630N7030M911j27889P4293J9755q0603M5716R8318J0993r7273
946G385n2432J09510k0025m9088M401j2425J14565m4445n2691M454J2141L0150
934E1500j4388N4392Q2564o1708N6488r8225j36799q6076N6723l603n9478M603
922a54007J50802m3492n6492L5150J19337m3386j15698Q9657P5722K8998m9422
$$ plain form
911 37169 58782 145907 185536 37543 -31134 18119 -14838 -88670 -103573 -143989 -99205 62437
899 62437 23835 -10496 36717 85656 49648 27885 53990 50530 38372 44248 116702 164334
887 164334 48769 85035 90825 -18502 4156 41925 46742 -17454 13895 68028 81636 16689
875 16689 27590 37600 93857 20478 12204 52709 38013 171134 101972 67509 37081 -15521
863 -15521 51183 139508 49865 121802 137529 60244 86551 18545 -126635 -113244 -65433 -10309
851 -10309 123638 96154 181513 190972 98072 98091 85547 -42470 -97668 -36063 45305 29515
839 29515 2844 -100458 -89636 -38081 -155135 -134708 -84584 -8228 37566 -24295 67220 19514
827 19514 78974 87077 -5929 -110371 -52735 -53685 -50825 27269 2147 38074 26903 -81967
$$ packed form
911C7169K1613Q7125L9629j47993o8677M9253l2957p3832j4903m0416M4784J61642
899F2437l8602l4331M7213M8939l6008k1763K6105l460j2158N876P2454M7632
887A64334j15565L6266N790j09327K2658L7769M817o4196L1349N4133J3608o4947
875A6689J0901J0010N6257p3379q274M0505j4696J33121o9162l4463l0428n2602
863a5521O6704Q8325q9643P1937J5727p7285K6307o8006j45180J3391M7811N5124
851a0309J33947k7484Q5359R459r2900J9j2544j28017n5198O1605Q1368j5790
839B9515k6671j03302J0822N1555j17054K0427N0124P6356M5794o1861R1515m7706
827A9514N9460Q103r3006j04442N7636r50K860P8094k5122L5927j1171j08870
$$ plain form
815 -81967 -86262 58356 107771 35083 66384 15678 -77235 -69214 -30475 26014 14328 34259
803 34259 30114 -29117 -6165 -22200 80448 24951 -75452 -11426 -85364 -109152 -39522 -94003
791 -94003 -67422 -22971 -118993 -35159 47166 40727 101124 -14370 -73180 -15992 -23664 79991
779 79991 71447 77857 83062 36207 -54844 17597 25084 -14525 9301 106769 122394 130344 72463
766 72463 78047 21401 -45661 5970 -77373 -136427 -109629 -130795 -194603 -172263 -129596 -170188
754 -170188 -169135 -40364 -48853 -39663 119791 17555 -82033 -30745 -14142 -1411 95914 -13944
742 -13944 -44045 21680 -11336 -22910 -62131 -133985 -112603 -53479 11294 71758 8044 60198
730 60198 82098 26335 -46303 -42211 97736 82732 87211 97198 7983 116447 86247 48362
$$ packed form
815h1967m295J44618M9415p2688L1301n0706r2913Q021L8739N6489j1686J9931
803C4259m145n9231K2952j6035J02648n5497j00403O4026p3938k3788O9630n4481
791i4003K6581M4451r6022Q3834Q2325o439O0397j15494n8810N7188p672J03655
779G9991q544O410N205m6855r1051P2441P487l9609K3826R7468J5625P950n7881
766G2463N584n6646o7062N1631q3343n9054K6798k1166o3808K2340M2667m0592
754a70188J053J28771q489R190J59454j02236r9588N1288J6603J2731R7325j09858
742a3944l0101O5725l3016j1574l9221p1854K1382N9124O4773O0464o3714N2154
730F0198K1900n5763p2638M092J39947j5004M479R987q9215J08464l0200l7885
$$ plain form
718 48362 82669 56180 39553 114750 115098 143980 137690 -51683 46387 107499 27334 65411
706 65411 159937 25455 -102584 -15321 43724 79326 -4693 -49834 -117227 -50921 -36760 39084
694 39084 73170 -10293 -40142 -83104 -7551 58148 36686 50513 -80823 -97867 46317 137028
682 137028 86494 -45996 -116829 -46797 31776 23337 27230 -41410 -21873 -10509 1422 122455
670 122455 192569 139626 127281 693 -11735 -43605 -24968 50626 20834 -46488 -42308 83387
658 83387 11324 -63122 21291 1360 -34979 -29944 23862 -9568 -135888 -108280 -53448 -33872
646 -33872 93379 208642 60836 -155641 -70832 -31921 -27926 -17693 106303 141492 -51420
635 -51420 -106953 -80350 22391 47289 29734 10061 -9605 -9440 -34340 -37110 10657 -3312
$$ packed form
718D8362L4307k6489j6627P5197L48K8882o290j89373R8070O1112q0165L8077
706F5411R4526j34482j28039Q7263N9045L5602q4019m5141o7393O6306J4161P5844
694C9084L4086q3463k9849m2962P5553O5699k1462J3827j31336j7044J44184R0711
682A37028n0534j32490p0833P0032P8573q439L893o8640J9537J1364J1931J21033
670A22455P0114n2943j2345j26588j2428l1870J8637P5594k9792o7322M180J25695
658H3387p2063p4446Q4413j9931l6339N035N3806l3430j26320K7608N4832J9576
646c3872J27251J15263j47806k16477Q4809L8911L995J0233J23996L5189j92912
635e1420n5533K6603J02741K4898j7555j9673j9666J65k4900k770M7767j3969
$$ plain form
623 -3312 -5023 -117001 -47550 55618 -66199 -131744 12592 101111 61123 47439 39871 -37897
611 -37897 -88663 -75531 928 -41963 -51989 -60220 -166374 -72989 51245 -43577 -98111 -34409
599 -34409 -70583 15696 -10630 -65447 -75862 -76426 -32602 -119001 -58179 6785 -27325 39136
587 39136 54557 -34861 -100901 -99965 43555 19788 -60153 42580 99028 16649 20533 37822
575 37822 11823 -97481 -40174 14553 -72529 -23653 13536 -29002 -22065 -62079 27881 23888
563 23888 -73332 22250 -75355 -108490 -9026 -43769 -17824 52111 73084 124842 -54367 -136465
551 -136465 -104682 -91900 -125248 -251449 -125093 -16318 -25513 166901 128575 48122 126618
540 126618 97037 18009 -49790 -9122 69917 68922 29601 -14663 53862 -123836 -56880 22976
$$ packed form
623c312j711j11978O9451J03168j21817o5545J44336Q8519l9988j3684p568p7768
611c7897n0766J3132P6459m2891j0026q231j06154R3385J24234r4822n4534O3702
599c4409l6174Q6279k6326n4817j0415n64M3824q6399O0822O4964l4110O6461
587C9136J5421q9418o6040R36J43520k3767p9941J02733N6448q2379L884J7289
575C7822k5999j09304N7307N4727q7082M8876L7189m2538O937m0014Q9960l993
563B3888r7220R5582r7605l3135R9464l4743K5945O9935K0973N1758j79209q2098
551a36465L1783J2782l3348j26201J26356J08775r195J92414l8326q0453P8496
540A26618k9581p9028o7799M0668P9039r95l9321m4264O8525j77698O6956P9856
$$ plain form
528 22976 106619 22623 42676 118694 18469 -22769 53429 63935 11602 99312 37009 -40818
516 -40818 23586 -65038 -27073 25872 125833 67627 6882 14873 -74370 -29622 -63648 41673
504 41673 -63025 -25486 51804 40733 -66134 66788 106968 37020 18443 -21480 -46273
493 -46273 2292 -33266 -67798 -132358 -59455 -15724 -71734 -156016 -84689 96001 23264 -14652
481 -14652 -27112 -4579 -45041 -5875 60306 -36336 -38764 -118006 -103713 -13795 61693 115732
469 115732 32854 59165 6666 20514 76105 43668 32381 -4087 2593 -11926 -36053 -43293
457 -43293 38801 22495 52028 -14487 3215 8773 -8924 -22814 -6221 17021 -8497 59486
445 59486 -17051 76259 90849 -586 86760 50969 -52067 -37170 18753 71889 72230 7366
$$ packed form
528B2976Q3643q3996K0053P6018j00225m1238P6198J0506n2333Q7710o2303p7827
516d0818O4404q8624L7965N2945R9961n8206o0745P991q9243M4748l4026J05321
504D1673j04698L7539P7290j1071j06867J32922M0180o9948j8577l9923k4793
493d6273M8565l5558l4532o4560P2903M3731n6010q4282P1327J80690p2737l7916
481a4652j2460K2533m0462L9166O6181r6642k428p9242J4293Q9918P5488N4039
469A15732q2878K6311n2499J3848N5591l2437j1287l6468O680j4519k4127p240
457d3293Q2094j6306K9533o6515J7702N558j7697j3890J6593K3242k5518O7983
445E9486p6537R3310J4590r1435Q7346l5791j03036J4897N5923N3136L41o4864
$$ plain form
433 7366 -69926 -4152 26594 -38111 -25957 33824 114812 162367 98842 31085 63725 54010
421 54010 -56162 52397 -54101 -60620 -3114 6520 54941 108372 106147 66504 17990 47300
409 47300 -48761 -75570 -70161 26618 10805 2807 16032 93897 63786 99448 231539 74035
397 74035 -11810 -68975 52989 28312 1201 -15736 -28526 -57420 92211 120447 59523 27735
385 27735 -4702 96402 77428 101433 153409 25386 27134 132587 114620 77955 57740 27947
373 27947 -44384 -26114 -4579 81759 100341 39832 40192 109445 19227 -32543 77061 123882
361 123882 -22953 -78305 48333 58109 39384 20761 160107 201941 74892 15416 51210
350 51210 46110 63352 74093 61495 -3244 69961 18153 83960 181259 48202 20636 -30596
$$ packed form
433G366p7292O5774L0746o4705J2154N9781Q0988M7555o3525o7757L2640r715
421E4010j10172J08559j06498o519N7506R634M8421N3431k225l9643m8514K9310
409D7300r6061k6809N409R6779j5813p998J3225P7865l0111L5662J32091j57504
397G4035q5845n7165J21964k4677k7111j6937j2790k8894J49631K8236o0924l1788
385B7735l2437J01104j8974K4005N1976j28023J748J05453j7967l6665k0215k9793
373B7947p2331J8270K1535Q6338J8582o0509L60O9253r0218n1770J09604M6821
361A23882j46835n5352J26638R776j8725j8623J39346M1834j27049n9476L5794
350E1210n100J7242J0741j2598o4739P3205n1808O5807R7299j33057k7566n1232
$$ plain form
338 -30596 -31621 -9566 -22845 -40865 -38232 70596 -25818 -31971 -6841 -94489 89462 148502
326 148502 95055 108917 145659 158806 156238 107361 -32922 34581 100045 98899 -7418 33659
314 33659 -1613 -23190 -36637 147321 128585 85038 175199 48253 -72808 -138209 -1585
303 -1585 -69551 -41394 -50310 36024 63745 -118507 -21403 5355 53235 -74399 9582 35221
291 35221 -47693 -20182 83816 140614 32588 15843 55710 81179 -25559 30653 31271 -21336
279 -21336 -10522 63860 -57559 1542 -7420 -34299 -61494 -34997 10623 28728 -1210 1635
267 1635 93553 57358 58313 101716 40985 -51182 -20628 -21150 -58283 -15305 24737 116078 63553
254 63553 89393 25261 37497 96052 153914 124646 29035 73436 125261 152632 100937 19590
$$ packed form
338c0596j025K2055j3279j8020K633J08828r6414o153K5130q7648J83951N9040
326A48502n3447J3862L6742J3147k568m8877j40283O7503O5464j146j06317M1077
314C3659l5272k1577j3447J83958j8736m3547R0161j26946j21061o5401J36624
303a585o7966K8157q916Q6334K7721j82252R7104K6758M7880j27634Q3981K5639
291C5221q2914K7511J03998N6798j08026j6745L9867K5469j06738N6212O18n2607
279b1336J0814P4382j21419N9101q962k6879k7195K6497M5620J8105k9938K845
267A635R1918l6195R55M3403o0731r2167L0554n22l7133M2978M0042R1341n2525
254F3553K5840o4132J2236N8555N7862k9268r5611M4401N1825K7371n1695q1347
$$ plain form
242 19590 4550 39293 184188 177083 167197 271153 125538 -98644 -110002 55992 48829 43157
230 43157 -38676 -61036 -26713 -29414 37190 81076 2128 57926 56456 14979 3263 98592
218 98592 168131 90867 23814 -53438 -30264 -33549 -10254 -34058 -36605 21629 118176 9010
206 9010 -58307 52367 99041 92755 35230 102852 160771 139573 139571 156791 126158 158750 147313
193 147313 19727 4582 27127 90623 76026 45596 119996 135759 81438 102626 89747 88869
181 88869 63009 94918 11754 -9121 81538 9490 -22970 151468 97435 44093 134328 220922
169 220922 139730 25706 31211 39871 22562 -99847 2873 -5884 33150 107777 143552 -25914
157 -25914 -12720 2499 66239 57368 -38504 26632 48426 15554 85122 -21540 5933 -25
$$ packed form
242A9590j5040L4743J44895p105r886J03956j45615k24182j1358J65994p163n672
230D3157q1833k2360L4323k701O6604M3886p8948N5798j470m1477j1716R5329
218I8592O9539p7264o7053p7252K3174l285K3295k3804k547N8234R6547j09166
206I010o7317J10674M6674o286n7525O7622N7919k1198kJ7220l0633L2592j1437
193A47313j27586j5145K2545O3496j4597l0430P4400J5763n4321K1188j2879q78
181H8869k5860L1909q3164k0875R0659p2048l2460J74438n4033n3342R0235Q6594
169B20922q1192j14024N505Q660j7309j22409J02720q757L9034P4627L5775j69466
157b5914J3194J5219O3740q871r5872O5136K1794l2872O9568j06662K7473n958
$$ plain form
145 -25 -7361 53744 -6390 99155 175654 131821 143453 87786 29270 -66571 -77991 -16534 15627
132 15627 71639 62737 111306 54908 -22616 64640 105281 182324 102775 42045 3927 42517
120 42517 -7093 -65765 8889 -9697 30764 -58487 -3022 55127 -30213 -15868 -99247 -21580
108 -21580 -70618 -126022 -23641 36045 74303 -3200 -12362 -21297 -3097 66198 23454 -16608
96 -16608 -22898 -69204 75460 2674 2248 -13576 102426 192824 104828 116706 187969 138201
84 138201 42618 34915 100919 93452 9425 17820 80585 82235 64348 32939 24945 21975 49780
71 49780 -11042 30448 80357 31465 6913 35485 88182 97841 100004 119019 24631 43383 76937
58 76937 16725 85064 127990 38555 53621 21663 165047 185363 94415 146932 158263 53273
$$ packed form
145b5p336O1105o0134J05545P6499m3833J1632n5667n8516r5841j1420O1457L2161
132A5627N6012q902M8569n6398p7524Q7256M0641P7043p9549o0730l8118L8590
120D2517m9610n8672P4654j8586M0461q9251N5465N8149q5340J4345q3379P7667
108b1580m9038n5404J02381N9686L8258p7503r162q935J8200O9295m2744m0062
96a6608o290m6306J44664p2786m26j5824J16002R0398q7996J1878P1263m9768
84A38201r5583p703O6004p467q4027Q395O2765J650j7887l1409p994k970K7805
71D9780o0822M1490M9909m8892k4552K8572N2697R659K163J9015r4388J8752L3554
58G6937o0212O8339M2926q9435J5066l1958J43384K0316r0948N2517J1331j04990
$$ plain form
46 53273 111770 119555 23394 108151 27877 -7391 -9178 -17392 -17842 83303 71000 65609 65584 2860
32 2860 2688 8129 106851 36922 21996 34055 -9351 46055 113020 77190 33675 21814 83700
19 83700 71185 18272 64031 95775 83335 28121 52040 29844 2493 17384 19521 1330
7 1330 68574 102425 67377 10461 -11882 59921 50954
0 50954
$$ packed form
46E3273N8497P785r6161Q4757q0274l5268j787q214m50J01145j2303n391k5o2724
32B860j72N441R8722o9929j4926J2059m3406N5406O6965l5830m3515j1861O1886
19H3700j2515n2913M5759L1744j2440n5214K3919k2196k7351J4891K137j8191
7A330O7244L3851l5048n6916k2343P1803q967
0E0954
$$ Imaginary data points
##PAGE= N=2
##DATA TABLE= (X++(I..I)), XYDATA
$$ plain form
16383 -1074745 -1073459 -1034187 -1076640 -1050288 -1048744 -1028767 -939645 -815560 -823149 -870989 -887016 -931891
16371 -931891 -926232 -941868 -859321 -938739 -972710 -844096 -867130 -843070 -799705 -797174 -753382 -711577
16359 -711577 -670728 -704856 -763522 -745331 -784274 -688829 -651052 -636728 -703628 -754040 -655795
16348 -655795 -632776 -640251 -661167 -696234 -626466 -573473 -484380 -541052 -590383 -549921 -538419 -493266
16336 -493266 -455945 -440881 -470648 -376194 -414637 -485416 -400258 -378009 -460257 -398429 -379734
16325 -379734 -352379 -330967 -362239 -350956 -360020 -329713 -280248 -282542 -252621 -240263 -198427 -213800
16313 -213800 -200380 -195474 -198028 -206671 -174694 -239545 -260231 -236126 -191082 -207191 -200850 -149591
16301 -149591 -127885 -91476 -50124 -138932 -118456 -124088 -27714 48054 26271 40396 22176 -16195
$$ packed form
16383a074745J286L9272m2453K6352J544J9977Q9122J24085p589m7840j6027m4875
16371i31891N659j5636Q2547p9418l3971J28614k3034K4060M3365K531M3792M1805
16359g11577M0849l4128n8666J8191l8943R5445L7777J4324o6900n0412R8245
16348f55795K3019p475k0916l5067O9768N2993Q9093n6672m9331M0462J1502M5153
16336d93266L7321J5064k9767R4454l8443p0779Q5158K2249q2248O1828J8695
16325c79734K7355K1412l1272J1283r064L0307M9465k294K9921J2358M1836j5373
16313b13800J3420M906k554q643L1977o4851k0686K4105M5044j6109O341N1259
16301a49591K1706L6409M1352q8808K0476n632R6374P5768k1783J4125j8220l8371
$$ plain form
16289 -16195 -39192 -77046 -103000 -99818 -7054 36035 -4508 123212 67037 42817 163979
16278 163979 29118 -1172 43066 102021 157498 149892 216406 147587 146194 223616 133929 137138
16266 137138 164205 212996 189991 208214 220388 202212 170986 303205 326459 234136 327443
16255 327443 282854 342559 266956 281588 298996 305185 323011 342517 404525 355336 407109 299593
16243 299593 246155 393466 342454 361810 484057 441997 410285 451761 399385 474378 382400
16232 382400 402366 482514 371719 378250 396662 473206 496927 471189 440020 368700 438829
16221 438829 377302 413591 479217 507068 464639 422331 525196 470505 455659 551381 593750
16210 593750 537742 603412 685182 578376 615149 649899 555545 415269 471817 535536 562612
$$ packed form
16289a6195k2997l7854k5954L182R2764M3089m0543J27720n6175k4220J21162
16278A63979j34861l0290M4238N8955N5477p606O6514o8819j393P7422q9687L209
16266A37138K7067M8791k3005J8223J2174j8176l1226J32219K3254r2323R3307
16255C27443m4589N9705p5603J4632J7408O189J7826J9506O2008m9189N1773j07516
16243B99593n3438J47311n1012J9356J22247m2060l1712M1476n2376P4993r1978
16232C82400J9966Q0148j10795O531J8412P6544K3721k5738l1169p1320P0129
16221D38829o1527L6289O5626K7851m2429m2308J02865n4691j4846R5722M2369
16210E93750n6008O5670Q1770j06806L6773L4750r4354j40276N6548O3719K7076
$$ plain form
16199 562612 548800 582320 598959 734826 755817 658214 768678 727066 639314 691269 722872
16188 722872 601346 658118 699938 731878 681158 649187 607966 584298 594102 578566 748086
16177 748086 789685 765745 753644 694942 670191 673919 647003 667467 715593 727973 696412 742358
16165 742358 801014 778091 724381 737701 691407 693234 697618 787163 692193 705057 709481 603160
16153 603160 673021 721784 685462 715235 837435 764225 687505 667767 730264 844853 792148
16142 792148 689965 844853 832284 821148 830903 801307 706936 656143 678794 710505 710045 769592
16130 769592 894751 853519 744576 746174 844007 744598 694738 810018 812323 764386 731705
16119 731705 806473 812523 782724 775734 738242 752600 762929 708664 760344 764440 791378 838844
$$ packed form
16199E62612j3812L3520J6639J35867K0991r7603J10464m1612q7752N1955L1603
16188G22872j21526N6772M1820L1940n0720l1971m1221k3668R804j5536J69520
16177G48086M1599k3940j2101n8702k4751L728k6916K0464M8126J2380l1561M5946
16165G42358N8656k2923n3710J3320m6294J827M384Q9545r4970J2864M424j06321
16153F03160O9861M8763l6322K9773J22200p3210p6720j9738O2497J14589n2705
16142G92148j02183J54888j2569j1136R755k9596r4371n0793K2651L1711m60N9547
16130G69592J25159m1232j08943J598R7833r9409m9860J15280K305m7937l2681
16119G31705P4768O050k9799o990l7492J4358J0329n4265N1680M096K6938M7466
$$ plain form
16107 838844 792735 732349 723257 721545 709630 694548 873938 892985 891461 865454 830369 761434
16095 761434 673994 694717 674616 823749 776693 804626 862930 786278 751382 756129 755240 896915
16083 896915 928723 853359 806616 802870 839102 857812 854760 754298 798653 785682 802131 751871
16071 751871 778660 818389 874619 904266 790006 765328 909156 890839 835977 726372 780388
16060 780388 858109 680311 834924 947290 906343 859127 833810 908666 887859 950134 905406
16049 905406 782459 819463 837655 869130 856179 842995 871658 895532 901773 919079 951021
16038 951021 833181 884599 905308 799874 935201 995318 915854 828086 955149 947980 995114
16027 995114 925048 886534 791468 861403 922638 873966 859696 785178 819828 854941 915789
$$ packed form
16107H38844m6109o0386r092j712j1915j5082J79390J9047j524k6007l5085o8935
16095G61434q7440K0723k0101J49133m7056K7933N8304p6652l4896M747q89J41675
16083H96915L1808p5364m6743l746L6232J8710l052j00462M4355j2971J6449n0260
16071G51871K6789L9729N6230K9647j14260k4678J43828j8317n4862j09605N4016
16060G80388P7721j77798J54613J12366m0947m7216k5317P4856k0807O2275m4728
16049I05406j22947L7004J8192L1475j2951j3184K8663K3874O241J7306L1942
16038I51021j17840N1418K0709j05434J35327O0117p9464q7768J27063p169M7134
16027I95114p0066l8514r5066O9935O1235m8672j4270p4518L4650L5113O0848
$$ plain form
16016 915789 929137 942203 892950 935855 942852 944953 975405 952077 900383 881251 823153 793155
16004 793155 914533 878445 889538 817391 856216 897733 867845 882922 845689 855034 964183
15993 964183 888251 814529 903005 1017321 882773 858484 909890 908461 948362 913609 879267
15982 879267 884859 935170 888528 857109 904377 920148 929729 861147 890799 905594 892107 918120
15970 918120 847394 866851 831731 789265 797749 842801 875966 879287 894480 952291 881877 852157
15958 852157 934126 848712 863061 817125 777154 765973 753594 858365 765008 906430 867052
15947 867052 813824 777893 932915 939765 877133 888528 886372 882711 909921 879106 911375 854131
15935 854131 835156 900361 806791 849932 864355 748697 917615 1055924 954932 988142 911492
$$ packed form
16016I15789J3348J3066m9253M2905O997K101L0452k3328n1694j9132n8098k9998
16004G93155J21378l6088J1093p2147L8825M1517k9888J5077l7233R345J09149
15993I64183p5932p3722Q8476J14316j34548k4289N1406j429L9901l4753l4342
15982H79267N592N0311m6642l1419M7268J5771R581o8582K9652J4795j3487K6013
15970I18120p0726J9457l5120m2466Q484M5052L3165L321J5193N7811p0414k9720
15958H52157Q1969q5414J4349m5936l9971j1181j2379J04771r3357J41422l9378
15947H67052n3228l5931J55022O850o2632J1395k156l661K7210l0815L2269n7244
15935H54131j8975O5205r3570M3141J4423j15658J68918J38309j00992L3210p6650
$$ plain form
15924 911492 880487 950470 952691 824098 832059 844453 953277 955181 962527 928965 879255 844501
15912 844501 725609 880376 845011 915650 841473 774879 881841 831184 802927 889821 707129
15901 707129 731951 843736 787418 867728 944422 894772 938758 940631 838349 977409 1024409
15890 1024409 1040980 1035149 1004722 962032 944931 844620 798912 761306 797408 854655 905452
15879 905452 843238 813800 831546 833374 810190 661419 679886 771924 838851 722306 802284
15868 802284 854677 796511 773817 726747 875467 967761 1018522 899702 911696 858153 885167
15857 885167 919010 840102 914243 970922 943590 985735 954677 750083 749493 878271 913481
15846 913481 895663 924857 992880 851657 845157 718657 675530 804446 844281 822562 871587
$$ packed form
15924I11492l1005O9983K221j28593P961J2394J08824J904P346l3562m9710l4754
15912H44501j18892J54767l5365P0639p4177o6594J06962n0657k8257Q6894j82692
15901G07129K4822J11785n6318Q0310P6694m9650M3986J873j02282J39060M7000
15890A024409J6571n831l0427m2690j7101j00311m5708l7606L6102N7247N0797
15879I05452o2214k9438J7746J828k3184j48771J8467R2038O6927j16545P9978
15868H02284N2393n8166k2694m7070J48720R2294N0761j18820J1994n3543K7014
15857H85167L3843p8908P4141N6679k7332M2145l1058k04594n90J28778L5210
15846I13481j7818K9194O8023j41223o500j26500m3127J28916L9835k1719M9025
$$ plain form
15835 871587 919664 924100 839192 812177 837594 986469 953708 947201 919350 771308 712928
15824 712928 772545 812317 854037 892691 925264 958690 915288 933607 945666 900306 831691
15813 831691 867358 734709 730857 712387 768462 775508 893835 822285 855004 812784 857571
15802 857571 905523 870427 886942 851829 938904 863699 812971 725613 786957 787441 844328 879201
$$ packed form
15835H71587M8077M436q4908k7015K5417J48875l2761o507k7851j48042n8380
15824G12928N9617L9772M1720L8654L2573L3426m3402J8319J2059m5360o8615
15813H31691L5667j32649l852j8470N6075P046J18327p1550L2719m2220M4787
15802H57571M7952l5096J6515l5113Q7075p5205n0728q7358O1344M84N6887L4873
$$ [...]
##END NTUPLES=NMR SPECTRUM
##END=
